(VERTEX_PLATE)
(VERTEX_PLATE)
(T6 D=6. CR=0. TAPER=45DEG - ZMIN=7.7 - CHAMFER MILL)
G90 G94 G91.1 G40 G49 G17
G21
(WHEN USING FUSION FOR PERSONAL USE, THE FEEDRATE OF RAPID)
(MOVES IS REDUCED TO MATCH THE FEEDRATE OF CUTTING MOVES,)
(WHICH CAN INCREASE MACHINING TIME. UNRESTRICTED RAPID MOVES)
(ARE AVAILABLE WITH A FUSION SUBSCRIPTION.)
G28 G91 Z0.
G90

(TOP CHAMFER)
T6 M6
S12000 M3
G17 G90 G94
G54
M7
G0 X-14.857 Y-21.4
G43 Z26. H6
G1 Z16. F700.
Z13. F233.
Z7.7
Y-22. F700.
X35.
G2 X38. Y-25. I0. J-3.
G1 Y-33.
G2 X35. Y-36. I-3. J0.
G1 X-33.
G2 X-36. Y-33. I0. J3.
G1 Y35.
G2 X-33. Y38. I3. J0.
G1 X-25.
G2 X-22. Y35. I0. J-3.
G1 Y-16.063
G2 X-24.625 Y-19.039 I-3. J0.
G3 X-23.375 Y-28.961 I0.625 J-4.961
X-19.039 Y-24.625 I-0.625 J4.961
G2 X-16.063 Y-22. I2.976 J-0.375
G1 X-14.857
Y-21.4
Z26.

M9
M5
G28 G91 Z0.
G90
G28 G91 X0. Y0.
G90
M30
