(VERTEX_PLATE)
(VERTEX_PLATE)
(T4 D=3. CR=0. TAPER=45DEG - ZMIN=4.5 - CHAMFER MILL)
G90 G94 G91.1 G40 G49 G17
G21
(WHEN USING FUSION FOR PERSONAL USE, THE FEEDRATE OF RAPID)
(MOVES IS REDUCED TO MATCH THE FEEDRATE OF CUTTING MOVES,)
(WHICH CAN INCREASE MACHINING TIME. UNRESTRICTED RAPID MOVES)
(ARE AVAILABLE WITH A FUSION SUBSCRIPTION.)
G28 G91 Z0.
G90

(INDENT CHAMFER)
T4 M6
S24000 M3
G17 G90 G94
G54
M7
G0 X-21.5 Y-17.072
G43 Z26. H4
G1 Z16. F800.
Z13. F267.
Z4.5
X-21.2 F800.
Y35.
G2 X-20. Y36.2 I1.2 J0.
G1 X-14.414
G2 X-13.566 Y35.849 I0. J-1.2
G1 X35.849 Y-13.566
G2 X36.2 Y-14.414 I-0.849 J-0.849
G1 Y-20.
G2 X35. Y-21.2 I-1.2 J0.
G1 X-17.072
G2 X-18.111 Y-20.6 I0. J1.2
G3 X-20.6 Y-18.111 I-5.889 J-3.4
G2 X-21.2 Y-17.072 I0.6 J1.039
G1 X-21.5
Z26.

M9
M5
G28 G91 Z0.
G90
G28 G91 X0. Y0.
G90
M30
