(GROOVE CONTOUR)
(VERTEX_PLATE)
(T3 D=2. CR=0. - ZMIN=4. - FLAT END MILL)
G90 G94 G91.1 G40 G49 G17
G21
G28 G91 Z0.
G90

(GROOVE CONTOUR)
T3 M6
S24000 M3
G17 G90 G94
G54
M7
G0 X-21.127 Y-19.423
G43 Z26. H3
G0 Z16.
G1 Z11.4 F67.
Z4.2
X-21.123 Y-19.418 Z4.148 F200.
X-21.113 Y-19.4 Z4.1
X-21.097 Y-19.373 Z4.059
X-21.077 Y-19.337 Z4.027
X-21.053 Y-19.295 Z4.007
X-21.027 Y-19.25 Z4.
X-20.927 Y-19.077
G3 X-21. Y-18.804 I-0.173 J0.1
G2 X-22. Y-17.072 I1. J1.732
G1 Y35.
G2 X-20. Y37. I2. J0.
G3 X-19.8 Y37.2 I0. J0.2
G1 Y37.4
G19 G3 Y37.6 Z4.2 J0. K0.2
G0 Z16.
X-25.2
G1 Z11.4 F67.
Z4.2
G2 Y37.4 Z4. J-0.2 K0. F200.
G1 Y37.2
G17 G3 X-25. Y37. I0.2 J0.
G2 X-23. Y35. I0. J-2.
G1 Y-16.063
G2 X-24.75 Y-18.047 I-2. J0.
G3 X-24.923 Y-18.27 I0.025 J-0.198
G1 X-24.898 Y-18.469
X-24.892 Y-18.52 Z4.007
X-24.886 Y-18.568 Z4.027
X-24.881 Y-18.609 Z4.059
X-24.877 Y-18.641 Z4.1
X-24.874 Y-18.661 Z4.148
X-24.873 Y-18.667 Z4.2
G0 Z16.
X-18.667 Y-24.873
G1 Z11.4 F67.
Z4.2
X-18.661 Y-24.874 Z4.148 F200.
X-18.641 Y-24.877 Z4.1
X-18.609 Y-24.881 Z4.059
X-18.568 Y-24.886 Z4.027
X-18.52 Y-24.892 Z4.007
X-18.469 Y-24.898 Z4.
X-18.27 Y-24.923
G3 X-18.047 Y-24.75 I0.025 J0.198
G2 X-16.063 Y-23. I1.984 J-0.25
G1 X35.
G2 X37. Y-25. I0. J-2.
G3 X37.2 Y-25.2 I0.2 J0.
G1 X37.4
G18 G2 X37.6 Z4.2 I0. K0.2
G0 Z16.
Y-19.8
G1 Z11.4 F67.
Z4.2
G3 X37.4 Z4. I-0.2 K0. F200.
G1 X37.2
G17 G3 X37. Y-20. I0. J-0.2
G2 X35. Y-22. I-2. J0.
G1 X-17.072
G2 X-18.804 Y-21. I0. J2.
G3 X-19.077 Y-20.927 I-0.173 J-0.1
G1 X-19.25 Y-21.027
X-19.295 Y-21.053 Z4.007
X-19.337 Y-21.077 Z4.027
X-19.373 Y-21.097 Z4.059
X-19.4 Y-21.113 Z4.1
X-19.418 Y-21.123 Z4.148
X-19.423 Y-21.127 Z4.2
G0 Z26.

M9
M5
G28 G91 Z0.
G90
G28 G91 X0. Y0.
G90
M30
