{
    "label": "Titres",
    "mapping": {
        "description": "system.description",
        "book_reference": "system.book_reference"
    },
    "entries": [
        {
            "id": "Emerald Magistrate",
            "name": "Magistrat d’Émeraude",
            "description": "<h2>Cursus</h2><table><tr><td>Compétences Professionnelles</td><td>Grp. de comp.</td></tr><tr><td>Forme</td><td>Compétence</td></tr><tr><td>Arts martiaux (choisissez-en un)</td><td>Compétence</td></tr><tr><td>Représentations</td><td>Compétence</td></tr><tr><td><a class=\"compendium-link\" data-pack=\"l5r5e.core-techniques-kata\">(kata) Kata de rang 1–2</a> (prereq)</td><td>Tech. Grp.</td></tr><tr><td><a class=\"entity-link content-link\" draggable=\"true\" data-uuid=\"Compendium.l5r5e.core-techniques-kata.L5RCoreKat000026\" data-pack=\"l5r5e.core-techniques-kata\" data-id=\"L5RCoreKat000026\">(kata) Style de la main ouverte</a> (prereq)</td><td>Technique</td></tr><tr><td><a class=\"entity-link content-link\" draggable=\"true\" data-uuid=\"Compendium.l5r5e.core-techniques-shuji.L5RCoreShu000034\" data-pack=\"l5r5e.core-techniques-shuji\" data-id=\"L5RCoreShu000034\">(shuji) Sous la surface</a> (prereq)</td><td>Technique</td></tr></table>",
            "book_reference": "Livre de Règles p.305"
        },
        {
            "id": "Castellan",
            "name": "Châtelain",
            "description": "<h2>Cursus</h2><table><tr><td>Compétences Sociales</td><td>Grp. de comp.</td></tr><tr><td>Culture</td><td>Compétence</td></tr><tr><td>Stylisme</td><td>Compétence</td></tr><tr><td>Gouvernement</td><td>Compétence</td></tr><tr><td><a class=\"entity-link content-link\" draggable=\"true\" data-uuid=\"Compendium.l5r5e.core-techniques-shuji.L5RCoreShu000020\" data-pack=\"l5r5e.core-techniques-shuji\" data-id=\"L5RCoreShu000020\">(shuji) Cri de ralliement</a> (prereq)</td><td>Technique</td></tr><tr><td><a class=\"entity-link content-link\" draggable=\"true\" data-uuid=\"Compendium.l5r5e.core-techniques-shuji.L5RCoreShu000031\" data-pack=\"l5r5e.core-techniques-shuji\" data-id=\"L5RCoreShu000031\">(shuji) Manœuvres d’esquive</a> (prereq)</td><td>Technique</td></tr><tr><td><a class=\"entity-link content-link\" draggable=\"true\" data-uuid=\"Compendium.l5r5e.core-techniques-shuji.L5RCoreShu000011\" data-pack=\"l5r5e.core-techniques-shuji\" data-id=\"L5RCoreShu000011\">(shuji) Courage exemplaire</a> (prereq)</td><td>Technique</td></tr></table>",
            "book_reference": "Les Cours de Pierre p.128"
        },
        {
            "id": "Covert Agent",
            "name": "Agent infiltré",
            "description": "<h2>Cursus</h2><table><tr><td>Compétences Sociales</td><td>Grp. de comp.</td></tr><tr><td>Méditation</td><td>Compétence</td></tr><tr><td><a class=\"entity-link content-link\" draggable=\"true\" data-uuid=\"Compendium.l5r5e.core-techniques-ninjutsu.L5RCoreNin000005\" data-pack=\"l5r5e.core-techniques-ninjutsu\" data-id=\"L5RCoreNin000005\">(ninjutsu) Alibi artistique</a> (prereq)</td><td>Technique</td></tr><tr><td><a class=\"entity-link content-link\" draggable=\"true\" data-uuid=\"Compendium.l5r5e.core-techniques-shuji.L5RCoreShu000002\" data-pack=\"l5r5e.core-techniques-shuji\" data-id=\"L5RCoreShu000002\">(shuji) Cadence</a> (prereq)</td><td>Technique</td></tr><tr><td><a class=\"entity-link content-link\" draggable=\"true\" data-uuid=\"Compendium.l5r5e.core-techniques-ninjutsu.L5RCoreNin000006\" data-pack=\"l5r5e.core-techniques-ninjutsu\" data-id=\"L5RCoreNin000006\">(ninjutsu) Distraction fourbe</a> (prereq)</td><td>Technique</td></tr><tr><td><a class=\"entity-link content-link\" draggable=\"true\" data-uuid=\"Compendium.l5r5e.core-techniques-ninjutsu.L5RCoreNin000012\" data-pack=\"l5r5e.core-techniques-ninjutsu\" data-id=\"L5RCoreNin000012\">(ninjutsu) Flotter ou sombrer</a> (prereq)</td><td>Technique</td></tr><tr><td><a class=\"entity-link content-link\" draggable=\"true\" data-uuid=\"Compendium.l5r5e.core-techniques-ninjutsu.L5RCoreNin000013\" data-pack=\"l5r5e.core-techniques-ninjutsu\" data-id=\"L5RCoreNin000013\">(ninjutsu) Ce qui est à toi est à moi</a> (prereq)</td><td>Technique</td></tr></table>",
            "book_reference": "Les Cours de Pierre p.128"
        },
        {
            "id": "Dreaded Enforcer",
            "name": "Homme de main redouté",
            "description": "<h2>Cursus</h2><table><tr><td>Compétences Martiales</td><td>Grp. de comp.</td></tr><tr><td>Médecine</td><td>Compétence</td></tr><tr><td>Magouilles</td><td>Compétence</td></tr><tr><td><a class=\"entity-link content-link\" draggable=\"true\" data-uuid=\"Compendium.l5r5e.core-techniques-ninjutsu.L5RCoreNin000007\" data-pack=\"l5r5e.core-techniques-ninjutsu\" data-id=\"L5RCoreNin000007\">(ninjutsu) Coup malhonnête</a> (prereq)</td><td>Technique</td></tr><tr><td><a class=\"entity-link content-link\" draggable=\"true\" data-uuid=\"Compendium.l5r5e.core-techniques-ninjutsu.L5RCoreNin000008\" data-pack=\"l5r5e.core-techniques-ninjutsu\" data-id=\"L5RCoreNin000008\">(ninjutsu) Tel un fantôme</a> (prereq)</td><td>Technique</td></tr><tr><td><a class=\"entity-link content-link\" draggable=\"true\" data-uuid=\"Compendium.l5r5e.core-techniques-ninjutsu.L5RCoreNin000009\" data-pack=\"l5r5e.core-techniques-ninjutsu\" data-id=\"L5RCoreNin000009\">(ninjutsu) Immobilisation silencieuse</a> (prereq)</td><td>Technique</td></tr><tr><td><a class=\"entity-link content-link\" draggable=\"true\" data-uuid=\"Compendium.l5r5e.core-techniques-ninjutsu.L5RCoreNin000011\" data-pack=\"l5r5e.core-techniques-ninjutsu\" data-id=\"L5RCoreNin000011\">(ninjutsu) Quiétude de la mort</a> (prereq)</td><td>Technique</td></tr></table>",
            "book_reference": "Les Cours de Pierre p.129"
        },
        {
            "id": "Esteemed Negotiator",
            "name": "Négociateur estimé",
            "description": "<h2>Cursus</h2><table><tr><td>Compétences Sociales</td><td>Grp. de comp.</td></tr><tr><td>Culture</td><td>Compétence</td></tr><tr><td>Gouvernement</td><td>Compétence</td></tr><tr><td>Sentiments</td><td>Compétence</td></tr><tr><td><a class=\"compendium-link\" data-pack=\"l5r5e.core-techniques-shuji\">(shuji) Shuji de la Terre de rang 1–3</a> (prereq)</td><td>Tech. Grp.</td></tr><tr><td><a class=\"entity-link content-link\" draggable=\"true\" data-uuid=\"Compendium.l5r5e.core-techniques-rituals.L5RCoreRit000013\" data-pack=\"l5r5e.core-techniques-rituals\" data-id=\"L5RCoreRit000013\">(ritual) Les liens qui nous unissent</a> (prereq)</td><td>Technique</td></tr><tr><td><a class=\"entity-link content-link\" draggable=\"true\" data-uuid=\"Compendium.l5r5e.core-techniques-rituals.L5RCoreRit000012\" data-pack=\"l5r5e.core-techniques-rituals\" data-id=\"L5RCoreRit000012\">(ritual) Signature de traité</a> (prereq)</td><td>Technique</td></tr></table>",
            "book_reference": "Les Cours de Pierre p.129"
        },
        {
            "id": "Kenshinzen",
            "name": "Kenshinzen",
            "description": "<h2>Cursus</h2><table><tr><td>Compétences Martiales</td><td>Grp. de comp.</td></tr><tr><td>Compétences Sociales</td><td>Grp. de comp.</td></tr><tr><td>Culture</td><td>Compétence</td></tr><tr><td>Sentiments</td><td>Compétence</td></tr><tr><td><a class=\"compendium-link\" data-pack=\"l5r5e.core-techniques-kata\">(kata) Kata (Combat Rapproché) de rang 1–5</a> (prereq)</td><td>Tech. Grp.</td></tr><tr><td><a class=\"compendium-link\" data-pack=\"l5r5e.core-techniques-shuji\">(shuji) Shuji du Vide de rang 1–5</a> (prereq)</td><td>Tech. Grp.</td></tr><tr><td><a class=\"entity-link content-link\" draggable=\"true\" data-uuid=\"Compendium.l5r5e.core-techniques-rituals.L5RCoreRit000001\" data-pack=\"l5r5e.core-techniques-rituals\" data-id=\"L5RCoreRit000001\">(ritual) Cérémonie du thé</a> (prereq)</td><td>Technique</td></tr></table>",
            "book_reference": "Les Cours de Pierre p.130"
        },
        {
            "id": "Kyuden Asako Shieldbearer",
            "name": "Porteur de bouclier de Kyūden Asako",
            "description": "<h2>Cursus</h2><table><tr><td>Compétences Savantes</td><td>Grp. de comp.</td></tr><tr><td>Arts martiaux (corps à corps)</td><td>Compétence</td></tr><tr><td>Arts martiaux (distance)</td><td>Compétence</td></tr><tr><td>Méditation</td><td>Compétence</td></tr><tr><td>Tactique</td><td>Compétence</td></tr><tr><td><a class=\"compendium-link\" data-pack=\"l5r5e.core-techniques-kata\">(kata) Kata de rang 1–3</a> (prereq)</td><td>Tech. Grp.</td></tr><tr><td><a class=\"entity-link content-link\" draggable=\"true\" data-uuid=\"Compendium.l5r5e.core-techniques-rituals.L5RCoreRit000004\" data-pack=\"l5r5e.core-techniques-rituals\" data-id=\"L5RCoreRit000004\">(ritual) Rite de purification</a> (prereq)</td><td>Technique</td></tr></table>",
            "book_reference": "Les Cours de Pierre p.130"
        },
        {
            "id": "Master Artisan",
            "name": "Maître artisan",
            "description": "<h2>Cursus</h2><table><tr><td>Compétences Artisanales</td><td>Grp. de comp.</td></tr><tr><td>Courtoisie</td><td>Compétence</td></tr><tr><td>Culture</td><td>Compétence</td></tr><tr><td>Médecine</td><td>Compétence</td></tr><tr><td>Méditation</td><td>Compétence</td></tr><tr><td><a class=\"entity-link content-link\" draggable=\"true\" data-uuid=\"Compendium.l5r5e.core-techniques-shuji.L5RCoreShu000043\" data-pack=\"l5r5e.core-techniques-shuji\" data-id=\"L5RCoreShu000043\">(shuji) Tous les arts ne font qu’un</a> (prereq)</td><td>Technique</td></tr><tr><td><a class=\"entity-link content-link\" draggable=\"true\" data-uuid=\"Compendium.l5r5e.core-techniques-rituals.L5RCoreRit000011\" data-pack=\"l5r5e.core-techniques-rituals\" data-id=\"L5RCoreRit000011\">(ritual) Cérémonie du thé protocolaire</a> (prereq)</td><td>Technique</td></tr></table>",
            "book_reference": "Les Cours de Pierre p.130"
        },
        {
            "id": "Winter Court Champion",
            "name": "Champion de la Cour d'Hiver",
            "description": "<h2>Cursus</h2><table><tr><td>Compétences Artisanales</td><td>Grp. de comp.</td></tr><tr><td>Compétences Sociales</td><td>Grp. de comp.</td></tr><tr><td><a class=\"entity-link content-link\" draggable=\"true\" data-uuid=\"Compendium.l5r5e.core-techniques-shuji.L5RCoreShu000003\" data-pack=\"l5r5e.core-techniques-shuji\" data-id=\"L5RCoreShu000003\">(shuji) Estimation de l’artisan</a> (prereq)</td><td>Technique</td></tr><tr><td><a class=\"entity-link content-link\" draggable=\"true\" data-uuid=\"Compendium.l5r5e.core-techniques-rituals.L5RCoreRit000011\" data-pack=\"l5r5e.core-techniques-rituals\" data-id=\"L5RCoreRit000011\">(ritual) Cérémonie du thé protocolaire</a> (prereq)</td><td>Technique</td></tr><tr><td><a class=\"entity-link content-link\" draggable=\"true\" data-uuid=\"Compendium.l5r5e.core-techniques-shuji.L5RCoreShu000052\" data-pack=\"l5r5e.core-techniques-shuji\" data-id=\"L5RCoreShu000052\">(shuji) Agréable participation</a> (prereq)</td><td>Technique</td></tr><tr><td><a class=\"entity-link content-link\" draggable=\"true\" data-uuid=\"Compendium.l5r5e.core-techniques-shuji.L5RCoreShu000047\" data-pack=\"l5r5e.core-techniques-shuji\" data-id=\"L5RCoreShu000047\">(shuji) Froisser les sensibilités</a> (prereq)</td><td>Technique</td></tr><tr><td><a class=\"entity-link content-link\" draggable=\"true\" data-uuid=\"Compendium.l5r5e.core-techniques-shuji.L5RCoreShu000050\" data-pack=\"l5r5e.core-techniques-shuji\" data-id=\"L5RCoreShu000050\">(shuji) Amère défaite</a> (prereq)</td><td>Technique</td></tr></table>",
            "book_reference": "Les Cours de Pierre p.131"
        },
        {
            "id": "Seven fold Palace Acolyte",
            "name": "Etudiant au palais des Sept Plis",
            "description": "<h2>Cursus</h2><table><tr><td>Compétences Professionnelles</td><td>Grp. de comp.</td></tr><tr><td>Esthétique</td><td>Compétence</td></tr><tr><td>Stylisme</td><td>Compétence</td></tr><tr><td>Forme</td><td>Compétence</td></tr><tr><td>Méditation</td><td>Compétence</td></tr><tr><td>Forge</td><td>Compétence</td></tr><tr><td><a class=\"entity-link content-link\" draggable=\"true\" data-uuid=\"Compendium.l5r5e.core-techniques-shuji.L5RCoreShu000003\" data-pack=\"l5r5e.core-techniques-shuji\" data-id=\"L5RCoreShu000003\">(shuji) Estimation de l’artisan</a> (prereq)</td><td>Technique</td></tr></table>",
            "book_reference": "Les Cours de Pierre p.131"
        },
        {
            "id": "The Damned",
            "name": "Damné",
            "description": "<h2>Cursus</h2><table><tr><td>Compétences Martiales</td><td>Grp. de comp.</td></tr><tr><td>Médecine</td><td>Compétence</td></tr><tr><td>Survie</td><td>Compétence</td></tr><tr><td>Théologie</td><td>Compétence</td></tr><tr><td><a class=\"compendium-link\" data-pack=\"l5r5e.core-techniques-kata\">(kata) Kata de rang 1-2</a> (prereq)</td><td>Tech. Grp.</td></tr><tr><td><a class=\"entity-link content-link\" draggable=\"true\" data-uuid=\"Compendium.l5r5e.core-techniques-kata.L5RCoreKat000003\" data-pack=\"l5r5e.core-techniques-kata\" data-id=\"L5RCoreKat000003\">(kata) Assaut en plein coeur</a> (prereq)</td><td>Technique</td></tr><tr><td><a class=\"entity-link content-link\" draggable=\"true\" data-uuid=\"Compendium.l5r5e.core-techniques-shuji.L5RCoreShu000020\" data-pack=\"l5r5e.core-techniques-shuji\" data-id=\"L5RCoreShu000020\">(shuji) Cri de ralliement</a> (prereq)</td><td>Technique</td></tr></table>",
            "book_reference": "L’Outremonde p.128"
        },
        {
            "id": "Harvester",
            "name": "Récolteur",
            "description": "<h2>Cursus</h2><table><tr><td>Compétences Martiales</td><td>Grp. de comp.</td></tr><tr><td>Forge</td><td>Compétence</td></tr><tr><td>Survie</td><td>Compétence</td></tr><tr><td>Théologie</td><td>Compétence</td></tr><tr><td><a class=\"compendium-link\" data-pack=\"l5r5e.core-techniques-kata\">(kata) Kata de rang 1-2</a> (prereq)</td><td>Tech. Grp.</td></tr><tr><td><a class=\"compendium-link\" data-pack=\"l5r5e.core-techniques-rituals\">(ritual) Rituels de rang 1-2</a> (prereq)</td><td>Tech. Grp.</td></tr><tr><td><a class=\"entity-link content-link\" draggable=\"true\" data-uuid=\"Compendium.l5r5e.core-techniques-ninjutsu.L5RCoreNin000002\" data-pack=\"l5r5e.core-techniques-ninjutsu\" data-id=\"L5RCoreNin000002\">(ninjutsu) Disparition</a> (prereq)</td><td>Technique</td></tr></table>",
            "book_reference": "L’Outremonde p.128"
        },
        {
            "id": "Twenty-Goblin Crab",
            "name": "Crabe au vingt gobelins",
            "description": "<h2>Cursus</h2><table><tr><td>Compétences Martiales</td><td>Grp. de comp.</td></tr><tr><td>Compétences Sociales</td><td>Grp. de comp.</td></tr><tr><td>Culture</td><td>Compétence</td></tr><tr><td>Gouvernement</td><td>Compétence</td></tr><tr><td><a class=\"compendium-link\" data-pack=\"l5r5e.core-techniques-kata\">(kata) Kata de rang 1-2</a> (prereq)</td><td>Tech. Grp.</td></tr><tr><td><a class=\"entity-link content-link\" draggable=\"true\" data-uuid=\"Compendium.l5r5e.core-techniques-kata.L5RCoreKat000021\" data-pack=\"l5r5e.core-techniques-kata\" data-id=\"L5RCoreKat000021\">(kata) Assaut du coup de tonnerre</a> (prereq)</td><td>Technique</td></tr><tr><td><a class=\"entity-link content-link\" draggable=\"true\" data-uuid=\"Compendium.l5r5e.core-techniques-shuji.L5RCoreShu000017\" data-pack=\"l5r5e.core-techniques-shuji\" data-id=\"L5RCoreShu000017\">(shuji) Tactique d’obstruction</a> (prereq)</td><td>Technique</td></tr></table>",
            "book_reference": "L’Outremonde p.128"
        },
        {
            "id": "Witch Hunter",
            "name": "Chasseur de sorcier",
            "description": "<h2>Cursus</h2><table><tr><td>Compétences Martiales</td><td>Grp. de comp.</td></tr><tr><td>Compétences Savantes</td><td>Grp. de comp.</td></tr><tr><td>Commandement</td><td>Compétence</td></tr><tr><td>Magouilles</td><td>Compétence</td></tr><tr><td><a class=\"compendium-link\" data-pack=\"l5r5e.core-techniques-kata\">(kata) Kata de rang 1-4</a> (prereq)</td><td>Tech. Grp.</td></tr><tr><td><a class=\"compendium-link\" data-pack=\"l5r5e.core-techniques-rituals\">(ritual) Rituels de rang 1-5</a> (prereq)</td><td>Tech. Grp.</td></tr><tr><td><a class=\"entity-link content-link\" draggable=\"true\" data-uuid=\"Compendium.l5r5e.core-techniques-shuji.L5RCoreShu000012\" data-pack=\"l5r5e.core-techniques-shuji\" data-id=\"L5RCoreShu000012\">(shuji) Evaluation honnête</a> (prereq)</td><td>Technique</td></tr></table>",
            "book_reference": "L’Outremonde p.129"
        },
        {
            "id": "Advisor",
            "name": "Conseiller",
            "description": "<h2>Cursus</h2><table><tr><td>Compétences Savantes</td><td>Grp. de comp.</td></tr><tr><td>Commerce</td><td>Compétence</td></tr><tr><td>Courtoisie</td><td>Compétence</td></tr><tr><td>Stylisme</td><td>Compétence</td></tr><tr><td><a class=\"entity-link content-link\" draggable=\"true\" data-uuid=\"Compendium.l5r5e.core-techniques-shuji.L5RCoreShu000018\" data-pack=\"l5r5e.core-techniques-shuji\" data-id=\"L5RCoreShu000018\">(shuji) Attiser les flammes</a> (prereq)</td><td>Technique</td></tr><tr><td><a class=\"entity-link content-link\" draggable=\"true\" data-uuid=\"Compendium.l5r5e.core-techniques-shuji.L5RCoreShu000008\" data-pack=\"l5r5e.core-techniques-shuji\" data-id=\"L5RCoreShu000008\">(shuji) Ouverture feinte</a> (prereq)</td><td>Technique</td></tr><tr><td><a class=\"entity-link content-link\" draggable=\"true\" data-uuid=\"Compendium.l5r5e.core-techniques-shuji.L5RCoreShu000017\" data-pack=\"l5r5e.core-techniques-shuji\" data-id=\"L5RCoreShu000017\">(shuji) Tactique d’obstruction</a> (prereq)</td><td>Technique</td></tr></table>",
            "book_reference": "L’Empire d’Émeraude p.249"
        },
        {
            "id": "Daimyo",
            "name": "Daimyo",
            "description": "<h2>Cursus</h2><table><tr><td>Compétences Sociales</td><td>Grp. de comp.</td></tr><tr><td>Culture</td><td>Compétence</td></tr><tr><td>Gouvernement</td><td>Compétence</td></tr><tr><td>Tactique</td><td>Compétence</td></tr><tr><td><a class=\"entity-link content-link\" draggable=\"true\" data-uuid=\"Compendium.l5r5e.core-techniques-shuji.L5RCoreShu000037\" data-pack=\"l5r5e.core-techniques-shuji\" data-id=\"L5RCoreShu000037\">(shuji) La détermination du courtisan</a> (prereq)</td><td>Technique</td></tr><tr><td><a class=\"entity-link content-link\" draggable=\"true\" data-uuid=\"Compendium.l5r5e.core-techniques-shuji.L5RCoreShu000034\" data-pack=\"l5r5e.core-techniques-shuji\" data-id=\"L5RCoreShu000034\">(shuji) Sous la surface</a> (prereq)</td><td>Technique</td></tr><tr><td><a class=\"entity-link content-link\" draggable=\"true\" data-uuid=\"Compendium.l5r5e.core-techniques-shuji.L5RCoreShu000026\" data-pack=\"l5r5e.core-techniques-shuji\" data-id=\"L5RCoreShu000026\">(shuji) Souffler sur les braises</a> (prereq)</td><td>Technique</td></tr></table>",
            "book_reference": "L’Empire d’Émeraude p.249"
        },
        {
            "id": "Spy",
            "name": "Espion",
            "description": "<h2>Cursus</h2><table><tr><td>Compétences Sociales</td><td>Grp. de comp.</td></tr><tr><td>Gouvernement</td><td>Compétence</td></tr><tr><td>Sentiments</td><td>Compétence</td></tr><tr><td>Magouilles</td><td>Compétence</td></tr><tr><td><a class=\"compendium-link\" data-pack=\"l5r5e.core-techniques-shuji\">(shuji) Shuji de l’Air de rang 1-5</a> (prereq)</td><td>Tech. Grp.</td></tr><tr><td><a class=\"entity-link content-link\" draggable=\"true\" data-uuid=\"Compendium.l5r5e.core-techniques-shuji.L5RCoreShu000034\" data-pack=\"l5r5e.core-techniques-shuji\" data-id=\"L5RCoreShu000034\">(shuji) Sous la surface</a> (prereq)</td><td>Technique</td></tr><tr><td><a class=\"entity-link content-link\" draggable=\"true\" data-uuid=\"Compendium.l5r5e.core-techniques-ninjutsu.L5RCoreNin000002\" data-pack=\"l5r5e.core-techniques-ninjutsu\" data-id=\"L5RCoreNin000002\">(ninjutsu) Disparition</a> (prereq)</td><td>Technique</td></tr></table>",
            "book_reference": "L’Empire d’Émeraude p.250"
        },
        {
            "id": "Gunso",
            "name": "Gunso",
            "description": "<h2>Cursus</h2><table><tr><td>Compétences Martiales</td><td>Grp. de comp.</td></tr><tr><td>Commandement</td><td>Compétence</td></tr><tr><td>Gouvernement</td><td>Compétence</td></tr><tr><td><a class=\"compendium-link\" data-pack=\"l5r5e.core-techniques-kata\">(kata) Kata de rang 1-4</a></td><td>Tech. Grp.</td></tr><tr><td><a class=\"entity-link content-link\" draggable=\"true\" data-uuid=\"Compendium.l5r5e.core-techniques-shuji.L5RCoreShu000020\" data-pack=\"l5r5e.core-techniques-shuji\" data-id=\"L5RCoreShu000020\">(shuji) Cri de ralliement</a> (prereq)</td><td>Technique</td></tr><tr><td><a class=\"entity-link content-link\" draggable=\"true\" data-uuid=\"Compendium.l5r5e.core-techniques-shuji.L5RCoreShu000026\" data-pack=\"l5r5e.core-techniques-shuji\" data-id=\"L5RCoreShu000026\">(shuji) Souffler sur les braises</a> (prereq)</td><td>Technique</td></tr><tr><td><a class=\"entity-link content-link\" draggable=\"true\" data-uuid=\"Compendium.l5r5e.core-techniques-shuji.L5RCoreShu000011\" data-pack=\"l5r5e.core-techniques-shuji\" data-id=\"L5RCoreShu000011\">(shuji) Courage exemplaire</a> (prereq)</td><td>Technique</td></tr></table>",
            "book_reference": "L’Empire d’Émeraude p.250"
        },
        {
            "id": "Clan Magistrate",
            "name": "Magistrat de clan",
            "description": "<h2>Cursus</h2><table><tr><td>Compétences Savantes</td><td>Grp. de comp.</td></tr><tr><td>Compétences Sociales</td><td>Grp. de comp.</td></tr><tr><td>Forme</td><td>Compétence</td></tr><tr><td>Arts martiaux (corps à corps)</td><td>Compétence</td></tr><tr><td><a class=\"entity-link content-link\" draggable=\"true\" data-uuid=\"Compendium.l5r5e.core-techniques-kata.L5RCoreKat000029\" data-pack=\"l5r5e.core-techniques-kata\" data-id=\"L5RCoreKat000029\">(kata) Style du serpent constricteur</a> (prereq)</td><td>Technique</td></tr><tr><td><a class=\"entity-link content-link\" draggable=\"true\" data-uuid=\"Compendium.l5r5e.core-techniques-shuji.L5RCoreShu000006\" data-pack=\"l5r5e.core-techniques-shuji\" data-id=\"L5RCoreShu000006\">(shuji) Malheur aux faibles</a> (prereq)</td><td>Technique</td></tr><tr><td><a class=\"entity-link content-link\" draggable=\"true\" data-uuid=\"Compendium.l5r5e.core-techniques-shuji.L5RCoreShu000023\" data-pack=\"l5r5e.core-techniques-shuji\" data-id=\"L5RCoreShu000023\">(shuji) La vérité derrière l’écran de fumée</a> (prereq)</td><td>Technique</td></tr></table>",
            "book_reference": "L’Empire d’Émeraude p.251"
        },
        {
            "id": "Monastic Acolyte",
            "name": "Moine acolyte",
            "description": "<h2>Cursus</h2><table><tr><td>Compétences Martiales</td><td>Grp. de comp.</td></tr><tr><td>Compétences Savantes</td><td>Grp. de comp.</td></tr><tr><td>Esthétique</td><td>Compétence</td></tr><tr><td>Composition</td><td>Compétence</td></tr><tr><td><a class=\"entity-link content-link\" draggable=\"true\" data-uuid=\"Compendium.l5r5e.core-techniques-kiho.L5RCoreKih000001\" data-pack=\"l5r5e.core-techniques-kiho\" data-id=\"L5RCoreKih000001\">(kiho) Esprit purificateur</a> (prereq)</td><td>Technique</td></tr><tr><td><a class=\"entity-link content-link\" draggable=\"true\" data-uuid=\"Compendium.l5r5e.core-techniques-kiho.L5RCoreKih000017\" data-pack=\"l5r5e.core-techniques-kiho\" data-id=\"L5RCoreKih000017\">(kiho) Ki protecteur</a> (prereq)</td><td>Technique</td></tr><tr><td><a class=\"entity-link content-link\" draggable=\"true\" data-uuid=\"Compendium.l5r5e.core-techniques-kiho.L5RCoreKih000022\" data-pack=\"l5r5e.core-techniques-kiho\" data-id=\"L5RCoreKih000022\">(kiho) Figer les éléments</a> (prereq)</td><td>Technique</td></tr></table>",
            "book_reference": "L’Empire d’Émeraude p.251"
        },
        {
            "id": "Priest",
            "name": "Prêtre",
            "description": "<h2>Cursus</h2><table><tr><td>Compétences Sociales</td><td>Grp. de comp.</td></tr><tr><td>Composition</td><td>Compétence</td></tr><tr><td>Culture</td><td>Compétence</td></tr><tr><td>Théologie</td><td>Compétence</td></tr><tr><td><a class=\"compendium-link\" data-pack=\"l5r5e.core-techniques-rituals\">(ritual) Rituels de rang 1-5</a></td><td>Tech. Grp.</td></tr><tr><td><a class=\"entity-link content-link\" draggable=\"true\" data-uuid=\"Compendium.l5r5e.core-techniques-shuji.L5RCoreShu000014\" data-pack=\"l5r5e.core-techniques-shuji\" data-id=\"L5RCoreShu000014\">(shuji) La courtoisie prime</a> (prereq)</td><td>Technique</td></tr><tr><td><a class=\"entity-link content-link\" draggable=\"true\" data-uuid=\"Compendium.l5r5e.core-techniques-shuji.L5RCoreShu000041\" data-pack=\"l5r5e.core-techniques-shuji\" data-id=\"L5RCoreShu000041\">(shuji) Réveil de l’âme</a> (prereq)</td><td>Technique</td></tr></table>",
            "book_reference": "L’Empire d’Émeraude p.251"
        },
        {
            "id": "Yojimbo",
            "name": "Yojimbo",
            "description": "<h2>Cursus</h2><table><tr><td>Compétences Martiales</td><td>Grp. de comp.</td></tr><tr><td>Gouvernement</td><td>Compétence</td></tr><tr><td>Médecine</td><td>Compétence</td></tr><tr><td>Sentiments</td><td>Compétence</td></tr><tr><td><a class=\"entity-link content-link\" draggable=\"true\" data-uuid=\"Compendium.l5r5e.core-techniques-kata.L5RCoreKat000023\" data-pack=\"l5r5e.core-techniques-kata\" data-id=\"L5RCoreKat000023\">(kata) Attaque de iaijutsu : lame horizontale</a> (prereq)</td><td>Technique</td></tr><tr><td><a class=\"entity-link content-link\" draggable=\"true\" data-uuid=\"Compendium.l5r5e.core-techniques-kata.L5RCoreKat000022\" data-pack=\"l5r5e.core-techniques-kata\" data-id=\"L5RCoreKat000022\">(kata) Attaque de iaijutsu : lame ascendante</a> (prereq)</td><td>Technique</td></tr><tr><td><a class=\"entity-link content-link\" draggable=\"true\" data-uuid=\"Compendium.l5r5e.core-techniques-kata.L5RCoreKat000007\" data-pack=\"l5r5e.core-techniques-kata\" data-id=\"L5RCoreKat000007\">(kata) Détermination du guerrier</a> (prereq)</td><td>Technique</td></tr></table>",
            "book_reference": "L’Empire d’Émeraude p.252"
        },
        {
            "id": "Yoriki",
            "name": "Yoriki",
            "description": "<h2>Cursus</h2><table><tr><td>Compétences Sociales</td><td>Grp. de comp.</td></tr><tr><td>Gouvernement</td><td>Compétence</td></tr><tr><td>Arts martiaux (corps à corps)</td><td>Compétence</td></tr><tr><td>Magouilles</td><td>Compétence</td></tr><tr><td><a class=\"compendium-link\" data-pack=\"l5r5e.core-techniques-kata\">(kata) Kata de rang 1-3</a></td><td>Tech. Grp.</td></tr><tr><td><a class=\"entity-link content-link\" draggable=\"true\" data-uuid=\"Compendium.l5r5e.core-techniques-shuji.L5RCoreShu000018\" data-pack=\"l5r5e.core-techniques-shuji\" data-id=\"L5RCoreShu000018\">(shuji) Attiser les flammes</a> (prereq)</td><td>Technique</td></tr><tr><td><a class=\"entity-link content-link\" draggable=\"true\" data-uuid=\"Compendium.l5r5e.core-techniques-shuji.L5RCoreShu000034\" data-pack=\"l5r5e.core-techniques-shuji\" data-id=\"L5RCoreShu000034\">(shuji) Sous la surface</a> (prereq)</td><td>Technique</td></tr></table>",
            "book_reference": "L’Empire d’Émeraude p.252"
        },
        {
            "id": "Ashigaru",
            "name": "Ashigaru (WIP)",
            "description": "<h2>Cursus</h2><table><tr><td>Compétences Martiales</td><td>Grp. de comp.</td></tr><tr><td>Courtoisie</td><td>Compétence</td></tr><tr><td>Commandement</td><td>Compétence</td></tr><tr><td>Survie</td><td>Compétence</td></tr><tr><td><a class=\"compendium-link\" data-pack=\"l5r5e.core-techniques-kata\">(kata) Kata de rang 1-2</a> (prereq)</td><td>Tech. Grp.</td></tr><tr><td><a class=\"entity-link content-link\" draggable=\"true\" data-uuid=\"Compendium.l5r5e.core-techniques-kata.L5RCoreKat000066\" data-pack=\"l5r5e.core-techniques-kata\" data-id=\"L5RCoreKat000066\">(kata) Thicket's Embrace Style (WIP)</a> (prereq)</td><td>Technique</td></tr><tr><td><a class=\"entity-link content-link\" draggable=\"true\" data-uuid=\"Compendium.l5r5e.core-techniques-shuji.L5RCoreShu000031\" data-pack=\"l5r5e.core-techniques-shuji\" data-id=\"L5RCoreShu000031\">(shuji) Manœuvres d’esquive</a> (prereq)</td><td>Technique</td></tr></table>",
            "book_reference": "Les Champs de la Victoire"
        },
        {
            "id": "Deathseeker",
            "name": "Deathseeker (WIP)",
            "description": "<h2>Cursus</h2><table><tr><td>Compétences Martiales</td><td>Grp. de comp.</td></tr><tr><td>Courtoisie</td><td>Compétence</td></tr><tr><td>Travail manuel</td><td>Compétence</td></tr><tr><td>Théologie</td><td>Compétence</td></tr><tr><td><a class=\"compendium-link\" data-pack=\"l5r5e.core-techniques-kata\">(kata) Kata de rang 1-3</a> (prereq)</td><td>Tech. Grp.</td></tr><tr><td><a class=\"entity-link content-link\" draggable=\"true\" data-uuid=\"Compendium.l5r5e.core-techniques-shuji.L5RCoreShu000038\" data-pack=\"l5r5e.core-techniques-shuji\" data-id=\"L5RCoreShu000038\">(shuji) Le destin du samouraï</a> (prereq)</td><td>Technique</td></tr><tr><td><a class=\"entity-link content-link\" draggable=\"true\" data-uuid=\"Compendium.l5r5e.core-techniques-shuji.L5RCoreShu000086\" data-pack=\"l5r5e.core-techniques-shuji\" data-id=\"L5RCoreShu000086\">(shuji) Moment of Glory (WIP)</a> (prereq)</td><td>Technique</td></tr></table>",
            "book_reference": "Les Champs de la Victoire"
        },
        {
            "id": "Elemental Guard",
            "name": "Elemental Guard (WIP)",
            "description": "<h2>Cursus</h2><table><tr><td>Compétences Martiales</td><td>Grp. de comp.</td></tr><tr><td>Commandement</td><td>Compétence</td></tr><tr><td>Gouvernement</td><td>Compétence</td></tr><tr><td>Médecine</td><td>Compétence</td></tr><tr><td><a class=\"entity-link content-link\" draggable=\"true\" data-uuid=\"Compendium.l5r5e.core-techniques-rituals.L5RCoreRit000027\" data-pack=\"l5r5e.core-techniques-rituals\" data-id=\"L5RCoreRit000027\">(ritual) Beseech Shiba's Calm (WIP)</a> (prereq)</td><td>Technique</td></tr><tr><td><a class=\"entity-link content-link\" draggable=\"true\" data-uuid=\"Compendium.l5r5e.core-techniques-kata.L5RCoreKat000008\" data-pack=\"l5r5e.core-techniques-kata\" data-id=\"L5RCoreKat000008\">(kata) Evaluation tactique</a> (prereq)</td><td>Technique</td></tr><tr><td><a class=\"entity-link content-link\" draggable=\"true\" data-uuid=\"Compendium.l5r5e.core-techniques-kata.L5RCoreKat000007\" data-pack=\"l5r5e.core-techniques-kata\" data-id=\"L5RCoreKat000007\">(kata) Détermination du guerrier</a> (prereq)</td><td>Technique</td></tr></table>",
            "book_reference": "Les Champs de la Victoire"
        },
        {
            "id": "Elemental Legionnaire",
            "name": "Elemental Legionnaire (WIP)",
            "description": "<h2>Cursus</h2><table><tr><td>Compétences Martiales</td><td>Grp. de comp.</td></tr><tr><td>Commandement</td><td>Compétence</td></tr><tr><td>Médecine</td><td>Compétence</td></tr><tr><td>Forge</td><td>Compétence</td></tr><tr><td><a class=\"compendium-link\" data-pack=\"l5r5e.core-techniques-kata\">(kata) Kata de rang 1-3</a> (prereq)</td><td>Tech. Grp.</td></tr><tr><td><a class=\"entity-link content-link\" draggable=\"true\" data-uuid=\"Compendium.l5r5e.core-techniques-shuji.L5RCoreShu000076\" data-pack=\"l5r5e.core-techniques-shuji\" data-id=\"L5RCoreShu000076\">(shuji) Great Anvil's Measure (WIP)</a> (prereq)</td><td>Technique</td></tr><tr><td><a class=\"entity-link content-link\" draggable=\"true\" data-uuid=\"Compendium.l5r5e.core-techniques-shuji.L5RCoreShu000086\" data-pack=\"l5r5e.core-techniques-shuji\" data-id=\"L5RCoreShu000086\">(shuji) Moment of Glory (WIP)</a> (prereq)</td><td>Technique</td></tr></table>",
            "book_reference": "Les Champs de la Victoire"
        },
        {
            "id": "General",
            "name": "General (WIP)",
            "description": "<h2>Cursus</h2><table><tr><td>Compétences Sociales</td><td>Grp. de comp.</td></tr><tr><td>Compétences Martiales</td><td>Grp. de comp.</td></tr><tr><td>Gouvernement</td><td>Compétence</td></tr><tr><td>Survie</td><td>Compétence</td></tr><tr><td><a class=\"compendium-link\" data-pack=\"l5r5e.core-techniques-kata\">(kata) Kata de rang 1-2</a> (prereq)</td><td>Tech. Grp.</td></tr><tr><td><a class=\"compendium-link\" data-pack=\"l5r5e.core-techniques-rituals\">(ritual) Rituels de rang 1-3</a> (prereq)</td><td>Tech. Grp.</td></tr><tr><td><a class=\"compendium-link\" data-pack=\"l5r5e.core-techniques-shuji\">(shuji) Shuji de rang 1-4</a> (prereq)</td><td>Tech. Grp.</td></tr></table>",
            "book_reference": "Les Champs de la Victoire"
        },
        {
            "id": "Lion's Pride Warrior",
            "name": "Lion's Pride Warrior (WIP)",
            "description": "<h2>Cursus</h2><table><tr><td>Compétences Martiales</td><td>Grp. de comp.</td></tr><tr><td>Commandement</td><td>Compétence</td></tr><tr><td>Sentiments</td><td>Compétence</td></tr><tr><td>Survie</td><td>Compétence</td></tr><tr><td><a class=\"compendium-link\" data-pack=\"l5r5e.core-techniques-kata\">(kata) Kata de rang 1-3</a> (prereq)</td><td>Tech. Grp.</td></tr><tr><td><a class=\"entity-link content-link\" draggable=\"true\" data-uuid=\"Compendium.l5r5e.core-techniques-shuji.L5RCoreShu000038\" data-pack=\"l5r5e.core-techniques-shuji\" data-id=\"L5RCoreShu000038\">(shuji) Le destin du samouraï</a> (prereq)</td><td>Technique</td></tr><tr><td><a class=\"entity-link content-link\" draggable=\"true\" data-uuid=\"Compendium.l5r5e.core-techniques-shuji.L5RCoreShu000085\" data-pack=\"l5r5e.core-techniques-shuji\" data-id=\"L5RCoreShu000085\">(shuji) Battle of No Escape (WIP)</a> (prereq)</td><td>Technique</td></tr></table>",
            "book_reference": "Les Champs de la Victoire"
        },
        {
            "id": "Master Saboteur",
            "name": "Master Saboteur (WIP)",
            "description": "<h2>Cursus</h2><table><tr><td>Compétences Professionnelles</td><td>Grp. de comp.</td></tr><tr><td>Gouvernement</td><td>Compétence</td></tr><tr><td>Arts martiaux (mains nues)</td><td>Compétence</td></tr><tr><td>Médecine</td><td>Compétence</td></tr><tr><td><a class=\"compendium-link\" data-pack=\"l5r5e.core-techniques-ninjutsu\">(ninjutsu) Ninjutsu de rang 1-2</a> (prereq)</td><td>Tech. Grp.</td></tr><tr><td><a class=\"entity-link content-link\" draggable=\"true\" data-uuid=\"Compendium.l5r5e.core-techniques-rituals.L5RCoreRit000030\" data-pack=\"l5r5e.core-techniques-rituals\" data-id=\"L5RCoreRit000030\">(ritual) Imbue Thunder (WIP)</a> (prereq)</td><td>Technique</td></tr><tr><td><a class=\"entity-link content-link\" draggable=\"true\" data-uuid=\"Compendium.l5r5e.core-techniques-ninjutsu.L5RCoreNin000018\" data-pack=\"l5r5e.core-techniques-ninjutsu\" data-id=\"L5RCoreNin000018\">(ninjutsu) Wreak Havoc (WIP)</a> (prereq)</td><td>Technique</td></tr></table>",
            "book_reference": "Les Champs de la Victoire"
        },
        {
            "id": "Poet of War",
            "name": "Poet of War (WIP)",
            "description": "<h2>Cursus</h2><table><tr><td>Compétences Sociales</td><td>Grp. de comp.</td></tr><tr><td>Composition</td><td>Compétence</td></tr><tr><td>Culture</td><td>Compétence</td></tr><tr><td>Sentiments</td><td>Compétence</td></tr><tr><td><a class=\"compendium-link\" data-pack=\"l5r5e.core-techniques-shuji\">(shuji) Shuji du Feu de rang 1-2</a> (prereq)</td><td>Tech. Grp.</td></tr><tr><td><a class=\"entity-link content-link\" draggable=\"true\" data-uuid=\"Compendium.l5r5e.core-techniques-shuji.L5RCoreShu000072\" data-pack=\"l5r5e.core-techniques-shuji\" data-id=\"L5RCoreShu000072\">(shuji) Borrowed Courage (WIP)</a> (prereq)</td><td>Technique</td></tr><tr><td><a class=\"entity-link content-link\" draggable=\"true\" data-uuid=\"Compendium.l5r5e.core-techniques-shuji.L5RCoreShu000082\" data-pack=\"l5r5e.core-techniques-shuji\" data-id=\"L5RCoreShu000082\">(shuji) Coursing March Chant (WIP)</a> (prereq)</td><td>Technique</td></tr></table>",
            "book_reference": "Les Champs de la Victoire"
        },
        {
            "id": "Quartermaster",
            "name": "Quartermaster (WIP)",
            "description": "<h2>Cursus</h2><table><tr><td>Compétences Professionnelles</td><td>Grp. de comp.</td></tr><tr><td>Courtoisie</td><td>Compétence</td></tr><tr><td>Gouvernement</td><td>Compétence</td></tr><tr><td>Tactique</td><td>Compétence</td></tr><tr><td><a class=\"compendium-link\" data-pack=\"l5r5e.core-techniques-shuji\">(shuji) Shuji de l’Air de rang 1-2</a> (prereq)</td><td>Tech. Grp.</td></tr><tr><td><a class=\"compendium-link\" data-pack=\"l5r5e.core-techniques-shuji\">(shuji) Shuji de l’Eau de rang 1-2</a> (prereq)</td><td>Tech. Grp.</td></tr><tr><td><a class=\"entity-link content-link\" draggable=\"true\" data-uuid=\"Compendium.l5r5e.core-techniques-shuji.L5RCoreShu000075\" data-pack=\"l5r5e.core-techniques-shuji\" data-id=\"L5RCoreShu000075\">(shuji) Fortress of Necessity (WIP)</a> (prereq)</td><td>Technique</td></tr></table>",
            "book_reference": "Les Champs de la Victoire"
        },
        {
            "id": "Renowned Warrior",
            "name": "Renowned Warrior (WIP)",
            "description": "<h2>Cursus</h2><table><tr><td>Compétences Martiales</td><td>Grp. de comp.</td></tr><tr><td>Commandement</td><td>Compétence</td></tr><tr><td>Culture</td><td>Compétence</td></tr><tr><td>Représentations</td><td>Compétence</td></tr><tr><td><a class=\"compendium-link\" data-pack=\"l5r5e.core-techniques-kata\">(kata) Kata de rang 1-2</a> (prereq)</td><td>Tech. Grp.</td></tr><tr><td><a class=\"entity-link content-link\" draggable=\"true\" data-uuid=\"Compendium.l5r5e.core-techniques-kata.L5RCoreKat000003\" data-pack=\"l5r5e.core-techniques-kata\" data-id=\"L5RCoreKat000003\">(kata) Assaut en plein coeur</a> (prereq)</td><td>Technique</td></tr><tr><td><a class=\"entity-link content-link\" draggable=\"true\" data-uuid=\"Compendium.l5r5e.core-techniques-shuji.L5RCoreShu000079\" data-pack=\"l5r5e.core-techniques-shuji\" data-id=\"L5RCoreShu000079\">(shuji) Righteous Example (WIP)</a> (prereq)</td><td>Technique</td></tr></table>",
            "book_reference": "Les Champs de la Victoire"
        },
        {
            "id": "Spirit Caller",
            "name": "Spirit Caller (WIP)",
            "description": "<h2>Cursus</h2><table><tr><td>Compétences Savantes</td><td>Grp. de comp.</td></tr><tr><td>Courtoisie</td><td>Compétence</td></tr><tr><td>Méditation</td><td>Compétence</td></tr><tr><td>Représentations</td><td>Compétence</td></tr><tr><td><a class=\"compendium-link\" data-pack=\"l5r5e.core-techniques-rituals\">(ritual) Rituels de rang 1-2</a> (prereq)</td><td>Tech. Grp.</td></tr><tr><td><a class=\"entity-link content-link\" draggable=\"true\" data-uuid=\"Compendium.l5r5e.core-techniques-shuji.L5RCoreShu000010\" data-pack=\"l5r5e.core-techniques-shuji\" data-id=\"L5RCoreShu000010\">(shuji) Ascendance dévoilée</a> (prereq)</td><td>Technique</td></tr><tr><td><a class=\"entity-link content-link\" draggable=\"true\" data-uuid=\"Compendium.l5r5e.core-techniques-shuji.L5RCoreShu000083\" data-pack=\"l5r5e.core-techniques-shuji\" data-id=\"L5RCoreShu000083\">(shuji) Preserve Strength (WIP)</a> (prereq)</td><td>Technique</td></tr></table>",
            "book_reference": "Les Champs de la Victoire"
        },
        {
            "id": "Sumai Master",
            "name": "Sumai Master (WIP)",
            "description": "<h2>Cursus</h2><table><tr><td>Compétences Sociales</td><td>Grp. de comp.</td></tr><tr><td>Culture</td><td>Compétence</td></tr><tr><td>Arts martiaux (mains nues)</td><td>Compétence</td></tr><tr><td>Théologie</td><td>Compétence</td></tr><tr><td><a class=\"compendium-link\" data-pack=\"l5r5e.core-techniques-kata\">(kata) Kata de rang 1-2</a> (prereq)</td><td>Tech. Grp.</td></tr><tr><td><a class=\"entity-link content-link\" draggable=\"true\" data-uuid=\"Compendium.l5r5e.core-techniques-rituals.L5RCoreRit000026\" data-pack=\"l5r5e.core-techniques-rituals\" data-id=\"L5RCoreRit000026\">(ritual) Beseech Hida's MIght (WIP)</a> (prereq)</td><td>Technique</td></tr><tr><td><a class=\"entity-link content-link\" draggable=\"true\" data-uuid=\"Compendium.l5r5e.core-techniques-kata.L5RCoreKat000065\" data-pack=\"l5r5e.core-techniques-kata\" data-id=\"L5RCoreKat000065\">(kata) Fierce Badger Style (WIP)</a> (prereq)</td><td>Technique</td></tr></table>",
            "book_reference": "Les Champs de la Victoire"
        },
        {
            "id": "Sword Saint",
            "name": "Sword Saint (WIP)",
            "description": "<h2>Cursus</h2><table><tr><td>Arts martiaux (corps à corps)</td><td>Compétence</td></tr><tr><td>Méditation</td><td>Compétence</td></tr><tr><td>Forge</td><td>Compétence</td></tr><tr><td>Tactique</td><td>Compétence</td></tr><tr><td><a class=\"compendium-link\" data-pack=\"l5r5e.core-techniques-kata\">(kata) Kata (Combat Rapproché) de rang 1-5</a> (prereq)</td><td>Tech. Grp.</td></tr><tr><td><a class=\"entity-link content-link\" draggable=\"true\" data-uuid=\"Compendium.l5r5e.core-techniques-kata.L5RCoreKat000006\" data-pack=\"l5r5e.core-techniques-kata\" data-id=\"L5RCoreKat000006\">(kata) Destruction de l’âme</a> (prereq)</td><td>Technique</td></tr><tr><td><a class=\"entity-link content-link\" draggable=\"true\" data-uuid=\"Compendium.l5r5e.core-techniques-shuji.L5RCoreShu000087\" data-pack=\"l5r5e.core-techniques-shuji\" data-id=\"L5RCoreShu000087\">(shuji) Victory Without a Sword (WIP)</a> (prereq)</td><td>Technique</td></tr></table>",
            "book_reference": "Les Champs de la Victoire"
        },
        {
            "id": "War College Graduate",
            "name": "War College Graduate (WIP)",
            "description": "<h2>Cursus</h2><table><tr><td>Compétences Martiales</td><td>Grp. de comp.</td></tr><tr><td>Commandement</td><td>Compétence</td></tr><tr><td>Culture</td><td>Compétence</td></tr><tr><td>Gouvernement</td><td>Compétence</td></tr><tr><td><a class=\"compendium-link\" data-pack=\"l5r5e.core-techniques-kata\">(kata) Kata de rang 1-3</a> (prereq)</td><td>Tech. Grp.</td></tr><tr><td><a class=\"compendium-link\" data-pack=\"l5r5e.core-techniques-shuji\">(shuji) Shuji de rang 1-3</a> (prereq)</td><td>Tech. Grp.</td></tr><tr><td><a class=\"entity-link content-link\" draggable=\"true\" data-uuid=\"Compendium.l5r5e.core-techniques-rituals.L5RCoreRit000023\" data-pack=\"l5r5e.core-techniques-rituals\" data-id=\"L5RCoreRit000023\">(ritual) Beseech Akodo's Judgment (WIP)</a> (prereq)</td><td>Technique</td></tr></table>",
            "book_reference": "Les Champs de la Victoire"
        },
        {
            "id": "In Service to a Lord",
            "name": "Au service d’un seigneur",
            "description": "<h2>Cursus</h2><table><tr><td>Compétences Martiales</td><td>Grp. de comp.</td></tr><tr><td>Compétences Sociales</td><td>Grp. de comp.</td></tr><tr><td>Culture</td><td>Compétence</td></tr><tr><td>Gouvernement</td><td>Compétence</td></tr><tr><td><a class=\"compendium-link\" data-pack=\"l5r5e.core-techniques-kata\">(kata) Kata de rang 1-2</a> (prereq)</td><td>Tech. Grp.</td></tr><tr><td><a class=\"entity-link content-link\" draggable=\"true\" data-uuid=\"Compendium.l5r5e.core-techniques-shuji.L5RCoreShu000009\" data-pack=\"l5r5e.core-techniques-shuji\" data-id=\"L5RCoreShu000009\">(shuji) Proposition du loup</a> (prereq)</td><td>Technique</td></tr><tr><td><a class=\"entity-link content-link\" draggable=\"true\" data-uuid=\"Compendium.l5r5e.core-techniques-shuji.L5RCoreShu000066\" data-pack=\"l5r5e.core-techniques-shuji\" data-id=\"L5RCoreShu000066\">(shuji) Négociations fructueuses</a> (prereq)</td><td>Technique</td></tr></table>",
            "book_reference": "La Voie des Vagues p.185"
        },
        {
            "id": "Perfect Land Sect Member",
            "name": "Adepte de la Terre Parfaite",
            "description": "<h2>Cursus</h2><table><tr><td>Compétences Savantes</td><td>Grp. de comp.</td></tr><tr><td>Courtoisie</td><td>Compétence</td></tr><tr><td>Forme</td><td>Compétence</td></tr><tr><td>Travail manuel</td><td>Compétence</td></tr><tr><td><a class=\"compendium-link\" data-pack=\"l5r5e.core-techniques-shuji\">(shuji) Shuji de l’Eau de rang 1-2</a> (prereq)</td><td>Tech. Grp.</td></tr><tr><td><a class=\"entity-link content-link\" draggable=\"true\" data-uuid=\"Compendium.l5r5e.core-techniques-shuji.L5RCoreShu000070\" data-pack=\"l5r5e.core-techniques-shuji\" data-id=\"L5RCoreShu000070\">(shuji) Hurlement d’encouragement</a> (prereq)</td><td>Technique</td></tr><tr><td><a class=\"entity-link content-link\" draggable=\"true\" data-uuid=\"Compendium.l5r5e.core-techniques-shuji.L5RCoreShu000020\" data-pack=\"l5r5e.core-techniques-shuji\" data-id=\"L5RCoreShu000020\">(shuji) Cri de ralliement</a> (prereq)</td><td>Technique</td></tr></table>",
            "book_reference": "La Voie des Vagues p.186"
        },
        {
            "id": "Ghostlands Warrior",
            "name": "Guerrier des terres Spectrales",
            "description": "<h2>Cursus</h2><table><tr><td>Compétences Martiales</td><td>Grp. de comp.</td></tr><tr><td>Commandement</td><td>Compétence</td></tr><tr><td>Médecine</td><td>Compétence</td></tr><tr><td>Survie</td><td>Compétence</td></tr><tr><td><a class=\"entity-link content-link\" draggable=\"true\" data-uuid=\"Compendium.l5r5e.core-techniques-kiho.L5RCoreKih000003\" data-pack=\"l5r5e.core-techniques-kiho\" data-id=\"L5RCoreKih000003\">(kiho) La Terre voit sans yeux</a> (prereq)</td><td>Technique</td></tr><tr><td><a class=\"entity-link content-link\" draggable=\"true\" data-uuid=\"Compendium.l5r5e.core-techniques-kata.L5RCoreKat000009\" data-pack=\"l5r5e.core-techniques-kata\" data-id=\"L5RCoreKat000009\">(kata) Mortelle envolée</a> (prereq)</td><td>Technique</td></tr><tr><td><a class=\"entity-link content-link\" draggable=\"true\" data-uuid=\"Compendium.l5r5e.core-techniques-rituals.L5RCoreRit000018\" data-pack=\"l5r5e.core-techniques-rituals\" data-id=\"L5RCoreRit000018\">(ritual) Purification par le corail et l’or (Royaumes d’Ivoire)</a> (prereq)</td><td>Technique</td></tr></table>",
            "book_reference": "La Voie des Vagues p.186"
        },
        {
            "id": "Astradhari",
            "name": "Astradhari",
            "description": "<h2>Cursus</h2><table><tr><td>Compétences Savantes</td><td>Grp. de comp.</td></tr><tr><td>Compétences Martiales</td><td>Grp. de comp.</td></tr><tr><td>Commandement</td><td>Compétence</td></tr><tr><td>Courtoisie</td><td>Compétence</td></tr><tr><td><a class=\"compendium-link\" data-pack=\"l5r5e.core-techniques-rituals\">(ritual) Rituels de rang 1-3</a> (prereq)</td><td>Tech. Grp.</td></tr><tr><td><a class=\"entity-link content-link\" draggable=\"true\" data-uuid=\"Compendium.l5r5e.core-techniques-mantra.L5RCoreMan000001\" data-pack=\"l5r5e.core-techniques-mantra\" data-id=\"L5RCoreMan000001\">(mantra) Mantra de conjuration : [Nom de l’instrument]</a> (prereq)</td><td>Technique</td></tr><tr><td><a class=\"entity-link content-link\" draggable=\"true\" data-uuid=\"Compendium.l5r5e.core-techniques-shuji.L5RCoreShu000011\" data-pack=\"l5r5e.core-techniques-shuji\" data-id=\"L5RCoreShu000011\">(shuji) Courage exemplaire</a> (prereq)</td><td>Technique</td></tr></table>",
            "book_reference": "La Voie des Vagues p.187"
        },
        {
            "id": "Awakened Soul",
            "name": "Awakened Soul (WIP)",
            "description": "<h2>Cursus</h2><table><tr><td>Compétences Sociales</td><td>Grp. de comp.</td></tr><tr><td>Compétences Savantes</td><td>Grp. de comp.</td></tr><tr><td>Culture</td><td>Compétence</td></tr><tr><td>Méditation</td><td>Compétence</td></tr><tr><td>Survie</td><td>Compétence</td></tr><tr><td>Théologie</td><td>Compétence</td></tr><tr><td><a class=\"entity-link content-link\" draggable=\"true\" data-uuid=\"Compendium.l5r5e.core-techniques-kiho.L5RCoreKih000038\" data-pack=\"l5r5e.core-techniques-kiho\" data-id=\"L5RCoreKih000038\">(kiho) Eternal Mind’s Gate (WIP)</a> (prereq)</td><td>Technique</td></tr><tr><td><a class=\"entity-link content-link\" draggable=\"true\" data-uuid=\"Compendium.l5r5e.core-techniques-rituals.L5RCoreRit000035\" data-pack=\"l5r5e.core-techniques-rituals\" data-id=\"L5RCoreRit000035\">(ritual) Trance of Lives Past (WIP)</a> (prereq)</td><td>Technique</td></tr></table>",
            "book_reference": "Décret de la nature"
        },
        {
            "id": "Forester",
            "name": "Forester (WIP)",
            "description": "<h2>Cursus</h2><table><tr><td>Compétences Sociales</td><td>Grp. de comp.</td></tr><tr><td>Compétences Savantes</td><td>Grp. de comp.</td></tr><tr><td>Courtoisie</td><td>Compétence</td></tr><tr><td>Sentiments</td><td>Compétence</td></tr><tr><td>Survie</td><td>Compétence</td></tr><tr><td>Théologie</td><td>Compétence</td></tr><tr><td><a class=\"compendium-link\" data-pack=\"l5r5e.core-techniques-invocations\">(invocation) Invocations de la Terre ou de l’Eau de rang 1-2</a> (prereq)</td><td>Tech. Grp.</td></tr><tr><td><a class=\"compendium-link\" data-pack=\"l5r5e.core-techniques-shuji\">(shuji) Shuji de rang 1-3</a> (prereq)</td><td>Tech. Grp.</td></tr></table>",
            "book_reference": "Décret de la nature"
        },
        {
            "id": "Temple Abbot",
            "name": "Temple Abbot (WIP)",
            "description": "<h2>Cursus</h2><table><tr><td>Compétences Sociales</td><td>Grp. de comp.</td></tr><tr><td>Compétences Savantes</td><td>Grp. de comp.</td></tr><tr><td>Culture</td><td>Compétence</td></tr><tr><td>Méditation</td><td>Compétence</td></tr><tr><td>Théologie</td><td>Compétence</td></tr><tr><td><a class=\"entity-link content-link\" draggable=\"true\" data-uuid=\"Compendium.l5r5e.core-techniques-rituals.L5RCoreRit000004\" data-pack=\"l5r5e.core-techniques-rituals\" data-id=\"L5RCoreRit000004\">(ritual) Rite de purification</a> (prereq)</td><td>Technique</td></tr><tr><td><a class=\"entity-link content-link\" draggable=\"true\" data-uuid=\"Compendium.l5r5e.core-techniques-kiho.L5RCoreKih000025\" data-pack=\"l5r5e.core-techniques-kiho\" data-id=\"L5RCoreKih000025\">(kiho) Rejuvenating Breath (WIP)</a> (prereq)</td><td>Technique</td></tr><tr><td><a class=\"entity-link content-link\" draggable=\"true\" data-uuid=\"Compendium.l5r5e.core-techniques-shuji.L5RCoreShu000011\" data-pack=\"l5r5e.core-techniques-shuji\" data-id=\"L5RCoreShu000011\">(shuji) Courage exemplaire</a> (prereq)</td><td>Technique</td></tr></table>",
            "book_reference": "Décret de la nature"
        },
        {
            "id": "Yōkai Hunter",
            "name": "Yōkai Hunter (WIP)",
            "description": "<h2>Cursus</h2><table><tr><td>Compétences Savantes</td><td>Grp. de comp.</td></tr><tr><td>Compétences Martiales</td><td>Grp. de comp.</td></tr><tr><td>Commandement</td><td>Compétence</td></tr><tr><td>Courtoisie</td><td>Compétence</td></tr><tr><td>Survie</td><td>Compétence</td></tr><tr><td><a class=\"entity-link content-link\" draggable=\"true\" data-uuid=\"Compendium.l5r5e.core-techniques-kiho.L5RCoreKih000030\" data-pack=\"l5r5e.core-techniques-kiho\" data-id=\"L5RCoreKih000030\">(kiho) Blistering Retribution (WIP)</a> (prereq)</td><td>Technique</td></tr><tr><td><a class=\"entity-link content-link\" draggable=\"true\" data-uuid=\"Compendium.l5r5e.core-techniques-kata.L5RCoreKat000070\" data-pack=\"l5r5e.core-techniques-kata\" data-id=\"L5RCoreKat000070\">(kata) Swallow’s Dart Style (WIP)</a> (prereq)</td><td>Technique</td></tr><tr><td><a class=\"entity-link content-link\" draggable=\"true\" data-uuid=\"Compendium.l5r5e.core-techniques-kata.L5RCoreKat000071\" data-pack=\"l5r5e.core-techniques-kata\" data-id=\"L5RCoreKat000071\">(kata) Tiger’s Lunge Style (WIP)</a> (prereq)</td><td>Technique</td></tr></table>",
            "book_reference": "Décret de la nature"
        },
        {
            "id": "Bond with a spirit",
            "name": "Bond with a spirit (WIP)",
            "description": "<h2>Cursus</h2><table><tr><td>Compétences Savantes</td><td>Grp. de comp.</td></tr><tr><td>Esthétique</td><td>Compétence</td></tr><tr><td>Jeux</td><td>Compétence</td></tr><tr><td>Méditation</td><td>Compétence</td></tr><tr><td><a class=\"compendium-link\" data-pack=\"l5r5e.core-techniques-invocations\">(invocation) Invocations (Eléments de l'esprit) de rang 1</a> (prereq)</td><td>Tech. Grp.</td></tr><tr><td><a class=\"entity-link content-link\" draggable=\"true\" data-uuid=\"Compendium.l5r5e.core-techniques-rituals.L5RCoreRit000002\" data-pack=\"l5r5e.core-techniques-rituals\" data-id=\"L5RCoreRit000002\">(ritual) Communier avec les esprits</a> (prereq)</td><td>Technique</td></tr><tr><td><a class=\"entity-link content-link\" draggable=\"true\" data-uuid=\"Compendium.l5r5e.core-techniques-rituals.L5RCoreRit000022\" data-pack=\"l5r5e.core-techniques-rituals\" data-id=\"L5RCoreRit000022\">(ritual) Blessing of Fertile Fields (WIP)</a> (prereq)</td><td>Technique</td></tr></table>",
            "book_reference": "Les Royaumes Célestes"
        },
        {
            "id": "Moon cultist",
            "name": "Moon cultist (WIP)",
            "description": "<h2>Cursus</h2><table><tr><td>Compétences Savantes</td><td>Grp. de comp.</td></tr><tr><td>Composition</td><td>Compétence</td></tr><tr><td>Courtoisie</td><td>Compétence</td></tr><tr><td>Forme</td><td>Compétence</td></tr><tr><td><a class=\"compendium-link\" data-pack=\"l5r5e.core-techniques-invocations\">(invocation) Invocations de l’Eau de rang 1-2</a></td><td>Tech. Grp.</td></tr><tr><td><a class=\"entity-link content-link\" draggable=\"true\" data-uuid=\"Compendium.l5r5e.core-techniques-invocations.L5RCoreInv000052\" data-pack=\"l5r5e.core-techniques-invocations\" data-id=\"L5RCoreInv000052\">(invocation) Mains des marées</a> (prereq)</td><td>Technique</td></tr><tr><td><a class=\"entity-link content-link\" draggable=\"true\" data-uuid=\"Compendium.l5r5e.core-techniques-rituals.L5RCoreRit000010\" data-pack=\"l5r5e.core-techniques-rituals\" data-id=\"L5RCoreRit000010\">(ritual) Whispers to the Moon (Moon Cultist) (WIP)</a> (prereq)</td><td>Technique</td></tr></table>",
            "book_reference": "Les Royaumes Célestes"
        }
    ]
}
