{
    "label": "Modelli di Oggetti",
    "mapping": {
        "description": "system.description",
        "book_reference": "system.book_reference"
    },
    "entries": [
        {
            "id": "Kakita Pattern",
            "name": "Kakita Pattern",
            "description": "",
            "book_reference": "Terre dell'Ombra p.109"
        },
        {
            "id": "Kenzō Blade",
            "name": "Kenzō Blade",
            "description": "",
            "book_reference": "Terre dell'Ombra p.109"
        },
        {
            "id": "Shirogane Jade Inlay",
            "name": "Shirogane Jade Inlay",
            "description": "",
            "book_reference": "Terre dell'Ombra p.109"
        },
        {
            "id": "Uchema’s Technique",
            "name": "Uchema’s Technique",
            "description": "",
            "book_reference": "Terre dell'Ombra p.109"
        },
        {
            "id": "Yasunori Steel",
            "name": "Yasunori Steel",
            "description": "",
            "book_reference": "Terre dell'Ombra p.109"
        },
        {
            "id": "Akodo Pattern",
            "name": "Akodo Pattern",
            "description": "",
            "book_reference": "Fields of Victory"
        },
        {
            "id": "Burning Watter Pattern",
            "name": "Burning Watter Pattern",
            "description": "",
            "book_reference": "Fields of Victory"
        },
        {
            "id": "Concealment Pattern",
            "name": "Concealment Pattern",
            "description": "",
            "book_reference": "Fields of Victory"
        },
        {
            "id": "Deadly Fangs Pattern",
            "name": "Deadly Fangs Pattern",
            "description": "",
            "book_reference": "Fields of Victory"
        },
        {
            "id": "Fearsome Snarl Pattern",
            "name": "Fearsome Snarl Pattern",
            "description": "",
            "book_reference": "Fields of Victory"
        },
        {
            "id": "Ichirō Pattern",
            "name": "Ichirō Pattern",
            "description": "",
            "book_reference": "Fields of Victory"
        },
        {
            "id": "Mountain Silk Pattern",
            "name": "Mountain Silk Pattern",
            "description": "",
            "book_reference": "Fields of Victory"
        },
        {
            "id": "Screaming Fire Pattern",
            "name": "Screaming Fire Pattern",
            "description": "",
            "book_reference": "Fields of Victory"
        },
        {
            "id": "Toriyama's Endurance Pattern",
            "name": "Toriyama's Endurance Pattern",
            "description": "",
            "book_reference": "Fields of Victory"
        },
        {
            "id": "Spirit of the Qamarist Pattern",
            "name": "Spirit of the Qamarist Pattern",
            "description": "",
            "book_reference": "Sentiero delle Onde p.117"
        },
        {
            "id": "Ghostlands Yodhaniya Pattern",
            "name": "Ghostlands Yodhaniya Pattern",
            "description": "",
            "book_reference": "Sentiero delle Onde p.117"
        },
        {
            "id": "Kökejin’s Heart of the Wind Pattern",
            "name": "Kökejin’s Heart of the Wind Pattern",
            "description": "",
            "book_reference": "Sentiero delle Onde p.117"
        },
        {
            "id": "Agasha Pattern",
            "name": "Agasha Pattern",
            "description": "",
            "book_reference": "Reami Celesti"
        }
    ]
}
