{
    "label": "Techniques Ninjutsu",
    "mapping": {
        "description": "system.description",
        "book_reference": "system.book_reference"
    },
    "entries": [
        {
            "id": "Deadly Sting",
            "name": "Dard mortel",
            "description": "",
            "book_reference": "Livre de Règles p.226"
        },
        {
            "id": "Skulk",
            "name": "Disparition",
            "description": "",
            "book_reference": "Livre de Règles p.226"
        },
        {
            "id": "Silencing Stroke",
            "name": "Neutralisation",
            "description": "",
            "book_reference": "Livre de Règles p.227"
        },
        {
            "id": "Noxious Cloud",
            "name": "Nuage toxique",
            "description": "",
            "book_reference": "Livre de Règles p.227"
        },
        {
            "id": "Artful Alibi",
            "name": "Alibi artistique",
            "description": "",
            "book_reference": "Les Cours de Pierre p.114"
        },
        {
            "id": "Cunning Distraction",
            "name": "Distraction fourbe",
            "description": "",
            "book_reference": "Les Cours de Pierre p.115"
        },
        {
            "id": "Deceitful Strike",
            "name": "Coup malhonnête",
            "description": "",
            "book_reference": "Les Cours de Pierre p.115"
        },
        {
            "id": "Like a Ghost",
            "name": "Tel un fantôme",
            "description": "",
            "book_reference": "Les Cours de Pierre p.116"
        },
        {
            "id": "Silent Elimination",
            "name": "Immobilisation silencieuse",
            "description": "",
            "book_reference": "Les Cours de Pierre p.115"
        },
        {
            "id": "Slicing Wind Kick",
            "name": "Coup de pied tourbillonnant",
            "description": "",
            "book_reference": "Les Cours de Pierre p.114"
        },
        {
            "id": "Stillness of Death",
            "name": "Quiétude de la mort",
            "description": "",
            "book_reference": "Les Cours de Pierre p.116"
        },
        {
            "id": "To Float or Sink",
            "name": "Flotter ou sombrer",
            "description": "",
            "book_reference": "Les Cours de Pierre p.115"
        },
        {
            "id": "What's Yours is Mine",
            "name": "Ce qui est à toi est à moi",
            "description": "",
            "book_reference": "Les Cours de Pierre p.114"
        },
        {
            "id": "Employ Terrible Thunder",
            "name": "Employ Terrible Thunder (WIP)",
            "description": "",
            "book_reference": "Les Champs de la Victoire"
        },
        {
            "id": "Swift Scouting",
            "name": "Swift Scouting (WIP)",
            "description": "",
            "book_reference": "Les Champs de la Victoire"
        },
        {
            "id": "The Patient Viper",
            "name": "The Patient Viper (WIP)",
            "description": "",
            "book_reference": "Les Champs de la Victoire"
        },
        {
            "id": "Vanish in the Shadows",
            "name": "Vanish in the Shadows (WIP)",
            "description": "",
            "book_reference": "Les Champs de la Victoire"
        },
        {
            "id": "Wreak Havoc",
            "name": "Wreak Havoc (WIP)",
            "description": "",
            "book_reference": "Les Champs de la Victoire"
        }
    ]
}
