{
  "version": 2,
  "projects": {
    "d3graph": {
      "root": "apps/d3graph",
      "sourceRoot": "apps/d3graph/src",
      "projectType": "application",
      "targets": {
        "build": {
          "executor": "@nrwl/web:build",
          "outputs": ["{options.outputPath}"],
          "options": {
            "outputPath": "dist/apps/d3graph",
            "index": "apps/d3graph/src/index.html",
            "main": "apps/d3graph/src/main.tsx",
            "polyfills": "apps/d3graph/src/polyfills.ts",
            "tsConfig": "apps/d3graph/tsconfig.app.json",
            "assets": [
              "apps/d3graph/src/favicon.ico",
              "apps/d3graph/src/assets"
            ],
            "styles": [],
            "scripts": [],
            "webpackConfig": "@nrwl/react/plugins/webpack"
          },
          "configurations": {
            "production": {
              "fileReplacements": [
                {
                  "replace": "apps/d3graph/src/environments/environment.ts",
                  "with": "apps/d3graph/src/environments/environment.prod.ts"
                }
              ],
              "optimization": true,
              "outputHashing": "all",
              "sourceMap": false,
              "extractCss": true,
              "namedChunks": false,
              "extractLicenses": true,
              "vendorChunk": false,
              "budgets": [
                {
                  "type": "initial",
                  "maximumWarning": "500kb",
                  "maximumError": "1mb"
                }
              ]
            }
          }
        },
        "serve": {
          "executor": "@nrwl/web:dev-server",
          "options": {
            "buildTarget": "d3graph:build",
            "hmr": true
          },
          "configurations": {
            "production": {
              "buildTarget": "d3graph:build:production",
              "hmr": false
            }
          }
        },
        "lint": {
          "executor": "@nrwl/linter:eslint",
          "outputs": ["{options.outputFile}"],
          "options": {
            "lintFilePatterns": ["apps/d3graph/**/*.{ts,tsx,js,jsx}"]
          }
        },
        "test": {
          "executor": "@nrwl/jest:jest",
          "outputs": ["coverage/apps/d3graph"],
          "options": {
            "jestConfig": "apps/d3graph/jest.config.js",
            "passWithNoTests": true
          }
        }
      }
    },
    "d3graph-e2e": {
      "root": "apps/d3graph-e2e",
      "sourceRoot": "apps/d3graph-e2e/src",
      "projectType": "application",
      "targets": {
        "e2e": {
          "executor": "@nrwl/cypress:cypress",
          "options": {
            "cypressConfig": "apps/d3graph-e2e/cypress.json",
            "devServerTarget": "d3graph:serve",
            "tsConfig": "apps/d3graph-e2e/tsconfig.json"
          },
          "configurations": {
            "production": {
              "devServerTarget": "d3graph:serve:production"
            }
          }
        },
        "lint": {
          "executor": "@nrwl/linter:eslint",
          "outputs": ["{options.outputFile}"],
          "options": {
            "lintFilePatterns": ["apps/d3graph-e2e/**/*.{js,ts}"]
          }
        }
      }
    },
    "features-bar-chart": {
      "root": "libs/features/bar-chart",
      "sourceRoot": "libs/features/bar-chart/src",
      "projectType": "library",
      "targets": {
        "lint": {
          "executor": "@nrwl/linter:eslint",
          "outputs": ["{options.outputFile}"],
          "options": {
            "lintFilePatterns": ["libs/features/bar-chart/**/*.{ts,tsx,js,jsx}"]
          }
        }
      }
    },
    "features-bar-chart-jsx": {
      "root": "libs/features/bar-chart-jsx",
      "sourceRoot": "libs/features/bar-chart-jsx/src",
      "projectType": "library",
      "targets": {
        "lint": {
          "executor": "@nrwl/linter:eslint",
          "outputs": ["{options.outputFile}"],
          "options": {
            "lintFilePatterns": [
              "libs/features/bar-chart-jsx/**/*.{ts,tsx,js,jsx}"
            ]
          }
        },
        "test": {
          "executor": "@nrwl/jest:jest",
          "outputs": ["coverage/libs/features/bar-chart-jsx"],
          "options": {
            "jestConfig": "libs/features/bar-chart-jsx/jest.config.js",
            "passWithNoTests": true
          }
        }
      }
    }
  },
  "cli": {
    "defaultCollection": "@nrwl/react"
  },
  "generators": {
    "@nrwl/react": {
      "application": {
        "style": "styled-components",
        "linter": "eslint",
        "babel": true
      },
      "component": {
        "style": "styled-components"
      },
      "library": {
        "style": "styled-components",
        "linter": "eslint"
      }
    }
  },
  "defaultProject": "d3graph"
}
