{
    "app-id" : "com.gitlab.maciej.czekaj.mail",
    "runtime" : "org.gnome.Platform",
    "runtime-version" : "45",
    "sdk" : "org.gnome.Sdk",
    "sdk-extensions" : [
        "org.freedesktop.Sdk.Extension.rust-stable"
    ],
    "command" : "mail",
    "finish-args" : [
        "--share=network",
        "--share=ipc",
        "--socket=fallback-x11",
        "--device=dri",
        "--socket=wayland"
    ],
    "build-options" : {
        "append-path" : "/usr/lib/sdk/rust-stable/bin",
        "build-args" : [
            "--share=network"
        ],
        "env" : {
            "RUST_BACKTRACE" : "1",
            "RUST_LOG" : "mail=debug"
        }
    },
    "cleanup" : [
        "/include",
        "/lib/pkgconfig",
        "/man",
        "/share/doc",
        "/share/gtk-doc",
        "/share/man",
        "/share/pkgconfig",
        "*.la",
        "*.a"
    ],
    "modules" : [
        {
            "name": "blueprint-compiler",
            "buildsystem": "meson",
            "cleanup": ["*"],
            "sources": [
                {
                    "type": "git",
                    "url": "https://gitlab.gnome.org/jwestman/blueprint-compiler",
                    "tag": "v0.10.0"
                }
            ]
        },
        {
            "name" : "mail",
            "builddir" : true,
            "buildsystem" : "meson",
            "sources" : [
                {
                    "type" : "git",
                    "url" : "file:///home/maciejczekaj/Projects"
                }
            ]
        }
    ]
}
