"San Francisco, CA",37.7790262,-122.419906
"Clarksburg/Fairmont, WV",39.2798118,-80.3300893
"State College, PA",40.7944504,-77.8616386
"Laramie, WY",41.311367,-105.591101
"Bethel, AK",60.7922222,-161.7558333
"Fort Myers, FL",26.640628,-81.8723084
"Dallas/Fort Worth, TX",32.89651945,-97.0465220537124
"Valdosta, GA",30.8327022,-83.2784851
"Lafayette, LA",30.2240897,-92.0198427
"Akron, OH",41.083064,-81.518485
"Fargo, ND",46.877229,-96.789821
"Hattiesburg/Laurel, MS",31.4672,-89.3363366
"Pocatello, ID",42.8620287,-112.450627
"Fort Leonard Wood, MO",37.701139999999995,-92.16933029454009
"Sacramento, CA",38.5810606,-121.493895
"Grand Rapids, MI",42.9632405,-85.6678639
"Baltimore, MD",39.2908816,-76.610759
"Santa Maria, CA",34.9531295,-120.4358577
"Madison, WI",43.074761,-89.3837613
"Portland, OR",45.5202471,-122.6741949
"Amarillo, TX",35.2072185,-101.8338246
"Mammoth Lakes, CA",37.6432525,-118.9668509
"Del Rio, TX",29.3655405,-100.894698
"Allentown/Bethlehem/Easton, PA",40.651163100000005,-75.44225386838299
"Concord, NC",35.4094178,-80.5800049
"Aguadilla, PR",18.4274359,-67.1541343
"Ontario, CA",50.000678,-86.000977
"Miami, FL",25.7741728,-80.19362
"Harrisburg, PA",40.2663107,-76.8861122
"Sanford, FL",28.8117345,-81.2680223
"Cold Bay, AK",55.199447500000005,-162.74047820061134
"Kearney, NE",40.4906216,-98.9472344
"Killeen, TX",31.1171441,-97.727796
"Hays, KS",38.8791783,-99.3267702
"Sheridan, WY",44.780021500000004,-106.95081072295685
"Peoria, IL",40.6938609,-89.5891008
"International Falls, MN",48.601033,-93.4105904
"St. Augustine, FL",29.8946952,-81.3145395
"Staunton, VA",38.1495947,-79.072557
"Decatur, IL",39.8454163,-88.9524151
"Dothan, AL",31.2237434,-85.3933906
"Islip, NY",40.7287274,-73.21360733221161
"Atlanta, GA",33.7489924,-84.3902644
"Wilmington, DE",39.7459468,-75.546589
"Columbus, OH",39.9622601,-83.0007065
"Rapid City, SD",44.0869329,-103.2274481
"Butte, MT",46.0131505,-112.536508
"Bend/Redmond, OR",44.2165084,-121.2150324
"Long Beach, CA",33.7690164,-118.191604
"Los Angeles, CA",34.0536909,-118.242766
"Erie, PA",42.1294712,-80.0852695
"Petersburg, AK",56.8127965,-132.95547
"San Diego, CA",32.7174202,-117.1627728
"Cedar City, UT",37.6774238,-113.061827
"Hyannis, MA",41.651513,-70.2825918
"Santa Fe, NM",35.6876096,-105.9384569
"Minot, ND",48.23251,-101.296273
"Cleveland, OH",41.4996562,-81.6936813
"Garden City, KS",37.9716898,-100.8726618
"Dayton, OH",39.7589478,-84.1916069
"Lincoln, NE",40.8088861,-96.7077751
"Kalamazoo, MI",42.291707,-85.5872286
"Hobbs, NM",32.707667,-103.1311314
"Grand Island, NE",40.924271,-98.338685
"Lubbock, TX",33.5635206,-101.879336
"West Yellowstone, MT",44.6632505,-111.101169
"Ketchikan, AK",55.3430696,-131.6466819
"Fort Wayne, IN",41.0799898,-85.1386015
"Everett, WA",47.9673056,-122.2013998
"Casper, WY",42.8501191,-106.325138
"Greenville, NC",35.613224,-77.3724593
"Plattsburgh, NY",44.69282,-73.45562
"Columbus, MS",33.4956744,-88.4272627
"Eagle, CO",39.6161124,-106.7172844
"Waterloo, IA",42.4979693,-92.3329637
"Spokane, WA",47.6571934,-117.4235106
"Monterey, CA",36.2231079,-121.3877428
"Bullhead City, AZ",35.1477774,-114.5682983
"Scranton/Wilkes-Barre, PA",41.33709205,-75.72257122928625
"Las Vegas, NV",36.1672559,-115.148516
"Brainerd, MN",46.3580221,-94.2008288
"Latrobe, PA",40.317287,-79.3840301
"Birmingham, AL",33.5206824,-86.8024326
"Newark, NJ",40.735657,-74.1723667
"Philadelphia, PA",39.9527237,-75.1635262
"Melbourne, FL",28.106471,-80.6371513
"Valparaiso, FL",30.5085309,-86.5027282
"Salt Lake City, UT",40.7596198,-111.8867975
"St. Petersburg, FL",27.7703796,-82.6695085
"Champaign/Urbana, IL",40.1157948,-88.241194
"Asheville, NC",35.6009498,-82.5540161
"Adak Island, AK",51.7961654,-176.5734916431957
"Nome, AK",64.4989922,-165.39879944316317
"Bloomington/Normal, IL",40.508752,-88.9844947
"Hibbing, MN",47.427155,-92.937689
"Rhinelander, WI",45.636623,-89.412075
"Binghamton, NY",42.0987125,-75.9125262
"Jacksonville/Camp Lejeune, NC",34.776723700000005,-77.38982677904275
"Springfield, IL",39.7990175,-89.6439575
"Wenatchee, WA",47.4234599,-120.3103494
"Brownsville, TX",25.9140256,-97.4890856
"Yakima, WA",46.601557,-120.510842
"Flagstaff, AZ",35.1987522,-111.6518229
"College Station/Bryan, TX",30.63009225,-96.33683659611643
"Portsmouth, NH",43.0702223,-70.7548621
"Williamsport, PA",41.2493292,-77.0027671
"West Palm Beach/Palm Beach, FL",26.715364,-80.0532942
"Sioux City, IA",42.4966815,-96.4058782
"Redding, CA",40.5863563,-122.391675
"Greer, SC",34.9381361,-82.2272119
"Jackson/Vicksburg, MS",32.3919624,-90.8653227
"San Angelo, TX",31.4649685,-100.4405094
"Texarkana, AR",33.4254259,-94.0430937
"Martha's Vineyard, MA",41.3918832,-70.62085427857699
"Burbank, CA",34.1816482,-118.3258554
"Stillwater, OK",36.1156306,-97.0585717
"Wichita Falls, TX",33.9137085,-98.4933873
"Pasco/Kennewick/Richland, WA",46.1742404,-119.0693344
"Pittsburgh, PA",40.4416941,-79.9900861
"Santa Rosa, CA",38.4404925,-122.7141049
"Quincy, IL",39.9356016,-91.4098727
"Denver, CO",39.7392364,-104.9848623
"Albuquerque, NM",35.0841034,-106.650985
"Lake Charles, LA",30.2265949,-93.2173759
"Belleville, IL",38.5200504,-89.9839935
"Guam, TT",7.0697092,125.5135578
"Tallahassee, FL",30.4380832,-84.2809332
"Durango, CO",37.2395367,-107.82158179169292
"Hilton Head, SC",32.1618488,-80.7512616
"Victoria, TX",28.8026443,-96.9766308
"Pellston, MI",45.552789,-84.783936
"Barrow, AK",71.387113,-156.4809618
"Sioux Falls, SD",43.5460587,-96.7313928
"San Juan, PR",-8.6691267,-77.62633440117426
"Medford, OR",42.3264181,-122.8718605
"Bemidji, MN",47.4785418,-94.8907869
"Fort Collins/Loveland, CO",40.44938465,-105.00740840168561
"Tulsa, OK",36.1556805,-95.9929113
"Norfolk, VA",36.8968052,-76.2602336
"North Platte, NE",41.1238873,-100.7654232
"Albany, NY",42.6511674,-73.754968
"Green Bay, WI",44.5126379,-88.0125794
"El Paso, TX",31.7754152,-106.464634
"Great Falls, MT",47.5048851,-111.29189
"Pueblo, CO",38.2544472,-104.609141
"Joplin, MO",37.08418,-94.51323
"Charleston, SC",32.7876012,-79.9402728
"Washington, DC",38.8950368,-77.0365427
"Cheyenne, WY",41.139981,-104.820246
"Montrose/Delta, CO",38.4011838,-107.844926
"Niagara Falls, NY",43.08436,-79.0614686
"Gunnison, CO",38.6476702,-107.0603126
"Youngstown/Warren, OH",41.26073745,-80.67497084511017
"Rochester, MN",44.0234387,-92.4630182
"Tyler, TX",32.3512601,-95.3010624
"Fort Smith, AR",35.3872218,-94.4248983
"Burlington, VT",44.4761601,-73.212906
"Wilmington, NC",34.2257282,-77.9447107
"Idaho Falls, ID",43.4887907,-112.03628
"Houston, TX",29.7589382,-95.3676974
"Lewisburg, WV",37.8017879,-80.4456303
"Lansing, MI",42.7337712,-84.5553805
"Ithaca/Cortland, NY",42.442585,-76.4695584
"Hayden, CO",47.7590638,-116.7866807
"Eugene, OR",44.0505054,-123.0950506
"Pullman, WA",46.7304268,-117.173895
"Lawton/Fort Sill, OK",34.569849500000004,-98.41812229900623
"Evansville, IN",37.9747645,-87.5558483
"Dickinson, ND",46.8791756,-102.7896242
"San Luis Obispo, CA",35.3540209,-120.3757163
"Boise, ID",43.6166163,-116.200886
"Florence, SC",34.1984435,-79.7671658
"Oakland, CA",37.8044557,-122.2713563
"Gainesville, FL",29.6519684,-82.3249846
"Corpus Christi, TX",27.7951482,-97.3942053
"Gustavus, AK",58.4128377,-135.7375654
"Moline, IL",41.5067003,-90.5151342
"Kona, HI",19.6472213,-155.9966428
"Charlotte, NC",35.2272086,-80.8430827
"Aberdeen, SD",45.4649805,-98.487813
"Monroe, LA",31.5593935,-87.3781004
"Honolulu, HI",21.304547,-157.855676
"Christiansted, VI",17.7439481,-64.7079823
"Boston, MA",42.3602534,-71.0582912
"Hagerstown, MD",39.6419219,-77.7202641
"Tampa, FL",27.9477595,-82.458444
"Toledo, OH",41.6529143,-83.5378173
"New Haven, CT",41.3082138,-72.9250518
"Fort Dodge, IA",42.4974694,-94.1680158
"Ashland, WV",37.4084488,-81.3526017
"Wrangell, AK",56.4706022,-132.3829431
"St. Cloud, MN",45.5616075,-94.1642004
"Buffalo, NY",42.8867166,-78.8783922
"Muskegon, MI",43.2341813,-86.2483921
"Roswell, NM",33.3943282,-104.5229518
"Fayetteville, AR",36.0625843,-94.1574328
"Fresno, CA",36.7295295,-119.70886126075588
"Kansas City, MO",39.100105,-94.5781416
"Escanaba, MI",45.7455707,-87.0647434
"Springfield, MO",37.2166779,-93.2920373
"Key West, FL",24.5625566,-81.7724368
"Little Rock, AR",34.7465071,-92.2896267
"Waco, TX",31.549333,-97.1466695
"Indianapolis, IN",39.7683331,-86.1583502
"Rockford, IL",42.2713945,-89.093966
"Bellingham, WA",48.7544012,-122.4788361
"Saipan, TT",34.15719,-119.199293
"San Antonio, TX",29.4246002,-98.4951405
"Bozeman, MT",45.6794293,-111.044047
"Manhattan/Ft. Riley, KS",39.1742555,-96.5766636
"Santa Barbara, CA",34.4221319,-119.7026673
"Columbus, GA",32.4610708,-84.9880449
"Provo, UT",40.2338438,-111.6585337
"Lewiston, ID",46.4195913,-117.0216144
"Lexington, KY",38.0464066,-84.4970393
"Albany, GA",31.5782062,-84.1556809
"Kahului, HI",20.8747708,-156.4529879461996
"Charlotte Amalie, VI",18.341137,-64.932789
"Harlingen/San Benito, TX",26.157512699999998,-97.67528781954634
"Nantucket, MA",41.315731400000004,-70.00901408779944
"Elko, NV",41.1958128,-115.3272864
"Ogdensburg, NY",44.694285,-75.486374
"Jackson, WY",43.479965,-110.761815
"Montgomery, AL",32.3669656,-86.3006485
"King Salmon, AK",58.7551615,-156.5192469940953
"Knoxville, TN",35.9603948,-83.9210261
"Pierre, SD",44.3683644,-100.3511367
"Jamestown, ND",46.910544,-98.708436
"Watertown, SD",44.899211,-97.115289
"Cincinnati, OH",39.1014537,-84.5124602
"Mobile, AL",30.6943566,-88.0430541
"Gulfport/Biloxi, MS",30.40711375,-89.07143302103171
"New Orleans, LA",29.9759983,-90.0782127
"Kodiak, AK",57.79,-152.4072222
"Sitka, AK",57.0524973,-135.337612
"Alexandria, LA",31.311248,-92.4449087
"Manchester, NH",42.9956397,-71.4547891
"Santa Ana, CA",33.7494951,-117.8732213
"Memphis, TN",35.1490215,-90.0516285
"Twin Falls, ID",42.5704456,-114.4602554
"Johnstown, PA",40.3267407,-78.9219698
"Sault Ste. Marie, MI",46.490586,-84.359269
"Fayetteville, NC",35.0525759,-78.878292
"Lihue, HI",21.9769622,-159.3687721
"Columbia, MO",38.9464035,-92.3484631580807
"Myrtle Beach, SC",33.6956461,-78.8900409
"Appleton, WI",44.2613967,-88.4069744
"Austin, TX",30.2711286,-97.7436995
"Mason City, IA",43.1535728,-93.2010367
"Oklahoma City, OK",35.4729886,-97.5170536
"North Bend/Coos Bay, OR",43.41549325,-124.2434654166912
"Dillingham, AK",59.0397222,-158.4575
"Greensboro/High Point, NC",36.06146415,-79.96049948393258
"Yuma, AZ",32.665135,-114.47603157249804
"Lynchburg, VA",37.4137536,-79.1422464
"Roanoke, VA",37.270973,-79.9414313
"Watertown, NY",43.9747838,-75.9107565
"Richmond, VA",37.5385087,-77.43428
"Fort Lauderdale, FL",26.1223084,-80.1433786
"Elmira/Corning, NY",42.1608441,-76.89199038453467
"Rochester, NY",43.157285,-77.615214
"Flint, MI",43.0161693,-83.6900211
"Hartford, CT",41.764582,-72.6908547
"Dodge City, KS",37.7527982,-100.0170787
"St. Louis, MO",38.6264256,-90.1995853
"Bakersfield, CA",35.3738712,-119.0194639
"Chicago, IL",41.8755616,-87.6244212
"Baton Rouge, LA",30.4459596,-91.18738
"Duluth, MN",46.7729322,-92.1251218
"Charleston/Dunbar, WV",38.3616659,-81.7207214
"Laredo, TX",27.5236998,-99.497352
"Hilo, HI",19.7073734,-155.0815803
"Paducah, KY",37.0833893,-88.6000478
"Kotzebue, AK",66.8982057,-162.5977621
"Moab, UT",38.5738096,-109.5462146
"Midland/Odessa, TX",31.8329723,-102.3606957
"Grand Junction, CO",39.063956,-108.5507317
"Deadhorse, AK",70.2006973,-148.4598151
"Punta Gorda, FL",26.9297836,-82.0453664
"Missoula, MT",46.8701049,-113.995267
"San Jose, CA",37.3361905,-121.890583
"Milwaukee, WI",43.0349931,-87.922497
"La Crosse, WI",43.8014053,-91.2395429
"Eau Claire, WI",44.811349,-91.4984941
"Palm Springs, CA",33.772179449999996,-116.49529769785079
"Shreveport, LA",32.5221828,-93.7651944
"Stockton, CA",37.9577016,-121.2907796
"Vernal, UT",40.4556825,-109.5284741
"Walla Walla, WA",46.0667277,-118.3393456
"South Bend, IN",41.6833813,-86.2500066
"Nashville, TN",36.1622767,-86.7742984
"Williston, ND",48.1465457,-103.621814
"Traverse City, MI",44.7606441,-85.6165301
"Colorado Springs, CO",38.8339578,-104.825348
"Scottsbluff, NE",41.862302,-103.6627088
"New York, NY",40.7127281,-74.0060152
"CONCORD, NC",35.4094178,-80.5800049
"Wichita, KS",37.6922361,-97.3375448
"Gillette, WY",44.290635,-105.501876
"Carlsbad, CA",33.1580933,-117.3505966
"Owensboro, KY",37.7742152,-87.1133304
"Louisville, KY",38.2542376,-85.759407
"Chattanooga, TN",35.0457219,-85.3094883
"Orlando, FL",28.5421109,-81.3790304
"Juneau, AK",58.3019496,-134.419734
"Ponce, PR",18.0067916,-66.61341064394503
"Brunswick, GA",31.1499528,-81.4914894
"Tucson, AZ",32.2228765,-110.9748477
"Savannah, GA",32.0809263,-81.0911768
"Pago Pago, TT",-14.2754786,-170.7048298
"Cordova, AK",60.5439444,-145.75891
"Panama City, FL",30.1600827,-85.6545729
"Ogden, UT",41.2230048,-111.9738429
"Beaumont/Port Arthur, TX",29.878116,-93.940555
"Fairbanks, AK",64.82897449999999,-147.66991691593407
"Raleigh/Durham, NC",35.880361449999995,-78.78723821716514
"Salina, KS",38.8402805,-97.6114237
"Omaha, NE",41.2587459,-95.9383758
"Kalispell, MT",48.202158,-114.315321
"Dallas, TX",32.7762719,-96.7968559
"Yakutat, AK",59.572734499999996,-139.57831243878087
"Grand Forks, ND",47.9078244,-97.0592028
"Alpena, MI",45.0176181,-83.6670019
"Billings, MT",45.7874957,-108.49607
"Atlantic City, NJ",39.3642852,-74.4229351
"Wendover, UT",40.7374014,-114.0304541
"Abilene, TX",32.44645,-99.7475905
"Bismarck/Mandan, ND",46.8005474,-100.8260757
"Worcester, MA",42.2625621,-71.8018877
"Detroit, MI",42.3315509,-83.0466403
"Aspen, CO",39.1911128,-106.8235606
"Providence, RI",41.8239891,-71.4128343
"Prescott, AZ",34.5399962,-112.4687616
"St. George, UT",37.104153,-113.5841313
"Minneapolis, MN",44.9772995,-93.2654692
"Tokeen, AK",55.9928603,-133.4617903
"Daytona Beach, FL",29.2108147,-81.0228331
"Jacksonville, FL",30.3321838,-81.655651
"Cody, WY",44.5263107,-109.056392
"Meridian, MS",32.3643098,-88.703656
"Rock Springs, WY",41.5860557,-109.2194544
"Liberal, KS",37.0430812,-100.920999
"Seattle, WA",47.6038321,-122.3300624
"Marquette, MI",46.4481521,-87.6305899
"Alamosa, CO",37.5780995,-105.7890452
"Bangor, ME",44.8011821,-68.7778138
"Arcata/Eureka, CA",40.9763645,-124.10842589937442
"Anchorage, AK",61.2163129,-149.894852
"Charlottesville, VA",38.029306,-78.4766781
"Portland, ME",43.6610277,-70.2548596
"Branson, MO",36.6411357,-93.2175285
"Pensacola, FL",30.421309,-87.2169149
"Hancock/Houghton, MI",47.126871,-88.580956
"Columbia, SC",34.0007493,-81.0343313
"Crescent City, CA",41.755948,-124.201747
"Huntsville, AL",34.729847,-86.5859011
"Reno, NV",39.5261206,-119.8126581
"Phoenix, AZ",33.4484367,-112.0741417
"Newport News/Williamsburg, VA",37.132296499999995,-76.49401292414504
"Longview, TX",32.5007031,-94.74049
"Cape Girardeau, MO",37.3034933,-89.5230357
"Syracuse, NY",43.0481221,-76.1474244
"Helena, MT",46.5927425,-112.036277
"Mosinee, WI",44.7927298,-89.7035959
"White Plains, NY",41.0339862,-73.7629097
"Des Moines, IA",41.5910323,-93.6046655
"Devils Lake, ND",48.112779,-98.86512
"Trenton, NJ",40.2170575,-74.7429463
"Dubuque, IA",42.5006243,-90.6647985
"Augusta, GA",33.4709714,-81.9748429
"Sarasota/Bradenton, FL",27.395988350000003,-82.55407423064528
"Bristol/Johnson City/Kingsport, TN",36.550238,-82.5594293
"Mission/McAllen/Edinburg, TX",26.3013982,-98.1624501
"Riverton/Lander, WY",42.8330755,-108.730702
"Newburgh/Poughkeepsie, NY",41.7065539,-73.9283672
"Sun Valley/Hailey/Ketchum, ID",43.680741,-114.363662
"New Bern/Morehead/Beaufort, NC",34.7180601,-76.6591587
"Saginaw/Bay City/Midland, MI",32.023939549999994,-102.09648921925708
"Cedar Rapids/Iowa City, IA",41.6612561,-91.5299106
"Iron Mountain/Kingsfd, MI",45.820233,-88.06596
