{
  "name": "gordon_wird_geladen",
  "chapter": {
    "chapter": [
      {
        "name": "INTRO",
        "path": [
          "red",
          "main"
        ],
        "color": "teal",
        "view": {
          "id": "5c05db55-b255-4c7e-be93-67d9b7bd16ce",
          "position": {
            "x": 390,
            "y": 40
          }
        },
        "time": {
          "timeout": "15",
          "next": "VORSTELLUNG"
        },
        "send_message": [
          {
            "agent": "Gordon",
            "to": "Player",
            "text": "Hi, ich bin Gordon! Das hier ist die allererste Nachricht, die ich rausschicke, sobald sich jemand mit dem richtigen Kennwort bei mir meldet. Gleich bestimmst du, was ich an dieser Stelle sage! Für den Anfang bietet sich eventuell sowas wie \"Hallo\" oder \"Hi\" an, aber da will ich dir nicht reinreden. "
          }
        ],
        "comment": "Gordons erste Nachricht"
      },
      {
        "name": "WANNAPLAY_WIN_TIMEOUT",
        "path": [
          "red",
          "main"
        ],
        "color": "teal",
        "view": {
          "position": {
            "x": 2260,
            "y": 40
          },
          "id": "446f6018-cc0b-4a0a-9e03-ba5335c3f9d4"
        },
        "time": {
          "timeout": "15",
          "next": "WANNAPLAY_WIN"
        }
      },
      {
        "name": "WANNAPLAY_LOSE_TIMEOUT",
        "path": [
          "red",
          "main"
        ],
        "color": "teal",
        "view": {
          "id": "cbcbdc10-2269-4416-ac7c-cc26331f5371",
          "position": {
            "x": 1940,
            "y": 540
          }
        },
        "time": {
          "timeout": "10",
          "next": "WANNAPLAY_LOSE"
        }
      },
      {
        "name": "QUESTION_LOSE_TIMEOUT",
        "path": [
          "red",
          "main"
        ],
        "color": "teal",
        "view": {
          "id": "71b79d9a-e566-4a49-b4f9-65ae07f79ff4",
          "position": {
            "x": 3620,
            "y": 580
          }
        },
        "time": {
          "timeout": "10",
          "next": "QUESTION_LOSE"
        }
      },
      {
        "name": "WANNAPLAY",
        "path": [
          "red",
          "main"
        ],
        "color": "teal",
        "view": {
          "id": "5cefc1f2-34ee-41db-b8d1-72f386b405a1",
          "position": {
            "x": 1930,
            "y": 40
          }
        },
        "send_message": [
          {
            "agent": "Gordon",
            "to": "Player",
            "text": "Diese Nachricht hier ist wieder in jedem Fall gleich - egal, welche meiner drei Antwortmöglichkeiten ich dir eben gesendet habe. \n\nProbieren wir uns doch gleich nochmal an einer Frage! Aber diesmal an einer Entscheidungsfrage, bei der die Antwort JA oder NEIN lauten kann. \n\n**Hast du Lust auf ein kleines Spiel?**"
          }
        ],
        "comment": "Gordon stellt eine Entscheidungsfrage. Ist die Antwort positiv, beginnt das Spiel. Ist die Antwort mehrmals negativ oder uneindeutig, wird das Ende des Dialogs eingeleitet.",
        "dialogue": [
          {
            "agent": "Gordon",
            "chat": "Player",
            "if": [
              {
                "contains": "JA",
                "next": "WANNAPLAY_WIN_TIMEOUT",
                "respond": [
                  {
                    "mode": "respond",
                    "text": "**Ja** ist genau das, was ich an dieser Stelle hören wollte. Mit dieser Nachricht (die du bekommst, egal ob du sofort oder erst bei der dritten Nachfrage __ja__ gesagt hast) gratuliere ich dir zu deiner Entscheidung und leite dich zu der Nachricht weiter, mit der das Spiel beginnt. Oh: Ich sollte vielleicht noch erwähnen, dass als Belohnung eine kleine Überraschung auf dich wartet! "
                  }
                ]
              },
              {
                "contains": "NEIN",
                "respond": [
                  {
                    "mode": "respond",
                    "text": "Wie, du hast keine Lust? Es gibt auch eine kleine Überraschung am Ende ... also frage ich dich zur Sicherheit nochmal: Willst du mitspielen, ja oder nein?"
                  },
                  {
                    "mode": "respond",
                    "text": "Nun hast du schon zum zweiten Mal mit __nein__ geantwortet, deswegen bekommst du diese Nachricht, in der ich nochmal versuche, dich zu überreden, mit __ja__ zu antworten. Gelingt es mir diesmal? "
                  },
                  {
                    "mode": "respond",
                    "text": "Mit dieser Nachricht - der Reaktion auf dein drittes __Nein__  -  beknie ich dich erneut, dich umzuentscheiden. Ich kündige dir auch schon mal an, dass ich dir nicht mehr viel zu sagen haben werde, wenn du dich jetzt, wo ich dich ein letztes Mal frage, wieder mit __nein__ antworten wirst. Also: Spielen?"
                  },
                  {
                    "mode": "respond",
                    "text": "Tja. Nun muss ich dich leider zu der LOSE-Box weiterleiten, in der alle landen, die hier nicht irgendwann mit __ja__ antworten."
                  }
                ],
                "next": "WANNAPLAY_LOSE_TIMEOUT"
              }
            ],
            "else": {
              "next": "WANNAPLAY_LOSE_TIMEOUT",
              "respond": [
                {
                  "mode": "respond",
                  "text": "Ah, ich hatte mich wahrscheinlich nicht klar genug ausgedrückt, denn du hast auf meine Frage weder mit __ja__ noch mit __nein__ geantwortet. Deswegen erhältst du jetzt diese Nachricht, in der ich dich bitte, diesmal mit __ja__ oder __nein__ zu antworten."
                },
                {
                  "mode": "respond",
                  "text": "Du hast zum zweiten Mal irgendwas geschrieben, in dem kein __ja__ und kein __nein__ vorkam. Ich kündige dir schon mal an, dass ich dir nicht mehr viel zu sagen haben werde, wenn du dich jetzt, wo ich dich ein letztes Mal frage, wieder mit irgendetwas anderem antworten wirst. Also: Spielen?"
                },
                {
                  "mode": "respond",
                  "text": "Tja. Nun muss ich dich leider zu der LOSE-Box weiterleiten, in der alle landen, die hier nicht irgendwann mit __ja__ antworten."
                }
              ]
            }
          }
        ]
      },
      {
        "name": "WANNAPLAY_WIN",
        "path": [
          "red",
          "main"
        ],
        "color": "teal",
        "view": {
          "id": "e3e2b81a-9452-4e8f-ab2c-47fbec2fa746",
          "position": {
            "x": 2590,
            "y": 40
          }
        },
        "send_message": [
          {
            "agent": "Gordon",
            "to": "Player",
            "text": "Für dich besteht das Spiel darin zu lernen, wie du mich programmierst. Aber wenn du mich später mit Freund*innen teilen willst, willst du ihnen in dieser Nachricht vielleicht erklären, was sie in dem Spiel erwartet. Zum Beispiel sowas wie \"Beantworte mir drei Fragen, und ich werde dir ein Geheimnis mitteilen\" oder so!  Oder \"Ich habe eine Geschenk für dich - aber du musst mir erst drei Sicherheitsfragen beantworten, um mir zu beweisen, dass es wirklich du bist\". "
          }
        ],
        "comment": "Eine weitere einfache Nachricht von Gordon, ohne Dialogabfragen.",
        "time": {
          "timeout": "15",
          "next": "QUESTION_QUIZ"
        }
      },
      {
        "name": "QUESTION_QUIZ",
        "path": [
          "red",
          "main"
        ],
        "color": "teal",
        "view": {
          "id": "b2c1b99c-19e2-4d79-8d8f-acbd2982b7fa",
          "position": {
            "x": 2940,
            "y": 40
          }
        },
        "send_message": [
          {
            "agent": "Gordon",
            "to": "Player",
            "text": "Damit es weder für dich noch für deine späteren Spieler*innen langweilig wird, sind die drei Fragen unterschiedlich aufgebaut. Die erste ist eine klassische Quizfrage. Du hast drei Versuche, um meine Frage korrekt zu beantworten.\n\nWie nennt man einen Gesprächspartner, mit dem du dir Nachrichten schreiben kannst, obwohl er kein Mensch ist?\n\n"
          }
        ],
        "comment": "Gordon stellt eine Quizfrage und reagiert: auf die korrekte Antwort, auf originelle (aber falsche) Antworten und auf nicht-korrekte Antworten.",
        "dialogue": [
          {
            "agent": "Gordon",
            "chat": "Player",
            "if": [
              {
                "contains": [
                  "CHATBOT"
                ],
                "next": "QUESTION_QUIZ_TIMEOUT",
                "respond": [
                  {
                    "mode": "respond",
                    "text": "Absolut richtig! Du hast die erste Frage korrekt beantwortet!"
                  }
                ]
              },
              {
                "contains": [
                  "GORDON",
                  "KIM"
                ],
                "respond": [
                  {
                    "mode": "respond",
                    "text": "Oh, du hast etwas geschrieben, dass die Begriffe __Kim__ oder __Gordon__ enthalten hat! Charmante Antwort, die ich gerne zählen lassen würde - aber hier suche ich nicht nach einzelnen Vertreter*innen, sondern nach dem Überbegriff. Versuch es doch nochmal! "
                  },
                  {
                    "mode": "respond",
                    "text": "Aha, nun hast du nochmal etwas geschrieben, dass die Begriffe __Kim__ oder __Gordon__ enthalten hat! Du kennst also unsere Namen! Aber weißt du auch, zu welcher Spezies wir gehören?\n(Wenn du noch ein drittes Mal was mit __Kim__ oder __Gordon__ schreibst, werde ich nicht mehr reagieren - dies ist meine letzte vorrätige Antwort auf diese Eingaben.)"
                  }
                ]
              }
            ],
            "else": {
              "next": "QUESTION_LOSE_TIMEOUT",
              "respond": [
                {
                  "mode": "respond",
                  "text": "Deine Nachricht hat das gesuchte Lösungswort nicht enthalten - deswegen gebe ich dir hier nochmal einen Tipp: Ich suche ein Wort mit sieben Buchstaben. Du hast noch zwei Versuche! "
                },
                {
                  "mode": "respond",
                  "text": "Das war leider wieder nix! Letzter Tipp und letzter Versuch: Es fängt mit C an! "
                },
                {
                  "mode": "respond",
                  "text": "Leider hast du die Frage drei Mal falsch beantwortet. Der gesuchte Begriff war __Chatbot__. "
                }
              ]
            }
          }
        ]
      },
      {
        "name": "INCORRECT",
        "path": [
          "red",
          "main"
        ],
        "color": "teal",
        "view": {
          "id": "96e4643b-25b9-4d05-adb6-5b60cb2ffffc",
          "position": {
            "x": 5490,
            "y": 420
          }
        },
        "send_message": [
          {
            "agent": "Gordon",
            "to": "Player",
            "text": "Das war leider die falsche Phrase, du musst dich irgendwo vertippt haben! Möchtest du es nochmal probieren?\n\n"
          }
        ],
        "comment": "Die Lösung war nicht korrekt. Gordon fragt, ob eine zweite Chance gewünscht wird - falls ja, leitet er zu SECOND_CHANCE weiter, falls nein, leitet er das Ende des Dialogs ein. Und wenn jemand etwas anderes eingibt, fragt er nochmal nach.",
        "dialogue": [
          {
            "agent": "Gordon",
            "chat": "Player",
            "if": [
              {
                "contains": "JA",
                "next": "SECOND_CHANCE"
              },
              {
                "contains": "NEIN",
                "respond": [
                  {
                    "mode": "respond",
                    "text": "Du möchtest es nicht nochmal probieren? Okay, dann endet mein Dialog mit dir an dieser Stelle. Schade, dass du so kurz vor dem Ziel aufgegeben hast! Vielleicht fandst du mich ja zu schwer? Dann geh doch einfach auf die Seite von Kim zurück und programmier mich leichter! Du hast es in der Hand.\n\n(Du kannst den Dialog mit mir übrigens jederzeit neu starten, indem du erneut dein Kennwort eingibst.)"
                  }
                ],
                "next": "QUIT"
              }
            ],
            "else": {
              "respond": [
                {
                  "mode": "respond",
                  "text": "Mittlerweile solltest du doch eigentlich gelernt haben, dass ich an dieser Stelle nur __ja__ oder __nein__ verstehe ..."
                }
              ]
            }
          }
        ]
      },
      {
        "name": "SECOND_CHANCE",
        "path": [
          "red",
          "main"
        ],
        "color": "teal",
        "view": {
          "id": "0be35631-93d0-495b-a243-4cca639bdf1c",
          "position": {
            "x": 5010,
            "y": 960
          }
        },
        "send_message": [
          {
            "agent": "Gordon",
            "to": "Player",
            "text": "Gut, dass du nicht so leicht aufgibst! Mach dich bereit, hier kommt die Phrase nochmal!"
          }
        ],
        "comment": "Eine einfache Nachricht, von der aus Gordon wieder in die Aufgabe (TASK) zurückleitet. (Theoretisch kann man sich hier unendlich viele zweite Chancen verschaffen.)",
        "time": {
          "timeout": "5",
          "next": "TASK"
        }
      },
      {
        "name": "VORSTELLUNG",
        "path": [
          "red",
          "main"
        ],
        "color": "teal",
        "view": {
          "id": "5c33c0ac-5f6d-48ef-9003-c641c391e392",
          "position": {
            "x": 780,
            "y": 40
          }
        },
        "comment": "Die zweite Nachricht von Gordon",
        "time": {
          "timeout": "15",
          "next": "SMALLTALK"
        },
        "send_message": [
          {
            "agent": "Gordon",
            "to": "Player",
            "text": "Mit einem Abstand von 15 Sekunden schicke ich diese Nachricht hinterher. Das passiert automatisch, ganz egal, ob und was die andere Person schreibt."
          }
        ]
      },
      {
        "name": "SMALLTALK_TIMEOUT",
        "path": [
          "red",
          "main"
        ],
        "color": "teal",
        "view": {
          "id": "61bf70b8-7895-49d7-bbe2-82eec13f685e",
          "position": {
            "x": 1570,
            "y": 370
          }
        },
        "time": {
          "timeout": "20",
          "next": "WANNAPLAY"
        }
      },
      {
        "name": "QUESTION_NUMBER_TIMEOUT",
        "path": [
          "red",
          "main"
        ],
        "color": "teal",
        "view": {
          "id": "ef3f3834-4688-4551-a511-a46dc33464a5",
          "position": {
            "x": 3960,
            "y": 40
          }
        },
        "time": {
          "timeout": "7",
          "next": "QUESTION_TIME"
        }
      },
      {
        "name": "COUNTDOWN",
        "path": [
          "red",
          "main"
        ],
        "color": "teal",
        "view": {
          "id": "11248d2c-343c-4449-8411-cd7c0de60943",
          "position": {
            "x": 4630,
            "y": 270
          }
        },
        "comment": "Gordon zählt runter.",
        "dialogue": [
          {
            "agent": "Gordon",
            "chat": "Player",
            "timeout": {
              "time": [
                1,
                1,
                1,
                1
              ],
              "respond": [
                "... 3 ...",
                "... 2 ...",
                "... 1 ...",
                "LOS! Hier kommt die Phrase:"
              ],
              "next": "TASK"
            }
          }
        ]
      },
      {
        "name": "QUESTION_TIME",
        "path": [
          "red",
          "main"
        ],
        "color": "teal",
        "view": {
          "id": "394cf9a0-a38d-485a-8eea-6cc23cad6b3b",
          "position": {
            "x": 4290,
            "y": 40
          }
        },
        "comment": "Gordon wartet vor der letzten Aufgabe auf eine Eingabe. Gibt sie mehrmals etwas anderes ein als die verlangte Phrase, wartet er trotzdem weiter.",
        "dialogue": [
          {
            "agent": "Gordon",
            "chat": "Player",
            "if": [
              {
                "contains": "BEREIT",
                "next": "COUNTDOWN",
                "respond": [
                  {
                    "mode": "respond",
                    "text": "Super! Dann starte ich den Countdown in ..."
                  }
                ]
              }
            ],
            "else": {
              "respond": [
                {
                  "mode": "respond",
                  "text": "An dieser Stelle warte ich nur darauf, dass du mir **__bereit__** schreibst, alles andere ist mir egal. Diese Nachricht schreibe ich dir, um dich darauf hinzuweisen, dass du etwas anderes als **__bereit__** geschrieben hast. Schreib doch bitte **__bereit__**!"
                },
                {
                  "mode": "respond",
                  "text": "In deiner Nachricht war schon wieder kein __bereit__. Ich warte jetzt einfach so lange, bis du mir __bereit__ schreibst, bis dahin bleibe ich stumm."
                }
              ]
            }
          }
        ],
        "send_message": [
          {
            "agent": "Gordon",
            "to": "Player",
            "text": "Die letzte Frage vor dem Ziel ist weniger eine Frage als eine Aufgabe. Ich schicke dir gleich eine Phrase, und du musst sie so schnell wie möglich fehlerfrei abtippen. Du hast allerdings nur 30 Sekunden Zeit dafür! Bist du bereit? Dann schreib mir **__bereit__**! "
          }
        ]
      },
      {
        "name": "QUESTION_QUIZ_TIMEOUT",
        "path": [
          "red",
          "main"
        ],
        "color": "teal",
        "view": {
          "id": "d0bfe86e-d3da-4c71-92ab-4fcdc9a33d83",
          "position": {
            "x": 3280,
            "y": 40
          }
        },
        "time": {
          "timeout": "7",
          "next": "QUESTION_NUMBERS"
        }
      },
      {
        "name": "QUESTION_NUMBERS",
        "path": [
          "red",
          "main"
        ],
        "color": "teal",
        "view": {
          "id": "b5bd1d11-681c-4925-9833-55963f896ab1",
          "position": {
            "x": 3620,
            "y": 40
          }
        },
        "comment": "Gordon stellt eine Schätzfrage und reagiert anschließend mit \"mehr\", \"weniger\" oder \"genau richtig\", nachdem Zahlen eingegeben wurden. Wurde die Zahl zu oft falsch geschätzt, leitet er in den Verlierercue QUESTION_LOSE weiter.",
        "dialogue": [
          {
            "agent": "Gordon",
            "chat": "Player",
            "if": [
              {
                "equals": "525600",
                "next": "QUESTION_NUMBER_TIMEOUT",
                "respond": [
                  {
                    "mode": "respond",
                    "text": "Das ist genau die Zahl, die ich hören wollte! "
                  }
                ]
              },
              {
                "lessThan": "524999",
                "respond": [
                  {
                    "mode": "respond",
                    "text": "Also, ein bisschen Spielraum geb ich dir - aber diese Zahl ist zu niedrig. "
                  },
                  {
                    "mode": "respond",
                    "text": "Zu wenig, zu wenig! Versuch es noch mal."
                  },
                  {
                    "mode": "respond",
                    "text": "Das war leider wieder zu wenig. Du hast es nicht erraten!"
                  }
                ],
                "next": "QUESTION_LOSE_TIMEOUT"
              },
              {
                "greaterThan": "526001",
                "respond": [
                  {
                    "mode": "respond",
                    "text": "Also, ein bisschen Spielraum geb ich dir - aber diese Zahl ist zu hoch. "
                  },
                  {
                    "mode": "respond",
                    "text": "Zu viel, zu viel! Versuch es nochmal."
                  },
                  {
                    "mode": "respond",
                    "text": "Das war leider wieder zu wenig. Du hast es nicht erraten!"
                  }
                ],
                "next": "QUESTION_LOSE_TIMEOUT"
              },
              {
                "greaterThan": "524999",
                "respond": [
                  {
                    "mode": "respond",
                    "text": "Du bist nah genug dran, ich lasse das gelten, obwohl die richtige Antwort 525600 gewesen wäre. \n\nWenn du es genau wissen willst: Hier landest du, wenn die Antwort nicht gleich 525600 (Condition 1), nicht kleiner als 524999 (Condition 2) und nicht größer als 526001 (Condition 3) ist, aber größer als 524999 ist; also eine Zahl zwischen 524999 und 526001."
                  }
                ],
                "next": "QUESTION_NUMBER_TIMEOUT"
              }
            ],
            "else": {
              "respond": [
                {
                  "mode": "respond",
                  "text": "Ich kann an dieser Stelle nur Zahlen interpretieren, und in deiner Antwort waren leider keine enthalten. Deswegen bekommst du diese Nachricht. Versuch es doch einfach nochmal!"
                },
                {
                  "mode": "respond",
                  "text": "Du hast mir zum zweiten Mal eine Nachricht ohne Zahlen geschickt. Hier weise ich dich nochmal darauf hin, dass ich damit an dieser Stelle nichts anfangen kann.  "
                },
                {
                  "mode": "respond",
                  "text": "Ein drittes Mal hast du mir nur Buchstaben geschickt. Das ist meine letzte Reaktion darauf, von nun an musst du alleine klarkommen."
                }
              ]
            }
          }
        ],
        "send_message": [
          {
            "agent": "Gordon",
            "to": "Player",
            "text": "Weiter geht's mit Frage 2! \nUm dir zu zeigen, wie ich mit Zahlen umgehe, habe ich mir hier eine Frage überlegt, bei der du die Antwort ausrechnen, wissen oder schätzen kannst: \n\n**Wie viele Minuten hat das Jahr 2021 (voraussichtlich)?**\nAchja: Bitte gib deine Antwort ohne Punkte oder Leerzeichen dazwischen ein, sonst check ich das nämlich nicht."
          }
        ]
      },
      {
        "name": "WIN",
        "path": [
          "red",
          "main"
        ],
        "color": "teal",
        "view": {
          "id": "89c12e11-552b-4d09-a7c3-cddc0f91456f",
          "position": {
            "x": 5490,
            "y": 80
          }
        },
        "comment": "Gordon gratuliert mit dieser einfachen Nachricht zum Sieg.",
        "send_message": [
          {
            "agent": "Gordon",
            "to": "Player",
            "text": "Du hast es geschafft! Ich gratuliere dir mit dieser Nachricht, und das solltest du auch gleich tun, wenn du mich umprogrammiert hast! \n\nNun hast du dir meine Überraschung und etwas Entspannung redlich verdient ..."
          }
        ],
        "time": {
          "timeout": "15",
          "next": "SURPRISE"
        }
      },
      {
        "name": "TASK",
        "path": [
          "red",
          "main"
        ],
        "color": "teal",
        "view": {
          "id": "40de494c-11b1-4759-bb07-2d8f851cf019",
          "position": {
            "x": 5000,
            "y": 270
          }
        },
        "comment": "Gordon stellt die Aufgabe und startet den Timer. Wird die korrekte Lösung rechtzeitig eingetippt, leitet er zum WIN-Cue weiter. Ist die Lösung nicht korrekt, geht es bei INCORRECT weiter. Ist die Zeit abgelaufen, bevor eine Eingabe erfolgt ist, geht es im TIMES-UP-Cue weiter.",
        "send_message": [
          {
            "agent": "Gordon",
            "to": "Player",
            "text": "**fhgZZt%23f78?\"9Lm**\n\nGO! Tippe sie so schnell wie möglich ab! Du hast ab jetzt 30 Sekunden Zeit.\n"
          }
        ],
        "dialogue": [
          {
            "agent": "Gordon",
            "chat": "Player",
            "if": [
              {
                "equals": "fhgZZt%23f78?\"9Lm",
                "next": "WIN",
                "respond": [
                  {
                    "mode": "respond",
                    "text": "🎉🎉🎉\n\nIch schicke dir diese Nachricht, weil du die Aufgabe erfolgreich absolviert hast! "
                  }
                ]
              }
            ],
            "else": {
              "next": "INCORRECT"
            },
            "timeout": {
              "time": [
                10,
                10,
                10
              ],
              "respond": [
                "Noch 20 Sekunden!",
                "Noch 10 Sekunden!",
                "Oh nein - die Zeit ist abgelaufen! "
              ],
              "next": "TIMES_UP"
            }
          }
        ]
      },
      {
        "name": "TIMES_UP",
        "path": [
          "red",
          "main"
        ],
        "color": "teal",
        "view": {
          "id": "ddd25419-8d91-4f2b-b129-c1012d7b5977",
          "position": {
            "x": 5490,
            "y": 860
          }
        },
        "comment": "Die Aufgabe wurde nicht rechtzeitig bewältigt. Gordon fragt, ob eine zweite Chance gewünscht wird - falls ja, leitet er zu SECOND_CHANCE weiter, falls nein, leitet er das Ende des Dialogs ein. Und wenn jemand etwas anderes eingibt, fragt er nochmal nach.",
        "send_message": [
          {
            "agent": "Gordon",
            "to": "Player",
            "text": "Leider hast du es nicht rechtzeitig geschafft. Möchtest du es nochmal probieren?\n\n"
          }
        ],
        "dialogue": [
          {
            "agent": "Gordon",
            "chat": "Player",
            "if": [
              {
                "contains": "JA",
                "next": "SECOND_CHANCE"
              },
              {
                "contains": "NEIN",
                "respond": [
                  {
                    "mode": "respond",
                    "text": "Du möchtest es nicht nochmal probieren? Okay, dann endet mein Dialog mit dir an dieser Stelle. Schade, dass du so kurz vor dem Ziel aufgegeben hast! Vielleicht fandst du mich ja zu schwer? Dann geh doch einfach auf die Seite von Kim zurück und programmier mich leichter! Du hast es in der Hand.\n\n(Du kannst den Dialog mit mir übrigens jederzeit neu starten, indem du erneut dein Kennwort eingibst.)"
                  }
                ],
                "next": "QUIT"
              }
            ],
            "else": {
              "respond": [
                {
                  "mode": "respond",
                  "text": "Mittlerweile solltest du doch eigentlich gelernt haben, dass ich bei so einer Frage nur __ja__ oder __nein__ verstehe ..."
                },
                {
                  "mode": "respond",
                  "text": "Ich sag jetzt gar nichts mehr. Du weißt, was du zu tun hast. "
                }
              ]
            }
          }
        ]
      },
      {
        "name": "SURPRISE",
        "path": [
          "red",
          "main"
        ],
        "color": "teal",
        "view": {
          "id": "dcca05f1-f547-490f-9e56-800007fc7d79",
          "position": {
            "x": 5830,
            "y": 80
          }
        },
        "comment": "Gordon schickt den Link zur Überraschung raus. Eine einfache Nachricht!",
        "send_message": [
          {
            "agent": "Gordon",
            "to": "Player",
            "text": "Einen Live-Einblick in ein Quallen-Aquarium! Schau dir doch nur mal ihre witzigen Arme an! Mich bringt das nach einem anstrengenden Chatbot-Tag immer zuverlässig runter. \n\nhttps://www.youtube.com/watch?v=O34gKi2IHk4\n\nWas möchtest du deinen Spieler*innen an dieser Stelle zeigen? "
          }
        ],
        "time": {
          "timeout": "45",
          "next": "GOODBYE"
        }
      },
      {
        "name": "WANNAPLAY_LOSE",
        "path": [
          "red",
          "main"
        ],
        "color": "teal",
        "view": {
          "id": "1c7e5c4d-0d84-4af8-912f-1c93778ae3ab",
          "position": {
            "x": 1950,
            "y": 1210
          }
        },
        "comment": "War die Antwort in WANNAPLAY nicht positiv, landet man in diesem Cue - und wird von hier aus zu QUIT (dem technischen Ende) weitergeleitet.",
        "send_message": [
          {
            "agent": "Gordon",
            "to": "Player",
            "text": "Ich hatte dich gewarnt! Du bist in eine Sackgasse geraten, in der ich keine weiteren Nachrichten für dich habe - entweder, weil du vier Mal __nein__ oder drei Mal weder __ja__ noch __nein__ geschrieben hast. Nun muss ich mich leider von dir verabschieden. \n\nDu kannst den Dialog mit mir aber jederzeit neu starten, indem du mir wieder das Kennwort schickst. \nOder du fängst jetzt an, mich gemeinsam mit Kim umzuprogrammieren. Klicke dazu auf das Glühbirnen-Symbol im Editor.",
            "next": "QUIT"
          }
        ]
      },
      {
        "name": "QUESTION_LOSE",
        "path": [
          "red",
          "main"
        ],
        "color": "teal",
        "view": {
          "id": "9e88ec06-847b-441e-8239-4cf53587bcc3",
          "position": {
            "x": 3630,
            "y": 1060
          }
        },
        "comment": "Diese Nachricht wird gesendet, wenn QUESTION_QUIZ oder QUESTION_NUMBER mehrmals falsch beantwortet wurden. Anschließend automatische Weiterleitung zu QUIT (dem technischen Ende).",
        "send_message": [
          {
            "agent": "Gordon",
            "to": "Player",
            "text": "Mein Dialog mit dir endet an dieser Stelle - wenn du eine der drei Fragen auch beim dritten Mal nicht beantworten kannst, bekommst du diese Nachricht, die dir anzeigt, dass du das Spiel leider verloren hast. Aber du kannst es natürlich jederzeit nochmal probieren und den Dialog mit mir neu starten, indem du nochmal das Kennwort eingibst.\nOder du fängst jetzt an, mich gemeinsam mit Kim umzuprogrammieren. Klicke dazu auf das Glühbirnen-Symbol im Editor.",
            "next": "QUIT"
          }
        ]
      },
      {
        "name": "GOODBYE",
        "path": [
          "red",
          "main"
        ],
        "color": "teal",
        "view": {
          "id": "5cb0cd07-f0af-45e9-ae50-3f8aee3fc911",
          "position": {
            "x": 6160,
            "y": 80
          }
        },
        "comment": "Mit dieser einfachen Nachricht verabschiedet Gordon sich und leitet zu QUIT (dem technischen Ende) weiter.",
        "send_message": [
          {
            "agent": "Gordon",
            "to": "Player",
            "text": "Du bist nun am Ende meines Dialogs angekommen. Jetzt bist du dran! Kim wird dir Schritt für Schritt zeigen, wie du mich programmieren kannst. Klicke dafür einfach auf das Glühbirnen-Symbol im Editor. Viel Spaß dabei! \n\n(Du kannst diesen Dialog mit mir jederzeit neu starten, indem du wieder das Kennwort eingibst.)",
            "next": "QUIT"
          }
        ]
      },
      {
        "name": "SMALLTALK",
        "path": [
          "red",
          "main"
        ],
        "color": "teal",
        "view": {
          "id": "80cd81f4-802a-424e-87a1-ed48643e4962",
          "position": {
            "x": 1210,
            "y": 40
          }
        },
        "comment": "Gordon stellt eine Frage und reagiert abhängig von der Antwort mit unterschiedlichen Nachrichten",
        "send_message": [
          {
            "agent": "Gordon",
            "to": "Player",
            "text": "Bis jetzt habe ich mein Gegenüber - also dich - einfach nur zugetextet, ohne darauf zu hören, was die andere Person schreibt. Ganz schön unhöflich! Aber ich kann auch Smalltalk (und Kim zeigt dir gleich, wie du mich dazu bringen kannst). Also, sag mal:\n\n**Wie geht es dir?**"
          }
        ],
        "dialogue": [
          {
            "agent": "Gordon",
            "chat": "Player",
            "if": [
              {
                "contains": [
                  "NICHT GUT",
                  "SCHLECHT",
                  "SCHWIERIG",
                  "GESTRESST",
                  "TRAURIG",
                  "ALLEIN"
                ],
                "next": "SMALLTALK_TIMEOUT",
                "respond": [
                  {
                    "mode": "respond",
                    "text": "**Das tut mir leid! Aber vielleicht kann ich dich wenigstens ein bisschen ablenken.**\n\nIch habe deine Antwort auf bestimmte Schlagwörter gescannt und mich deswegen dazu entschieden, so zu reagieren, als würde es dir __nicht gut__ gehen.\n\nHättest du etwas ähnliches wie __gut__ geschrieben, würdest du an dieser Stelle eine andere Nachricht lesen!\n\n"
                  }
                ]
              },
              {
                "contains": [
                  "GUT",
                  "NICHT SCHLECHT",
                  "SUPER",
                  "SPITZE",
                  "OK",
                  "IN ORDNUNG"
                ],
                "respond": [
                  {
                    "mode": "respond",
                    "text": "**Das freut mich für dich!**\n\nIch habe deine Antwort auf bestimmte Schlagwörter gescannt und mich deswegen dazu entschieden, so zu reagieren, als würde es dir __gut__ gehen.\n\nHättest du etwas ähnliches wie __nicht gut__ geschrieben, würdest du an dieser Stelle eine andere Nachricht lesen!"
                  }
                ],
                "next": "SMALLTALK_TIMEOUT"
              }
            ],
            "else": {
              "respond": [
                {
                  "mode": "respond",
                  "text": "Ich habe deine Antwort auf bestimmte Schlagworte gescannt, aber konnte nicht eindeutig herauslesen, wie es dir geht. Deswegen frage ich sicherheitshalber bzw. verständnisvollerweise nochmal nach: \n\n**Verstehe. Also eher gut oder eher schlecht?**"
                },
                {
                  "mode": "respond",
                  "text": "🙋 \n\nAuch aus dieser Antwort konnte ich nicht klar erkennen, ob es dir __gut__ oder __schlecht__ geht. Deswegen antworte ich  mit diesem unverbindlichen Emoji! \n\n(Hättest du etwas anderes geschrieben, würdest du an dieser Stelle eine andere Nachricht lesen.)"
                }
              ],
              "next": "SMALLTALK_TIMEOUT"
            }
          }
        ]
      },
      {
        "name": "START",
        "path": [
          "main"
        ],
        "color": "dimgray",
        "view": {
          "id": "e7a18f4d-cdf2-4525-9717-bfed2ce3ee3a",
          "position": {
            "x": 20,
            "y": 40
          }
        },
        "comment": "Gordon startet immer im START Cue und springt dann immer einen Cue weiter",
        "session": [
          {
            "split": [
              {
                "name": "red",
                "next": "INTRO"
              },
              {
                "name": "blue",
                "next": "DEFAULT"
              }
            ]
          }
        ]
      },
      {
        "name": "QUIT",
        "path": [
          "red",
          "main",
          "blue"
        ],
        "color": "dimgray",
        "view": {
          "id": "f7cc52b8-1082-45f1-8724-8ca61669cecf",
          "position": {
            "x": 6590,
            "y": 770
          }
        },
        "comment": "Technisch gesehen landen am Ende alle hier, egal welches Dialogende sie vorher bekommen haben. Von diesem Moment an kann das Spiel durch Kennworteingabe neu gestartet werden.",
        "session": [
          {
            "quit": true
          }
        ]
      },
      {
        "name": "DEFAULT",
        "path": [
          "blue",
          "main"
        ],
        "color": "dimgray",
        "view": {
          "id": "c40e3a8f-3695-41ce-b88a-a7c3792b4b43",
          "position": {
            "x": 470,
            "y": 1430
          }
        },
        "comment": "Hier hört Gordon immer auf vordefinierte Signalwörter. Außerdem startet er einen Timer, um nach 30 Minuten einen inaktiven Chat zu beenden.",
        "dialogue": [
          {
            "agent": "Gordon",
            "chat": "Player",
            "if": [
              {
                "contains": [
                  "STOP",
                  "QUIT"
                ],
                "next": "QUIT",
                "respond": [
                  {
                    "mode": "respond",
                    "text": "Gordon beenden"
                  }
                ]
              }
            ],
            "priority": 2
          }
        ],
        "time": {
          "timeout": "00:30:00",
          "next": "QUIT"
        }
      }
    ]
  },
  "config": {
    "arguments": {
      "Player": {}
    }
  },
  "control": {
    "pages": {}
  },
  "modified": "2021-03-08T09:55:06.302Z",
  "instances": 1
}