<svg width="30" height="30" viewBox="0 0 30 30" fill="none" xmlns="http://www.w3.org/2000/svg">
<path d="M25.13 4.1456L25.0398 3.7093L24.7089 3.4444C21.7156 1.02919 15.9246 0.764292 11.7279 1.13826C11.1112 1.20059 10.5397 1.29408 10.0282 1.43432C7.4862 2.13551 4.79375 3.36649 3.89125 6.26476C3.10909 8.83579 2.97371 12.3106 3.0038 14.8193C3.01884 16.5957 2.83834 22.174 4.05671 24.4178C5.27508 26.6617 6.35808 27.3161 7.47116 27.5966C9.6522 28.1575 13.7435 28.064 17.3084 27.7368C17.4438 27.7212 17.5791 27.7057 17.7145 27.6901L17.9401 27.6589C19.339 27.5031 20.9334 27.3317 22.3323 26.5214C23.5657 25.8046 25.2353 22.2831 25.0247 20.834L22.9941 18.6057L20.3017 21.6754L18.3914 19.4316L17.5641 18.4655L16.6766 19.3693L14.1196 22.0026L10.9157 19.4472L10.8856 15.6296L14.0594 18.2629L16.6165 14.5232L19.2187 17.5306L21.9262 14.2739L25.2504 17.0164L25.6715 15.1465C26.4687 11.6561 25.6264 6.5764 25.13 4.1456ZM11.6076 5.59473C11.5174 6.06219 11.0059 6.56081 10.4945 6.49849C9.98312 6.43616 9.57699 6.34267 9.59203 5.73497C9.62212 4.70655 10.6901 4.20793 10.9759 4.36375C11.4271 4.61306 11.7129 5.12727 11.6076 5.59473ZM13.548 5.2675C12.9914 5.22076 13.0366 4.42607 13.1118 4.28584C13.4126 3.77163 13.8488 4.09885 14.0895 4.36375C14.3753 4.67539 14.0143 5.29867 13.548 5.2675Z" fill="#EA48F7"/>
<path d="M25.13 4.1456L25.0398 3.7093L24.7089 3.4444C21.7156 1.02919 15.9246 0.764292 11.7279 1.13826C11.1112 1.20059 10.5397 1.29408 10.0282 1.43432C7.4862 2.13551 4.79375 3.36649 3.89125 6.26476C3.10909 8.83579 2.97371 12.3106 3.0038 14.8193C3.01884 16.5957 2.83834 22.174 4.05671 24.4178C5.27508 26.6617 6.35808 27.3161 7.47116 27.5966C9.6522 28.1575 13.7435 28.064 17.3084 27.7368C17.4438 27.7212 17.5791 27.7057 17.7145 27.6901L17.9401 27.6589C19.339 27.5031 20.9334 27.3317 22.3323 26.5214C23.5657 25.8046 25.2353 22.2831 25.0247 20.834L22.9941 18.6057L20.3017 21.6754L18.3914 19.4316L17.5641 18.4655L16.6766 19.3693L14.1196 22.0026L10.9157 19.4472L10.8856 15.6296L14.0594 18.2629L16.6165 14.5232L19.2187 17.5306L21.9262 14.2739L25.2504 17.0164L25.6715 15.1465C26.4687 11.6561 25.6264 6.5764 25.13 4.1456ZM11.6076 5.59473C11.5174 6.06219 11.0059 6.56081 10.4945 6.49849C9.98312 6.43616 9.57699 6.34267 9.59203 5.73497C9.62212 4.70655 10.6901 4.20793 10.9759 4.36375C11.4271 4.61306 11.7129 5.12727 11.6076 5.59473ZM13.548 5.2675C12.9914 5.22076 13.0366 4.42607 13.1118 4.28584C13.4126 3.77163 13.8488 4.09885 14.0895 4.36375C14.3753 4.67539 14.0143 5.29867 13.548 5.2675Z" fill="url(#paint0_linear)"/>
<defs>
<linearGradient id="paint0_linear" x1="3.575" y1="13.3261" x2="26.0024" y2="14.4528" gradientUnits="userSpaceOnUse">
<stop stop-color="#796AE5"/>
<stop offset="1" stop-color="#796AE5" stop-opacity="0"/>
</linearGradient>
</defs>
</svg>
