{
  "include": ["./src/**/*"],
  "compilerOptions": {
    "baseUrl": ".",
    "paths": {
      "@/*": ["./src/*"],
      "@components/*": ["./src/components/*"],
      "@utils/*": ["./src/utils/*"]
    },
    "jsx": "preserve"
  },
  "exclude": ["node_modules", "dist"]
}
