{
  "settings":{
    "type":"object",
    "title":"Sound Settings",
    "properties":{
      "path":{
        "type":"string"
      }
    }
  },
  "cue":{
    "sound":{
      "type":"object",
      "listener":true,
      "properties":{
        "play":{
          "oneOf": [
            {
              "title":"choose file",
              "type":"string"
            },
            {
              "title":"free text",
              "type":"string"
            }
          ]
        },
        "next":{
          "type":"string"
        },
        "loop":{
          "type":"integer",
          "minimum":-1
        },
        "stop":{
          "type":"string"
        }
      }
    }
  },
  "collections": {
    "playlist":{
      "type":"object",
      "title":"Playlist",
      "properties":{
        "tracks":{
          "type":"array",
          "required":true,
          "minItems":1,
          "items":{
            "type":"string"
          }
        },
        "settings":{
          "type":"object",
          "required":true,
          "default":{"silence":0.0},
          "properties":{
            "silence":{
              "type":"number",
              "description":"Define a silence between each track in seconds"
            }
          }
        }
      }
    }
  }
}
