{
  "settings":{
    "type":"object",
    "title":"Time Plugin",
    "description":"use the 'time' property to dispatch timed next cues",
    "additionalProperties":false,
    "readonly":true
  },
  "cue": {
    "time":{
      "listener":true,
      "oneOf":[
        {
          "type":"object",
          "title":"Timeout",
          "description":"Zeit bis next in Sekunden oder: hh:mm:ss",
          "additionalProperties":false,
          "properties":{
            "timeout":{
              "type":"string",
              "required":true
            },
            "next":{
              "type":"string",
              "required":true
            }
          }
        },
        {
          "type":"object",
          "title":"Date Time",
          "additionalProperties":false,
          "properties":{
            "datetime":{
              "type":"string",
              "format":"datetime-local",
              "required":true
            },
            "next":{
              "type":"string",
              "required":true
            }
          }
        }
      ]
    }
  }
}
