%TF.GenerationSoftware,KiCad,Pcbnew,5.1.10*%
%TF.CreationDate,2021-11-04T10:56:06+01:00*%
%TF.ProjectId,Headtrack,48656164-7472-4616-936b-2e6b69636164,rev?*%
%TF.SameCoordinates,Original*%
%TF.FileFunction,Soldermask,Top*%
%TF.FilePolarity,Negative*%
%FSLAX46Y46*%
G04 Gerber Fmt 4.6, Leading zero omitted, Abs format (unit mm)*
G04 Created by KiCad (PCBNEW 5.1.10) date 2021-11-04 10:56:06*
%MOMM*%
%LPD*%
G01*
G04 APERTURE LIST*
%ADD10O,1.500000X3.500000*%
%ADD11R,1.500000X1.000000*%
%ADD12C,3.200000*%
%ADD13O,0.800000X1.300000*%
%ADD14R,0.900000X0.800000*%
%ADD15R,1.500000X1.100000*%
%ADD16R,1.500000X2.000000*%
%ADD17R,3.800000X2.000000*%
G04 APERTURE END LIST*
D10*
%TO.C,H3*%
X126238000Y-96393000D03*
X121238000Y-96393000D03*
%TD*%
D11*
%TO.C,D1*%
X110922900Y-87909600D03*
X110922900Y-91109600D03*
X115822900Y-87909600D03*
X115822900Y-91109600D03*
%TD*%
%TO.C,C7*%
G36*
G01*
X126894400Y-90670200D02*
X126394400Y-90670200D01*
G75*
G02*
X126169400Y-90445200I0J225000D01*
G01*
X126169400Y-89995200D01*
G75*
G02*
X126394400Y-89770200I225000J0D01*
G01*
X126894400Y-89770200D01*
G75*
G02*
X127119400Y-89995200I0J-225000D01*
G01*
X127119400Y-90445200D01*
G75*
G02*
X126894400Y-90670200I-225000J0D01*
G01*
G37*
G36*
G01*
X126894400Y-92220200D02*
X126394400Y-92220200D01*
G75*
G02*
X126169400Y-91995200I0J225000D01*
G01*
X126169400Y-91545200D01*
G75*
G02*
X126394400Y-91320200I225000J0D01*
G01*
X126894400Y-91320200D01*
G75*
G02*
X127119400Y-91545200I0J-225000D01*
G01*
X127119400Y-91995200D01*
G75*
G02*
X126894400Y-92220200I-225000J0D01*
G01*
G37*
%TD*%
D12*
%TO.C,H2*%
X115000000Y-95500000D03*
%TD*%
%TO.C,H1*%
X115000000Y-83500000D03*
%TD*%
D13*
%TO.C,J1*%
X120496000Y-81000000D03*
X121746000Y-81000000D03*
X122996000Y-81000000D03*
X124246000Y-81000000D03*
X125496000Y-81000000D03*
G36*
G01*
X127146000Y-80550000D02*
X127146000Y-81450000D01*
G75*
G02*
X126946000Y-81650000I-200000J0D01*
G01*
X126546000Y-81650000D01*
G75*
G02*
X126346000Y-81450000I0J200000D01*
G01*
X126346000Y-80550000D01*
G75*
G02*
X126546000Y-80350000I200000J0D01*
G01*
X126946000Y-80350000D01*
G75*
G02*
X127146000Y-80550000I0J-200000D01*
G01*
G37*
%TD*%
%TO.C,C5*%
G36*
G01*
X97611600Y-92435500D02*
X97611600Y-92095500D01*
G75*
G02*
X97751600Y-91955500I140000J0D01*
G01*
X98031600Y-91955500D01*
G75*
G02*
X98171600Y-92095500I0J-140000D01*
G01*
X98171600Y-92435500D01*
G75*
G02*
X98031600Y-92575500I-140000J0D01*
G01*
X97751600Y-92575500D01*
G75*
G02*
X97611600Y-92435500I0J140000D01*
G01*
G37*
G36*
G01*
X96651600Y-92435500D02*
X96651600Y-92095500D01*
G75*
G02*
X96791600Y-91955500I140000J0D01*
G01*
X97071600Y-91955500D01*
G75*
G02*
X97211600Y-92095500I0J-140000D01*
G01*
X97211600Y-92435500D01*
G75*
G02*
X97071600Y-92575500I-140000J0D01*
G01*
X96791600Y-92575500D01*
G75*
G02*
X96651600Y-92435500I0J140000D01*
G01*
G37*
%TD*%
%TO.C,C4*%
G36*
G01*
X100411100Y-89446700D02*
X100071100Y-89446700D01*
G75*
G02*
X99931100Y-89306700I0J140000D01*
G01*
X99931100Y-89026700D01*
G75*
G02*
X100071100Y-88886700I140000J0D01*
G01*
X100411100Y-88886700D01*
G75*
G02*
X100551100Y-89026700I0J-140000D01*
G01*
X100551100Y-89306700D01*
G75*
G02*
X100411100Y-89446700I-140000J0D01*
G01*
G37*
G36*
G01*
X100411100Y-90406700D02*
X100071100Y-90406700D01*
G75*
G02*
X99931100Y-90266700I0J140000D01*
G01*
X99931100Y-89986700D01*
G75*
G02*
X100071100Y-89846700I140000J0D01*
G01*
X100411100Y-89846700D01*
G75*
G02*
X100551100Y-89986700I0J-140000D01*
G01*
X100551100Y-90266700D01*
G75*
G02*
X100411100Y-90406700I-140000J0D01*
G01*
G37*
%TD*%
%TO.C,C3*%
G36*
G01*
X99111400Y-92095500D02*
X99111400Y-92435500D01*
G75*
G02*
X98971400Y-92575500I-140000J0D01*
G01*
X98691400Y-92575500D01*
G75*
G02*
X98551400Y-92435500I0J140000D01*
G01*
X98551400Y-92095500D01*
G75*
G02*
X98691400Y-91955500I140000J0D01*
G01*
X98971400Y-91955500D01*
G75*
G02*
X99111400Y-92095500I0J-140000D01*
G01*
G37*
G36*
G01*
X100071400Y-92095500D02*
X100071400Y-92435500D01*
G75*
G02*
X99931400Y-92575500I-140000J0D01*
G01*
X99651400Y-92575500D01*
G75*
G02*
X99511400Y-92435500I0J140000D01*
G01*
X99511400Y-92095500D01*
G75*
G02*
X99651400Y-91955500I140000J0D01*
G01*
X99931400Y-91955500D01*
G75*
G02*
X100071400Y-92095500I0J-140000D01*
G01*
G37*
%TD*%
%TO.C,R5*%
G36*
G01*
X108340400Y-86278300D02*
X108340400Y-85908300D01*
G75*
G02*
X108475400Y-85773300I135000J0D01*
G01*
X108745400Y-85773300D01*
G75*
G02*
X108880400Y-85908300I0J-135000D01*
G01*
X108880400Y-86278300D01*
G75*
G02*
X108745400Y-86413300I-135000J0D01*
G01*
X108475400Y-86413300D01*
G75*
G02*
X108340400Y-86278300I0J135000D01*
G01*
G37*
G36*
G01*
X107320400Y-86278300D02*
X107320400Y-85908300D01*
G75*
G02*
X107455400Y-85773300I135000J0D01*
G01*
X107725400Y-85773300D01*
G75*
G02*
X107860400Y-85908300I0J-135000D01*
G01*
X107860400Y-86278300D01*
G75*
G02*
X107725400Y-86413300I-135000J0D01*
G01*
X107455400Y-86413300D01*
G75*
G02*
X107320400Y-86278300I0J135000D01*
G01*
G37*
%TD*%
%TO.C,R4*%
G36*
G01*
X109894400Y-85908300D02*
X109894400Y-86278300D01*
G75*
G02*
X109759400Y-86413300I-135000J0D01*
G01*
X109489400Y-86413300D01*
G75*
G02*
X109354400Y-86278300I0J135000D01*
G01*
X109354400Y-85908300D01*
G75*
G02*
X109489400Y-85773300I135000J0D01*
G01*
X109759400Y-85773300D01*
G75*
G02*
X109894400Y-85908300I0J-135000D01*
G01*
G37*
G36*
G01*
X110914400Y-85908300D02*
X110914400Y-86278300D01*
G75*
G02*
X110779400Y-86413300I-135000J0D01*
G01*
X110509400Y-86413300D01*
G75*
G02*
X110374400Y-86278300I0J135000D01*
G01*
X110374400Y-85908300D01*
G75*
G02*
X110509400Y-85773300I135000J0D01*
G01*
X110779400Y-85773300D01*
G75*
G02*
X110914400Y-85908300I0J-135000D01*
G01*
G37*
%TD*%
%TO.C,R3*%
G36*
G01*
X124744900Y-85302600D02*
X125114900Y-85302600D01*
G75*
G02*
X125249900Y-85437600I0J-135000D01*
G01*
X125249900Y-85707600D01*
G75*
G02*
X125114900Y-85842600I-135000J0D01*
G01*
X124744900Y-85842600D01*
G75*
G02*
X124609900Y-85707600I0J135000D01*
G01*
X124609900Y-85437600D01*
G75*
G02*
X124744900Y-85302600I135000J0D01*
G01*
G37*
G36*
G01*
X124744900Y-84282600D02*
X125114900Y-84282600D01*
G75*
G02*
X125249900Y-84417600I0J-135000D01*
G01*
X125249900Y-84687600D01*
G75*
G02*
X125114900Y-84822600I-135000J0D01*
G01*
X124744900Y-84822600D01*
G75*
G02*
X124609900Y-84687600I0J135000D01*
G01*
X124609900Y-84417600D01*
G75*
G02*
X124744900Y-84282600I135000J0D01*
G01*
G37*
%TD*%
%TO.C,R2*%
G36*
G01*
X107144400Y-93716600D02*
X106774400Y-93716600D01*
G75*
G02*
X106639400Y-93581600I0J135000D01*
G01*
X106639400Y-93311600D01*
G75*
G02*
X106774400Y-93176600I135000J0D01*
G01*
X107144400Y-93176600D01*
G75*
G02*
X107279400Y-93311600I0J-135000D01*
G01*
X107279400Y-93581600D01*
G75*
G02*
X107144400Y-93716600I-135000J0D01*
G01*
G37*
G36*
G01*
X107144400Y-94736600D02*
X106774400Y-94736600D01*
G75*
G02*
X106639400Y-94601600I0J135000D01*
G01*
X106639400Y-94331600D01*
G75*
G02*
X106774400Y-94196600I135000J0D01*
G01*
X107144400Y-94196600D01*
G75*
G02*
X107279400Y-94331600I0J-135000D01*
G01*
X107279400Y-94601600D01*
G75*
G02*
X107144400Y-94736600I-135000J0D01*
G01*
G37*
%TD*%
%TO.C,R1*%
G36*
G01*
X107872500Y-92514000D02*
X107872500Y-92144000D01*
G75*
G02*
X108007500Y-92009000I135000J0D01*
G01*
X108277500Y-92009000D01*
G75*
G02*
X108412500Y-92144000I0J-135000D01*
G01*
X108412500Y-92514000D01*
G75*
G02*
X108277500Y-92649000I-135000J0D01*
G01*
X108007500Y-92649000D01*
G75*
G02*
X107872500Y-92514000I0J135000D01*
G01*
G37*
G36*
G01*
X106852500Y-92514000D02*
X106852500Y-92144000D01*
G75*
G02*
X106987500Y-92009000I135000J0D01*
G01*
X107257500Y-92009000D01*
G75*
G02*
X107392500Y-92144000I0J-135000D01*
G01*
X107392500Y-92514000D01*
G75*
G02*
X107257500Y-92649000I-135000J0D01*
G01*
X106987500Y-92649000D01*
G75*
G02*
X106852500Y-92514000I0J135000D01*
G01*
G37*
%TD*%
D14*
%TO.C,Q1*%
X108562900Y-94767400D03*
X110562900Y-93817400D03*
X110562900Y-95717400D03*
%TD*%
%TO.C,C6*%
G36*
G01*
X117377400Y-90279400D02*
X117877400Y-90279400D01*
G75*
G02*
X118102400Y-90504400I0J-225000D01*
G01*
X118102400Y-90954400D01*
G75*
G02*
X117877400Y-91179400I-225000J0D01*
G01*
X117377400Y-91179400D01*
G75*
G02*
X117152400Y-90954400I0J225000D01*
G01*
X117152400Y-90504400D01*
G75*
G02*
X117377400Y-90279400I225000J0D01*
G01*
G37*
G36*
G01*
X117377400Y-88729400D02*
X117877400Y-88729400D01*
G75*
G02*
X118102400Y-88954400I0J-225000D01*
G01*
X118102400Y-89404400D01*
G75*
G02*
X117877400Y-89629400I-225000J0D01*
G01*
X117377400Y-89629400D01*
G75*
G02*
X117152400Y-89404400I0J225000D01*
G01*
X117152400Y-88954400D01*
G75*
G02*
X117377400Y-88729400I225000J0D01*
G01*
G37*
%TD*%
%TO.C,C2*%
G36*
G01*
X108843000Y-89060200D02*
X109343000Y-89060200D01*
G75*
G02*
X109568000Y-89285200I0J-225000D01*
G01*
X109568000Y-89735200D01*
G75*
G02*
X109343000Y-89960200I-225000J0D01*
G01*
X108843000Y-89960200D01*
G75*
G02*
X108618000Y-89735200I0J225000D01*
G01*
X108618000Y-89285200D01*
G75*
G02*
X108843000Y-89060200I225000J0D01*
G01*
G37*
G36*
G01*
X108843000Y-87510200D02*
X109343000Y-87510200D01*
G75*
G02*
X109568000Y-87735200I0J-225000D01*
G01*
X109568000Y-88185200D01*
G75*
G02*
X109343000Y-88410200I-225000J0D01*
G01*
X108843000Y-88410200D01*
G75*
G02*
X108618000Y-88185200I0J225000D01*
G01*
X108618000Y-87735200D01*
G75*
G02*
X108843000Y-87510200I225000J0D01*
G01*
G37*
%TD*%
%TO.C,C1*%
G36*
G01*
X107552300Y-89857400D02*
X107052300Y-89857400D01*
G75*
G02*
X106827300Y-89632400I0J225000D01*
G01*
X106827300Y-89182400D01*
G75*
G02*
X107052300Y-88957400I225000J0D01*
G01*
X107552300Y-88957400D01*
G75*
G02*
X107777300Y-89182400I0J-225000D01*
G01*
X107777300Y-89632400D01*
G75*
G02*
X107552300Y-89857400I-225000J0D01*
G01*
G37*
G36*
G01*
X107552300Y-91407400D02*
X107052300Y-91407400D01*
G75*
G02*
X106827300Y-91182400I0J225000D01*
G01*
X106827300Y-90732400D01*
G75*
G02*
X107052300Y-90507400I225000J0D01*
G01*
X107552300Y-90507400D01*
G75*
G02*
X107777300Y-90732400I0J-225000D01*
G01*
X107777300Y-91182400D01*
G75*
G02*
X107552300Y-91407400I-225000J0D01*
G01*
G37*
%TD*%
D15*
%TO.C,IC1*%
X104876600Y-92646900D03*
X102336600Y-92646900D03*
X102336600Y-86346900D03*
X104876600Y-86346900D03*
%TD*%
%TO.C,U2*%
G36*
G01*
X96550000Y-88275000D02*
X96450000Y-88275000D01*
G75*
G02*
X96400000Y-88225000I0J50000D01*
G01*
X96400000Y-87775000D01*
G75*
G02*
X96450000Y-87725000I50000J0D01*
G01*
X96550000Y-87725000D01*
G75*
G02*
X96600000Y-87775000I0J-50000D01*
G01*
X96600000Y-88225000D01*
G75*
G02*
X96550000Y-88275000I-50000J0D01*
G01*
G37*
G36*
G01*
X96950000Y-88275000D02*
X96850000Y-88275000D01*
G75*
G02*
X96800000Y-88225000I0J50000D01*
G01*
X96800000Y-87775000D01*
G75*
G02*
X96850000Y-87725000I50000J0D01*
G01*
X96950000Y-87725000D01*
G75*
G02*
X97000000Y-87775000I0J-50000D01*
G01*
X97000000Y-88225000D01*
G75*
G02*
X96950000Y-88275000I-50000J0D01*
G01*
G37*
G36*
G01*
X97350000Y-88275000D02*
X97250000Y-88275000D01*
G75*
G02*
X97200000Y-88225000I0J50000D01*
G01*
X97200000Y-87775000D01*
G75*
G02*
X97250000Y-87725000I50000J0D01*
G01*
X97350000Y-87725000D01*
G75*
G02*
X97400000Y-87775000I0J-50000D01*
G01*
X97400000Y-88225000D01*
G75*
G02*
X97350000Y-88275000I-50000J0D01*
G01*
G37*
G36*
G01*
X97750000Y-88275000D02*
X97650000Y-88275000D01*
G75*
G02*
X97600000Y-88225000I0J50000D01*
G01*
X97600000Y-87775000D01*
G75*
G02*
X97650000Y-87725000I50000J0D01*
G01*
X97750000Y-87725000D01*
G75*
G02*
X97800000Y-87775000I0J-50000D01*
G01*
X97800000Y-88225000D01*
G75*
G02*
X97750000Y-88275000I-50000J0D01*
G01*
G37*
G36*
G01*
X98150000Y-88275000D02*
X98050000Y-88275000D01*
G75*
G02*
X98000000Y-88225000I0J50000D01*
G01*
X98000000Y-87775000D01*
G75*
G02*
X98050000Y-87725000I50000J0D01*
G01*
X98150000Y-87725000D01*
G75*
G02*
X98200000Y-87775000I0J-50000D01*
G01*
X98200000Y-88225000D01*
G75*
G02*
X98150000Y-88275000I-50000J0D01*
G01*
G37*
G36*
G01*
X98550000Y-88275000D02*
X98450000Y-88275000D01*
G75*
G02*
X98400000Y-88225000I0J50000D01*
G01*
X98400000Y-87775000D01*
G75*
G02*
X98450000Y-87725000I50000J0D01*
G01*
X98550000Y-87725000D01*
G75*
G02*
X98600000Y-87775000I0J-50000D01*
G01*
X98600000Y-88225000D01*
G75*
G02*
X98550000Y-88275000I-50000J0D01*
G01*
G37*
G36*
G01*
X98725000Y-88550000D02*
X98725000Y-88450000D01*
G75*
G02*
X98775000Y-88400000I50000J0D01*
G01*
X99225000Y-88400000D01*
G75*
G02*
X99275000Y-88450000I0J-50000D01*
G01*
X99275000Y-88550000D01*
G75*
G02*
X99225000Y-88600000I-50000J0D01*
G01*
X98775000Y-88600000D01*
G75*
G02*
X98725000Y-88550000I0J50000D01*
G01*
G37*
G36*
G01*
X98725000Y-88950000D02*
X98725000Y-88850000D01*
G75*
G02*
X98775000Y-88800000I50000J0D01*
G01*
X99225000Y-88800000D01*
G75*
G02*
X99275000Y-88850000I0J-50000D01*
G01*
X99275000Y-88950000D01*
G75*
G02*
X99225000Y-89000000I-50000J0D01*
G01*
X98775000Y-89000000D01*
G75*
G02*
X98725000Y-88950000I0J50000D01*
G01*
G37*
G36*
G01*
X98725000Y-89350000D02*
X98725000Y-89250000D01*
G75*
G02*
X98775000Y-89200000I50000J0D01*
G01*
X99225000Y-89200000D01*
G75*
G02*
X99275000Y-89250000I0J-50000D01*
G01*
X99275000Y-89350000D01*
G75*
G02*
X99225000Y-89400000I-50000J0D01*
G01*
X98775000Y-89400000D01*
G75*
G02*
X98725000Y-89350000I0J50000D01*
G01*
G37*
G36*
G01*
X98725000Y-89750000D02*
X98725000Y-89650000D01*
G75*
G02*
X98775000Y-89600000I50000J0D01*
G01*
X99225000Y-89600000D01*
G75*
G02*
X99275000Y-89650000I0J-50000D01*
G01*
X99275000Y-89750000D01*
G75*
G02*
X99225000Y-89800000I-50000J0D01*
G01*
X98775000Y-89800000D01*
G75*
G02*
X98725000Y-89750000I0J50000D01*
G01*
G37*
G36*
G01*
X98725000Y-90150000D02*
X98725000Y-90050000D01*
G75*
G02*
X98775000Y-90000000I50000J0D01*
G01*
X99225000Y-90000000D01*
G75*
G02*
X99275000Y-90050000I0J-50000D01*
G01*
X99275000Y-90150000D01*
G75*
G02*
X99225000Y-90200000I-50000J0D01*
G01*
X98775000Y-90200000D01*
G75*
G02*
X98725000Y-90150000I0J50000D01*
G01*
G37*
G36*
G01*
X98725000Y-90550000D02*
X98725000Y-90450000D01*
G75*
G02*
X98775000Y-90400000I50000J0D01*
G01*
X99225000Y-90400000D01*
G75*
G02*
X99275000Y-90450000I0J-50000D01*
G01*
X99275000Y-90550000D01*
G75*
G02*
X99225000Y-90600000I-50000J0D01*
G01*
X98775000Y-90600000D01*
G75*
G02*
X98725000Y-90550000I0J50000D01*
G01*
G37*
G36*
G01*
X98550000Y-91275000D02*
X98450000Y-91275000D01*
G75*
G02*
X98400000Y-91225000I0J50000D01*
G01*
X98400000Y-90775000D01*
G75*
G02*
X98450000Y-90725000I50000J0D01*
G01*
X98550000Y-90725000D01*
G75*
G02*
X98600000Y-90775000I0J-50000D01*
G01*
X98600000Y-91225000D01*
G75*
G02*
X98550000Y-91275000I-50000J0D01*
G01*
G37*
G36*
G01*
X98150000Y-91275000D02*
X98050000Y-91275000D01*
G75*
G02*
X98000000Y-91225000I0J50000D01*
G01*
X98000000Y-90775000D01*
G75*
G02*
X98050000Y-90725000I50000J0D01*
G01*
X98150000Y-90725000D01*
G75*
G02*
X98200000Y-90775000I0J-50000D01*
G01*
X98200000Y-91225000D01*
G75*
G02*
X98150000Y-91275000I-50000J0D01*
G01*
G37*
G36*
G01*
X97750000Y-91275000D02*
X97650000Y-91275000D01*
G75*
G02*
X97600000Y-91225000I0J50000D01*
G01*
X97600000Y-90775000D01*
G75*
G02*
X97650000Y-90725000I50000J0D01*
G01*
X97750000Y-90725000D01*
G75*
G02*
X97800000Y-90775000I0J-50000D01*
G01*
X97800000Y-91225000D01*
G75*
G02*
X97750000Y-91275000I-50000J0D01*
G01*
G37*
G36*
G01*
X97350000Y-91275000D02*
X97250000Y-91275000D01*
G75*
G02*
X97200000Y-91225000I0J50000D01*
G01*
X97200000Y-90775000D01*
G75*
G02*
X97250000Y-90725000I50000J0D01*
G01*
X97350000Y-90725000D01*
G75*
G02*
X97400000Y-90775000I0J-50000D01*
G01*
X97400000Y-91225000D01*
G75*
G02*
X97350000Y-91275000I-50000J0D01*
G01*
G37*
G36*
G01*
X96950000Y-91275000D02*
X96850000Y-91275000D01*
G75*
G02*
X96800000Y-91225000I0J50000D01*
G01*
X96800000Y-90775000D01*
G75*
G02*
X96850000Y-90725000I50000J0D01*
G01*
X96950000Y-90725000D01*
G75*
G02*
X97000000Y-90775000I0J-50000D01*
G01*
X97000000Y-91225000D01*
G75*
G02*
X96950000Y-91275000I-50000J0D01*
G01*
G37*
G36*
G01*
X96550000Y-91275000D02*
X96450000Y-91275000D01*
G75*
G02*
X96400000Y-91225000I0J50000D01*
G01*
X96400000Y-90775000D01*
G75*
G02*
X96450000Y-90725000I50000J0D01*
G01*
X96550000Y-90725000D01*
G75*
G02*
X96600000Y-90775000I0J-50000D01*
G01*
X96600000Y-91225000D01*
G75*
G02*
X96550000Y-91275000I-50000J0D01*
G01*
G37*
G36*
G01*
X95725000Y-90550000D02*
X95725000Y-90450000D01*
G75*
G02*
X95775000Y-90400000I50000J0D01*
G01*
X96225000Y-90400000D01*
G75*
G02*
X96275000Y-90450000I0J-50000D01*
G01*
X96275000Y-90550000D01*
G75*
G02*
X96225000Y-90600000I-50000J0D01*
G01*
X95775000Y-90600000D01*
G75*
G02*
X95725000Y-90550000I0J50000D01*
G01*
G37*
G36*
G01*
X95725000Y-90150000D02*
X95725000Y-90050000D01*
G75*
G02*
X95775000Y-90000000I50000J0D01*
G01*
X96225000Y-90000000D01*
G75*
G02*
X96275000Y-90050000I0J-50000D01*
G01*
X96275000Y-90150000D01*
G75*
G02*
X96225000Y-90200000I-50000J0D01*
G01*
X95775000Y-90200000D01*
G75*
G02*
X95725000Y-90150000I0J50000D01*
G01*
G37*
G36*
G01*
X95725000Y-89750000D02*
X95725000Y-89650000D01*
G75*
G02*
X95775000Y-89600000I50000J0D01*
G01*
X96225000Y-89600000D01*
G75*
G02*
X96275000Y-89650000I0J-50000D01*
G01*
X96275000Y-89750000D01*
G75*
G02*
X96225000Y-89800000I-50000J0D01*
G01*
X95775000Y-89800000D01*
G75*
G02*
X95725000Y-89750000I0J50000D01*
G01*
G37*
G36*
G01*
X95725000Y-89350000D02*
X95725000Y-89250000D01*
G75*
G02*
X95775000Y-89200000I50000J0D01*
G01*
X96225000Y-89200000D01*
G75*
G02*
X96275000Y-89250000I0J-50000D01*
G01*
X96275000Y-89350000D01*
G75*
G02*
X96225000Y-89400000I-50000J0D01*
G01*
X95775000Y-89400000D01*
G75*
G02*
X95725000Y-89350000I0J50000D01*
G01*
G37*
G36*
G01*
X95725000Y-88950000D02*
X95725000Y-88850000D01*
G75*
G02*
X95775000Y-88800000I50000J0D01*
G01*
X96225000Y-88800000D01*
G75*
G02*
X96275000Y-88850000I0J-50000D01*
G01*
X96275000Y-88950000D01*
G75*
G02*
X96225000Y-89000000I-50000J0D01*
G01*
X95775000Y-89000000D01*
G75*
G02*
X95725000Y-88950000I0J50000D01*
G01*
G37*
G36*
G01*
X95725000Y-88550000D02*
X95725000Y-88450000D01*
G75*
G02*
X95775000Y-88400000I50000J0D01*
G01*
X96225000Y-88400000D01*
G75*
G02*
X96275000Y-88450000I0J-50000D01*
G01*
X96275000Y-88550000D01*
G75*
G02*
X96225000Y-88600000I-50000J0D01*
G01*
X95775000Y-88600000D01*
G75*
G02*
X95725000Y-88550000I0J50000D01*
G01*
G37*
%TD*%
D16*
%TO.C,U1*%
X119810500Y-91288000D03*
X124410500Y-91288000D03*
X122110500Y-91288000D03*
D17*
X122110500Y-84988000D03*
%TD*%
M02*
