Designator,Val,Package,Mid X,Mid Y,Rotation,Layer
C1,4u7,C_0603_1608Metric,107.3023,-90.1824,90,top
C2,10u/10V,C_0603_1608Metric,109.093,-88.7352,270,top
C3,100n/3V3,C_0402_1005Metric,99.3114,-92.2655,180,top
C4,100n/3V3,C_0402_1005Metric,100.2411,-89.6467,90,top
C5,100n/3V3,C_0402_1005Metric,97.4116,-92.2655,0,top
C6,22u/6V3,C_0603_1608Metric,117.6274,-89.9544,270,top
C7,10u/10V,C_0603_1608Metric,126.6444,-90.9952,90,top
D1,WS2812B,LED_WS2812B_PLCC4_5.0x5.0mm_P3.2mm,113.3729,-89.5096,0,top
IC1,IRM-H6xxT,IRM-H6XXT,103.6066,-89.4969,270,top
Q1,2N7002,SOT-23,109.5629,-94.7674,180,top
R1,100,R_0402_1005Metric,107.6325,-92.329,0,top
R2,10k,R_0402_1005Metric,106.9594,-93.9566,90,top
R3,3k9,R_0402_1005Metric,124.9299,-85.0626,270,top
R4,3k9,R_0402_1005Metric,110.1344,-86.0933,180,top
R5,3k9,R_0402_1005Metric,108.1004,-86.0933,0,top
U1,AMS1117-3.3,SOT-223-3_TabPin2,122.1105,-88.138,90,top
U2,MPU-9250,InvenSense_QFN-24_3x3mm_P0.4mm,97.5,-89.5,0,top
