%TF.GenerationSoftware,KiCad,Pcbnew,5.1.10*%
%TF.CreationDate,2021-11-04T10:56:06+01:00*%
%TF.ProjectId,Headtrack,48656164-7472-4616-936b-2e6b69636164,rev?*%
%TF.SameCoordinates,Original*%
%TF.FileFunction,Copper,L2,Bot*%
%TF.FilePolarity,Positive*%
%FSLAX46Y46*%
G04 Gerber Fmt 4.6, Leading zero omitted, Abs format (unit mm)*
G04 Created by KiCad (PCBNEW 5.1.10) date 2021-11-04 10:56:06*
%MOMM*%
%LPD*%
G01*
G04 APERTURE LIST*
%TA.AperFunction,ComponentPad*%
%ADD10O,0.800000X1.300000*%
%TD*%
%TA.AperFunction,SMDPad,CuDef*%
%ADD11C,0.100000*%
%TD*%
%TA.AperFunction,ViaPad*%
%ADD12C,0.400000*%
%TD*%
%TA.AperFunction,Conductor*%
%ADD13C,0.400000*%
%TD*%
%TA.AperFunction,Conductor*%
%ADD14C,0.200000*%
%TD*%
%TA.AperFunction,Conductor*%
%ADD15C,0.254000*%
%TD*%
%TA.AperFunction,Conductor*%
%ADD16C,0.100000*%
%TD*%
G04 APERTURE END LIST*
D10*
%TO.P,J1,6*%
%TO.N,GND*%
X120496000Y-81000000D03*
%TO.P,J1,5*%
%TO.N,/SCL*%
X121746000Y-81000000D03*
%TO.P,J1,4*%
%TO.N,/SDA*%
X122996000Y-81000000D03*
%TO.P,J1,3*%
%TO.N,/LED_DATA*%
X124246000Y-81000000D03*
%TO.P,J1,2*%
%TO.N,Net-(J1-Pad2)*%
X125496000Y-81000000D03*
%TO.P,J1,1*%
%TO.N,/5V*%
%TA.AperFunction,ComponentPad*%
G36*
G01*
X127146000Y-80550000D02*
X127146000Y-81450000D01*
G75*
G02*
X126946000Y-81650000I-200000J0D01*
G01*
X126546000Y-81650000D01*
G75*
G02*
X126346000Y-81450000I0J200000D01*
G01*
X126346000Y-80550000D01*
G75*
G02*
X126546000Y-80350000I200000J0D01*
G01*
X126946000Y-80350000D01*
G75*
G02*
X127146000Y-80550000I0J-200000D01*
G01*
G37*
%TD.AperFunction*%
%TD*%
%TA.AperFunction,SMDPad,CuDef*%
D11*
%TO.P,JP3,1*%
%TO.N,Net-(JP3-Pad1)*%
G36*
X105016300Y-85182200D02*
G01*
X105766300Y-85682200D01*
X105766300Y-86682200D01*
X104266300Y-86682200D01*
X104266300Y-85682200D01*
X105016300Y-85182200D01*
G37*
%TD.AperFunction*%
%TA.AperFunction,SMDPad,CuDef*%
%TO.P,JP3,2*%
%TO.N,/SCL*%
G36*
X105766300Y-84232200D02*
G01*
X105766300Y-85382200D01*
X105016300Y-84882200D01*
X104266300Y-85382200D01*
X104266300Y-84232200D01*
X105766300Y-84232200D01*
G37*
%TD.AperFunction*%
%TD*%
%TA.AperFunction,SMDPad,CuDef*%
%TO.P,JP2,1*%
%TO.N,Net-(JP2-Pad1)*%
G36*
X109537500Y-85157900D02*
G01*
X110287500Y-85657900D01*
X110287500Y-86657900D01*
X108787500Y-86657900D01*
X108787500Y-85657900D01*
X109537500Y-85157900D01*
G37*
%TD.AperFunction*%
%TA.AperFunction,SMDPad,CuDef*%
%TO.P,JP2,2*%
%TO.N,/SDA*%
G36*
X110287500Y-84207900D02*
G01*
X110287500Y-85357900D01*
X109537500Y-84857900D01*
X108787500Y-85357900D01*
X108787500Y-84207900D01*
X110287500Y-84207900D01*
G37*
%TD.AperFunction*%
%TD*%
%TA.AperFunction,SMDPad,CuDef*%
%TO.P,JP1,1*%
%TO.N,/5V*%
G36*
X108000000Y-93000000D02*
G01*
X107250000Y-92500000D01*
X107250000Y-91500000D01*
X108750000Y-91500000D01*
X108750000Y-92500000D01*
X108000000Y-93000000D01*
G37*
%TD.AperFunction*%
%TA.AperFunction,SMDPad,CuDef*%
%TO.P,JP1,2*%
%TO.N,Net-(JP1-Pad2)*%
G36*
X107250000Y-93950000D02*
G01*
X107250000Y-92800000D01*
X108000000Y-93300000D01*
X108750000Y-92800000D01*
X108750000Y-93950000D01*
X107250000Y-93950000D01*
G37*
%TD.AperFunction*%
%TD*%
D12*
%TO.N,/5V*%
X109693010Y-91770200D03*
%TO.N,GND*%
X120662700Y-89814400D03*
X126733300Y-89166700D03*
X126771400Y-88188800D03*
X119011700Y-89763600D03*
X116243100Y-89789000D03*
X108038900Y-88557100D03*
X113779300Y-89928700D03*
X113385600Y-91922600D03*
X104889300Y-87312500D03*
X102387400Y-87312500D03*
X99504500Y-87744300D03*
X99098100Y-91084400D03*
X98475800Y-91732100D03*
X101028500Y-89166700D03*
X108190700Y-89510200D03*
X109093000Y-90449400D03*
X109852100Y-93106600D03*
X114439700Y-90538300D03*
X118592600Y-91808300D03*
X125666500Y-89433400D03*
%TO.N,/5V*%
X124599700Y-89446100D03*
%TO.N,/3V3*%
X97434400Y-87071200D03*
X95554800Y-87934800D03*
%TO.N,/SDA*%
X109537500Y-83921600D03*
%TO.N,/SCL*%
X106703110Y-85308190D03*
%TO.N,Net-(JP1-Pad2)*%
X107731598Y-94246530D03*
%TO.N,Net-(JP2-Pad1)*%
X111393746Y-86167454D03*
%TO.N,Net-(JP3-Pad1)*%
X106781600Y-86321900D03*
%TD*%
D13*
%TO.N,/5V*%
X109463210Y-92000000D02*
X109693010Y-91770200D01*
X108000000Y-92000000D02*
X109463210Y-92000000D01*
X126746000Y-87299800D02*
X124599700Y-89446100D01*
X126746000Y-81000000D02*
X126746000Y-87299800D01*
D14*
%TO.N,/3V3*%
X96418400Y-87071200D02*
X95554800Y-87934800D01*
X97434400Y-87071200D02*
X96418400Y-87071200D01*
D13*
%TO.N,/SDA*%
X109537500Y-84707900D02*
X109537500Y-83921600D01*
D14*
%TO.N,/SCL*%
X106127120Y-84732200D02*
X106703110Y-85308190D01*
X105016300Y-84732200D02*
X106127120Y-84732200D01*
D13*
%TO.N,Net-(JP1-Pad2)*%
X108000000Y-93978128D02*
X107731598Y-94246530D01*
X108000000Y-93450000D02*
X108000000Y-93978128D01*
%TO.N,Net-(JP2-Pad1)*%
X111384192Y-86157900D02*
X111393746Y-86167454D01*
X109537500Y-86157900D02*
X111384192Y-86157900D01*
%TO.N,Net-(JP3-Pad1)*%
X105156000Y-86321900D02*
X105016300Y-86182200D01*
X106781600Y-86321900D02*
X105156000Y-86321900D01*
%TD*%
D15*
%TO.N,GND*%
X128580000Y-99542225D02*
X117070068Y-99547966D01*
X103735918Y-95305282D01*
X113023000Y-95305282D01*
X113023000Y-95694718D01*
X113098975Y-96076670D01*
X113248005Y-96436461D01*
X113464364Y-96760264D01*
X113739736Y-97035636D01*
X114063539Y-97251995D01*
X114423330Y-97401025D01*
X114805282Y-97477000D01*
X115194718Y-97477000D01*
X115576670Y-97401025D01*
X115936461Y-97251995D01*
X116260264Y-97035636D01*
X116535636Y-96760264D01*
X116751995Y-96436461D01*
X116901025Y-96076670D01*
X116977000Y-95694718D01*
X116977000Y-95337636D01*
X120111000Y-95337636D01*
X120111001Y-97448365D01*
X120127308Y-97613931D01*
X120191751Y-97826371D01*
X120296401Y-98022157D01*
X120437236Y-98193765D01*
X120608844Y-98334600D01*
X120804630Y-98439250D01*
X121017070Y-98503693D01*
X121238000Y-98525453D01*
X121458931Y-98503693D01*
X121671371Y-98439250D01*
X121867157Y-98334600D01*
X122038765Y-98193765D01*
X122179600Y-98022157D01*
X122284250Y-97826371D01*
X122348693Y-97613931D01*
X122365000Y-97448365D01*
X122365000Y-95337636D01*
X125111000Y-95337636D01*
X125111001Y-97448365D01*
X125127308Y-97613931D01*
X125191751Y-97826371D01*
X125296401Y-98022157D01*
X125437236Y-98193765D01*
X125608844Y-98334600D01*
X125804630Y-98439250D01*
X126017070Y-98503693D01*
X126238000Y-98525453D01*
X126458931Y-98503693D01*
X126671371Y-98439250D01*
X126867157Y-98334600D01*
X127038765Y-98193765D01*
X127179600Y-98022157D01*
X127284250Y-97826371D01*
X127348693Y-97613931D01*
X127365000Y-97448365D01*
X127365000Y-95337635D01*
X127348693Y-95172069D01*
X127284250Y-94959629D01*
X127179600Y-94763843D01*
X127038765Y-94592235D01*
X126867157Y-94451400D01*
X126671370Y-94346750D01*
X126458930Y-94282307D01*
X126238000Y-94260547D01*
X126017069Y-94282307D01*
X125804629Y-94346750D01*
X125608843Y-94451400D01*
X125437235Y-94592235D01*
X125296400Y-94763843D01*
X125191750Y-94959630D01*
X125127307Y-95172070D01*
X125111000Y-95337636D01*
X122365000Y-95337636D01*
X122365000Y-95337635D01*
X122348693Y-95172069D01*
X122284250Y-94959629D01*
X122179600Y-94763843D01*
X122038765Y-94592235D01*
X121867157Y-94451400D01*
X121671370Y-94346750D01*
X121458930Y-94282307D01*
X121238000Y-94260547D01*
X121017069Y-94282307D01*
X120804629Y-94346750D01*
X120608843Y-94451400D01*
X120437235Y-94592235D01*
X120296400Y-94763843D01*
X120191750Y-94959630D01*
X120127307Y-95172070D01*
X120111000Y-95337636D01*
X116977000Y-95337636D01*
X116977000Y-95305282D01*
X116901025Y-94923330D01*
X116751995Y-94563539D01*
X116535636Y-94239736D01*
X116260264Y-93964364D01*
X115936461Y-93748005D01*
X115576670Y-93598975D01*
X115194718Y-93523000D01*
X114805282Y-93523000D01*
X114423330Y-93598975D01*
X114063539Y-93748005D01*
X113739736Y-93964364D01*
X113464364Y-94239736D01*
X113248005Y-94563539D01*
X113098975Y-94923330D01*
X113023000Y-95305282D01*
X103735918Y-95305282D01*
X95452000Y-92669490D01*
X95452000Y-91500000D01*
X106871176Y-91500000D01*
X106871176Y-92500000D01*
X106878533Y-92574293D01*
X106900164Y-92645336D01*
X106902682Y-92650035D01*
X106900012Y-92655030D01*
X106878455Y-92726095D01*
X106871176Y-92800000D01*
X106871176Y-93950000D01*
X106878455Y-94023905D01*
X106900012Y-94094970D01*
X106935019Y-94160463D01*
X106982131Y-94217869D01*
X107039537Y-94264981D01*
X107105030Y-94299988D01*
X107157067Y-94315773D01*
X107160156Y-94331303D01*
X107162947Y-94359641D01*
X107171213Y-94386891D01*
X107176772Y-94414835D01*
X107187678Y-94441165D01*
X107195942Y-94468406D01*
X107209359Y-94493508D01*
X107220267Y-94519842D01*
X107236102Y-94543541D01*
X107249520Y-94568644D01*
X107267580Y-94590651D01*
X107283413Y-94614346D01*
X107303561Y-94634494D01*
X107321624Y-94656504D01*
X107343634Y-94674567D01*
X107363782Y-94694715D01*
X107387477Y-94710548D01*
X107409484Y-94728608D01*
X107434587Y-94742026D01*
X107458286Y-94757861D01*
X107484620Y-94768769D01*
X107509722Y-94782186D01*
X107536963Y-94790450D01*
X107563293Y-94801356D01*
X107591237Y-94806915D01*
X107618487Y-94815181D01*
X107646825Y-94817972D01*
X107674768Y-94823530D01*
X107703267Y-94823530D01*
X107731598Y-94826320D01*
X107759929Y-94823530D01*
X107788428Y-94823530D01*
X107816371Y-94817972D01*
X107844709Y-94815181D01*
X107871959Y-94806915D01*
X107899903Y-94801356D01*
X107926233Y-94790450D01*
X107953474Y-94782186D01*
X107978576Y-94768769D01*
X108004910Y-94757861D01*
X108028609Y-94742026D01*
X108053712Y-94728608D01*
X108075719Y-94710548D01*
X108099414Y-94694715D01*
X108179783Y-94614346D01*
X108179783Y-94614345D01*
X108387957Y-94406171D01*
X108409974Y-94388102D01*
X108458623Y-94328824D01*
X108750000Y-94328824D01*
X108823905Y-94321545D01*
X108894970Y-94299988D01*
X108960463Y-94264981D01*
X109017869Y-94217869D01*
X109064981Y-94160463D01*
X109099988Y-94094970D01*
X109121545Y-94023905D01*
X109128824Y-93950000D01*
X109128824Y-92800000D01*
X109121622Y-92726484D01*
X109100139Y-92655397D01*
X109097280Y-92650035D01*
X109099988Y-92644970D01*
X109120606Y-92577000D01*
X109434879Y-92577000D01*
X109463210Y-92579790D01*
X109491541Y-92577000D01*
X109491546Y-92577000D01*
X109522969Y-92573905D01*
X109576321Y-92568651D01*
X109620980Y-92555103D01*
X109685086Y-92535657D01*
X109785325Y-92482079D01*
X109873184Y-92409974D01*
X109891250Y-92387961D01*
X110141195Y-92138016D01*
X110157029Y-92114318D01*
X110175088Y-92092314D01*
X110188507Y-92067210D01*
X110204341Y-92043512D01*
X110215248Y-92017181D01*
X110228666Y-91992077D01*
X110236930Y-91964834D01*
X110247836Y-91938505D01*
X110253395Y-91910556D01*
X110261660Y-91883312D01*
X110264450Y-91854980D01*
X110270010Y-91827030D01*
X110270010Y-91798530D01*
X110272800Y-91770201D01*
X110270010Y-91741872D01*
X110270010Y-91713370D01*
X110264450Y-91685419D01*
X110261660Y-91657089D01*
X110253396Y-91629847D01*
X110247836Y-91601895D01*
X110236929Y-91575563D01*
X110228666Y-91548324D01*
X110215249Y-91523223D01*
X110204341Y-91496888D01*
X110188504Y-91473186D01*
X110175088Y-91448087D01*
X110157033Y-91426087D01*
X110141195Y-91402384D01*
X110121038Y-91382227D01*
X110102983Y-91360227D01*
X110080983Y-91342172D01*
X110060826Y-91322015D01*
X110037123Y-91306177D01*
X110015123Y-91288122D01*
X109990024Y-91274706D01*
X109966322Y-91258869D01*
X109939987Y-91247961D01*
X109914886Y-91234544D01*
X109887647Y-91226281D01*
X109861315Y-91215374D01*
X109833363Y-91209814D01*
X109806121Y-91201550D01*
X109777791Y-91198760D01*
X109749840Y-91193200D01*
X109721338Y-91193200D01*
X109693009Y-91190410D01*
X109664680Y-91193200D01*
X109636180Y-91193200D01*
X109608230Y-91198760D01*
X109579898Y-91201550D01*
X109552654Y-91209815D01*
X109524705Y-91215374D01*
X109498376Y-91226280D01*
X109471133Y-91234544D01*
X109446029Y-91247962D01*
X109419698Y-91258869D01*
X109396000Y-91274703D01*
X109370896Y-91288122D01*
X109348892Y-91306181D01*
X109325194Y-91322015D01*
X109244823Y-91402386D01*
X109224210Y-91423000D01*
X109120606Y-91423000D01*
X109099988Y-91355030D01*
X109064981Y-91289537D01*
X109017869Y-91232131D01*
X108960463Y-91185019D01*
X108894970Y-91150012D01*
X108823905Y-91128455D01*
X108750000Y-91121176D01*
X107250000Y-91121176D01*
X107176095Y-91128455D01*
X107105030Y-91150012D01*
X107039537Y-91185019D01*
X106982131Y-91232131D01*
X106935019Y-91289537D01*
X106900012Y-91355030D01*
X106878455Y-91426095D01*
X106871176Y-91500000D01*
X95452000Y-91500000D01*
X95452000Y-88684100D01*
X96507300Y-88684100D01*
X96507300Y-90385900D01*
X96509740Y-90410676D01*
X96516967Y-90434501D01*
X96528703Y-90456457D01*
X96544497Y-90475703D01*
X96563743Y-90491497D01*
X96585699Y-90503233D01*
X96609524Y-90510460D01*
X96634300Y-90512900D01*
X98412300Y-90512900D01*
X98437076Y-90510460D01*
X98460901Y-90503233D01*
X98482857Y-90491497D01*
X98502103Y-90475703D01*
X98517897Y-90456457D01*
X98529633Y-90434501D01*
X98536860Y-90410676D01*
X98539300Y-90385900D01*
X98539300Y-88684100D01*
X98536860Y-88659324D01*
X98529633Y-88635499D01*
X98517897Y-88613543D01*
X98502103Y-88594297D01*
X98482857Y-88578503D01*
X98460901Y-88566767D01*
X98437076Y-88559540D01*
X98412300Y-88557100D01*
X96634300Y-88557100D01*
X96609524Y-88559540D01*
X96585699Y-88566767D01*
X96563743Y-88578503D01*
X96544497Y-88594297D01*
X96528703Y-88613543D01*
X96516967Y-88635499D01*
X96509740Y-88659324D01*
X96507300Y-88684100D01*
X95452000Y-88684100D01*
X95452000Y-88502656D01*
X95497970Y-88511800D01*
X95611630Y-88511800D01*
X95723105Y-88489626D01*
X95828112Y-88446131D01*
X95922616Y-88382985D01*
X96002985Y-88302616D01*
X96066131Y-88208112D01*
X96109626Y-88103105D01*
X96121682Y-88042498D01*
X96615980Y-87548200D01*
X97109708Y-87548200D01*
X97161088Y-87582531D01*
X97266095Y-87626026D01*
X97377570Y-87648200D01*
X97491230Y-87648200D01*
X97602705Y-87626026D01*
X97707712Y-87582531D01*
X97802216Y-87519385D01*
X97882585Y-87439016D01*
X97945731Y-87344512D01*
X97989226Y-87239505D01*
X98011400Y-87128030D01*
X98011400Y-87014370D01*
X97989226Y-86902895D01*
X97945731Y-86797888D01*
X97882585Y-86703384D01*
X97802216Y-86623015D01*
X97707712Y-86559869D01*
X97602705Y-86516374D01*
X97491230Y-86494200D01*
X97377570Y-86494200D01*
X97266095Y-86516374D01*
X97161088Y-86559869D01*
X97109708Y-86594200D01*
X96441815Y-86594200D01*
X96418400Y-86591894D01*
X96394985Y-86594200D01*
X96394977Y-86594200D01*
X96324892Y-86601103D01*
X96234977Y-86628378D01*
X96152111Y-86672671D01*
X96126662Y-86693557D01*
X96079479Y-86732279D01*
X96064549Y-86750471D01*
X95452000Y-87363021D01*
X95452000Y-86330510D01*
X102046689Y-84232200D01*
X103887476Y-84232200D01*
X103887476Y-85382200D01*
X103894678Y-85455716D01*
X103916161Y-85526803D01*
X103919020Y-85532165D01*
X103916312Y-85537230D01*
X103894755Y-85608295D01*
X103887476Y-85682200D01*
X103887476Y-86682200D01*
X103894755Y-86756105D01*
X103916312Y-86827170D01*
X103951319Y-86892663D01*
X103998431Y-86950069D01*
X104055837Y-86997181D01*
X104121330Y-87032188D01*
X104192395Y-87053745D01*
X104266300Y-87061024D01*
X105766300Y-87061024D01*
X105840205Y-87053745D01*
X105911270Y-87032188D01*
X105976763Y-86997181D01*
X106034169Y-86950069D01*
X106076162Y-86898900D01*
X106838430Y-86898900D01*
X106866378Y-86893341D01*
X106894712Y-86890550D01*
X106921958Y-86882285D01*
X106949905Y-86876726D01*
X106976230Y-86865822D01*
X107003476Y-86857557D01*
X107028587Y-86844135D01*
X107054912Y-86833231D01*
X107078600Y-86817403D01*
X107103715Y-86803979D01*
X107125729Y-86785912D01*
X107149416Y-86770085D01*
X107169564Y-86749937D01*
X107191574Y-86731874D01*
X107209639Y-86709862D01*
X107229785Y-86689716D01*
X107245612Y-86666029D01*
X107263679Y-86644015D01*
X107277103Y-86618900D01*
X107292931Y-86595212D01*
X107303835Y-86568887D01*
X107317257Y-86543776D01*
X107325522Y-86516530D01*
X107336426Y-86490205D01*
X107341985Y-86462258D01*
X107350250Y-86435012D01*
X107353041Y-86406678D01*
X107358600Y-86378730D01*
X107358600Y-86350236D01*
X107361391Y-86321900D01*
X107358600Y-86293564D01*
X107358600Y-86265070D01*
X107353041Y-86237122D01*
X107350250Y-86208788D01*
X107341985Y-86181542D01*
X107336426Y-86153595D01*
X107325522Y-86127270D01*
X107317257Y-86100024D01*
X107303835Y-86074913D01*
X107292931Y-86048588D01*
X107277103Y-86024900D01*
X107263679Y-85999785D01*
X107245612Y-85977771D01*
X107229785Y-85954084D01*
X107209638Y-85933937D01*
X107191574Y-85911926D01*
X107169562Y-85893861D01*
X107149416Y-85873715D01*
X107125729Y-85857888D01*
X107103715Y-85839821D01*
X107078600Y-85826397D01*
X107054912Y-85810569D01*
X107028587Y-85799665D01*
X107016115Y-85792999D01*
X107070926Y-85756375D01*
X107151295Y-85676006D01*
X107214441Y-85581502D01*
X107257936Y-85476495D01*
X107280110Y-85365020D01*
X107280110Y-85251360D01*
X107257936Y-85139885D01*
X107214441Y-85034878D01*
X107151295Y-84940374D01*
X107070926Y-84860005D01*
X106976422Y-84796859D01*
X106871415Y-84753364D01*
X106810808Y-84741308D01*
X106480975Y-84411476D01*
X106466041Y-84393279D01*
X106393409Y-84333671D01*
X106310543Y-84289378D01*
X106220628Y-84262103D01*
X106150543Y-84255200D01*
X106150535Y-84255200D01*
X106145124Y-84254667D01*
X106145124Y-84232200D01*
X106142731Y-84207900D01*
X108408676Y-84207900D01*
X108408676Y-85357900D01*
X108415878Y-85431416D01*
X108437361Y-85502503D01*
X108440220Y-85507865D01*
X108437512Y-85512930D01*
X108415955Y-85583995D01*
X108408676Y-85657900D01*
X108408676Y-86657900D01*
X108415955Y-86731805D01*
X108437512Y-86802870D01*
X108472519Y-86868363D01*
X108519631Y-86925769D01*
X108577037Y-86972881D01*
X108642530Y-87007888D01*
X108713595Y-87029445D01*
X108787500Y-87036724D01*
X110287500Y-87036724D01*
X110361405Y-87029445D01*
X110432470Y-87007888D01*
X110497963Y-86972881D01*
X110555369Y-86925769D01*
X110602481Y-86868363D01*
X110637488Y-86802870D01*
X110658106Y-86734900D01*
X111276666Y-86734900D01*
X111280635Y-86736104D01*
X111308965Y-86738894D01*
X111336916Y-86744454D01*
X111365417Y-86744454D01*
X111393745Y-86747244D01*
X111422074Y-86744454D01*
X111450576Y-86744454D01*
X111478527Y-86738894D01*
X111506857Y-86736104D01*
X111534099Y-86727840D01*
X111562051Y-86722280D01*
X111588383Y-86711373D01*
X111615622Y-86703110D01*
X111640723Y-86689693D01*
X111667058Y-86678785D01*
X111690760Y-86662948D01*
X111715859Y-86649532D01*
X111737859Y-86631477D01*
X111761562Y-86615639D01*
X111781719Y-86595482D01*
X111803719Y-86577427D01*
X111821774Y-86555427D01*
X111841931Y-86535270D01*
X111857769Y-86511567D01*
X111875824Y-86489567D01*
X111889240Y-86464468D01*
X111905077Y-86440766D01*
X111915985Y-86414431D01*
X111929402Y-86389330D01*
X111937665Y-86362091D01*
X111948572Y-86335759D01*
X111954132Y-86307807D01*
X111962396Y-86280565D01*
X111965186Y-86252235D01*
X111970746Y-86224284D01*
X111970746Y-86195782D01*
X111973536Y-86167453D01*
X111970746Y-86139125D01*
X111970746Y-86110624D01*
X111965186Y-86082673D01*
X111962396Y-86054343D01*
X111954132Y-86027101D01*
X111948572Y-85999149D01*
X111937665Y-85972817D01*
X111929402Y-85945578D01*
X111915985Y-85920476D01*
X111905077Y-85894142D01*
X111889242Y-85870443D01*
X111875824Y-85845340D01*
X111857765Y-85823336D01*
X111841931Y-85799638D01*
X111812231Y-85769938D01*
X111794166Y-85747926D01*
X111772154Y-85729861D01*
X111761562Y-85719269D01*
X111749109Y-85710948D01*
X111706307Y-85675821D01*
X111606068Y-85622243D01*
X111540575Y-85602376D01*
X111497303Y-85589249D01*
X111442237Y-85583826D01*
X111412528Y-85580900D01*
X111412523Y-85580900D01*
X111384192Y-85578110D01*
X111355861Y-85580900D01*
X110658143Y-85580900D01*
X110637336Y-85512564D01*
X110634818Y-85507865D01*
X110637488Y-85502870D01*
X110659045Y-85431805D01*
X110666324Y-85357900D01*
X110666324Y-84207900D01*
X110659045Y-84133995D01*
X110637488Y-84062930D01*
X110602481Y-83997437D01*
X110555369Y-83940031D01*
X110497963Y-83892919D01*
X110432470Y-83857912D01*
X110361405Y-83836355D01*
X110287500Y-83829076D01*
X110108178Y-83829076D01*
X110106150Y-83808488D01*
X110097885Y-83781242D01*
X110092326Y-83753295D01*
X110081422Y-83726970D01*
X110073157Y-83699724D01*
X110059735Y-83674613D01*
X110048831Y-83648288D01*
X110033003Y-83624600D01*
X110019579Y-83599485D01*
X110001512Y-83577471D01*
X109985685Y-83553784D01*
X109965539Y-83533638D01*
X109947474Y-83511626D01*
X109925462Y-83493561D01*
X109905316Y-83473415D01*
X109881629Y-83457588D01*
X109859615Y-83439521D01*
X109834500Y-83426097D01*
X109810812Y-83410269D01*
X109784487Y-83399365D01*
X109759376Y-83385943D01*
X109732130Y-83377678D01*
X109705805Y-83366774D01*
X109677858Y-83361215D01*
X109650612Y-83352950D01*
X109622278Y-83350159D01*
X109594330Y-83344600D01*
X109565836Y-83344600D01*
X109537500Y-83341809D01*
X109509164Y-83344600D01*
X109480670Y-83344600D01*
X109452722Y-83350159D01*
X109424389Y-83352950D01*
X109397145Y-83361214D01*
X109369195Y-83366774D01*
X109342867Y-83377679D01*
X109315625Y-83385943D01*
X109290517Y-83399363D01*
X109264188Y-83410269D01*
X109240496Y-83426100D01*
X109215386Y-83439521D01*
X109193376Y-83457584D01*
X109169684Y-83473415D01*
X109149534Y-83493565D01*
X109127527Y-83511626D01*
X109109466Y-83533633D01*
X109089315Y-83553784D01*
X109073484Y-83577477D01*
X109055422Y-83599485D01*
X109042002Y-83624592D01*
X109026169Y-83648288D01*
X109015262Y-83674621D01*
X109001844Y-83699724D01*
X108993581Y-83726963D01*
X108982674Y-83753295D01*
X108977114Y-83781244D01*
X108968850Y-83808488D01*
X108966822Y-83829076D01*
X108787500Y-83829076D01*
X108713595Y-83836355D01*
X108642530Y-83857912D01*
X108577037Y-83892919D01*
X108519631Y-83940031D01*
X108472519Y-83997437D01*
X108437512Y-84062930D01*
X108415955Y-84133995D01*
X108408676Y-84207900D01*
X106142731Y-84207900D01*
X106137845Y-84158295D01*
X106116288Y-84087230D01*
X106081281Y-84021737D01*
X106034169Y-83964331D01*
X105976763Y-83917219D01*
X105911270Y-83882212D01*
X105840205Y-83860655D01*
X105766300Y-83853376D01*
X104266300Y-83853376D01*
X104192395Y-83860655D01*
X104121330Y-83882212D01*
X104055837Y-83917219D01*
X103998431Y-83964331D01*
X103951319Y-84021737D01*
X103916312Y-84087230D01*
X103894755Y-84158295D01*
X103887476Y-84232200D01*
X102046689Y-84232200D01*
X104959860Y-83305282D01*
X113023000Y-83305282D01*
X113023000Y-83694718D01*
X113098975Y-84076670D01*
X113248005Y-84436461D01*
X113464364Y-84760264D01*
X113739736Y-85035636D01*
X114063539Y-85251995D01*
X114423330Y-85401025D01*
X114805282Y-85477000D01*
X115194718Y-85477000D01*
X115576670Y-85401025D01*
X115936461Y-85251995D01*
X116260264Y-85035636D01*
X116535636Y-84760264D01*
X116751995Y-84436461D01*
X116901025Y-84076670D01*
X116977000Y-83694718D01*
X116977000Y-83305282D01*
X116901025Y-82923330D01*
X116751995Y-82563539D01*
X116535636Y-82239736D01*
X116260264Y-81964364D01*
X115936461Y-81748005D01*
X115576670Y-81598975D01*
X115194718Y-81523000D01*
X114805282Y-81523000D01*
X114423330Y-81598975D01*
X114063539Y-81748005D01*
X113739736Y-81964364D01*
X113464364Y-82239736D01*
X113248005Y-82563539D01*
X113098975Y-82923330D01*
X113023000Y-83305282D01*
X104959860Y-83305282D01*
X112132746Y-81023000D01*
X119769000Y-81023000D01*
X119769000Y-81273000D01*
X119787456Y-81414389D01*
X119833141Y-81549460D01*
X119904299Y-81673023D01*
X119998196Y-81780330D01*
X120111223Y-81867257D01*
X120239037Y-81930463D01*
X120359612Y-81964092D01*
X120473000Y-81894840D01*
X120473000Y-81023000D01*
X119769000Y-81023000D01*
X112132746Y-81023000D01*
X113063031Y-80727000D01*
X119769000Y-80727000D01*
X119769000Y-80977000D01*
X120473000Y-80977000D01*
X120473000Y-80105160D01*
X120519000Y-80105160D01*
X120519000Y-80977000D01*
X120539000Y-80977000D01*
X120539000Y-81023000D01*
X120519000Y-81023000D01*
X120519000Y-81894840D01*
X120632388Y-81964092D01*
X120752963Y-81930463D01*
X120880777Y-81867257D01*
X120993804Y-81780330D01*
X121087701Y-81673023D01*
X121089454Y-81669979D01*
X121096823Y-81683765D01*
X121193920Y-81802080D01*
X121312234Y-81899177D01*
X121447216Y-81971327D01*
X121593681Y-82015757D01*
X121746000Y-82030759D01*
X121898318Y-82015757D01*
X122044783Y-81971327D01*
X122179765Y-81899177D01*
X122298080Y-81802080D01*
X122371000Y-81713226D01*
X122443920Y-81802080D01*
X122562234Y-81899177D01*
X122697216Y-81971327D01*
X122843681Y-82015757D01*
X122996000Y-82030759D01*
X123148318Y-82015757D01*
X123294783Y-81971327D01*
X123429765Y-81899177D01*
X123548080Y-81802080D01*
X123621000Y-81713226D01*
X123693920Y-81802080D01*
X123812234Y-81899177D01*
X123947216Y-81971327D01*
X124093681Y-82015757D01*
X124246000Y-82030759D01*
X124398318Y-82015757D01*
X124544783Y-81971327D01*
X124679765Y-81899177D01*
X124798080Y-81802080D01*
X124871000Y-81713226D01*
X124943920Y-81802080D01*
X125062234Y-81899177D01*
X125197216Y-81971327D01*
X125343681Y-82015757D01*
X125496000Y-82030759D01*
X125648318Y-82015757D01*
X125794783Y-81971327D01*
X125929765Y-81899177D01*
X126048080Y-81802080D01*
X126068919Y-81776687D01*
X126136710Y-81859290D01*
X126169000Y-81885790D01*
X126169001Y-87060798D01*
X124151515Y-89078284D01*
X124135682Y-89101979D01*
X124117622Y-89123986D01*
X124104204Y-89149089D01*
X124088369Y-89172788D01*
X124077461Y-89199122D01*
X124064044Y-89224224D01*
X124055780Y-89251465D01*
X124044874Y-89277795D01*
X124039315Y-89305739D01*
X124031049Y-89332989D01*
X124028258Y-89361327D01*
X124022700Y-89389270D01*
X124022700Y-89417769D01*
X124019910Y-89446100D01*
X124022700Y-89474431D01*
X124022700Y-89502930D01*
X124028258Y-89530873D01*
X124031049Y-89559211D01*
X124039315Y-89586461D01*
X124044874Y-89614405D01*
X124055780Y-89640735D01*
X124064044Y-89667976D01*
X124077461Y-89693078D01*
X124088369Y-89719412D01*
X124104204Y-89743111D01*
X124117622Y-89768214D01*
X124135682Y-89790221D01*
X124151515Y-89813916D01*
X124171663Y-89834064D01*
X124189726Y-89856074D01*
X124211736Y-89874137D01*
X124231884Y-89894285D01*
X124255579Y-89910118D01*
X124277586Y-89928178D01*
X124302689Y-89941596D01*
X124326388Y-89957431D01*
X124352722Y-89968339D01*
X124377824Y-89981756D01*
X124405065Y-89990020D01*
X124431395Y-90000926D01*
X124459339Y-90006485D01*
X124486589Y-90014751D01*
X124514927Y-90017542D01*
X124542870Y-90023100D01*
X124571369Y-90023100D01*
X124599700Y-90025890D01*
X124628031Y-90023100D01*
X124656530Y-90023100D01*
X124684473Y-90017542D01*
X124712811Y-90014751D01*
X124740061Y-90006485D01*
X124768005Y-90000926D01*
X124794335Y-89990020D01*
X124821576Y-89981756D01*
X124846678Y-89968339D01*
X124873012Y-89957431D01*
X124896711Y-89941596D01*
X124921814Y-89928178D01*
X124943821Y-89910118D01*
X124967516Y-89894285D01*
X127133962Y-87727839D01*
X127155974Y-87709774D01*
X127228079Y-87621915D01*
X127271170Y-87541297D01*
X127281657Y-87521677D01*
X127314651Y-87412912D01*
X127325791Y-87299800D01*
X127323000Y-87271461D01*
X127323000Y-81885790D01*
X127355290Y-81859290D01*
X127427275Y-81771577D01*
X127480764Y-81671506D01*
X127513702Y-81562923D01*
X127524824Y-81450000D01*
X127524824Y-80550000D01*
X127513702Y-80437077D01*
X127480764Y-80328494D01*
X127427275Y-80228423D01*
X127355290Y-80140710D01*
X127267577Y-80068725D01*
X127167506Y-80015236D01*
X127058923Y-79982298D01*
X126946000Y-79971176D01*
X126546000Y-79971176D01*
X126433077Y-79982298D01*
X126324494Y-80015236D01*
X126224423Y-80068725D01*
X126136710Y-80140710D01*
X126068919Y-80223313D01*
X126048080Y-80197920D01*
X125929766Y-80100823D01*
X125794784Y-80028673D01*
X125648319Y-79984243D01*
X125496000Y-79969241D01*
X125343682Y-79984243D01*
X125197217Y-80028673D01*
X125062235Y-80100823D01*
X124943921Y-80197920D01*
X124871000Y-80286774D01*
X124798080Y-80197920D01*
X124679766Y-80100823D01*
X124544784Y-80028673D01*
X124398319Y-79984243D01*
X124246000Y-79969241D01*
X124093682Y-79984243D01*
X123947217Y-80028673D01*
X123812235Y-80100823D01*
X123693921Y-80197920D01*
X123621000Y-80286774D01*
X123548080Y-80197920D01*
X123429766Y-80100823D01*
X123294784Y-80028673D01*
X123148319Y-79984243D01*
X122996000Y-79969241D01*
X122843682Y-79984243D01*
X122697217Y-80028673D01*
X122562235Y-80100823D01*
X122443921Y-80197920D01*
X122371000Y-80286774D01*
X122298080Y-80197920D01*
X122179766Y-80100823D01*
X122044784Y-80028673D01*
X121898319Y-79984243D01*
X121746000Y-79969241D01*
X121593682Y-79984243D01*
X121447217Y-80028673D01*
X121312235Y-80100823D01*
X121193921Y-80197920D01*
X121096823Y-80316234D01*
X121089454Y-80330021D01*
X121087701Y-80326977D01*
X120993804Y-80219670D01*
X120880777Y-80132743D01*
X120752963Y-80069537D01*
X120632388Y-80035908D01*
X120519000Y-80105160D01*
X120473000Y-80105160D01*
X120359612Y-80035908D01*
X120239037Y-80069537D01*
X120111223Y-80132743D01*
X119998196Y-80219670D01*
X119904299Y-80326977D01*
X119833141Y-80450540D01*
X119787456Y-80585611D01*
X119769000Y-80727000D01*
X113063031Y-80727000D01*
X117070286Y-79451965D01*
X128580001Y-79446225D01*
X128580000Y-99542225D01*
%TA.AperFunction,Conductor*%
D16*
G36*
X128580000Y-99542225D02*
G01*
X117070068Y-99547966D01*
X103735918Y-95305282D01*
X113023000Y-95305282D01*
X113023000Y-95694718D01*
X113098975Y-96076670D01*
X113248005Y-96436461D01*
X113464364Y-96760264D01*
X113739736Y-97035636D01*
X114063539Y-97251995D01*
X114423330Y-97401025D01*
X114805282Y-97477000D01*
X115194718Y-97477000D01*
X115576670Y-97401025D01*
X115936461Y-97251995D01*
X116260264Y-97035636D01*
X116535636Y-96760264D01*
X116751995Y-96436461D01*
X116901025Y-96076670D01*
X116977000Y-95694718D01*
X116977000Y-95337636D01*
X120111000Y-95337636D01*
X120111001Y-97448365D01*
X120127308Y-97613931D01*
X120191751Y-97826371D01*
X120296401Y-98022157D01*
X120437236Y-98193765D01*
X120608844Y-98334600D01*
X120804630Y-98439250D01*
X121017070Y-98503693D01*
X121238000Y-98525453D01*
X121458931Y-98503693D01*
X121671371Y-98439250D01*
X121867157Y-98334600D01*
X122038765Y-98193765D01*
X122179600Y-98022157D01*
X122284250Y-97826371D01*
X122348693Y-97613931D01*
X122365000Y-97448365D01*
X122365000Y-95337636D01*
X125111000Y-95337636D01*
X125111001Y-97448365D01*
X125127308Y-97613931D01*
X125191751Y-97826371D01*
X125296401Y-98022157D01*
X125437236Y-98193765D01*
X125608844Y-98334600D01*
X125804630Y-98439250D01*
X126017070Y-98503693D01*
X126238000Y-98525453D01*
X126458931Y-98503693D01*
X126671371Y-98439250D01*
X126867157Y-98334600D01*
X127038765Y-98193765D01*
X127179600Y-98022157D01*
X127284250Y-97826371D01*
X127348693Y-97613931D01*
X127365000Y-97448365D01*
X127365000Y-95337635D01*
X127348693Y-95172069D01*
X127284250Y-94959629D01*
X127179600Y-94763843D01*
X127038765Y-94592235D01*
X126867157Y-94451400D01*
X126671370Y-94346750D01*
X126458930Y-94282307D01*
X126238000Y-94260547D01*
X126017069Y-94282307D01*
X125804629Y-94346750D01*
X125608843Y-94451400D01*
X125437235Y-94592235D01*
X125296400Y-94763843D01*
X125191750Y-94959630D01*
X125127307Y-95172070D01*
X125111000Y-95337636D01*
X122365000Y-95337636D01*
X122365000Y-95337635D01*
X122348693Y-95172069D01*
X122284250Y-94959629D01*
X122179600Y-94763843D01*
X122038765Y-94592235D01*
X121867157Y-94451400D01*
X121671370Y-94346750D01*
X121458930Y-94282307D01*
X121238000Y-94260547D01*
X121017069Y-94282307D01*
X120804629Y-94346750D01*
X120608843Y-94451400D01*
X120437235Y-94592235D01*
X120296400Y-94763843D01*
X120191750Y-94959630D01*
X120127307Y-95172070D01*
X120111000Y-95337636D01*
X116977000Y-95337636D01*
X116977000Y-95305282D01*
X116901025Y-94923330D01*
X116751995Y-94563539D01*
X116535636Y-94239736D01*
X116260264Y-93964364D01*
X115936461Y-93748005D01*
X115576670Y-93598975D01*
X115194718Y-93523000D01*
X114805282Y-93523000D01*
X114423330Y-93598975D01*
X114063539Y-93748005D01*
X113739736Y-93964364D01*
X113464364Y-94239736D01*
X113248005Y-94563539D01*
X113098975Y-94923330D01*
X113023000Y-95305282D01*
X103735918Y-95305282D01*
X95452000Y-92669490D01*
X95452000Y-91500000D01*
X106871176Y-91500000D01*
X106871176Y-92500000D01*
X106878533Y-92574293D01*
X106900164Y-92645336D01*
X106902682Y-92650035D01*
X106900012Y-92655030D01*
X106878455Y-92726095D01*
X106871176Y-92800000D01*
X106871176Y-93950000D01*
X106878455Y-94023905D01*
X106900012Y-94094970D01*
X106935019Y-94160463D01*
X106982131Y-94217869D01*
X107039537Y-94264981D01*
X107105030Y-94299988D01*
X107157067Y-94315773D01*
X107160156Y-94331303D01*
X107162947Y-94359641D01*
X107171213Y-94386891D01*
X107176772Y-94414835D01*
X107187678Y-94441165D01*
X107195942Y-94468406D01*
X107209359Y-94493508D01*
X107220267Y-94519842D01*
X107236102Y-94543541D01*
X107249520Y-94568644D01*
X107267580Y-94590651D01*
X107283413Y-94614346D01*
X107303561Y-94634494D01*
X107321624Y-94656504D01*
X107343634Y-94674567D01*
X107363782Y-94694715D01*
X107387477Y-94710548D01*
X107409484Y-94728608D01*
X107434587Y-94742026D01*
X107458286Y-94757861D01*
X107484620Y-94768769D01*
X107509722Y-94782186D01*
X107536963Y-94790450D01*
X107563293Y-94801356D01*
X107591237Y-94806915D01*
X107618487Y-94815181D01*
X107646825Y-94817972D01*
X107674768Y-94823530D01*
X107703267Y-94823530D01*
X107731598Y-94826320D01*
X107759929Y-94823530D01*
X107788428Y-94823530D01*
X107816371Y-94817972D01*
X107844709Y-94815181D01*
X107871959Y-94806915D01*
X107899903Y-94801356D01*
X107926233Y-94790450D01*
X107953474Y-94782186D01*
X107978576Y-94768769D01*
X108004910Y-94757861D01*
X108028609Y-94742026D01*
X108053712Y-94728608D01*
X108075719Y-94710548D01*
X108099414Y-94694715D01*
X108179783Y-94614346D01*
X108179783Y-94614345D01*
X108387957Y-94406171D01*
X108409974Y-94388102D01*
X108458623Y-94328824D01*
X108750000Y-94328824D01*
X108823905Y-94321545D01*
X108894970Y-94299988D01*
X108960463Y-94264981D01*
X109017869Y-94217869D01*
X109064981Y-94160463D01*
X109099988Y-94094970D01*
X109121545Y-94023905D01*
X109128824Y-93950000D01*
X109128824Y-92800000D01*
X109121622Y-92726484D01*
X109100139Y-92655397D01*
X109097280Y-92650035D01*
X109099988Y-92644970D01*
X109120606Y-92577000D01*
X109434879Y-92577000D01*
X109463210Y-92579790D01*
X109491541Y-92577000D01*
X109491546Y-92577000D01*
X109522969Y-92573905D01*
X109576321Y-92568651D01*
X109620980Y-92555103D01*
X109685086Y-92535657D01*
X109785325Y-92482079D01*
X109873184Y-92409974D01*
X109891250Y-92387961D01*
X110141195Y-92138016D01*
X110157029Y-92114318D01*
X110175088Y-92092314D01*
X110188507Y-92067210D01*
X110204341Y-92043512D01*
X110215248Y-92017181D01*
X110228666Y-91992077D01*
X110236930Y-91964834D01*
X110247836Y-91938505D01*
X110253395Y-91910556D01*
X110261660Y-91883312D01*
X110264450Y-91854980D01*
X110270010Y-91827030D01*
X110270010Y-91798530D01*
X110272800Y-91770201D01*
X110270010Y-91741872D01*
X110270010Y-91713370D01*
X110264450Y-91685419D01*
X110261660Y-91657089D01*
X110253396Y-91629847D01*
X110247836Y-91601895D01*
X110236929Y-91575563D01*
X110228666Y-91548324D01*
X110215249Y-91523223D01*
X110204341Y-91496888D01*
X110188504Y-91473186D01*
X110175088Y-91448087D01*
X110157033Y-91426087D01*
X110141195Y-91402384D01*
X110121038Y-91382227D01*
X110102983Y-91360227D01*
X110080983Y-91342172D01*
X110060826Y-91322015D01*
X110037123Y-91306177D01*
X110015123Y-91288122D01*
X109990024Y-91274706D01*
X109966322Y-91258869D01*
X109939987Y-91247961D01*
X109914886Y-91234544D01*
X109887647Y-91226281D01*
X109861315Y-91215374D01*
X109833363Y-91209814D01*
X109806121Y-91201550D01*
X109777791Y-91198760D01*
X109749840Y-91193200D01*
X109721338Y-91193200D01*
X109693009Y-91190410D01*
X109664680Y-91193200D01*
X109636180Y-91193200D01*
X109608230Y-91198760D01*
X109579898Y-91201550D01*
X109552654Y-91209815D01*
X109524705Y-91215374D01*
X109498376Y-91226280D01*
X109471133Y-91234544D01*
X109446029Y-91247962D01*
X109419698Y-91258869D01*
X109396000Y-91274703D01*
X109370896Y-91288122D01*
X109348892Y-91306181D01*
X109325194Y-91322015D01*
X109244823Y-91402386D01*
X109224210Y-91423000D01*
X109120606Y-91423000D01*
X109099988Y-91355030D01*
X109064981Y-91289537D01*
X109017869Y-91232131D01*
X108960463Y-91185019D01*
X108894970Y-91150012D01*
X108823905Y-91128455D01*
X108750000Y-91121176D01*
X107250000Y-91121176D01*
X107176095Y-91128455D01*
X107105030Y-91150012D01*
X107039537Y-91185019D01*
X106982131Y-91232131D01*
X106935019Y-91289537D01*
X106900012Y-91355030D01*
X106878455Y-91426095D01*
X106871176Y-91500000D01*
X95452000Y-91500000D01*
X95452000Y-88684100D01*
X96507300Y-88684100D01*
X96507300Y-90385900D01*
X96509740Y-90410676D01*
X96516967Y-90434501D01*
X96528703Y-90456457D01*
X96544497Y-90475703D01*
X96563743Y-90491497D01*
X96585699Y-90503233D01*
X96609524Y-90510460D01*
X96634300Y-90512900D01*
X98412300Y-90512900D01*
X98437076Y-90510460D01*
X98460901Y-90503233D01*
X98482857Y-90491497D01*
X98502103Y-90475703D01*
X98517897Y-90456457D01*
X98529633Y-90434501D01*
X98536860Y-90410676D01*
X98539300Y-90385900D01*
X98539300Y-88684100D01*
X98536860Y-88659324D01*
X98529633Y-88635499D01*
X98517897Y-88613543D01*
X98502103Y-88594297D01*
X98482857Y-88578503D01*
X98460901Y-88566767D01*
X98437076Y-88559540D01*
X98412300Y-88557100D01*
X96634300Y-88557100D01*
X96609524Y-88559540D01*
X96585699Y-88566767D01*
X96563743Y-88578503D01*
X96544497Y-88594297D01*
X96528703Y-88613543D01*
X96516967Y-88635499D01*
X96509740Y-88659324D01*
X96507300Y-88684100D01*
X95452000Y-88684100D01*
X95452000Y-88502656D01*
X95497970Y-88511800D01*
X95611630Y-88511800D01*
X95723105Y-88489626D01*
X95828112Y-88446131D01*
X95922616Y-88382985D01*
X96002985Y-88302616D01*
X96066131Y-88208112D01*
X96109626Y-88103105D01*
X96121682Y-88042498D01*
X96615980Y-87548200D01*
X97109708Y-87548200D01*
X97161088Y-87582531D01*
X97266095Y-87626026D01*
X97377570Y-87648200D01*
X97491230Y-87648200D01*
X97602705Y-87626026D01*
X97707712Y-87582531D01*
X97802216Y-87519385D01*
X97882585Y-87439016D01*
X97945731Y-87344512D01*
X97989226Y-87239505D01*
X98011400Y-87128030D01*
X98011400Y-87014370D01*
X97989226Y-86902895D01*
X97945731Y-86797888D01*
X97882585Y-86703384D01*
X97802216Y-86623015D01*
X97707712Y-86559869D01*
X97602705Y-86516374D01*
X97491230Y-86494200D01*
X97377570Y-86494200D01*
X97266095Y-86516374D01*
X97161088Y-86559869D01*
X97109708Y-86594200D01*
X96441815Y-86594200D01*
X96418400Y-86591894D01*
X96394985Y-86594200D01*
X96394977Y-86594200D01*
X96324892Y-86601103D01*
X96234977Y-86628378D01*
X96152111Y-86672671D01*
X96126662Y-86693557D01*
X96079479Y-86732279D01*
X96064549Y-86750471D01*
X95452000Y-87363021D01*
X95452000Y-86330510D01*
X102046689Y-84232200D01*
X103887476Y-84232200D01*
X103887476Y-85382200D01*
X103894678Y-85455716D01*
X103916161Y-85526803D01*
X103919020Y-85532165D01*
X103916312Y-85537230D01*
X103894755Y-85608295D01*
X103887476Y-85682200D01*
X103887476Y-86682200D01*
X103894755Y-86756105D01*
X103916312Y-86827170D01*
X103951319Y-86892663D01*
X103998431Y-86950069D01*
X104055837Y-86997181D01*
X104121330Y-87032188D01*
X104192395Y-87053745D01*
X104266300Y-87061024D01*
X105766300Y-87061024D01*
X105840205Y-87053745D01*
X105911270Y-87032188D01*
X105976763Y-86997181D01*
X106034169Y-86950069D01*
X106076162Y-86898900D01*
X106838430Y-86898900D01*
X106866378Y-86893341D01*
X106894712Y-86890550D01*
X106921958Y-86882285D01*
X106949905Y-86876726D01*
X106976230Y-86865822D01*
X107003476Y-86857557D01*
X107028587Y-86844135D01*
X107054912Y-86833231D01*
X107078600Y-86817403D01*
X107103715Y-86803979D01*
X107125729Y-86785912D01*
X107149416Y-86770085D01*
X107169564Y-86749937D01*
X107191574Y-86731874D01*
X107209639Y-86709862D01*
X107229785Y-86689716D01*
X107245612Y-86666029D01*
X107263679Y-86644015D01*
X107277103Y-86618900D01*
X107292931Y-86595212D01*
X107303835Y-86568887D01*
X107317257Y-86543776D01*
X107325522Y-86516530D01*
X107336426Y-86490205D01*
X107341985Y-86462258D01*
X107350250Y-86435012D01*
X107353041Y-86406678D01*
X107358600Y-86378730D01*
X107358600Y-86350236D01*
X107361391Y-86321900D01*
X107358600Y-86293564D01*
X107358600Y-86265070D01*
X107353041Y-86237122D01*
X107350250Y-86208788D01*
X107341985Y-86181542D01*
X107336426Y-86153595D01*
X107325522Y-86127270D01*
X107317257Y-86100024D01*
X107303835Y-86074913D01*
X107292931Y-86048588D01*
X107277103Y-86024900D01*
X107263679Y-85999785D01*
X107245612Y-85977771D01*
X107229785Y-85954084D01*
X107209638Y-85933937D01*
X107191574Y-85911926D01*
X107169562Y-85893861D01*
X107149416Y-85873715D01*
X107125729Y-85857888D01*
X107103715Y-85839821D01*
X107078600Y-85826397D01*
X107054912Y-85810569D01*
X107028587Y-85799665D01*
X107016115Y-85792999D01*
X107070926Y-85756375D01*
X107151295Y-85676006D01*
X107214441Y-85581502D01*
X107257936Y-85476495D01*
X107280110Y-85365020D01*
X107280110Y-85251360D01*
X107257936Y-85139885D01*
X107214441Y-85034878D01*
X107151295Y-84940374D01*
X107070926Y-84860005D01*
X106976422Y-84796859D01*
X106871415Y-84753364D01*
X106810808Y-84741308D01*
X106480975Y-84411476D01*
X106466041Y-84393279D01*
X106393409Y-84333671D01*
X106310543Y-84289378D01*
X106220628Y-84262103D01*
X106150543Y-84255200D01*
X106150535Y-84255200D01*
X106145124Y-84254667D01*
X106145124Y-84232200D01*
X106142731Y-84207900D01*
X108408676Y-84207900D01*
X108408676Y-85357900D01*
X108415878Y-85431416D01*
X108437361Y-85502503D01*
X108440220Y-85507865D01*
X108437512Y-85512930D01*
X108415955Y-85583995D01*
X108408676Y-85657900D01*
X108408676Y-86657900D01*
X108415955Y-86731805D01*
X108437512Y-86802870D01*
X108472519Y-86868363D01*
X108519631Y-86925769D01*
X108577037Y-86972881D01*
X108642530Y-87007888D01*
X108713595Y-87029445D01*
X108787500Y-87036724D01*
X110287500Y-87036724D01*
X110361405Y-87029445D01*
X110432470Y-87007888D01*
X110497963Y-86972881D01*
X110555369Y-86925769D01*
X110602481Y-86868363D01*
X110637488Y-86802870D01*
X110658106Y-86734900D01*
X111276666Y-86734900D01*
X111280635Y-86736104D01*
X111308965Y-86738894D01*
X111336916Y-86744454D01*
X111365417Y-86744454D01*
X111393745Y-86747244D01*
X111422074Y-86744454D01*
X111450576Y-86744454D01*
X111478527Y-86738894D01*
X111506857Y-86736104D01*
X111534099Y-86727840D01*
X111562051Y-86722280D01*
X111588383Y-86711373D01*
X111615622Y-86703110D01*
X111640723Y-86689693D01*
X111667058Y-86678785D01*
X111690760Y-86662948D01*
X111715859Y-86649532D01*
X111737859Y-86631477D01*
X111761562Y-86615639D01*
X111781719Y-86595482D01*
X111803719Y-86577427D01*
X111821774Y-86555427D01*
X111841931Y-86535270D01*
X111857769Y-86511567D01*
X111875824Y-86489567D01*
X111889240Y-86464468D01*
X111905077Y-86440766D01*
X111915985Y-86414431D01*
X111929402Y-86389330D01*
X111937665Y-86362091D01*
X111948572Y-86335759D01*
X111954132Y-86307807D01*
X111962396Y-86280565D01*
X111965186Y-86252235D01*
X111970746Y-86224284D01*
X111970746Y-86195782D01*
X111973536Y-86167453D01*
X111970746Y-86139125D01*
X111970746Y-86110624D01*
X111965186Y-86082673D01*
X111962396Y-86054343D01*
X111954132Y-86027101D01*
X111948572Y-85999149D01*
X111937665Y-85972817D01*
X111929402Y-85945578D01*
X111915985Y-85920476D01*
X111905077Y-85894142D01*
X111889242Y-85870443D01*
X111875824Y-85845340D01*
X111857765Y-85823336D01*
X111841931Y-85799638D01*
X111812231Y-85769938D01*
X111794166Y-85747926D01*
X111772154Y-85729861D01*
X111761562Y-85719269D01*
X111749109Y-85710948D01*
X111706307Y-85675821D01*
X111606068Y-85622243D01*
X111540575Y-85602376D01*
X111497303Y-85589249D01*
X111442237Y-85583826D01*
X111412528Y-85580900D01*
X111412523Y-85580900D01*
X111384192Y-85578110D01*
X111355861Y-85580900D01*
X110658143Y-85580900D01*
X110637336Y-85512564D01*
X110634818Y-85507865D01*
X110637488Y-85502870D01*
X110659045Y-85431805D01*
X110666324Y-85357900D01*
X110666324Y-84207900D01*
X110659045Y-84133995D01*
X110637488Y-84062930D01*
X110602481Y-83997437D01*
X110555369Y-83940031D01*
X110497963Y-83892919D01*
X110432470Y-83857912D01*
X110361405Y-83836355D01*
X110287500Y-83829076D01*
X110108178Y-83829076D01*
X110106150Y-83808488D01*
X110097885Y-83781242D01*
X110092326Y-83753295D01*
X110081422Y-83726970D01*
X110073157Y-83699724D01*
X110059735Y-83674613D01*
X110048831Y-83648288D01*
X110033003Y-83624600D01*
X110019579Y-83599485D01*
X110001512Y-83577471D01*
X109985685Y-83553784D01*
X109965539Y-83533638D01*
X109947474Y-83511626D01*
X109925462Y-83493561D01*
X109905316Y-83473415D01*
X109881629Y-83457588D01*
X109859615Y-83439521D01*
X109834500Y-83426097D01*
X109810812Y-83410269D01*
X109784487Y-83399365D01*
X109759376Y-83385943D01*
X109732130Y-83377678D01*
X109705805Y-83366774D01*
X109677858Y-83361215D01*
X109650612Y-83352950D01*
X109622278Y-83350159D01*
X109594330Y-83344600D01*
X109565836Y-83344600D01*
X109537500Y-83341809D01*
X109509164Y-83344600D01*
X109480670Y-83344600D01*
X109452722Y-83350159D01*
X109424389Y-83352950D01*
X109397145Y-83361214D01*
X109369195Y-83366774D01*
X109342867Y-83377679D01*
X109315625Y-83385943D01*
X109290517Y-83399363D01*
X109264188Y-83410269D01*
X109240496Y-83426100D01*
X109215386Y-83439521D01*
X109193376Y-83457584D01*
X109169684Y-83473415D01*
X109149534Y-83493565D01*
X109127527Y-83511626D01*
X109109466Y-83533633D01*
X109089315Y-83553784D01*
X109073484Y-83577477D01*
X109055422Y-83599485D01*
X109042002Y-83624592D01*
X109026169Y-83648288D01*
X109015262Y-83674621D01*
X109001844Y-83699724D01*
X108993581Y-83726963D01*
X108982674Y-83753295D01*
X108977114Y-83781244D01*
X108968850Y-83808488D01*
X108966822Y-83829076D01*
X108787500Y-83829076D01*
X108713595Y-83836355D01*
X108642530Y-83857912D01*
X108577037Y-83892919D01*
X108519631Y-83940031D01*
X108472519Y-83997437D01*
X108437512Y-84062930D01*
X108415955Y-84133995D01*
X108408676Y-84207900D01*
X106142731Y-84207900D01*
X106137845Y-84158295D01*
X106116288Y-84087230D01*
X106081281Y-84021737D01*
X106034169Y-83964331D01*
X105976763Y-83917219D01*
X105911270Y-83882212D01*
X105840205Y-83860655D01*
X105766300Y-83853376D01*
X104266300Y-83853376D01*
X104192395Y-83860655D01*
X104121330Y-83882212D01*
X104055837Y-83917219D01*
X103998431Y-83964331D01*
X103951319Y-84021737D01*
X103916312Y-84087230D01*
X103894755Y-84158295D01*
X103887476Y-84232200D01*
X102046689Y-84232200D01*
X104959860Y-83305282D01*
X113023000Y-83305282D01*
X113023000Y-83694718D01*
X113098975Y-84076670D01*
X113248005Y-84436461D01*
X113464364Y-84760264D01*
X113739736Y-85035636D01*
X114063539Y-85251995D01*
X114423330Y-85401025D01*
X114805282Y-85477000D01*
X115194718Y-85477000D01*
X115576670Y-85401025D01*
X115936461Y-85251995D01*
X116260264Y-85035636D01*
X116535636Y-84760264D01*
X116751995Y-84436461D01*
X116901025Y-84076670D01*
X116977000Y-83694718D01*
X116977000Y-83305282D01*
X116901025Y-82923330D01*
X116751995Y-82563539D01*
X116535636Y-82239736D01*
X116260264Y-81964364D01*
X115936461Y-81748005D01*
X115576670Y-81598975D01*
X115194718Y-81523000D01*
X114805282Y-81523000D01*
X114423330Y-81598975D01*
X114063539Y-81748005D01*
X113739736Y-81964364D01*
X113464364Y-82239736D01*
X113248005Y-82563539D01*
X113098975Y-82923330D01*
X113023000Y-83305282D01*
X104959860Y-83305282D01*
X112132746Y-81023000D01*
X119769000Y-81023000D01*
X119769000Y-81273000D01*
X119787456Y-81414389D01*
X119833141Y-81549460D01*
X119904299Y-81673023D01*
X119998196Y-81780330D01*
X120111223Y-81867257D01*
X120239037Y-81930463D01*
X120359612Y-81964092D01*
X120473000Y-81894840D01*
X120473000Y-81023000D01*
X119769000Y-81023000D01*
X112132746Y-81023000D01*
X113063031Y-80727000D01*
X119769000Y-80727000D01*
X119769000Y-80977000D01*
X120473000Y-80977000D01*
X120473000Y-80105160D01*
X120519000Y-80105160D01*
X120519000Y-80977000D01*
X120539000Y-80977000D01*
X120539000Y-81023000D01*
X120519000Y-81023000D01*
X120519000Y-81894840D01*
X120632388Y-81964092D01*
X120752963Y-81930463D01*
X120880777Y-81867257D01*
X120993804Y-81780330D01*
X121087701Y-81673023D01*
X121089454Y-81669979D01*
X121096823Y-81683765D01*
X121193920Y-81802080D01*
X121312234Y-81899177D01*
X121447216Y-81971327D01*
X121593681Y-82015757D01*
X121746000Y-82030759D01*
X121898318Y-82015757D01*
X122044783Y-81971327D01*
X122179765Y-81899177D01*
X122298080Y-81802080D01*
X122371000Y-81713226D01*
X122443920Y-81802080D01*
X122562234Y-81899177D01*
X122697216Y-81971327D01*
X122843681Y-82015757D01*
X122996000Y-82030759D01*
X123148318Y-82015757D01*
X123294783Y-81971327D01*
X123429765Y-81899177D01*
X123548080Y-81802080D01*
X123621000Y-81713226D01*
X123693920Y-81802080D01*
X123812234Y-81899177D01*
X123947216Y-81971327D01*
X124093681Y-82015757D01*
X124246000Y-82030759D01*
X124398318Y-82015757D01*
X124544783Y-81971327D01*
X124679765Y-81899177D01*
X124798080Y-81802080D01*
X124871000Y-81713226D01*
X124943920Y-81802080D01*
X125062234Y-81899177D01*
X125197216Y-81971327D01*
X125343681Y-82015757D01*
X125496000Y-82030759D01*
X125648318Y-82015757D01*
X125794783Y-81971327D01*
X125929765Y-81899177D01*
X126048080Y-81802080D01*
X126068919Y-81776687D01*
X126136710Y-81859290D01*
X126169000Y-81885790D01*
X126169001Y-87060798D01*
X124151515Y-89078284D01*
X124135682Y-89101979D01*
X124117622Y-89123986D01*
X124104204Y-89149089D01*
X124088369Y-89172788D01*
X124077461Y-89199122D01*
X124064044Y-89224224D01*
X124055780Y-89251465D01*
X124044874Y-89277795D01*
X124039315Y-89305739D01*
X124031049Y-89332989D01*
X124028258Y-89361327D01*
X124022700Y-89389270D01*
X124022700Y-89417769D01*
X124019910Y-89446100D01*
X124022700Y-89474431D01*
X124022700Y-89502930D01*
X124028258Y-89530873D01*
X124031049Y-89559211D01*
X124039315Y-89586461D01*
X124044874Y-89614405D01*
X124055780Y-89640735D01*
X124064044Y-89667976D01*
X124077461Y-89693078D01*
X124088369Y-89719412D01*
X124104204Y-89743111D01*
X124117622Y-89768214D01*
X124135682Y-89790221D01*
X124151515Y-89813916D01*
X124171663Y-89834064D01*
X124189726Y-89856074D01*
X124211736Y-89874137D01*
X124231884Y-89894285D01*
X124255579Y-89910118D01*
X124277586Y-89928178D01*
X124302689Y-89941596D01*
X124326388Y-89957431D01*
X124352722Y-89968339D01*
X124377824Y-89981756D01*
X124405065Y-89990020D01*
X124431395Y-90000926D01*
X124459339Y-90006485D01*
X124486589Y-90014751D01*
X124514927Y-90017542D01*
X124542870Y-90023100D01*
X124571369Y-90023100D01*
X124599700Y-90025890D01*
X124628031Y-90023100D01*
X124656530Y-90023100D01*
X124684473Y-90017542D01*
X124712811Y-90014751D01*
X124740061Y-90006485D01*
X124768005Y-90000926D01*
X124794335Y-89990020D01*
X124821576Y-89981756D01*
X124846678Y-89968339D01*
X124873012Y-89957431D01*
X124896711Y-89941596D01*
X124921814Y-89928178D01*
X124943821Y-89910118D01*
X124967516Y-89894285D01*
X127133962Y-87727839D01*
X127155974Y-87709774D01*
X127228079Y-87621915D01*
X127271170Y-87541297D01*
X127281657Y-87521677D01*
X127314651Y-87412912D01*
X127325791Y-87299800D01*
X127323000Y-87271461D01*
X127323000Y-81885790D01*
X127355290Y-81859290D01*
X127427275Y-81771577D01*
X127480764Y-81671506D01*
X127513702Y-81562923D01*
X127524824Y-81450000D01*
X127524824Y-80550000D01*
X127513702Y-80437077D01*
X127480764Y-80328494D01*
X127427275Y-80228423D01*
X127355290Y-80140710D01*
X127267577Y-80068725D01*
X127167506Y-80015236D01*
X127058923Y-79982298D01*
X126946000Y-79971176D01*
X126546000Y-79971176D01*
X126433077Y-79982298D01*
X126324494Y-80015236D01*
X126224423Y-80068725D01*
X126136710Y-80140710D01*
X126068919Y-80223313D01*
X126048080Y-80197920D01*
X125929766Y-80100823D01*
X125794784Y-80028673D01*
X125648319Y-79984243D01*
X125496000Y-79969241D01*
X125343682Y-79984243D01*
X125197217Y-80028673D01*
X125062235Y-80100823D01*
X124943921Y-80197920D01*
X124871000Y-80286774D01*
X124798080Y-80197920D01*
X124679766Y-80100823D01*
X124544784Y-80028673D01*
X124398319Y-79984243D01*
X124246000Y-79969241D01*
X124093682Y-79984243D01*
X123947217Y-80028673D01*
X123812235Y-80100823D01*
X123693921Y-80197920D01*
X123621000Y-80286774D01*
X123548080Y-80197920D01*
X123429766Y-80100823D01*
X123294784Y-80028673D01*
X123148319Y-79984243D01*
X122996000Y-79969241D01*
X122843682Y-79984243D01*
X122697217Y-80028673D01*
X122562235Y-80100823D01*
X122443921Y-80197920D01*
X122371000Y-80286774D01*
X122298080Y-80197920D01*
X122179766Y-80100823D01*
X122044784Y-80028673D01*
X121898319Y-79984243D01*
X121746000Y-79969241D01*
X121593682Y-79984243D01*
X121447217Y-80028673D01*
X121312235Y-80100823D01*
X121193921Y-80197920D01*
X121096823Y-80316234D01*
X121089454Y-80330021D01*
X121087701Y-80326977D01*
X120993804Y-80219670D01*
X120880777Y-80132743D01*
X120752963Y-80069537D01*
X120632388Y-80035908D01*
X120519000Y-80105160D01*
X120473000Y-80105160D01*
X120359612Y-80035908D01*
X120239037Y-80069537D01*
X120111223Y-80132743D01*
X119998196Y-80219670D01*
X119904299Y-80326977D01*
X119833141Y-80450540D01*
X119787456Y-80585611D01*
X119769000Y-80727000D01*
X113063031Y-80727000D01*
X117070286Y-79451965D01*
X128580001Y-79446225D01*
X128580000Y-99542225D01*
G37*
%TD.AperFunction*%
%TD*%
M02*
