EESchema Schematic File Version 4
LIBS:Telefon-cache
EELAYER 26 0
EELAYER END
$Descr A4 11693 8268
encoding utf-8
Sheet 1 2
Title ""
Date ""
Rev ""
Comp ""
Comment1 ""
Comment2 ""
Comment3 ""
Comment4 ""
$EndDescr
$Comp
L teensy:Teensy3.2 U1
U 1 1 5BDAD1B7
P 2800 5550
F 0 "U1" H 2800 7137 60  0000 C CNN
F 1 "Teensy3.2" H 2800 7031 60  0000 C CNN
F 2 "teensy:Teensy30_31_32_LC" H 2800 4750 60  0001 C CNN
F 3 "" H 2800 4750 60  0000 C CNN
	1    2800 5550
	1    0    0    -1  
$EndComp
$Comp
L ap7313-xxsag-7:AP7313-XXSAG-7 U2
U 1 1 5BDB024E
P 5550 2100
F 0 "U2" H 5550 2342 50  0000 C CNN
F 1 "AP7313-XXSAG-7" H 5550 2251 50  0000 C CNN
F 2 "TO_SOT_Packages_SMD:SOT-23" H 5550 2325 50  0001 C CNN
F 3 "https://www.diodes.com/assets/Datasheets/AP2204.pdf" H 5550 2100 50  0001 C CNN
	1    5550 2100
	1    0    0    -1  
$EndComp
$Comp
L Audio:SGTL5000XNLA3_R2 U3
U 1 1 5BDB7AD4
P 6700 3750
F 0 "U3" H 6675 4928 50  0000 C CNN
F 1 "SGTL5000XNLA3_R2" H 6675 4837 50  0000 C CNN
F 2 "Package_DFN_QFN:QFN-32-1EP_5x5mm_P0.5mm_EP3.6x3.6mm" H 6700 3750 50  0001 C CNN
F 3 "https://www.nxp.com/docs/en/data-sheet/SGTL5000.pdf" H 6700 3750 50  0001 C CNN
	1    6700 3750
	1    0    0    -1  
$EndComp
$Sheet
S 8700 3350 700  650 
U 5BDBF509
F0 "PiezoAmp" 50
F1 "PiezoAmp.sch" 50
F2 "VCC" I L 8700 3450 50 
F3 "GND" I L 8700 3900 50 
F4 "OUT" O R 9400 3700 50 
F5 "IN" I L 8700 3700 50 
$EndSheet
Wire Wire Line
	7850 3250 7250 3250
Wire Wire Line
	7250 3350 7950 3350
Wire Wire Line
	7250 3700 7900 3700
$Comp
L Device:R R3
U 1 1 5BDC4D32
P 7650 4150
F 0 "R3" V 7600 4350 50  0000 C CNN
F 1 "2k2" V 7650 4150 50  0000 C CNN
F 2 "Resistor_SMD:R_0603_1608Metric" V 7580 4150 50  0001 C CNN
F 3 "~" H 7650 4150 50  0001 C CNN
	1    7650 4150
	0    1    1    0   
$EndComp
$Comp
L Device:C C7
U 1 1 5BDC4DE0
P 7650 4350
F 0 "C7" V 7700 4450 50  0000 C CNN
F 1 "100n" V 7800 4350 50  0000 C CNN
F 2 "Capacitor_SMD:C_0603_1608Metric" H 7688 4200 50  0001 C CNN
F 3 "~" H 7650 4350 50  0001 C CNN
	1    7650 4350
	0    1    1    0   
$EndComp
Wire Wire Line
	7250 4150 7350 4150
Wire Wire Line
	7500 4350 7250 4350
Wire Wire Line
	7800 4150 8050 4150
Wire Wire Line
	8050 4150 8050 4350
Wire Wire Line
	8050 4350 7800 4350
$Comp
L Device:C C6
U 1 1 5BDC5B42
P 7650 3950
F 0 "C6" V 7600 4050 50  0000 C CNN
F 1 "2u2" V 7489 3950 50  0000 C CNN
F 2 "Capacitor_SMD:C_0603_1608Metric" H 7688 3800 50  0001 C CNN
F 3 "~" H 7650 3950 50  0001 C CNN
	1    7650 3950
	0    1    1    0   
$EndComp
Wire Wire Line
	7500 3950 7350 3950
Wire Wire Line
	7350 3950 7350 4150
Connection ~ 7350 4150
Text Label 7900 3950 0    50   ~ 0
GND
Text Label 8800 2550 2    50   ~ 0
GND
Wire Wire Line
	7800 3950 7900 3950
Wire Wire Line
	6650 4750 6750 4750
Wire Wire Line
	6950 4750 6950 4700
Text Label 7000 4750 0    50   ~ 0
GND
$Comp
L Device:C C3
U 1 1 5BE2E9A9
P 5950 2300
F 0 "C3" H 6065 2346 50  0000 L CNN
F 1 "2u2" H 6065 2255 50  0000 L CNN
F 2 "Capacitor_SMD:C_0603_1608Metric" H 5988 2150 50  0001 C CNN
F 3 "~" H 5950 2300 50  0001 C CNN
	1    5950 2300
	1    0    0    -1  
$EndComp
Wire Wire Line
	5950 2150 5950 2100
Wire Wire Line
	5850 2100 5950 2100
Wire Wire Line
	6500 2100 6500 2750
Connection ~ 5950 2100
Text Label 5950 2550 0    50   ~ 0
GND
Wire Wire Line
	5950 2450 5950 2550
Text Label 5550 2550 0    50   ~ 0
GND
Wire Wire Line
	5550 2400 5550 2550
$Comp
L Device:Ferrite_Bead L1
U 1 1 5BE300B7
P 6900 1800
F 0 "L1" V 6626 1800 50  0000 C CNN
F 1 "Ferrite_Bead" V 6717 1800 50  0000 C CNN
F 2 "Inductor_SMD:L_0603_1608Metric" V 6830 1800 50  0001 C CNN
F 3 "~" H 6900 1800 50  0001 C CNN
	1    6900 1800
	0    1    1    0   
$EndComp
Text Label 3650 1800 0    50   ~ 0
3V3
Wire Wire Line
	6700 1800 6700 2750
Connection ~ 6700 1800
Wire Wire Line
	6900 2750 6900 2100
Wire Wire Line
	6900 2100 7050 2100
Wire Wire Line
	7050 2100 7050 1800
$Comp
L Device:C C5
U 1 1 5BE32285
P 7350 2000
F 0 "C5" H 7465 2046 50  0000 L CNN
F 1 "2u2" H 7465 1955 50  0000 L CNN
F 2 "Capacitor_SMD:C_0603_1608Metric" H 7388 1850 50  0001 C CNN
F 3 "~" H 7350 2000 50  0001 C CNN
	1    7350 2000
	1    0    0    -1  
$EndComp
$Comp
L Device:C C8
U 1 1 5BE3230D
P 7700 2000
F 0 "C8" H 7815 2046 50  0000 L CNN
F 1 "100n" H 7815 1955 50  0000 L CNN
F 2 "Capacitor_SMD:C_0603_1608Metric" H 7738 1850 50  0001 C CNN
F 3 "~" H 7700 2000 50  0001 C CNN
	1    7700 2000
	1    0    0    -1  
$EndComp
Wire Wire Line
	7050 1800 7150 1800
Wire Wire Line
	7350 1800 7350 1850
Connection ~ 7050 1800
Wire Wire Line
	7700 1800 7700 1850
Connection ~ 7350 1800
Text Label 7350 2250 0    50   ~ 0
GND
Text Label 7700 2250 0    50   ~ 0
GND
Wire Wire Line
	7350 2150 7350 2250
Wire Wire Line
	7700 2150 7700 2250
Wire Wire Line
	5150 1800 5150 2100
Wire Wire Line
	5150 2100 5250 2100
Connection ~ 5150 1800
$Comp
L Device:C C1
U 1 1 5BE34DC5
P 4400 2050
F 0 "C1" H 4515 2096 50  0000 L CNN
F 1 "2u2" H 4515 2005 50  0000 L CNN
F 2 "Capacitor_SMD:C_0603_1608Metric" H 4438 1900 50  0001 C CNN
F 3 "~" H 4400 2050 50  0001 C CNN
	1    4400 2050
	1    0    0    -1  
$EndComp
$Comp
L Device:C C2
U 1 1 5BE34E26
P 4800 2050
F 0 "C2" H 4915 2096 50  0000 L CNN
F 1 "100n" H 4915 2005 50  0000 L CNN
F 2 "Capacitor_SMD:C_0603_1608Metric" H 4838 1900 50  0001 C CNN
F 3 "~" H 4800 2050 50  0001 C CNN
	1    4800 2050
	1    0    0    -1  
$EndComp
Wire Wire Line
	4800 1800 4800 1900
Connection ~ 4800 1800
Wire Wire Line
	4400 1800 4400 1900
Connection ~ 4400 1800
Text Label 4400 2300 0    50   ~ 0
GND
Text Label 4800 2300 0    50   ~ 0
GND
Wire Wire Line
	4800 2200 4800 2300
Wire Wire Line
	4400 2200 4400 2300
Wire Wire Line
	4400 4000 4850 4000
$Comp
L Device:R R1
U 1 1 5BE38A5C
P 4850 3550
F 0 "R1" H 4920 3596 50  0000 L CNN
F 1 "2k2" H 4920 3505 50  0000 L CNN
F 2 "Resistor_SMD:R_0603_1608Metric" V 4780 3550 50  0001 C CNN
F 3 "~" H 4850 3550 50  0001 C CNN
	1    4850 3550
	1    0    0    -1  
$EndComp
$Comp
L Device:R R2
U 1 1 5BE38AB7
P 5050 3550
F 0 "R2" H 5120 3596 50  0000 L CNN
F 1 "2k2" H 5120 3505 50  0000 L CNN
F 2 "Resistor_SMD:R_0603_1608Metric" V 4980 3550 50  0001 C CNN
F 3 "~" H 5050 3550 50  0001 C CNN
	1    5050 3550
	1    0    0    -1  
$EndComp
Wire Wire Line
	4400 3900 5050 3900
Wire Wire Line
	4850 4000 4850 3700
Wire Wire Line
	5050 3400 5050 3300
Wire Wire Line
	4850 3400 4850 3300
Text Label 4850 3300 1    50   ~ 0
3V3
Text Label 5050 3300 1    50   ~ 0
3V3
Wire Wire Line
	5050 3700 5050 3900
Connection ~ 5050 3900
Connection ~ 4850 4000
Text Label 4400 3900 0    50   ~ 0
SDA
Text Label 4400 4000 0    50   ~ 0
SCL
Wire Wire Line
	6100 4200 5950 4200
Wire Wire Line
	5950 4200 5950 4350
Text Label 5950 4350 0    50   ~ 0
GND
$Comp
L Device:C C4
U 1 1 5BE3F72C
P 6450 4950
F 0 "C4" H 6565 4996 50  0000 L CNN
F 1 "150n" H 6565 4905 50  0000 L CNN
F 2 "Capacitor_SMD:C_0603_1608Metric" H 6488 4800 50  0001 C CNN
F 3 "~" H 6450 4950 50  0001 C CNN
	1    6450 4950
	1    0    0    -1  
$EndComp
Wire Wire Line
	6450 4700 6450 4800
Wire Wire Line
	6450 5100 6450 5200
Text Label 6450 5200 0    50   ~ 0
GND
Wire Wire Line
	6650 4700 6650 4750
Wire Wire Line
	6750 4700 6750 4750
$Comp
L Device:C C9
U 1 1 5BE47AD6
P 8050 3700
F 0 "C9" V 7798 3700 50  0000 C CNN
F 1 "2u2" V 7889 3700 50  0000 C CNN
F 2 "Capacitor_SMD:C_0603_1608Metric" H 8088 3550 50  0001 C CNN
F 3 "~" H 8050 3700 50  0001 C CNN
	1    8050 3700
	0    1    1    0   
$EndComp
Wire Wire Line
	8200 3700 8350 3700
$Comp
L Device:Speaker_Crystal LS2
U 1 1 5BE47C44
P 9950 3900
F 0 "LS2" H 10125 3896 50  0000 L CNN
F 1 "Speaker_Crystal" H 10125 3805 50  0000 L CNN
F 2 "Connector_PinHeader_2.54mm:PinHeader_1x02_P2.54mm_Vertical" H 9915 3850 50  0001 C CNN
F 3 "~" H 9915 3850 50  0001 C CNN
	1    9950 3900
	1    0    0    -1  
$EndComp
Wire Wire Line
	9650 3900 9750 3900
Wire Wire Line
	9650 3700 9400 3700
Wire Wire Line
	9650 3700 9650 3900
Wire Wire Line
	9750 4000 9650 4000
Wire Wire Line
	9650 4000 9650 4150
Wire Wire Line
	9650 4150 8600 4150
Wire Wire Line
	8600 4150 8600 3900
Wire Wire Line
	8550 3900 8600 3900
Wire Wire Line
	8700 3450 8500 3450
Wire Wire Line
	8500 3450 8500 3150
Text Label 8500 3150 0    50   ~ 0
5V
Wire Wire Line
	1750 6650 1800 6650
Wire Wire Line
	1750 6750 1800 6750
Text Label 1750 6650 2    50   ~ 0
SDA
Text Label 1750 6750 2    50   ~ 0
SCL
Text Label 1750 5450 2    50   ~ 0
MCLK
Text Label 1750 5250 2    50   ~ 0
BCLK
Text Label 3850 6750 0    50   ~ 0
TX
Text Label 1750 6150 2    50   ~ 0
RX
Text Label 3850 6650 0    50   ~ 0
LRCLK
Wire Wire Line
	3850 6650 3800 6650
Wire Wire Line
	3800 6750 3850 6750
Wire Wire Line
	1800 5450 1750 5450
Wire Wire Line
	1750 5250 1800 5250
Text Label 6050 3700 2    50   ~ 0
TX
Text Label 6050 3600 2    50   ~ 0
RX
Text Label 6050 3250 2    50   ~ 0
MCLK
Text Label 6050 3350 2    50   ~ 0
LRCLK
Text Label 6050 3450 2    50   ~ 0
BCLK
Wire Wire Line
	6050 3250 6100 3250
Wire Wire Line
	6100 3350 6050 3350
Wire Wire Line
	6050 3450 6100 3450
Wire Wire Line
	6100 3600 6050 3600
Wire Wire Line
	6050 3700 6100 3700
NoConn ~ 7250 3450
NoConn ~ 7250 3600
NoConn ~ 7250 3850
NoConn ~ 7250 3950
NoConn ~ 6350 4700
NoConn ~ 3100 7600
$Comp
L Connector:Conn_01x11_Female J1
U 1 1 5BE7F3DE
P 1950 3050
F 0 "J1" V 2115 3030 50  0000 C CNN
F 1 "Conn_01x11_Female" V 2024 3030 50  0000 C CNN
F 2 "Connector_PinHeader_2.54mm:PinHeader_1x11_P2.54mm_Vertical" H 1950 3050 50  0001 C CNN
F 3 "~" H 1950 3050 50  0001 C CNN
	1    1950 3050
	0    -1   -1   0   
$EndComp
Text Label 1450 3350 3    50   ~ 0
MATRIX_01
Text Label 1550 3350 3    50   ~ 0
MATRIX_02
Text Label 1650 3350 3    50   ~ 0
MATRIX_03
Text Label 1750 3350 3    50   ~ 0
MATRIX_04
Text Label 1850 3350 3    50   ~ 0
MATRIX_05
Text Label 1950 3350 3    50   ~ 0
MATRIX_06
Text Label 2050 3350 3    50   ~ 0
MATRIX_07
Text Label 2150 3350 3    50   ~ 0
MATRIX_08
Text Label 2250 3350 3    50   ~ 0
MATRIX_09
Text Label 2350 3350 3    50   ~ 0
MATRIX_10
Text Label 2450 3350 3    50   ~ 0
MATRIX_11
Text Label 1750 4350 2    50   ~ 0
MATRIX_01
Text Label 1750 4450 2    50   ~ 0
MATRIX_02
Text Label 1750 4550 2    50   ~ 0
MATRIX_03
Text Label 1750 4650 2    50   ~ 0
MATRIX_04
Text Label 1750 4750 2    50   ~ 0
MATRIX_05
Text Label 1750 4850 2    50   ~ 0
MATRIX_06
Text Label 1750 4950 2    50   ~ 0
MATRIX_07
Text Label 1750 5050 2    50   ~ 0
MATRIX_08
Text Label 1750 5150 2    50   ~ 0
MATRIX_09
Text Label 1750 5350 2    50   ~ 0
MATRIX_10
Text Label 1750 5550 2    50   ~ 0
MATRIX_11
Wire Wire Line
	1750 4350 1800 4350
Wire Wire Line
	1800 4450 1750 4450
Wire Wire Line
	1750 4550 1800 4550
Wire Wire Line
	1800 4650 1750 4650
Wire Wire Line
	1750 4750 1800 4750
Wire Wire Line
	1800 4850 1750 4850
Wire Wire Line
	1750 4950 1800 4950
Wire Wire Line
	1800 5050 1750 5050
Wire Wire Line
	1750 5150 1800 5150
Wire Wire Line
	1800 5350 1750 5350
Wire Wire Line
	1750 5550 1800 5550
Wire Wire Line
	1450 3350 1450 3250
Wire Wire Line
	1550 3250 1550 3350
Wire Wire Line
	1650 3350 1650 3250
Wire Wire Line
	1750 3250 1750 3350
Wire Wire Line
	1850 3350 1850 3250
Wire Wire Line
	1950 3250 1950 3350
Wire Wire Line
	2050 3350 2050 3250
Wire Wire Line
	2150 3250 2150 3350
Wire Wire Line
	2250 3350 2250 3250
Wire Wire Line
	2350 3250 2350 3350
Wire Wire Line
	2450 3350 2450 3250
Text Label 1750 4250 2    50   ~ 0
GND
Wire Wire Line
	1800 4250 1750 4250
$Comp
L Switch:SW_DPDT_x2 SW1
U 1 1 5BEF10C7
P 1200 6150
F 0 "SW1" H 1200 6435 50  0000 C CNN
F 1 "SW_DPDT_x2" H 1200 6344 50  0000 C CNN
F 2 "FeTAp:SW_HookSwitchFeTAp" H 1200 6150 50  0001 C CNN
F 3 "" H 1200 6150 50  0001 C CNN
	1    1200 6150
	1    0    0    -1  
$EndComp
Text Label 3850 6350 0    50   ~ 0
5V
Wire Wire Line
	3850 6350 3800 6350
NoConn ~ 3800 4250
NoConn ~ 3800 4350
NoConn ~ 3800 4450
NoConn ~ 3800 4550
NoConn ~ 3800 4650
NoConn ~ 3800 4750
NoConn ~ 3800 4850
NoConn ~ 3800 4950
NoConn ~ 3800 5050
NoConn ~ 3800 5150
NoConn ~ 3800 5250
NoConn ~ 3800 5350
NoConn ~ 3800 5450
NoConn ~ 3800 5550
NoConn ~ 3800 5650
NoConn ~ 3800 5750
NoConn ~ 3800 5850
NoConn ~ 3800 5950
NoConn ~ 3800 6050
NoConn ~ 3800 6150
NoConn ~ 3800 6250
NoConn ~ 3800 6450
NoConn ~ 3800 6850
NoConn ~ 1800 6050
NoConn ~ 1800 5950
NoConn ~ 1800 5850
NoConn ~ 1800 5650
NoConn ~ 6200 4350
$Comp
L power:PWR_FLAG #FLG01
U 1 1 5BF974ED
P 2350 1950
F 0 "#FLG01" H 2350 2025 50  0001 C CNN
F 1 "PWR_FLAG" H 2350 2124 50  0000 C CNN
F 2 "" H 2350 1950 50  0001 C CNN
F 3 "~" H 2350 1950 50  0001 C CNN
	1    2350 1950
	1    0    0    -1  
$EndComp
Text Label 2050 2000 3    50   ~ 0
3V3
Text Label 2350 2000 3    50   ~ 0
GND
Text Label 1700 2000 3    50   ~ 0
5V
$Comp
L power:PWR_FLAG #FLG02
U 1 1 5BF97630
P 1700 1950
F 0 "#FLG02" H 1700 2025 50  0001 C CNN
F 1 "PWR_FLAG" H 1700 2124 50  0000 C CNN
F 2 "" H 1700 1950 50  0001 C CNN
F 3 "~" H 1700 1950 50  0001 C CNN
	1    1700 1950
	1    0    0    -1  
$EndComp
Wire Wire Line
	1700 1950 1700 2000
Wire Wire Line
	2050 2000 2050 1950
Wire Wire Line
	2350 1950 2350 2000
$Comp
L power:PWR_FLAG #FLG03
U 1 1 5BFA605F
P 7150 1800
F 0 "#FLG03" H 7150 1875 50  0001 C CNN
F 1 "PWR_FLAG" H 7150 1974 50  0000 C CNN
F 2 "" H 7150 1800 50  0001 C CNN
F 3 "~" H 7150 1800 50  0001 C CNN
	1    7150 1800
	1    0    0    -1  
$EndComp
Connection ~ 7150 1800
Text Label 8550 3900 2    50   ~ 0
GND
Connection ~ 8600 3900
Wire Wire Line
	7350 4150 7500 4150
Wire Wire Line
	5950 2100 6200 2100
Wire Wire Line
	6700 1800 6750 1800
Wire Wire Line
	7350 1800 7700 1800
Wire Wire Line
	5150 1800 6700 1800
Wire Wire Line
	4800 1800 5150 1800
Wire Wire Line
	4400 1800 4800 1800
Wire Wire Line
	5050 3900 6100 3900
Wire Wire Line
	4850 4000 6100 4000
Wire Wire Line
	7150 1800 7350 1800
Wire Wire Line
	8600 3900 8700 3900
$Comp
L Connector:Conn_01x02_Male J2
U 1 1 5BE51A70
P 1200 6450
F 0 "J2" H 1306 6628 50  0000 C CNN
F 1 "Conn_01x02_Male" H 1306 6537 50  0000 C CNN
F 2 "Connector_PinHeader_2.54mm:PinHeader_1x02_P2.54mm_Vertical" H 1200 6450 50  0001 C CNN
F 3 "~" H 1200 6450 50  0001 C CNN
	1    1200 6450
	1    0    0    -1  
$EndComp
$Comp
L Connector:Conn_01x04_Male J3
U 1 1 5BE5C7E2
P 9100 2750
F 0 "J3" H 9073 2630 50  0000 R CNN
F 1 "Conn_01x04_Male" H 9073 2721 50  0000 R CNN
F 2 "Connector_PinHeader_2.54mm:PinHeader_1x04_P2.54mm_Vertical" H 9100 2750 50  0001 C CNN
F 3 "~" H 9100 2750 50  0001 C CNN
	1    9100 2750
	-1   0    0    1   
$EndComp
Wire Wire Line
	7950 2850 8250 2850
Wire Wire Line
	7950 2850 7950 3350
Wire Wire Line
	8900 2750 8450 2750
Wire Wire Line
	7850 2750 7850 3250
Wire Wire Line
	8900 2650 8800 2650
Text Label 8800 2650 2    50   ~ 0
MIC
Wire Wire Line
	8050 4150 8100 4150
Connection ~ 8050 4150
Text Label 8100 4150 0    50   ~ 0
MIC
Wire Wire Line
	8800 2550 8900 2550
Wire Wire Line
	3800 6550 3850 6550
$Comp
L Device:Jumper_NC_Small JP4
U 1 1 5BE9C580
P 8350 2850
F 0 "JP4" H 8350 3062 50  0000 C CNN
F 1 "Jumper_NC_Small" H 8350 2971 50  0000 C CNN
F 2 "Jumper:SolderJumper-2_P1.3mm_Bridged_RoundedPad1.0x1.5mm" H 8350 2850 50  0001 C CNN
F 3 "~" H 8350 2850 50  0001 C CNN
	1    8350 2850
	1    0    0    -1  
$EndComp
Wire Wire Line
	8450 2850 8900 2850
$Comp
L Device:Jumper_NC_Small JP3
U 1 1 5BE9C659
P 8350 2750
F 0 "JP3" H 8350 2962 50  0000 C CNN
F 1 "Jumper_NC_Small" H 8350 2871 50  0000 C CNN
F 2 "Jumper:SolderJumper-2_P1.3mm_Bridged_RoundedPad1.0x1.5mm" H 8350 2750 50  0001 C CNN
F 3 "~" H 8350 2750 50  0001 C CNN
	1    8350 2750
	1    0    0    -1  
$EndComp
Wire Wire Line
	8250 2750 7850 2750
$Comp
L Connector:Test_Point TP2
U 1 1 5BE9C91F
P 6200 2100
F 0 "TP2" H 6258 2220 50  0000 L CNN
F 1 "Test_Point" H 6258 2129 50  0000 L CNN
F 2 "TestPoint:TestPoint_Pad_D1.0mm" H 6400 2100 50  0001 C CNN
F 3 "~" H 6400 2100 50  0001 C CNN
	1    6200 2100
	1    0    0    -1  
$EndComp
Connection ~ 6200 2100
Wire Wire Line
	6200 2100 6500 2100
$Comp
L Connector:Test_Point TP3
U 1 1 5BE9CAB1
P 8350 3700
F 0 "TP3" H 8408 3820 50  0000 L CNN
F 1 "Test_Point" H 8408 3729 50  0000 L CNN
F 2 "TestPoint:TestPoint_Pad_D1.0mm" H 8550 3700 50  0001 C CNN
F 3 "~" H 8550 3700 50  0001 C CNN
	1    8350 3700
	1    0    0    -1  
$EndComp
Connection ~ 8350 3700
Wire Wire Line
	8350 3700 8700 3700
$Comp
L Connector:Test_Point TP1
U 1 1 5BE9CC85
P 2350 2000
F 0 "TP1" V 2304 2188 50  0000 L CNN
F 1 "Test_Point" V 2395 2188 50  0000 L CNN
F 2 "TestPoint:TestPoint_Pad_4.0x4.0mm" H 2550 2000 50  0001 C CNN
F 3 "~" H 2550 2000 50  0001 C CNN
	1    2350 2000
	0    1    1    0   
$EndComp
$Comp
L Device:Jumper_NC_Small JP2
U 1 1 5BEA8B73
P 3950 6550
F 0 "JP2" H 3950 6762 50  0000 C CNN
F 1 "Jumper_NC_Small" H 3950 6671 50  0000 C CNN
F 2 "Jumper:SolderJumper-2_P1.3mm_Bridged_RoundedPad1.0x1.5mm" H 3950 6550 50  0001 C CNN
F 3 "~" H 3950 6550 50  0001 C CNN
	1    3950 6550
	1    0    0    -1  
$EndComp
Text Label 4100 6550 0    50   ~ 0
3V3
Wire Wire Line
	4100 6550 4050 6550
NoConn ~ 1800 5750
Wire Wire Line
	3650 1800 4050 1800
Wire Wire Line
	6100 4100 5950 4100
Wire Wire Line
	5950 4100 5950 4200
Connection ~ 5950 4200
$Comp
L Device:C C12
U 1 1 5BECE02F
P 4050 2050
F 0 "C12" H 4165 2096 50  0000 L CNN
F 1 "100n" H 4165 2005 50  0000 L CNN
F 2 "Capacitor_SMD:C_0603_1608Metric" H 4088 1900 50  0001 C CNN
F 3 "~" H 4050 2050 50  0001 C CNN
	1    4050 2050
	1    0    0    -1  
$EndComp
Wire Wire Line
	4050 1800 4050 1900
Connection ~ 4050 1800
Wire Wire Line
	4050 1800 4400 1800
Wire Wire Line
	4050 2200 4050 2300
Text Label 4050 2300 0    50   ~ 0
GND
Wire Wire Line
	6550 4700 6550 4750
Wire Wire Line
	6550 4750 6650 4750
Connection ~ 6650 4750
Connection ~ 6750 4750
Wire Wire Line
	6750 4750 6950 4750
Wire Wire Line
	1400 6450 1800 6450
Wire Wire Line
	1800 6550 1400 6550
Wire Wire Line
	1750 6150 1800 6150
Wire Wire Line
	1400 6250 1800 6250
Wire Wire Line
	1000 6350 1000 6150
Wire Wire Line
	1000 6350 1800 6350
Connection ~ 6950 4750
Wire Wire Line
	6950 4750 7000 4750
NoConn ~ 1800 6850
NoConn ~ 1400 6050
$Comp
L power:PWR_FLAG #FLG0101
U 1 1 5BECC1AB
P 2050 1950
F 0 "#FLG0101" H 2050 2025 50  0001 C CNN
F 1 "PWR_FLAG" H 2050 2124 50  0000 C CNN
F 2 "" H 2050 1950 50  0001 C CNN
F 3 "~" H 2050 1950 50  0001 C CNN
	1    2050 1950
	1    0    0    -1  
$EndComp
$EndSCHEMATC
