EESchema Schematic File Version 4
LIBS:Telefon-cache
EELAYER 26 0
EELAYER END
$Descr A4 11693 8268
encoding utf-8
Sheet 2 2
Title ""
Date ""
Rev ""
Comp ""
Comment1 ""
Comment2 ""
Comment3 ""
Comment4 ""
$EndDescr
$Comp
L Amplifier_Audio:LT3469 U4
U 1 1 5BDBFA02
P 4850 3350
F 0 "U4" H 4850 3400 50  0000 C CNN
F 1 "LT3469" H 4850 3300 50  0000 C CNN
F 2 "TO_SOT_Packages_SMD:TSOT-23-8" H 4950 3150 50  0001 C CNN
F 3 "https://www.analog.com/media/en/technical-documentation/data-sheets/3469f.pdf" H 4950 3150 50  0001 C CNN
	1    4850 3350
	1    0    0    -1  
$EndComp
$Comp
L Device:R R?
U 1 1 5BDBFA09
P 5750 3200
AR Path="/5BDBFA09" Ref="R?"  Part="1" 
AR Path="/5BDBF509/5BDBFA09" Ref="R8"  Part="1" 
F 0 "R8" H 5820 3246 50  0000 L CNN
F 1 "330k" H 5820 3155 50  0000 L CNN
F 2 "Resistor_SMD:R_0603_1608Metric" V 5680 3200 50  0001 C CNN
F 3 "~" H 5750 3200 50  0001 C CNN
	1    5750 3200
	1    0    0    -1  
$EndComp
$Comp
L Device:R R?
U 1 1 5BDBFA10
P 5750 3550
AR Path="/5BDBFA10" Ref="R?"  Part="1" 
AR Path="/5BDBF509/5BDBFA10" Ref="R9"  Part="1" 
F 0 "R9" H 5680 3504 50  0000 R CNN
F 1 "22k" H 5680 3595 50  0000 R CNN
F 2 "Resistor_SMD:R_0603_1608Metric" V 5680 3550 50  0001 C CNN
F 3 "~" H 5750 3550 50  0001 C CNN
	1    5750 3550
	-1   0    0    1   
$EndComp
$Comp
L Device:L L2
U 1 1 5BDBFA18
P 4850 2600
F 0 "L2" V 5040 2600 50  0000 C CNN
F 1 "LQH32CN470K23" V 4949 2600 50  0000 C CNN
F 2 "Inductor_SMD:L_1210_3225Metric" H 4850 2600 50  0001 C CNN
F 3 "~" H 4850 2600 50  0001 C CNN
F 4 "MURATA LQH32CN470" V 4850 2600 50  0001 C CNN "MPN"
	1    4850 2600
	0    -1   -1   0   
$EndComp
$Comp
L Device:C C10
U 1 1 5BDBFA1F
P 4100 2850
F 0 "C10" H 4215 2896 50  0000 L CNN
F 1 "2u2" H 4215 2805 50  0000 L CNN
F 2 "Capacitor_SMD:C_0603_1608Metric" H 4138 2700 50  0001 C CNN
F 3 "~" H 4100 2850 50  0001 C CNN
	1    4100 2850
	1    0    0    -1  
$EndComp
Wire Wire Line
	4100 2700 4100 2600
Wire Wire Line
	3900 2600 4100 2600
Wire Wire Line
	4600 2600 4600 2700
Connection ~ 4600 2600
Wire Wire Line
	5000 2600 5100 2600
Wire Wire Line
	5100 2600 5100 2700
$Comp
L Device:C C11
U 1 1 5BDBFA2D
P 6000 3400
F 0 "C11" H 6115 3446 50  0000 L CNN
F 1 "470n/50V" H 6115 3355 50  0000 L CNN
F 2 "Capacitor_SMD:C_0603_1608Metric" H 6038 3250 50  0001 C CNN
F 3 "~" H 6000 3400 50  0001 C CNN
	1    6000 3400
	1    0    0    -1  
$EndComp
Wire Wire Line
	5350 3050 5600 3050
Wire Wire Line
	5350 3350 5750 3350
Wire Wire Line
	5750 3350 5750 3400
Connection ~ 5750 3350
Wire Wire Line
	5750 3700 5750 3750
Wire Wire Line
	5750 3750 5850 3750
Wire Wire Line
	6000 3750 6000 3550
Wire Wire Line
	6000 3050 6000 3250
Connection ~ 5750 3050
$Comp
L Device:R R?
U 1 1 5BDBFA45
P 4000 3600
AR Path="/5BDBFA45" Ref="R?"  Part="1" 
AR Path="/5BDBF509/5BDBFA45" Ref="R5"  Part="1" 
F 0 "R5" V 3793 3600 50  0000 C CNN
F 1 "22k" V 3884 3600 50  0000 C CNN
F 2 "Resistor_SMD:R_0603_1608Metric" V 3930 3600 50  0001 C CNN
F 3 "~" H 4000 3600 50  0001 C CNN
	1    4000 3600
	0    1    1    0   
$EndComp
Wire Wire Line
	4350 3800 4150 3800
Wire Wire Line
	4150 3800 4150 4250
Wire Wire Line
	4150 3600 4350 3600
Wire Wire Line
	4850 4050 4850 4100
Wire Wire Line
	5450 3700 5450 4150
Wire Wire Line
	5450 3700 5350 3700
$Comp
L Device:R R4
U 1 1 5BDBFA5D
P 3750 2600
F 0 "R4" V 3543 2600 50  0000 C CNN
F 1 "4.7" V 3634 2600 50  0000 C CNN
F 2 "Resistor_SMD:R_0603_1608Metric" V 3680 2600 50  0001 C CNN
F 3 "~" H 3750 2600 50  0001 C CNN
	1    3750 2600
	0    1    1    0   
$EndComp
Connection ~ 4100 2600
Connection ~ 5850 3750
Text HLabel 3550 2600 0    50   Input ~ 0
VCC
Text HLabel 3550 3050 0    50   Input ~ 0
GND
Wire Wire Line
	3550 3050 4100 3050
Wire Wire Line
	4100 3050 4100 3000
Connection ~ 4100 3050
Text Label 4150 3050 0    50   ~ 0
PiezoGND
Text Label 4900 4100 0    50   ~ 0
PiezoGND
Text Label 3850 4400 2    50   ~ 0
PiezoGND
Text Label 5850 3900 0    50   ~ 0
PiezoGND
Wire Wire Line
	5850 3750 5850 3900
Wire Wire Line
	4850 4100 4900 4100
Text HLabel 6250 4150 2    50   Output ~ 0
OUT
Wire Wire Line
	5450 4150 5700 4150
Connection ~ 5450 4150
Text HLabel 3550 3600 0    50   Input ~ 0
IN
Wire Wire Line
	3550 3600 3850 3600
Wire Wire Line
	3600 2600 3550 2600
$Comp
L power:PWR_FLAG #FLG04
U 1 1 5BFA5B31
P 4100 2600
F 0 "#FLG04" H 4100 2675 50  0001 C CNN
F 1 "PWR_FLAG" H 4100 2774 50  0000 C CNN
F 2 "" H 4100 2600 50  0001 C CNN
F 3 "~" H 4100 2600 50  0001 C CNN
	1    4100 2600
	1    0    0    -1  
$EndComp
Wire Wire Line
	4600 2600 4700 2600
Wire Wire Line
	5750 3050 6000 3050
Wire Wire Line
	4100 2600 4600 2600
Wire Wire Line
	5850 3750 6000 3750
Wire Wire Line
	4100 3050 4150 3050
Wire Wire Line
	5450 4150 5450 4400
$Comp
L Connector:Test_Point TP4
U 1 1 5BEA9652
P 5600 3050
F 0 "TP4" H 5658 3170 50  0000 L CNN
F 1 "Test_Point" H 5658 3079 50  0000 L CNN
F 2 "TestPoint:TestPoint_Pad_D1.0mm" H 5800 3050 50  0001 C CNN
F 3 "~" H 5800 3050 50  0001 C CNN
	1    5600 3050
	1    0    0    -1  
$EndComp
Connection ~ 5600 3050
Wire Wire Line
	5600 3050 5750 3050
$Comp
L Connector:Test_Point TP5
U 1 1 5BEA96E9
P 5700 4150
F 0 "TP5" H 5758 4270 50  0000 L CNN
F 1 "Test_Point" H 5758 4179 50  0000 L CNN
F 2 "TestPoint:TestPoint_Pad_D1.0mm" H 5900 4150 50  0001 C CNN
F 3 "~" H 5900 4150 50  0001 C CNN
	1    5700 4150
	1    0    0    -1  
$EndComp
Connection ~ 5700 4150
Wire Wire Line
	5700 4150 6250 4150
$Comp
L Device:R_POT RV1
U 1 1 5BEDFEE6
P 4150 4400
F 0 "RV1" V 4036 4400 50  0000 C CNN
F 1 "200k" V 3945 4400 50  0000 C CNN
F 2 "Potentiometer_SMD:Potentiometer_Vishay_TS53YJ_Vertical" H 4150 4400 50  0001 C CNN
F 3 "~" H 4150 4400 50  0001 C CNN
	1    4150 4400
	0    -1   -1   0   
$EndComp
Wire Wire Line
	4300 4400 5450 4400
Wire Wire Line
	4000 4400 3850 4400
$EndSCHEMATC
