G04 #@! TF.GenerationSoftware,KiCad,Pcbnew,5.0.0-fee4fd1~65~ubuntu17.10.1*
G04 #@! TF.CreationDate,2018-11-12T12:08:18+01:00*
G04 #@! TF.ProjectId,Telefon,54656C65666F6E2E6B696361645F7063,rev?*
G04 #@! TF.SameCoordinates,Original*
G04 #@! TF.FileFunction,Legend,Top*
G04 #@! TF.FilePolarity,Positive*
%FSLAX46Y46*%
G04 Gerber Fmt 4.6, Leading zero omitted, Abs format (unit mm)*
G04 Created by KiCad (PCBNEW 5.0.0-fee4fd1~65~ubuntu17.10.1) date Mon Nov 12 12:08:18 2018*
%MOMM*%
%LPD*%
G01*
G04 APERTURE LIST*
%ADD10C,0.300000*%
%ADD11C,0.150000*%
%ADD12C,0.120000*%
G04 APERTURE END LIST*
D10*
X116596417Y-99621327D02*
X116524968Y-99764174D01*
X116453529Y-99835592D01*
X116310662Y-99907000D01*
X116239233Y-99906990D01*
X116096386Y-99835541D01*
X116024968Y-99764102D01*
X115953560Y-99621235D01*
X115953601Y-99335520D01*
X116025050Y-99192674D01*
X116096489Y-99121255D01*
X116239356Y-99049847D01*
X116310785Y-99049858D01*
X116453632Y-99121307D01*
X116525050Y-99192745D01*
X116596458Y-99335613D01*
X116596417Y-99621327D01*
X116667825Y-99764195D01*
X116739243Y-99835633D01*
X116882090Y-99907083D01*
X117167805Y-99907124D01*
X117310672Y-99835716D01*
X117382111Y-99764297D01*
X117453560Y-99621450D01*
X117453601Y-99335736D01*
X117382193Y-99192869D01*
X117310775Y-99121430D01*
X117167928Y-99049981D01*
X116882214Y-99049940D01*
X116739346Y-99121348D01*
X116667907Y-99192766D01*
X116596458Y-99335613D01*
X115953776Y-98121235D02*
X115953796Y-97978378D01*
X116025245Y-97835531D01*
X116096684Y-97764112D01*
X116239552Y-97692704D01*
X116525276Y-97621317D01*
X116882419Y-97621368D01*
X117168123Y-97692838D01*
X117310970Y-97764287D01*
X117382388Y-97835726D01*
X117453796Y-97978593D01*
X117453776Y-98121451D01*
X117382327Y-98264297D01*
X117310888Y-98335716D01*
X117168020Y-98407124D01*
X116882296Y-98478511D01*
X116525153Y-98478460D01*
X116239449Y-98406990D01*
X116096602Y-98335541D01*
X116025184Y-98264102D01*
X115953776Y-98121235D01*
X117382522Y-96907155D02*
X117453950Y-96907165D01*
X117596797Y-96978614D01*
X117668216Y-97050053D01*
X117454156Y-95478593D02*
X117454033Y-96335736D01*
X117454094Y-95907165D02*
X115954094Y-95906949D01*
X116168360Y-96049837D01*
X116311196Y-96192715D01*
X116382604Y-96335582D01*
X117454362Y-94050022D02*
X117454238Y-94907165D01*
X117454300Y-94478593D02*
X115954300Y-94478378D01*
X116168565Y-94621266D01*
X116311402Y-94764143D01*
X116382810Y-94907011D01*
X116097301Y-93478398D02*
X116025883Y-93406959D01*
X115954475Y-93264092D01*
X115954526Y-92906949D01*
X116025975Y-92764102D01*
X116097414Y-92692684D01*
X116240281Y-92621276D01*
X116383139Y-92621296D01*
X116597414Y-92692756D01*
X117454433Y-93550022D01*
X117454567Y-92621451D01*
X117454824Y-90835736D02*
X116454824Y-90835592D01*
X116597681Y-90835613D02*
X116526263Y-90764174D01*
X116454855Y-90621307D01*
X116454886Y-90407021D01*
X116526335Y-90264174D01*
X116669202Y-90192766D01*
X117454916Y-90192879D01*
X116669202Y-90192766D02*
X116526355Y-90121317D01*
X116454947Y-89978450D01*
X116454978Y-89764164D01*
X116526427Y-89621317D01*
X116669295Y-89549909D01*
X117455009Y-89550022D01*
X117455112Y-88835736D02*
X116455112Y-88835592D01*
X116597969Y-88835613D02*
X116526551Y-88764174D01*
X116455143Y-88621307D01*
X116455173Y-88407021D01*
X116526623Y-88264174D01*
X116669490Y-88192766D01*
X117455204Y-88192879D01*
X116669490Y-88192766D02*
X116526643Y-88121317D01*
X116455235Y-87978450D01*
X116455266Y-87764164D01*
X116526715Y-87621317D01*
X116669582Y-87549909D01*
X117455297Y-87550022D01*
X118881605Y-53637332D02*
X118870079Y-133748836D01*
X126971526Y-53638496D02*
X118295184Y-53637248D01*
X126960000Y-133750000D02*
X118283658Y-133748752D01*
X118870079Y-133748836D02*
X118283820Y-132622248D01*
X118870079Y-133748836D02*
X119456662Y-132622417D01*
X118881605Y-53637332D02*
X118295022Y-54763751D01*
X118881605Y-53637332D02*
X119467864Y-54763920D01*
X139803655Y-144018951D02*
X140732227Y-144018951D01*
X140232227Y-144590380D01*
X140446512Y-144590380D01*
X140589370Y-144661808D01*
X140660798Y-144733237D01*
X140732227Y-144876094D01*
X140732227Y-145233237D01*
X140660798Y-145376094D01*
X140589370Y-145447522D01*
X140446512Y-145518951D01*
X140017941Y-145518951D01*
X139875084Y-145447522D01*
X139803655Y-145376094D01*
X141589370Y-144661808D02*
X141446512Y-144590380D01*
X141375084Y-144518951D01*
X141303655Y-144376094D01*
X141303655Y-144304665D01*
X141375084Y-144161808D01*
X141446512Y-144090380D01*
X141589370Y-144018951D01*
X141875084Y-144018951D01*
X142017941Y-144090380D01*
X142089370Y-144161808D01*
X142160798Y-144304665D01*
X142160798Y-144376094D01*
X142089370Y-144518951D01*
X142017941Y-144590380D01*
X141875084Y-144661808D01*
X141589370Y-144661808D01*
X141446512Y-144733237D01*
X141375084Y-144804665D01*
X141303655Y-144947522D01*
X141303655Y-145233237D01*
X141375084Y-145376094D01*
X141446512Y-145447522D01*
X141589370Y-145518951D01*
X141875084Y-145518951D01*
X142017941Y-145447522D01*
X142089370Y-145376094D01*
X142160798Y-145233237D01*
X142160798Y-144947522D01*
X142089370Y-144804665D01*
X142017941Y-144733237D01*
X141875084Y-144661808D01*
X142875084Y-145447522D02*
X142875084Y-145518951D01*
X142803655Y-145661808D01*
X142732227Y-145733237D01*
X143446512Y-144161808D02*
X143517941Y-144090380D01*
X143660798Y-144018951D01*
X144017941Y-144018951D01*
X144160798Y-144090380D01*
X144232227Y-144161808D01*
X144303655Y-144304665D01*
X144303655Y-144447522D01*
X144232227Y-144661808D01*
X143375084Y-145518951D01*
X144303655Y-145518951D01*
X145160798Y-144661808D02*
X145017941Y-144590380D01*
X144946512Y-144518951D01*
X144875084Y-144376094D01*
X144875084Y-144304665D01*
X144946512Y-144161808D01*
X145017941Y-144090380D01*
X145160798Y-144018951D01*
X145446512Y-144018951D01*
X145589370Y-144090380D01*
X145660798Y-144161808D01*
X145732227Y-144304665D01*
X145732227Y-144376094D01*
X145660798Y-144518951D01*
X145589370Y-144590380D01*
X145446512Y-144661808D01*
X145160798Y-144661808D01*
X145017941Y-144733237D01*
X144946512Y-144804665D01*
X144875084Y-144947522D01*
X144875084Y-145233237D01*
X144946512Y-145376094D01*
X145017941Y-145447522D01*
X145160798Y-145518951D01*
X145446512Y-145518951D01*
X145589370Y-145447522D01*
X145660798Y-145376094D01*
X145732227Y-145233237D01*
X145732227Y-144947522D01*
X145660798Y-144804665D01*
X145589370Y-144733237D01*
X145446512Y-144661808D01*
X146660798Y-144018951D02*
X146803655Y-144018951D01*
X146946512Y-144090380D01*
X147017941Y-144161808D01*
X147089370Y-144304665D01*
X147160798Y-144590380D01*
X147160798Y-144947522D01*
X147089370Y-145233237D01*
X147017941Y-145376094D01*
X146946512Y-145447522D01*
X146803655Y-145518951D01*
X146660798Y-145518951D01*
X146517941Y-145447522D01*
X146446512Y-145376094D01*
X146375084Y-145233237D01*
X146303655Y-144947522D01*
X146303655Y-144590380D01*
X146375084Y-144304665D01*
X146446512Y-144161808D01*
X146517941Y-144090380D01*
X146660798Y-144018951D01*
X148946512Y-145518951D02*
X148946512Y-144518951D01*
X148946512Y-144661808D02*
X149017941Y-144590380D01*
X149160798Y-144518951D01*
X149375084Y-144518951D01*
X149517941Y-144590380D01*
X149589370Y-144733237D01*
X149589370Y-145518951D01*
X149589370Y-144733237D02*
X149660798Y-144590380D01*
X149803655Y-144518951D01*
X150017941Y-144518951D01*
X150160798Y-144590380D01*
X150232227Y-144733237D01*
X150232227Y-145518951D01*
X150946512Y-145518951D02*
X150946512Y-144518951D01*
X150946512Y-144661808D02*
X151017941Y-144590380D01*
X151160798Y-144518951D01*
X151375084Y-144518951D01*
X151517941Y-144590380D01*
X151589370Y-144733237D01*
X151589370Y-145518951D01*
X151589370Y-144733237D02*
X151660798Y-144590380D01*
X151803655Y-144518951D01*
X152017941Y-144518951D01*
X152160798Y-144590380D01*
X152232227Y-144733237D01*
X152232227Y-145518951D01*
X165229540Y-142740380D02*
X126949200Y-142740380D01*
X165229540Y-137325100D02*
X165229540Y-143326801D01*
X126949200Y-137325100D02*
X126949200Y-143326801D01*
X126949200Y-142740380D02*
X128075704Y-142153959D01*
X126949200Y-142740380D02*
X128075704Y-143326801D01*
X165229540Y-142740380D02*
X164103036Y-142153959D01*
X165229540Y-142740380D02*
X164103036Y-143326801D01*
D11*
G04 #@! TO.C,SW1*
X132090000Y-91976200D02*
X133590000Y-91976200D01*
X133590000Y-90476200D02*
X133590000Y-91976200D01*
X163590000Y-91976200D02*
X165090000Y-91976200D01*
X163590000Y-90476200D02*
X163590000Y-91976200D01*
X136590000Y-108976200D02*
X136590000Y-99976200D01*
X160590000Y-108976200D02*
X136590000Y-108976200D01*
X160590000Y-99976200D02*
X160590000Y-108976200D01*
X160590000Y-99976200D02*
X136590000Y-99976200D01*
X138590000Y-101976200D02*
X138590000Y-106976200D01*
X158590000Y-106976200D02*
X138590000Y-106976200D01*
X158590000Y-101976200D02*
X158590000Y-106976200D01*
X138590000Y-101976200D02*
X158590000Y-101976200D01*
X132090000Y-91976200D02*
X132090000Y-54976200D01*
X133590000Y-90476200D02*
X163590000Y-90476200D01*
X165090000Y-54976200D02*
X165090000Y-91976200D01*
X132090000Y-54976200D02*
X165090000Y-54976200D01*
D12*
G04 #@! TO.C,LS2*
X161700000Y-91550000D02*
X161700000Y-92880000D01*
X160370000Y-91550000D02*
X161700000Y-91550000D01*
X159100000Y-91550000D02*
X159100000Y-94210000D01*
X159100000Y-94210000D02*
X156500000Y-94210000D01*
X159100000Y-91550000D02*
X156500000Y-91550000D01*
X156500000Y-91550000D02*
X156500000Y-94210000D01*
G04 #@! TO.C,J1*
X136193220Y-132762300D02*
X136193220Y-131432300D01*
X137523220Y-132762300D02*
X136193220Y-132762300D01*
X138793220Y-132762300D02*
X138793220Y-130102300D01*
X138793220Y-130102300D02*
X164253220Y-130102300D01*
X138793220Y-132762300D02*
X164253220Y-132762300D01*
X164253220Y-132762300D02*
X164253220Y-130102300D01*
D11*
G04 #@! TO.C,U1*
X129001520Y-127139700D02*
X129001520Y-109359700D01*
X164561520Y-127139700D02*
X129001520Y-127139700D01*
X164561520Y-109359700D02*
X164561520Y-127139700D01*
X129001520Y-109359700D02*
X164561520Y-109359700D01*
X155671520Y-123329700D02*
X146781520Y-123329700D01*
X155671520Y-113169700D02*
X146781520Y-113169700D01*
X146781520Y-113169700D02*
X146781520Y-123329700D01*
X155671520Y-123329700D02*
X155671520Y-113169700D01*
X159481520Y-115709700D02*
X162021520Y-115709700D01*
X159481520Y-120789700D02*
X159481520Y-115709700D01*
X162021520Y-120789700D02*
X159481520Y-120789700D01*
X162021520Y-115709700D02*
X162021520Y-120789700D01*
X135351520Y-120789700D02*
X135351520Y-123329700D01*
X137891520Y-120789700D02*
X135351520Y-120789700D01*
X137891520Y-123329700D02*
X137891520Y-120789700D01*
X135351520Y-123329700D02*
X137891520Y-123329700D01*
X134081520Y-122059700D02*
X129001520Y-122059700D01*
X134081520Y-114439700D02*
X129001520Y-114439700D01*
X134081520Y-122059700D02*
X134081520Y-114439700D01*
X140431520Y-120789700D02*
X140431520Y-123329700D01*
X144241520Y-120789700D02*
X140431520Y-120789700D01*
X144241520Y-123329700D02*
X144241520Y-120789700D01*
X140431520Y-123329700D02*
X144241520Y-123329700D01*
X127731520Y-114439700D02*
X129001520Y-114439700D01*
X127731520Y-122059700D02*
X127731520Y-114439700D01*
X129001520Y-122059700D02*
X127731520Y-122059700D01*
D12*
G04 #@! TO.C,J3*
X128210000Y-55820000D02*
X129540000Y-55820000D01*
X128210000Y-57150000D02*
X128210000Y-55820000D01*
X128210000Y-58420000D02*
X130870000Y-58420000D01*
X130870000Y-58420000D02*
X130870000Y-66100000D01*
X128210000Y-58420000D02*
X128210000Y-66100000D01*
X128210000Y-66100000D02*
X130870000Y-66100000D01*
G04 #@! TO.C,J2*
X164009380Y-107138780D02*
X162679380Y-107138780D01*
X164009380Y-105808780D02*
X164009380Y-107138780D01*
X164009380Y-104538780D02*
X161349380Y-104538780D01*
X161349380Y-104538780D02*
X161349380Y-101938780D01*
X164009380Y-104538780D02*
X164009380Y-101938780D01*
X164009380Y-101938780D02*
X161349380Y-101938780D01*
G04 #@! TO.C,TP5*
X163966120Y-93228160D02*
G75*
G03X163966120Y-93228160I-700000J0D01*
G01*
G04 #@! TO.C,TP2*
X142025600Y-98930460D02*
G75*
G03X142025600Y-98930460I-700000J0D01*
G01*
G04 #@! TO.C,TP3*
X147910000Y-95360000D02*
G75*
G03X147910000Y-95360000I-700000J0D01*
G01*
G04 #@! TO.C,TP4*
X153310820Y-98298000D02*
G75*
G03X153310820Y-98298000I-700000J0D01*
G01*
G04 #@! TO.C,TP1*
X127908960Y-132847440D02*
X127908960Y-128447440D01*
X132308960Y-132847440D02*
X127908960Y-132847440D01*
X132308960Y-128447440D02*
X132308960Y-132847440D01*
X127908960Y-128447440D02*
X132308960Y-128447440D01*
G04 #@! TO.C,JP2*
X131187420Y-108401360D02*
X129787420Y-108401360D01*
X129087420Y-107701360D02*
X129087420Y-107101360D01*
X129787420Y-106401360D02*
X131187420Y-106401360D01*
X131887420Y-107101360D02*
X131887420Y-107701360D01*
X131887420Y-107701360D02*
G75*
G02X131187420Y-108401360I-700000J0D01*
G01*
X131187420Y-106401360D02*
G75*
G02X131887420Y-107101360I0J-700000D01*
G01*
X129087420Y-107101360D02*
G75*
G02X129787420Y-106401360I700000J0D01*
G01*
X129787420Y-108401360D02*
G75*
G02X129087420Y-107701360I0J700000D01*
G01*
G04 #@! TO.C,JP3*
X128382520Y-89469240D02*
X128382520Y-88069240D01*
X129082520Y-87369240D02*
X129682520Y-87369240D01*
X130382520Y-88069240D02*
X130382520Y-89469240D01*
X129682520Y-90169240D02*
X129082520Y-90169240D01*
X129082520Y-90169240D02*
G75*
G02X128382520Y-89469240I0J700000D01*
G01*
X130382520Y-89469240D02*
G75*
G02X129682520Y-90169240I-700000J0D01*
G01*
X129682520Y-87369240D02*
G75*
G02X130382520Y-88069240I0J-700000D01*
G01*
X128382520Y-88069240D02*
G75*
G02X129082520Y-87369240I700000J0D01*
G01*
G04 #@! TO.C,JP4*
X128382520Y-85035620D02*
X128382520Y-83635620D01*
X129082520Y-82935620D02*
X129682520Y-82935620D01*
X130382520Y-83635620D02*
X130382520Y-85035620D01*
X129682520Y-85735620D02*
X129082520Y-85735620D01*
X129082520Y-85735620D02*
G75*
G02X128382520Y-85035620I0J700000D01*
G01*
X130382520Y-85035620D02*
G75*
G02X129682520Y-85735620I-700000J0D01*
G01*
X129682520Y-82935620D02*
G75*
G02X130382520Y-83635620I0J-700000D01*
G01*
X128382520Y-83635620D02*
G75*
G02X129082520Y-82935620I700000J0D01*
G01*
G04 #@! TO.C,R5*
X150208199Y-95689960D02*
X149882641Y-95689960D01*
X150208199Y-96709960D02*
X149882641Y-96709960D01*
G04 #@! TO.C,R4*
X151831580Y-92214581D02*
X151831580Y-92540139D01*
X152851580Y-92214581D02*
X152851580Y-92540139D01*
G04 #@! TO.C,R3*
X130620040Y-91919841D02*
X130620040Y-92245399D01*
X131640040Y-91919841D02*
X131640040Y-92245399D01*
G04 #@! TO.C,R2*
X130248441Y-105907300D02*
X130573999Y-105907300D01*
X130248441Y-104887300D02*
X130573999Y-104887300D01*
G04 #@! TO.C,R1*
X130314481Y-104121680D02*
X130640039Y-104121680D01*
X130314481Y-103101680D02*
X130640039Y-103101680D01*
G04 #@! TO.C,R8*
X154988141Y-98711480D02*
X155313699Y-98711480D01*
X154988141Y-97691480D02*
X155313699Y-97691480D01*
G04 #@! TO.C,R9*
X156350000Y-95654721D02*
X156350000Y-95980279D01*
X157370000Y-95654721D02*
X157370000Y-95980279D01*
D11*
G04 #@! TO.C,U3*
X134220040Y-97928340D02*
X134745040Y-97928340D01*
X134220040Y-92678340D02*
X134745040Y-92678340D01*
X139470040Y-92678340D02*
X138945040Y-92678340D01*
X139470040Y-97928340D02*
X138945040Y-97928340D01*
X134220040Y-92678340D02*
X134220040Y-93203340D01*
X139470040Y-92678340D02*
X139470040Y-93203340D01*
X134220040Y-97928340D02*
X134220040Y-97403340D01*
D12*
G04 #@! TO.C,L2*
X148595640Y-92509296D02*
X148595640Y-93713424D01*
X151315640Y-92509296D02*
X151315640Y-93713424D01*
G04 #@! TO.C,L1*
X144508001Y-95500000D02*
X144833559Y-95500000D01*
X144508001Y-94480000D02*
X144833559Y-94480000D01*
G04 #@! TO.C,C2*
X131632420Y-95308639D02*
X131632420Y-94983081D01*
X130612420Y-95308639D02*
X130612420Y-94983081D01*
G04 #@! TO.C,C3*
X138325641Y-99714780D02*
X138651199Y-99714780D01*
X138325641Y-98694780D02*
X138651199Y-98694780D01*
G04 #@! TO.C,C4*
X139559721Y-91900000D02*
X139885279Y-91900000D01*
X139559721Y-90880000D02*
X139885279Y-90880000D01*
G04 #@! TO.C,C5*
X142930000Y-94412779D02*
X142930000Y-94087221D01*
X141910000Y-94412779D02*
X141910000Y-94087221D01*
G04 #@! TO.C,C6*
X133336760Y-93771939D02*
X133336760Y-93446381D01*
X132316760Y-93771939D02*
X132316760Y-93446381D01*
G04 #@! TO.C,C7*
X135659721Y-91870000D02*
X135985279Y-91870000D01*
X135659721Y-90850000D02*
X135985279Y-90850000D01*
G04 #@! TO.C,C8*
X141390000Y-94412779D02*
X141390000Y-94087221D01*
X140370000Y-94412779D02*
X140370000Y-94087221D01*
G04 #@! TO.C,C9*
X145525279Y-92960000D02*
X145199721Y-92960000D01*
X145525279Y-93980000D02*
X145199721Y-93980000D01*
G04 #@! TO.C,C10*
X154497821Y-92137960D02*
X154823379Y-92137960D01*
X154497821Y-91117960D02*
X154823379Y-91117960D01*
G04 #@! TO.C,C11*
X154487661Y-93656880D02*
X154813219Y-93656880D01*
X154487661Y-92636880D02*
X154813219Y-92636880D01*
G04 #@! TO.C,C12*
X146538220Y-97766921D02*
X146538220Y-98092479D01*
X147558220Y-97766921D02*
X147558220Y-98092479D01*
G04 #@! TO.C,C1*
X130055080Y-95295939D02*
X130055080Y-94970381D01*
X129035080Y-95295939D02*
X129035080Y-94970381D01*
G04 #@! TO.C,RV1*
X164040000Y-99390000D02*
X164040000Y-99970000D01*
X164040000Y-97090000D02*
X164040000Y-97610000D01*
X164040000Y-94730000D02*
X164040000Y-95311000D01*
X158800000Y-98590000D02*
X158800000Y-99970000D01*
X158800000Y-94730000D02*
X158800000Y-96110000D01*
X158800000Y-99970000D02*
X164040000Y-99970000D01*
X158800000Y-94730000D02*
X164040000Y-94730000D01*
G04 #@! TO.C,U2*
X142819000Y-98765900D02*
X142819000Y-97305900D01*
X145979000Y-98765900D02*
X145979000Y-96605900D01*
X145979000Y-98765900D02*
X145049000Y-98765900D01*
X142819000Y-98765900D02*
X143749000Y-98765900D01*
G04 #@! TO.C,U4*
X152975640Y-97171360D02*
X155405640Y-97171360D01*
X154735640Y-94101360D02*
X152975640Y-94101360D01*
G04 #@! TO.C,SW1*
D11*
X147256666Y-89880961D02*
X147399523Y-89928580D01*
X147637619Y-89928580D01*
X147732857Y-89880961D01*
X147780476Y-89833342D01*
X147828095Y-89738104D01*
X147828095Y-89642866D01*
X147780476Y-89547628D01*
X147732857Y-89500009D01*
X147637619Y-89452390D01*
X147447142Y-89404771D01*
X147351904Y-89357152D01*
X147304285Y-89309533D01*
X147256666Y-89214295D01*
X147256666Y-89119057D01*
X147304285Y-89023819D01*
X147351904Y-88976200D01*
X147447142Y-88928580D01*
X147685238Y-88928580D01*
X147828095Y-88976200D01*
X148161428Y-88928580D02*
X148399523Y-89928580D01*
X148590000Y-89214295D01*
X148780476Y-89928580D01*
X149018571Y-88928580D01*
X149923333Y-89928580D02*
X149351904Y-89928580D01*
X149637619Y-89928580D02*
X149637619Y-88928580D01*
X149542380Y-89071438D01*
X149447142Y-89166676D01*
X149351904Y-89214295D01*
G04 #@! TO.C,LS2*
X163152380Y-93522857D02*
X163152380Y-93999047D01*
X162152380Y-93999047D01*
X163104761Y-93237142D02*
X163152380Y-93094285D01*
X163152380Y-92856190D01*
X163104761Y-92760952D01*
X163057142Y-92713333D01*
X162961904Y-92665714D01*
X162866666Y-92665714D01*
X162771428Y-92713333D01*
X162723809Y-92760952D01*
X162676190Y-92856190D01*
X162628571Y-93046666D01*
X162580952Y-93141904D01*
X162533333Y-93189523D01*
X162438095Y-93237142D01*
X162342857Y-93237142D01*
X162247619Y-93189523D01*
X162200000Y-93141904D01*
X162152380Y-93046666D01*
X162152380Y-92808571D01*
X162200000Y-92665714D01*
X162247619Y-92284761D02*
X162200000Y-92237142D01*
X162152380Y-92141904D01*
X162152380Y-91903809D01*
X162200000Y-91808571D01*
X162247619Y-91760952D01*
X162342857Y-91713333D01*
X162438095Y-91713333D01*
X162580952Y-91760952D01*
X163152380Y-92332380D01*
X163152380Y-91713333D01*
G04 #@! TO.C,J1*
X134645600Y-131765633D02*
X135359886Y-131765633D01*
X135502743Y-131813252D01*
X135597981Y-131908490D01*
X135645600Y-132051347D01*
X135645600Y-132146585D01*
X135645600Y-130765633D02*
X135645600Y-131337061D01*
X135645600Y-131051347D02*
X134645600Y-131051347D01*
X134788458Y-131146585D01*
X134883696Y-131241823D01*
X134931315Y-131337061D01*
G04 #@! TO.C,U1*
X146019615Y-107542080D02*
X146019615Y-108351604D01*
X146067234Y-108446842D01*
X146114853Y-108494461D01*
X146210091Y-108542080D01*
X146400567Y-108542080D01*
X146495805Y-108494461D01*
X146543424Y-108446842D01*
X146591043Y-108351604D01*
X146591043Y-107542080D01*
X147591043Y-108542080D02*
X147019615Y-108542080D01*
X147305329Y-108542080D02*
X147305329Y-107542080D01*
X147210091Y-107684938D01*
X147114853Y-107780176D01*
X147019615Y-107827795D01*
X139883900Y-117185890D02*
X139883900Y-116614461D01*
X140883900Y-116900176D02*
X139883900Y-116900176D01*
X139883900Y-116376366D02*
X139883900Y-115757319D01*
X140264853Y-116090652D01*
X140264853Y-115947795D01*
X140312472Y-115852557D01*
X140360091Y-115804938D01*
X140455329Y-115757319D01*
X140693424Y-115757319D01*
X140788662Y-115804938D01*
X140836281Y-115852557D01*
X140883900Y-115947795D01*
X140883900Y-116233509D01*
X140836281Y-116328747D01*
X140788662Y-116376366D01*
X140788662Y-115328747D02*
X140836281Y-115281128D01*
X140883900Y-115328747D01*
X140836281Y-115376366D01*
X140788662Y-115328747D01*
X140883900Y-115328747D01*
X140883900Y-114328747D02*
X140883900Y-114900176D01*
X140883900Y-114614461D02*
X139883900Y-114614461D01*
X140026758Y-114709700D01*
X140121996Y-114804938D01*
X140169615Y-114900176D01*
X136073900Y-117185890D02*
X136073900Y-116614461D01*
X137073900Y-116900176D02*
X136073900Y-116900176D01*
X136073900Y-116376366D02*
X136073900Y-115757319D01*
X136454853Y-116090652D01*
X136454853Y-115947795D01*
X136502472Y-115852557D01*
X136550091Y-115804938D01*
X136645329Y-115757319D01*
X136883424Y-115757319D01*
X136978662Y-115804938D01*
X137026281Y-115852557D01*
X137073900Y-115947795D01*
X137073900Y-116233509D01*
X137026281Y-116328747D01*
X136978662Y-116376366D01*
X136978662Y-115328747D02*
X137026281Y-115281128D01*
X137073900Y-115328747D01*
X137026281Y-115376366D01*
X136978662Y-115328747D01*
X137073900Y-115328747D01*
X136169139Y-114900176D02*
X136121520Y-114852557D01*
X136073900Y-114757319D01*
X136073900Y-114519223D01*
X136121520Y-114423985D01*
X136169139Y-114376366D01*
X136264377Y-114328747D01*
X136359615Y-114328747D01*
X136502472Y-114376366D01*
X137073900Y-114947795D01*
X137073900Y-114328747D01*
G04 #@! TO.C,J3*
X129206666Y-54272380D02*
X129206666Y-54986666D01*
X129159047Y-55129523D01*
X129063809Y-55224761D01*
X128920952Y-55272380D01*
X128825714Y-55272380D01*
X129587619Y-54272380D02*
X130206666Y-54272380D01*
X129873333Y-54653333D01*
X130016190Y-54653333D01*
X130111428Y-54700952D01*
X130159047Y-54748571D01*
X130206666Y-54843809D01*
X130206666Y-55081904D01*
X130159047Y-55177142D01*
X130111428Y-55224761D01*
X130016190Y-55272380D01*
X129730476Y-55272380D01*
X129635238Y-55224761D01*
X129587619Y-55177142D01*
G04 #@! TO.C,J2*
X162346046Y-107591160D02*
X162346046Y-108305446D01*
X162298427Y-108448303D01*
X162203189Y-108543541D01*
X162060332Y-108591160D01*
X161965094Y-108591160D01*
X162774618Y-107686399D02*
X162822237Y-107638780D01*
X162917475Y-107591160D01*
X163155570Y-107591160D01*
X163250808Y-107638780D01*
X163298427Y-107686399D01*
X163346046Y-107781637D01*
X163346046Y-107876875D01*
X163298427Y-108019732D01*
X162726999Y-108591160D01*
X163346046Y-108591160D01*
G04 #@! TO.C,TP5*
X162004215Y-91232540D02*
X162575643Y-91232540D01*
X162289929Y-92232540D02*
X162289929Y-91232540D01*
X162908977Y-92232540D02*
X162908977Y-91232540D01*
X163289929Y-91232540D01*
X163385167Y-91280160D01*
X163432786Y-91327779D01*
X163480405Y-91423017D01*
X163480405Y-91565874D01*
X163432786Y-91661112D01*
X163385167Y-91708731D01*
X163289929Y-91756350D01*
X162908977Y-91756350D01*
X164385167Y-91232540D02*
X163908977Y-91232540D01*
X163861358Y-91708731D01*
X163908977Y-91661112D01*
X164004215Y-91613493D01*
X164242310Y-91613493D01*
X164337548Y-91661112D01*
X164385167Y-91708731D01*
X164432786Y-91803969D01*
X164432786Y-92042064D01*
X164385167Y-92137302D01*
X164337548Y-92184921D01*
X164242310Y-92232540D01*
X164004215Y-92232540D01*
X163908977Y-92184921D01*
X163861358Y-92137302D01*
G04 #@! TO.C,TP2*
X140063695Y-96934840D02*
X140635123Y-96934840D01*
X140349409Y-97934840D02*
X140349409Y-96934840D01*
X140968457Y-97934840D02*
X140968457Y-96934840D01*
X141349409Y-96934840D01*
X141444647Y-96982460D01*
X141492266Y-97030079D01*
X141539885Y-97125317D01*
X141539885Y-97268174D01*
X141492266Y-97363412D01*
X141444647Y-97411031D01*
X141349409Y-97458650D01*
X140968457Y-97458650D01*
X141920838Y-97030079D02*
X141968457Y-96982460D01*
X142063695Y-96934840D01*
X142301790Y-96934840D01*
X142397028Y-96982460D01*
X142444647Y-97030079D01*
X142492266Y-97125317D01*
X142492266Y-97220555D01*
X142444647Y-97363412D01*
X141873219Y-97934840D01*
X142492266Y-97934840D01*
G04 #@! TO.C,TP3*
X145948095Y-96260380D02*
X146519523Y-96260380D01*
X146233809Y-97260380D02*
X146233809Y-96260380D01*
X146852857Y-97260380D02*
X146852857Y-96260380D01*
X147233809Y-96260380D01*
X147329047Y-96308000D01*
X147376666Y-96355619D01*
X147424285Y-96450857D01*
X147424285Y-96593714D01*
X147376666Y-96688952D01*
X147329047Y-96736571D01*
X147233809Y-96784190D01*
X146852857Y-96784190D01*
X147757619Y-96260380D02*
X148376666Y-96260380D01*
X148043333Y-96641333D01*
X148186190Y-96641333D01*
X148281428Y-96688952D01*
X148329047Y-96736571D01*
X148376666Y-96831809D01*
X148376666Y-97069904D01*
X148329047Y-97165142D01*
X148281428Y-97212761D01*
X148186190Y-97260380D01*
X147900476Y-97260380D01*
X147805238Y-97212761D01*
X147757619Y-97165142D01*
G04 #@! TO.C,TP4*
X151348915Y-99198380D02*
X151920343Y-99198380D01*
X151634629Y-100198380D02*
X151634629Y-99198380D01*
X152253677Y-100198380D02*
X152253677Y-99198380D01*
X152634629Y-99198380D01*
X152729867Y-99246000D01*
X152777486Y-99293619D01*
X152825105Y-99388857D01*
X152825105Y-99531714D01*
X152777486Y-99626952D01*
X152729867Y-99674571D01*
X152634629Y-99722190D01*
X152253677Y-99722190D01*
X153682248Y-99531714D02*
X153682248Y-100198380D01*
X153444153Y-99150761D02*
X153206058Y-99865047D01*
X153825105Y-99865047D01*
G04 #@! TO.C,TP1*
X128847055Y-127201820D02*
X129418483Y-127201820D01*
X129132769Y-128201820D02*
X129132769Y-127201820D01*
X129751817Y-128201820D02*
X129751817Y-127201820D01*
X130132769Y-127201820D01*
X130228007Y-127249440D01*
X130275626Y-127297059D01*
X130323245Y-127392297D01*
X130323245Y-127535154D01*
X130275626Y-127630392D01*
X130228007Y-127678011D01*
X130132769Y-127725630D01*
X129751817Y-127725630D01*
X131275626Y-128201820D02*
X130704198Y-128201820D01*
X130989912Y-128201820D02*
X130989912Y-127201820D01*
X130894674Y-127344678D01*
X130799436Y-127439916D01*
X130704198Y-127487535D01*
G04 #@! TO.C,JP2*
X129654086Y-108653740D02*
X129654086Y-109368026D01*
X129606467Y-109510883D01*
X129511229Y-109606121D01*
X129368372Y-109653740D01*
X129273134Y-109653740D01*
X130130277Y-109653740D02*
X130130277Y-108653740D01*
X130511229Y-108653740D01*
X130606467Y-108701360D01*
X130654086Y-108748979D01*
X130701705Y-108844217D01*
X130701705Y-108987074D01*
X130654086Y-109082312D01*
X130606467Y-109129931D01*
X130511229Y-109177550D01*
X130130277Y-109177550D01*
X131082658Y-108748979D02*
X131130277Y-108701360D01*
X131225515Y-108653740D01*
X131463610Y-108653740D01*
X131558848Y-108701360D01*
X131606467Y-108748979D01*
X131654086Y-108844217D01*
X131654086Y-108939455D01*
X131606467Y-109082312D01*
X131035039Y-109653740D01*
X131654086Y-109653740D01*
G04 #@! TO.C,JP3*
X127034900Y-89602573D02*
X127749186Y-89602573D01*
X127892043Y-89650192D01*
X127987281Y-89745430D01*
X128034900Y-89888287D01*
X128034900Y-89983525D01*
X128034900Y-89126382D02*
X127034900Y-89126382D01*
X127034900Y-88745430D01*
X127082520Y-88650192D01*
X127130139Y-88602573D01*
X127225377Y-88554954D01*
X127368234Y-88554954D01*
X127463472Y-88602573D01*
X127511091Y-88650192D01*
X127558710Y-88745430D01*
X127558710Y-89126382D01*
X127034900Y-88221620D02*
X127034900Y-87602573D01*
X127415853Y-87935906D01*
X127415853Y-87793049D01*
X127463472Y-87697811D01*
X127511091Y-87650192D01*
X127606329Y-87602573D01*
X127844424Y-87602573D01*
X127939662Y-87650192D01*
X127987281Y-87697811D01*
X128034900Y-87793049D01*
X128034900Y-88078763D01*
X127987281Y-88174001D01*
X127939662Y-88221620D01*
G04 #@! TO.C,JP4*
X127034900Y-85168953D02*
X127749186Y-85168953D01*
X127892043Y-85216572D01*
X127987281Y-85311810D01*
X128034900Y-85454667D01*
X128034900Y-85549905D01*
X128034900Y-84692762D02*
X127034900Y-84692762D01*
X127034900Y-84311810D01*
X127082520Y-84216572D01*
X127130139Y-84168953D01*
X127225377Y-84121334D01*
X127368234Y-84121334D01*
X127463472Y-84168953D01*
X127511091Y-84216572D01*
X127558710Y-84311810D01*
X127558710Y-84692762D01*
X127368234Y-83264191D02*
X128034900Y-83264191D01*
X126987281Y-83502286D02*
X127701567Y-83740381D01*
X127701567Y-83121334D01*
G04 #@! TO.C,R5*
X149878753Y-98082340D02*
X149545420Y-97606150D01*
X149307324Y-98082340D02*
X149307324Y-97082340D01*
X149688277Y-97082340D01*
X149783515Y-97129960D01*
X149831134Y-97177579D01*
X149878753Y-97272817D01*
X149878753Y-97415674D01*
X149831134Y-97510912D01*
X149783515Y-97558531D01*
X149688277Y-97606150D01*
X149307324Y-97606150D01*
X150783515Y-97082340D02*
X150307324Y-97082340D01*
X150259705Y-97558531D01*
X150307324Y-97510912D01*
X150402562Y-97463293D01*
X150640658Y-97463293D01*
X150735896Y-97510912D01*
X150783515Y-97558531D01*
X150831134Y-97653769D01*
X150831134Y-97891864D01*
X150783515Y-97987102D01*
X150735896Y-98034721D01*
X150640658Y-98082340D01*
X150402562Y-98082340D01*
X150307324Y-98034721D01*
X150259705Y-97987102D01*
G04 #@! TO.C,R4*
X154223960Y-92544026D02*
X153747770Y-92877360D01*
X154223960Y-93115455D02*
X153223960Y-93115455D01*
X153223960Y-92734502D01*
X153271580Y-92639264D01*
X153319199Y-92591645D01*
X153414437Y-92544026D01*
X153557294Y-92544026D01*
X153652532Y-92591645D01*
X153700151Y-92639264D01*
X153747770Y-92734502D01*
X153747770Y-93115455D01*
X153557294Y-91686883D02*
X154223960Y-91686883D01*
X153176341Y-91924979D02*
X153890627Y-92163074D01*
X153890627Y-91544026D01*
G04 #@! TO.C,R3*
X133012420Y-92249286D02*
X132536230Y-92582620D01*
X133012420Y-92820715D02*
X132012420Y-92820715D01*
X132012420Y-92439762D01*
X132060040Y-92344524D01*
X132107659Y-92296905D01*
X132202897Y-92249286D01*
X132345754Y-92249286D01*
X132440992Y-92296905D01*
X132488611Y-92344524D01*
X132536230Y-92439762D01*
X132536230Y-92820715D01*
X132012420Y-91915953D02*
X132012420Y-91296905D01*
X132393373Y-91630239D01*
X132393373Y-91487381D01*
X132440992Y-91392143D01*
X132488611Y-91344524D01*
X132583849Y-91296905D01*
X132821944Y-91296905D01*
X132917182Y-91344524D01*
X132964801Y-91392143D01*
X133012420Y-91487381D01*
X133012420Y-91773096D01*
X132964801Y-91868334D01*
X132917182Y-91915953D01*
G04 #@! TO.C,R2*
X130244553Y-104419680D02*
X129911220Y-103943490D01*
X129673124Y-104419680D02*
X129673124Y-103419680D01*
X130054077Y-103419680D01*
X130149315Y-103467300D01*
X130196934Y-103514919D01*
X130244553Y-103610157D01*
X130244553Y-103753014D01*
X130196934Y-103848252D01*
X130149315Y-103895871D01*
X130054077Y-103943490D01*
X129673124Y-103943490D01*
X130625505Y-103514919D02*
X130673124Y-103467300D01*
X130768362Y-103419680D01*
X131006458Y-103419680D01*
X131101696Y-103467300D01*
X131149315Y-103514919D01*
X131196934Y-103610157D01*
X131196934Y-103705395D01*
X131149315Y-103848252D01*
X130577886Y-104419680D01*
X131196934Y-104419680D01*
G04 #@! TO.C,R1*
X130310593Y-102634060D02*
X129977260Y-102157870D01*
X129739164Y-102634060D02*
X129739164Y-101634060D01*
X130120117Y-101634060D01*
X130215355Y-101681680D01*
X130262974Y-101729299D01*
X130310593Y-101824537D01*
X130310593Y-101967394D01*
X130262974Y-102062632D01*
X130215355Y-102110251D01*
X130120117Y-102157870D01*
X129739164Y-102157870D01*
X131262974Y-102634060D02*
X130691545Y-102634060D01*
X130977260Y-102634060D02*
X130977260Y-101634060D01*
X130882021Y-101776918D01*
X130786783Y-101872156D01*
X130691545Y-101919775D01*
G04 #@! TO.C,R8*
X154984253Y-97223860D02*
X154650920Y-96747670D01*
X154412824Y-97223860D02*
X154412824Y-96223860D01*
X154793777Y-96223860D01*
X154889015Y-96271480D01*
X154936634Y-96319099D01*
X154984253Y-96414337D01*
X154984253Y-96557194D01*
X154936634Y-96652432D01*
X154889015Y-96700051D01*
X154793777Y-96747670D01*
X154412824Y-96747670D01*
X155555681Y-96652432D02*
X155460443Y-96604813D01*
X155412824Y-96557194D01*
X155365205Y-96461956D01*
X155365205Y-96414337D01*
X155412824Y-96319099D01*
X155460443Y-96271480D01*
X155555681Y-96223860D01*
X155746158Y-96223860D01*
X155841396Y-96271480D01*
X155889015Y-96319099D01*
X155936634Y-96414337D01*
X155936634Y-96461956D01*
X155889015Y-96557194D01*
X155841396Y-96604813D01*
X155746158Y-96652432D01*
X155555681Y-96652432D01*
X155460443Y-96700051D01*
X155412824Y-96747670D01*
X155365205Y-96842908D01*
X155365205Y-97033384D01*
X155412824Y-97128622D01*
X155460443Y-97176241D01*
X155555681Y-97223860D01*
X155746158Y-97223860D01*
X155841396Y-97176241D01*
X155889015Y-97128622D01*
X155936634Y-97033384D01*
X155936634Y-96842908D01*
X155889015Y-96747670D01*
X155841396Y-96700051D01*
X155746158Y-96652432D01*
G04 #@! TO.C,R9*
X158742380Y-95984166D02*
X158266190Y-96317500D01*
X158742380Y-96555595D02*
X157742380Y-96555595D01*
X157742380Y-96174642D01*
X157790000Y-96079404D01*
X157837619Y-96031785D01*
X157932857Y-95984166D01*
X158075714Y-95984166D01*
X158170952Y-96031785D01*
X158218571Y-96079404D01*
X158266190Y-96174642D01*
X158266190Y-96555595D01*
X158742380Y-95507976D02*
X158742380Y-95317500D01*
X158694761Y-95222261D01*
X158647142Y-95174642D01*
X158504285Y-95079404D01*
X158313809Y-95031785D01*
X157932857Y-95031785D01*
X157837619Y-95079404D01*
X157790000Y-95127023D01*
X157742380Y-95222261D01*
X157742380Y-95412738D01*
X157790000Y-95507976D01*
X157837619Y-95555595D01*
X157932857Y-95603214D01*
X158170952Y-95603214D01*
X158266190Y-95555595D01*
X158313809Y-95507976D01*
X158361428Y-95412738D01*
X158361428Y-95222261D01*
X158313809Y-95127023D01*
X158266190Y-95079404D01*
X158170952Y-95031785D01*
G04 #@! TO.C,U3*
X136083135Y-98505720D02*
X136083135Y-99315244D01*
X136130754Y-99410482D01*
X136178373Y-99458101D01*
X136273611Y-99505720D01*
X136464087Y-99505720D01*
X136559325Y-99458101D01*
X136606944Y-99410482D01*
X136654563Y-99315244D01*
X136654563Y-98505720D01*
X137035516Y-98505720D02*
X137654563Y-98505720D01*
X137321230Y-98886673D01*
X137464087Y-98886673D01*
X137559325Y-98934292D01*
X137606944Y-98981911D01*
X137654563Y-99077149D01*
X137654563Y-99315244D01*
X137606944Y-99410482D01*
X137559325Y-99458101D01*
X137464087Y-99505720D01*
X137178373Y-99505720D01*
X137083135Y-99458101D01*
X137035516Y-99410482D01*
G04 #@! TO.C,L2*
X152688020Y-93278026D02*
X152688020Y-93754217D01*
X151688020Y-93754217D01*
X151783259Y-92992312D02*
X151735640Y-92944693D01*
X151688020Y-92849455D01*
X151688020Y-92611360D01*
X151735640Y-92516121D01*
X151783259Y-92468502D01*
X151878497Y-92420883D01*
X151973735Y-92420883D01*
X152116592Y-92468502D01*
X152688020Y-93039931D01*
X152688020Y-92420883D01*
G04 #@! TO.C,L1*
X144504113Y-94012380D02*
X144027922Y-94012380D01*
X144027922Y-93012380D01*
X145361256Y-94012380D02*
X144789827Y-94012380D01*
X145075541Y-94012380D02*
X145075541Y-93012380D01*
X144980303Y-93155238D01*
X144885065Y-93250476D01*
X144789827Y-93298095D01*
G04 #@! TO.C,C2*
X130049562Y-95312526D02*
X130097181Y-95360145D01*
X130144800Y-95503002D01*
X130144800Y-95598240D01*
X130097181Y-95741098D01*
X130001943Y-95836336D01*
X129906705Y-95883955D01*
X129716229Y-95931574D01*
X129573372Y-95931574D01*
X129382896Y-95883955D01*
X129287658Y-95836336D01*
X129192420Y-95741098D01*
X129144800Y-95598240D01*
X129144800Y-95503002D01*
X129192420Y-95360145D01*
X129240039Y-95312526D01*
X129240039Y-94931574D02*
X129192420Y-94883955D01*
X129144800Y-94788717D01*
X129144800Y-94550621D01*
X129192420Y-94455383D01*
X129240039Y-94407764D01*
X129335277Y-94360145D01*
X129430515Y-94360145D01*
X129573372Y-94407764D01*
X130144800Y-94979193D01*
X130144800Y-94360145D01*
G04 #@! TO.C,C3*
X138321753Y-98131922D02*
X138274134Y-98179541D01*
X138131277Y-98227160D01*
X138036039Y-98227160D01*
X137893181Y-98179541D01*
X137797943Y-98084303D01*
X137750324Y-97989065D01*
X137702705Y-97798589D01*
X137702705Y-97655732D01*
X137750324Y-97465256D01*
X137797943Y-97370018D01*
X137893181Y-97274780D01*
X138036039Y-97227160D01*
X138131277Y-97227160D01*
X138274134Y-97274780D01*
X138321753Y-97322399D01*
X138655086Y-97227160D02*
X139274134Y-97227160D01*
X138940800Y-97608113D01*
X139083658Y-97608113D01*
X139178896Y-97655732D01*
X139226515Y-97703351D01*
X139274134Y-97798589D01*
X139274134Y-98036684D01*
X139226515Y-98131922D01*
X139178896Y-98179541D01*
X139083658Y-98227160D01*
X138797943Y-98227160D01*
X138702705Y-98179541D01*
X138655086Y-98131922D01*
G04 #@! TO.C,C4*
X139555833Y-90317142D02*
X139508214Y-90364761D01*
X139365357Y-90412380D01*
X139270119Y-90412380D01*
X139127261Y-90364761D01*
X139032023Y-90269523D01*
X138984404Y-90174285D01*
X138936785Y-89983809D01*
X138936785Y-89840952D01*
X138984404Y-89650476D01*
X139032023Y-89555238D01*
X139127261Y-89460000D01*
X139270119Y-89412380D01*
X139365357Y-89412380D01*
X139508214Y-89460000D01*
X139555833Y-89507619D01*
X140412976Y-89745714D02*
X140412976Y-90412380D01*
X140174880Y-89364761D02*
X139936785Y-90079047D01*
X140555833Y-90079047D01*
G04 #@! TO.C,C5*
X141347142Y-94416666D02*
X141394761Y-94464285D01*
X141442380Y-94607142D01*
X141442380Y-94702380D01*
X141394761Y-94845238D01*
X141299523Y-94940476D01*
X141204285Y-94988095D01*
X141013809Y-95035714D01*
X140870952Y-95035714D01*
X140680476Y-94988095D01*
X140585238Y-94940476D01*
X140490000Y-94845238D01*
X140442380Y-94702380D01*
X140442380Y-94607142D01*
X140490000Y-94464285D01*
X140537619Y-94416666D01*
X140442380Y-93511904D02*
X140442380Y-93988095D01*
X140918571Y-94035714D01*
X140870952Y-93988095D01*
X140823333Y-93892857D01*
X140823333Y-93654761D01*
X140870952Y-93559523D01*
X140918571Y-93511904D01*
X141013809Y-93464285D01*
X141251904Y-93464285D01*
X141347142Y-93511904D01*
X141394761Y-93559523D01*
X141442380Y-93654761D01*
X141442380Y-93892857D01*
X141394761Y-93988095D01*
X141347142Y-94035714D01*
G04 #@! TO.C,C6*
X131753902Y-93775826D02*
X131801521Y-93823445D01*
X131849140Y-93966302D01*
X131849140Y-94061540D01*
X131801521Y-94204398D01*
X131706283Y-94299636D01*
X131611045Y-94347255D01*
X131420569Y-94394874D01*
X131277712Y-94394874D01*
X131087236Y-94347255D01*
X130991998Y-94299636D01*
X130896760Y-94204398D01*
X130849140Y-94061540D01*
X130849140Y-93966302D01*
X130896760Y-93823445D01*
X130944379Y-93775826D01*
X130849140Y-92918683D02*
X130849140Y-93109160D01*
X130896760Y-93204398D01*
X130944379Y-93252017D01*
X131087236Y-93347255D01*
X131277712Y-93394874D01*
X131658664Y-93394874D01*
X131753902Y-93347255D01*
X131801521Y-93299636D01*
X131849140Y-93204398D01*
X131849140Y-93013921D01*
X131801521Y-92918683D01*
X131753902Y-92871064D01*
X131658664Y-92823445D01*
X131420569Y-92823445D01*
X131325331Y-92871064D01*
X131277712Y-92918683D01*
X131230093Y-93013921D01*
X131230093Y-93204398D01*
X131277712Y-93299636D01*
X131325331Y-93347255D01*
X131420569Y-93394874D01*
G04 #@! TO.C,C7*
X135655833Y-90287142D02*
X135608214Y-90334761D01*
X135465357Y-90382380D01*
X135370119Y-90382380D01*
X135227261Y-90334761D01*
X135132023Y-90239523D01*
X135084404Y-90144285D01*
X135036785Y-89953809D01*
X135036785Y-89810952D01*
X135084404Y-89620476D01*
X135132023Y-89525238D01*
X135227261Y-89430000D01*
X135370119Y-89382380D01*
X135465357Y-89382380D01*
X135608214Y-89430000D01*
X135655833Y-89477619D01*
X135989166Y-89382380D02*
X136655833Y-89382380D01*
X136227261Y-90382380D01*
G04 #@! TO.C,C8*
X139807142Y-94416666D02*
X139854761Y-94464285D01*
X139902380Y-94607142D01*
X139902380Y-94702380D01*
X139854761Y-94845238D01*
X139759523Y-94940476D01*
X139664285Y-94988095D01*
X139473809Y-95035714D01*
X139330952Y-95035714D01*
X139140476Y-94988095D01*
X139045238Y-94940476D01*
X138950000Y-94845238D01*
X138902380Y-94702380D01*
X138902380Y-94607142D01*
X138950000Y-94464285D01*
X138997619Y-94416666D01*
X139330952Y-93845238D02*
X139283333Y-93940476D01*
X139235714Y-93988095D01*
X139140476Y-94035714D01*
X139092857Y-94035714D01*
X138997619Y-93988095D01*
X138950000Y-93940476D01*
X138902380Y-93845238D01*
X138902380Y-93654761D01*
X138950000Y-93559523D01*
X138997619Y-93511904D01*
X139092857Y-93464285D01*
X139140476Y-93464285D01*
X139235714Y-93511904D01*
X139283333Y-93559523D01*
X139330952Y-93654761D01*
X139330952Y-93845238D01*
X139378571Y-93940476D01*
X139426190Y-93988095D01*
X139521428Y-94035714D01*
X139711904Y-94035714D01*
X139807142Y-93988095D01*
X139854761Y-93940476D01*
X139902380Y-93845238D01*
X139902380Y-93654761D01*
X139854761Y-93559523D01*
X139807142Y-93511904D01*
X139711904Y-93464285D01*
X139521428Y-93464285D01*
X139426190Y-93511904D01*
X139378571Y-93559523D01*
X139330952Y-93654761D01*
G04 #@! TO.C,C9*
X145195833Y-95257142D02*
X145148214Y-95304761D01*
X145005357Y-95352380D01*
X144910119Y-95352380D01*
X144767261Y-95304761D01*
X144672023Y-95209523D01*
X144624404Y-95114285D01*
X144576785Y-94923809D01*
X144576785Y-94780952D01*
X144624404Y-94590476D01*
X144672023Y-94495238D01*
X144767261Y-94400000D01*
X144910119Y-94352380D01*
X145005357Y-94352380D01*
X145148214Y-94400000D01*
X145195833Y-94447619D01*
X145672023Y-95352380D02*
X145862500Y-95352380D01*
X145957738Y-95304761D01*
X146005357Y-95257142D01*
X146100595Y-95114285D01*
X146148214Y-94923809D01*
X146148214Y-94542857D01*
X146100595Y-94447619D01*
X146052976Y-94400000D01*
X145957738Y-94352380D01*
X145767261Y-94352380D01*
X145672023Y-94400000D01*
X145624404Y-94447619D01*
X145576785Y-94542857D01*
X145576785Y-94780952D01*
X145624404Y-94876190D01*
X145672023Y-94923809D01*
X145767261Y-94971428D01*
X145957738Y-94971428D01*
X146052976Y-94923809D01*
X146100595Y-94876190D01*
X146148214Y-94780952D01*
G04 #@! TO.C,C10*
X154017742Y-90555102D02*
X153970123Y-90602721D01*
X153827266Y-90650340D01*
X153732028Y-90650340D01*
X153589171Y-90602721D01*
X153493933Y-90507483D01*
X153446314Y-90412245D01*
X153398695Y-90221769D01*
X153398695Y-90078912D01*
X153446314Y-89888436D01*
X153493933Y-89793198D01*
X153589171Y-89697960D01*
X153732028Y-89650340D01*
X153827266Y-89650340D01*
X153970123Y-89697960D01*
X154017742Y-89745579D01*
X154970123Y-90650340D02*
X154398695Y-90650340D01*
X154684409Y-90650340D02*
X154684409Y-89650340D01*
X154589171Y-89793198D01*
X154493933Y-89888436D01*
X154398695Y-89936055D01*
X155589171Y-89650340D02*
X155684409Y-89650340D01*
X155779647Y-89697960D01*
X155827266Y-89745579D01*
X155874885Y-89840817D01*
X155922504Y-90031293D01*
X155922504Y-90269388D01*
X155874885Y-90459864D01*
X155827266Y-90555102D01*
X155779647Y-90602721D01*
X155684409Y-90650340D01*
X155589171Y-90650340D01*
X155493933Y-90602721D01*
X155446314Y-90555102D01*
X155398695Y-90459864D01*
X155351076Y-90269388D01*
X155351076Y-90031293D01*
X155398695Y-89840817D01*
X155446314Y-89745579D01*
X155493933Y-89697960D01*
X155589171Y-89650340D01*
G04 #@! TO.C,C11*
X154007582Y-92074022D02*
X153959963Y-92121641D01*
X153817106Y-92169260D01*
X153721868Y-92169260D01*
X153579011Y-92121641D01*
X153483773Y-92026403D01*
X153436154Y-91931165D01*
X153388535Y-91740689D01*
X153388535Y-91597832D01*
X153436154Y-91407356D01*
X153483773Y-91312118D01*
X153579011Y-91216880D01*
X153721868Y-91169260D01*
X153817106Y-91169260D01*
X153959963Y-91216880D01*
X154007582Y-91264499D01*
X154959963Y-92169260D02*
X154388535Y-92169260D01*
X154674249Y-92169260D02*
X154674249Y-91169260D01*
X154579011Y-91312118D01*
X154483773Y-91407356D01*
X154388535Y-91454975D01*
X155912344Y-92169260D02*
X155340916Y-92169260D01*
X155626630Y-92169260D02*
X155626630Y-91169260D01*
X155531392Y-91312118D01*
X155436154Y-91407356D01*
X155340916Y-91454975D01*
G04 #@! TO.C,C12*
X148835362Y-98572557D02*
X148882981Y-98620176D01*
X148930600Y-98763033D01*
X148930600Y-98858271D01*
X148882981Y-99001128D01*
X148787743Y-99096366D01*
X148692505Y-99143985D01*
X148502029Y-99191604D01*
X148359172Y-99191604D01*
X148168696Y-99143985D01*
X148073458Y-99096366D01*
X147978220Y-99001128D01*
X147930600Y-98858271D01*
X147930600Y-98763033D01*
X147978220Y-98620176D01*
X148025839Y-98572557D01*
X148930600Y-97620176D02*
X148930600Y-98191604D01*
X148930600Y-97905890D02*
X147930600Y-97905890D01*
X148073458Y-98001128D01*
X148168696Y-98096366D01*
X148216315Y-98191604D01*
X148025839Y-97239223D02*
X147978220Y-97191604D01*
X147930600Y-97096366D01*
X147930600Y-96858271D01*
X147978220Y-96763033D01*
X148025839Y-96715414D01*
X148121077Y-96667795D01*
X148216315Y-96667795D01*
X148359172Y-96715414D01*
X148930600Y-97286842D01*
X148930600Y-96667795D01*
G04 #@! TO.C,C1*
X128472222Y-95299826D02*
X128519841Y-95347445D01*
X128567460Y-95490302D01*
X128567460Y-95585540D01*
X128519841Y-95728398D01*
X128424603Y-95823636D01*
X128329365Y-95871255D01*
X128138889Y-95918874D01*
X127996032Y-95918874D01*
X127805556Y-95871255D01*
X127710318Y-95823636D01*
X127615080Y-95728398D01*
X127567460Y-95585540D01*
X127567460Y-95490302D01*
X127615080Y-95347445D01*
X127662699Y-95299826D01*
X128567460Y-94347445D02*
X128567460Y-94918874D01*
X128567460Y-94633160D02*
X127567460Y-94633160D01*
X127710318Y-94728398D01*
X127805556Y-94823636D01*
X127853175Y-94918874D01*
G04 #@! TO.C,RV1*
X160824761Y-94052380D02*
X160491428Y-93576190D01*
X160253333Y-94052380D02*
X160253333Y-93052380D01*
X160634285Y-93052380D01*
X160729523Y-93100000D01*
X160777142Y-93147619D01*
X160824761Y-93242857D01*
X160824761Y-93385714D01*
X160777142Y-93480952D01*
X160729523Y-93528571D01*
X160634285Y-93576190D01*
X160253333Y-93576190D01*
X161110476Y-93052380D02*
X161443809Y-94052380D01*
X161777142Y-93052380D01*
X162634285Y-94052380D02*
X162062857Y-94052380D01*
X162348571Y-94052380D02*
X162348571Y-93052380D01*
X162253333Y-93195238D01*
X162158095Y-93290476D01*
X162062857Y-93338095D01*
G04 #@! TO.C,U2*
X146351380Y-98767804D02*
X147160904Y-98767804D01*
X147256142Y-98720185D01*
X147303761Y-98672566D01*
X147351380Y-98577328D01*
X147351380Y-98386852D01*
X147303761Y-98291614D01*
X147256142Y-98243995D01*
X147160904Y-98196376D01*
X146351380Y-98196376D01*
X146446619Y-97767804D02*
X146399000Y-97720185D01*
X146351380Y-97624947D01*
X146351380Y-97386852D01*
X146399000Y-97291614D01*
X146446619Y-97243995D01*
X146541857Y-97196376D01*
X146637095Y-97196376D01*
X146779952Y-97243995D01*
X147351380Y-97815423D01*
X147351380Y-97196376D01*
G04 #@! TO.C,U4*
X153093735Y-97563740D02*
X153093735Y-98373264D01*
X153141354Y-98468502D01*
X153188973Y-98516121D01*
X153284211Y-98563740D01*
X153474687Y-98563740D01*
X153569925Y-98516121D01*
X153617544Y-98468502D01*
X153665163Y-98373264D01*
X153665163Y-97563740D01*
X154569925Y-97897074D02*
X154569925Y-98563740D01*
X154331830Y-97516121D02*
X154093735Y-98230407D01*
X154712782Y-98230407D01*
G04 #@! TD*
M02*
