{
    "host": "http://0.0.0.0",
    "port": 8080,
    "data": "./data",
    "database": { "type": "postgres" },
    "debuglevel": "trace",
    "authentication": "Token",
    "whitelist": ["http://localhost:8080"],
    "externalBaseUrl":"http://localhost:8080/api",
    "maptilerKey":"seeeeecret",
    "mainWebClientUrl": "http://localhost:8081",
    "publicItemsOutsidePlatform":false
  }