{
  "settings":{
    "type":"object",
    "title":"Sound Settings",
    "properties":{
    }
  },
  "actions":{
    "play":{
      "type":"object",
      "title":"Play",
      "mode":"listen",
      "description":"Play one or more Audio Tracks.",
      "documentation":"https://docs.adaptorex.org/basics/actions/sound/play.html",
      "required":["tracks"],
      "additionalProperties": false,
      "properties":{
        "tracks":{
          "type":"array",
          "format":"table",
          "default":[""],
          "items":{"$ref":"#/definitions/files","title":"track"}
        },
        "loop":{
          "type":"integer",
          "description":"Repeat playing track or tracks multiple times. Set to -1 to repeat infinite.",
          "minimum":-1
        },
        "next":{"$ref":"#/definitions/next"}
      }
    }
  }
}
