\BOOKMARK [1][-]{section.1}{Introdu\347\343o}{}% 1
\BOOKMARK [1][-]{section.2}{Tipos}{}% 2
\BOOKMARK [1][-]{section.3}{Descri\347\343o do Problema}{}% 3
\BOOKMARK [2][-]{subsection.3.1}{Objetivo}{section.3}% 4
\BOOKMARK [3][-]{subsubsection.3.1.1}{1\252 Fase}{subsection.3.1}% 5
\BOOKMARK [3][-]{subsubsection.3.1.2}{2\252 Fase}{subsection.3.1}% 6
\BOOKMARK [2][-]{subsection.3.2}{Dificuldades}{section.3}% 7
\BOOKMARK [3][-]{subsubsection.3.2.1}{1\252 Fase}{subsection.3.2}% 8
\BOOKMARK [3][-]{subsubsection.3.2.2}{2\252 Fase}{subsection.3.2}% 9
\BOOKMARK [1][-]{section.4}{Concep\347\343o da Solu\347\343o}{}% 10
\BOOKMARK [2][-]{subsection.4.1}{Tarefa 1}{section.4}% 11
\BOOKMARK [2][-]{subsection.4.2}{Tarefa 2}{section.4}% 12
\BOOKMARK [2][-]{subsection.4.3}{Tarefa 3}{section.4}% 13
\BOOKMARK [2][-]{subsection.4.4}{Tarefa 4}{section.4}% 14
\BOOKMARK [3][-]{subsubsection.4.4.1}{Passagem de tempo e explos\365es de bombas}{subsection.4.4}% 15
\BOOKMARK [3][-]{subsubsection.4.4.2}{Espiral}{subsection.4.4}% 16
\BOOKMARK [2][-]{subsection.4.5}{Tarefa 5}{section.4}% 17
\BOOKMARK [3][-]{subsubsection.4.5.1}{Estruturas de Dados}{subsection.4.5}% 18
\BOOKMARK [3][-]{subsubsection.4.5.2}{Implementa\347\343o}{subsection.4.5}% 19
\BOOKMARK [3][-]{subsubsection.4.5.3}{Testes}{subsection.4.5}% 20
\BOOKMARK [2][-]{subsection.4.6}{Tarefa 6}{section.4}% 21
\BOOKMARK [3][-]{subsubsection.4.6.1}{Estrat\351gia de Combate}{subsection.4.6}% 22
\BOOKMARK [3][-]{subsubsection.4.6.2}{An\341lise de Vari\341veis}{subsection.4.6}% 23
\BOOKMARK [3][-]{subsubsection.4.6.3}{Implementa\347\343o}{subsection.4.6}% 24
\BOOKMARK [1][-]{section.5}{Resultados}{}% 25
\BOOKMARK [2][-]{subsection.5.1}{Tarefa 1}{section.5}% 26
\BOOKMARK [2][-]{subsection.5.2}{Tarefa 2}{section.5}% 27
\BOOKMARK [2][-]{subsection.5.3}{Tarefa 3}{section.5}% 28
\BOOKMARK [2][-]{subsection.5.4}{Tarefa 4}{section.5}% 29
\BOOKMARK [2][-]{subsection.5.5}{Tarefa 5}{section.5}% 30
\BOOKMARK [2][-]{subsection.5.6}{Tarefa 6}{section.5}% 31
\BOOKMARK [1][-]{section.6}{An\341lise}{}% 32
\BOOKMARK [1][-]{section.7}{Conclus\365es}{}% 33
