\relax 
\providecommand\hyper@newdestlabel[2]{}
\catcode `"\active 
\providecommand\HyperFirstAtBeginDocument{\AtBeginDocument}
\HyperFirstAtBeginDocument{\ifx\hyper@anchor\@undefined
\global\let\oldcontentsline\contentsline
\gdef\contentsline#1#2#3#4{\oldcontentsline{#1}{#2}{#3}}
\global\let\oldnewlabel\newlabel
\gdef\newlabel#1#2{\newlabelxx{#1}#2}
\gdef\newlabelxx#1#2#3#4#5#6{\oldnewlabel{#1}{{#2}{#3}}}
\AtEndDocument{\ifx\hyper@anchor\@undefined
\let\contentsline\oldcontentsline
\let\newlabel\oldnewlabel
\fi}
\fi}
\global\let\hyper@last\relax 
\gdef\HyperFirstAtBeginDocument#1{#1}
\providecommand\HyField@AuxAddToFields[1]{}
\providecommand\HyField@AuxAddToCoFields[2]{}
\select@language{portuges}
\@writefile{toc}{\select@language{portuges}}
\@writefile{lof}{\select@language{portuges}}
\@writefile{lot}{\select@language{portuges}}
\@writefile{toc}{\contentsline {section}{\numberline {1}Introdu\IeC {\c c}\IeC {\~a}o}{3}{section.1}}
\newlabel{sec:intro}{{1}{3}{Introdução}{section.1}{}}
\@writefile{toc}{\contentsline {section}{\numberline {2}Tipos}{4}{section.2}}
\@writefile{toc}{\contentsline {section}{\numberline {3}Descri\IeC {\c c}\IeC {\~a}o do Problema}{5}{section.3}}
\newlabel{sec:problema}{{3}{5}{Descrição do Problema}{section.3}{}}
\@writefile{toc}{\contentsline {subsection}{\numberline {3.1}Objetivo}{5}{subsection.3.1}}
\@writefile{toc}{\contentsline {subsubsection}{\numberline {3.1.1}1\IeC {\textordfeminine } Fase}{5}{subsubsection.3.1.1}}
\@writefile{toc}{\contentsline {subsubsection}{\numberline {3.1.2}2\IeC {\textordfeminine } Fase}{5}{subsubsection.3.1.2}}
\@writefile{toc}{\contentsline {subsection}{\numberline {3.2}Dificuldades}{6}{subsection.3.2}}
\@writefile{toc}{\contentsline {subsubsection}{\numberline {3.2.1}1\IeC {\textordfeminine } Fase}{6}{subsubsection.3.2.1}}
\@writefile{toc}{\contentsline {subsubsection}{\numberline {3.2.2}2\IeC {\textordfeminine } Fase}{6}{subsubsection.3.2.2}}
\@writefile{toc}{\contentsline {section}{\numberline {4}Concep\IeC {\c c}\IeC {\~a}o da Solu\IeC {\c c}\IeC {\~a}o}{7}{section.4}}
\newlabel{sec:solucao}{{4}{7}{Concepção da Solução}{section.4}{}}
\@writefile{toc}{\contentsline {subsection}{\numberline {4.1}Tarefa 1}{7}{subsection.4.1}}
\@writefile{toc}{\contentsline {subsection}{\numberline {4.2}Tarefa 2}{7}{subsection.4.2}}
\@writefile{toc}{\contentsline {subsection}{\numberline {4.3}Tarefa 3}{8}{subsection.4.3}}
\@writefile{toc}{\contentsline {subsection}{\numberline {4.4}Tarefa 4}{9}{subsection.4.4}}
\@writefile{toc}{\contentsline {subsubsection}{\numberline {4.4.1}Passagem de tempo e explos\IeC {\~o}es de bombas}{9}{subsubsection.4.4.1}}
\@writefile{toc}{\contentsline {subsubsection}{\numberline {4.4.2}Espiral}{9}{subsubsection.4.4.2}}
\@writefile{toc}{\contentsline {subsection}{\numberline {4.5}Tarefa 5}{11}{subsection.4.5}}
\@writefile{toc}{\contentsline {subsubsection}{\numberline {4.5.1}Estruturas de Dados}{11}{subsubsection.4.5.1}}
\@writefile{toc}{\contentsline {subsubsection}{\numberline {4.5.2}Implementa\IeC {\c c}\IeC {\~a}o}{11}{subsubsection.4.5.2}}
\@writefile{toc}{\contentsline {subsubsection}{\numberline {4.5.3}Testes}{12}{subsubsection.4.5.3}}
\@writefile{toc}{\contentsline {subsection}{\numberline {4.6}Tarefa 6}{13}{subsection.4.6}}
\@writefile{toc}{\contentsline {subsubsection}{\numberline {4.6.1}Estrat\IeC {\'e}gia de Combate}{13}{subsubsection.4.6.1}}
\@writefile{toc}{\contentsline {subsubsection}{\numberline {4.6.2}An\IeC {\'a}lise de Vari\IeC {\'a}veis}{13}{subsubsection.4.6.2}}
\@writefile{toc}{\contentsline {subsubsection}{\numberline {4.6.3}Implementa\IeC {\c c}\IeC {\~a}o}{13}{subsubsection.4.6.3}}
\@writefile{toc}{\contentsline {section}{\numberline {5}Resultados}{14}{section.5}}
\newlabel{sec:problema}{{5}{14}{Resultados}{section.5}{}}
\@writefile{toc}{\contentsline {subsection}{\numberline {5.1}Tarefa 1}{14}{subsection.5.1}}
\@writefile{toc}{\contentsline {subsection}{\numberline {5.2}Tarefa 2}{14}{subsection.5.2}}
\@writefile{toc}{\contentsline {subsection}{\numberline {5.3}Tarefa 3}{15}{subsection.5.3}}
\@writefile{toc}{\contentsline {subsection}{\numberline {5.4}Tarefa 4}{16}{subsection.5.4}}
\@writefile{toc}{\contentsline {subsection}{\numberline {5.5}Tarefa 5}{17}{subsection.5.5}}
\@writefile{lof}{\contentsline {figure}{\numberline {1}{\ignorespaces Momento Incial de Jogo}}{17}{figure.1}}
\newlabel{img:bomberman}{{1}{17}{Momento Incial de Jogo}{figure.1}{}}
\@writefile{toc}{\contentsline {subsection}{\numberline {5.6}Tarefa 6}{18}{subsection.5.6}}
\newlabel{rt6}{{5.6}{18}{Tarefa 6}{subsection.5.6}{}}
\@writefile{lof}{\contentsline {figure}{\numberline {2}{\ignorespaces Combate entre \textit  {bot}'s de 4 grupos}}{18}{figure.2}}
\newlabel{img:bot}{{2}{18}{Combate entre \textit {bot}'s de 4 grupos}{figure.2}{}}
\@writefile{toc}{\contentsline {section}{\numberline {6}An\IeC {\'a}lise}{19}{section.6}}
\newlabel{sec:problema}{{6}{19}{Análise}{section.6}{}}
\@writefile{toc}{\contentsline {section}{\numberline {7}Conclus\IeC {\~o}es}{20}{section.7}}
\newlabel{sec:conclusao}{{7}{20}{Conclusões}{section.7}{}}
