Place,Name,Sex,BirthDate,Equipment,Division,BodyweightKg,WeightClassKg,Squat1Kg,Squat2Kg,Squat3Kg,Best3SquatKg,Bench1Kg,Bench2Kg,Bench3Kg,Best3BenchKg,Deadlift1Kg,Deadlift2Kg,Deadlift3Kg,Best3DeadliftKg,TotalKg,Event
1,Rebecca Heath #1,F,,Raw,FR-O,46.3,47,100,105,110,110,57.5,62.5,,62.5,112.5,122.5,130,130,302.5,SBD
1,Alison Benjamin,F,,Raw,FR-O,50.1,52,60,62.5,67.5,67.5,32.5,35,37.5,37.5,75,80,-85,80,185,SBD
1,Yana,F,,Raw,FR-O,55.4,57,130,135,140,140,60,65,-67.5,65,130,140,-152.5,140,345,SBD
2,Pru Mowbray,F,,Raw,FR-O,56.4,57,100,110,-115,110,57.5,62.5,-65,62.5,120,127.5,135,135,307.5,SBD
3,Yuanyuan Pao,F,,Raw,FR-O,56.9,57,85,90,95,95,55,-60,-60,55,95,105,115,115,265,SBD
1,Katie Hall,F,,Raw,FR-O,61.5,63,115,125,130,130,72.5,77.5,-80,77.5,130,140,145,145,352.5,SBD
2,Lara Oliver-Tomic,F,,Raw,FR-O,62.3,63,115,117.5,122.5,122.5,55,60,-65,60,132.5,140,-145,140,322.5,SBD
3,Marta Lesina,F,,Raw,FR-O,63,63,92.5,-97.5,100,100,57.5,-62.5,65,65,115,120,125,125,290,SBD
4,Elisabetta Conradi,F,,Raw,FR-O,61.6,63,82.5,90,95,95,50,55,57.5,57.5,100,110,115,115,267.5,SBD
5,Shana Brooks,F,,Raw,FR-O,62.2,63,82.5,87.5,92.5,92.5,35,40,45,45,97.5,105,112.5,112.5,250,SBD
1,Dami Howells,F,,Raw,FR-O,68.9,69,155,165,172.5,172.5,55,62.5,-67.5,62.5,170,185,192.5,192.5,427.5,SBD
2,Hannah Middlebrook,F,,Raw,FR-O,68.6,69,115,122.5,125,125,60,65,67.5,67.5,147.5,155,160,160,352.5,SBD
3,Eleanor Smith,F,,Raw,FR-O,68.3,69,117.5,125,132.5,132.5,60,-62.5,-62.5,60,132.5,145,147.5,147.5,340,SBD
4,Rashara Harewood,F,,Raw,FR-O,68.1,69,102.5,110,117.5,117.5,45,52.5,-60,52.5,127.5,137.5,147.5,147.5,317.5,SBD
5,Alexandra Dima,F,,Raw,FR-O,66.4,69,105,110,112.5,112.5,62.5,-65,-67.5,62.5,115,125,-130,125,300,SBD
DQ,Claire Yates,F,,Raw,FR-O,68,69,-77.5,-77.5,-77.5,,45,-47.5,47.5,47.5,80,92.5,100,100,,SBD
1,Izzy Fakkel,F,,Raw,FR-O,71.7,76,115,122.5,127.5,127.5,65,-70,-70,65,152.5,162.5,172.5,172.5,365,SBD
2,Annabel Barr,F,,Raw,FR-O,73.8,76,117.5,125,132.5,132.5,65,70,75,75,132.5,142.5,152.5,152.5,360,SBD
3,Patricia Meana Saez,F,,Raw,FR-O,75.5,76,100,110,115,115,62.5,70,75,75,130,140,150,150,340,SBD
4,Yunia Maalo,F,,Raw,FR-O,72.8,76,105,115,120,120,47.5,52.5,-55,52.5,130,145,160,160,332.5,SBD
5,Sajanee Samuel,F,,Raw,FR-O,70.6,76,100,107.5,-115,107.5,-55,57.5,-60,57.5,140,150,160,160,325,SBD
6,Rianne Mccartney,F,,Raw,FR-O,74.4,76,100,110,-120,110,50,55,60,60,125,132.5,145,145,315,SBD
7,Praveeta Thayalan,F,,Raw,FR-O,71.6,76,92.5,97.5,100,100,57.5,-60,-60,57.5,125,135,-142.5,135,292.5,SBD
8,Khadija Kachra,F,,Raw,FR-O,71.5,76,97.5,100,110,110,55,60,-65,60,107.5,115,120,120,290,SBD
9,Erica Goh,F,,Raw,FR-O,72.4,76,105,110,115,115,37.5,-40,-40,37.5,115,122.5,132.5,132.5,285,SBD
1,Klara Boudova,F,,Raw,FR-O,81.9,84,120,130,140,140,60,70,-77.5,70,140,147.5,152.5,152.5,362.5,SBD
2,Marianne Lound-McGowan,F,,Raw,FR-O,82.3,84,112.5,120,125,125,62.5,67.5,-70,67.5,130,137.5,142.5,142.5,335,SBD
3,Greta Galimberti,F,,Raw,FR-O,80.9,84,95,100,-105,100,57.5,60,-62.5,60,115,120,127.5,127.5,287.5,SBD
4,Vikki Cohen,F,,Raw,FR-O,82.9,84,-60,70,75,75,35,40,42.5,42.5,95,102.5,-107.5,102.5,220,SBD
1,Mikéla Henry-Lowe,F,,Raw,FR-O,114.2,84+,150,157.5,162.5,162.5,80,85,-87.5,85,157.5,167.5,172.5,172.5,420,SBD
2,Emily Dennis,F,,Raw,FR-O,144,84+,152.5,157.5,162.5,162.5,92.5,97.5,-100,97.5,130,-140,-140,130,390,SBD
3,Serena Bersani,F,,Raw,FR-O,87.7,84+,110,120,130,130,55,60,62.5,62.5,110,120,135,135,327.5,SBD
4,Alexandria Cordova,F,,Raw,FR-O,91.5,84+,115,120,127.5,127.5,67.5,-72.5,-72.5,67.5,115,125,-135,125,320,SBD
1,Salman Desai,M,,Raw,MR-O,56.9,59,115,122.5,130,130,75,80,85,85,140,150,160,160,375,SBD
1,Alain Peroumal,M,,Raw,MR-O,60,66,95,107.5,115,115,-52.5,52.5,65,65,130,142.5,152.5,152.5,332.5,SBD
1,Jake Cazin-Meyer,M,,Raw,MR-O,73.8,74,-190,190,-210,190,117.5,125,130,130,-225,235,-250,235,555,SBD
2,Peter Le,M,,Raw,MR-O,71.8,74,160,167.5,175,175,100,105,110,110,205,220,-230,220,505,SBD
3,Stefan Saverimuttu,M,,Raw,MR-O,71.5,74,160,170,-180,170,110,120,-125,120,200,210,-215,210,500,SBD
4,Godfrey Chau,M,,Raw,MR-O,72,74,170,182.5,185,185,95,102.5,105,105,-205,207.5,-215,207.5,497.5,SBD
5,Clement Guardiera,M,,Raw,MR-O,71.5,74,152.5,162.5,-165,162.5,117.5,120,-122.5,120,195,-205,-205,195,477.5,SBD
6,Kamron Mir-Gajadhar,M,,Raw,MR-O,74,74,150,-157.5,157.5,157.5,100,107.5,-110,107.5,170,182.5,190,190,455,SBD
1,Anakin Kwok,M,,Raw,MR-O,75.7,83,160,180,190,190,110,120,125,125,200,225,265,265,580,SBD
2,Colin Chu,M,,Raw,MR-O,82.7,83,190,202.5,210,210,125,132.5,135,135,230,-245,-245,230,575,SBD
3,Jack Bowen-Bravery,M,,Raw,MR-O,81,83,160,180,190,190,125,130,-132.5,130,-230,-250,250,250,570,SBD
4,Peter Emerson,M,,Raw,MR-O,80.8,83,170,180,-187.5,180,-120,-125,125,125,200,210,220,220,525,SBD
5,Mason Green-Prosper,M,,Raw,MR-O,81.5,83,177.5,190,200,200,92.5,100,-107.5,100,200,210,220,220,520,SBD
6,Alan Malek,M,,Raw,MR-O,75.9,83,130,-150,150,150,105,115,-120,115,165,180,200,200,465,SBD
7,Teo Valdes Vodanovic,M,,Raw,MR-O,81,83,165,175,-180,175,80,90,95,95,170,180,190,190,460,SBD
1,Caleb Ellis,M,,Raw,MR-O,91.8,93,235,250,260,260,127.5,-135,-137.5,127.5,250,275,-280,275,662.5,SBD
2,Tyler Acheampong,M,,Raw,MR-O,91.5,93,200,210,220,220,-135,145,155,155,227.5,240,250,250,625,SBD
3,Alan Flanagan,M,,Raw,MR-O,92.5,93,157.5,170,180,180,115,122.5,130,130,200,220,230,230,540,SBD
4,Wilberth Solano,M,,Raw,MR-O,85,93,170,180,190,190,110,115,120,120,200,210,-215,210,520,SBD
5,Jubril Balogun,M,,Raw,MR-O,91,93,165,175,180,180,92.5,100,105,105,210,222.5,230,230,515,SBD
6,Alan Joseph,M,,Raw,MR-O,85,93,-150,150,160,160,100,110,115,115,180,200,220,220,495,SBD
7,Tiwa Adejuyigbe,M,,Raw,MR-O,90,93,165,170,172.5,172.5,95,-102.5,-102.5,95,192.5,205,217.5,217.5,485,SBD
8,Dave Osborne,M,,Raw,MR-O,91,93,140,152.5,160,160,100,105,107.5,107.5,190,212.5,-227.5,212.5,480,SBD
9,Lloyd Taylor,M,,Raw,MR-O,91.2,93,-160,170,175,175,100,107.5,-112.5,107.5,180,190,-202.5,190,472.5,SBD
10,Michael Oghenekevwe,M,,Raw,MR-O,84.1,93,155,165,-175,165,-102.5,107.5,-112.5,107.5,155,165,175,175,447.5,SBD
1,Chago Bunton-Cole,M,,Raw,MR-O,96,105,227.5,235,242.5,242.5,165,175,-180,175,270,285,300,300,717.5,SBD
2,Daniel Olaofe,M,,Raw,MR-O,103.5,105,215,230,240,240,140,147.5,152.5,152.5,290,305,320,320,712.5,SBD
3,Ivan Otim,M,,Raw,MR-O,100.1,105,180,195,-205,195,112.5,-117.5,117.5,117.5,240,260,275,275,587.5,SBD
4,Simon Parsons,M,,Raw,MR-O,98,105,197.5,207.5,215,215,130,137.5,-142.5,137.5,197.5,205,212.5,212.5,565,SBD
1,Reece Smith,M,,Raw,MR-O,119.6,120,260,285,300,300,167.5,175,180,180,260,285,-300,285,765,SBD
2,Tom Roberts #3,M,,Raw,MR-O,108.3,120,220,230,237.5,237.5,162.5,172.5,180,180,240,255,-265,255,672.5,SBD
3,Samuel Monkley,M,,Raw,MR-O,107.4,120,225,-230,230,230,120,125,-130,125,250,260,270,270,625,SBD
4,John Carroll,M,,Raw,MR-O,117.6,120,-210,220,225,225,140,147.5,155,155,225,235,245,245,625,SBD
5,Nimrod Avissar,M,,Raw,MR-O,118.8,120,195,205,207.5,207.5,120,-127.5,-127.5,120,205,215,222.5,222.5,550,SBD
