Place,Name,BirthDate,Sex,BirthYear,Age,Country,State,Equipment,Division,BodyweightKg,WeightClassKg,Squat1Kg,Squat2Kg,Squat3Kg,Best3SquatKg,Bench1Kg,Bench2Kg,Bench3Kg,Best3BenchKg,Deadlift1Kg,Deadlift2Kg,Deadlift3Kg,Best3DeadliftKg,TotalKg,Event
1,Brooke Woolford,,F,2003,,,,Raw,Juniors,74.6,76,117.5,122.5,125,125,60,62.5,65,65,150,157.5,162.5,162.5,352.5,SBD
2,Kayla Turfus,,F,2002,,,,Raw,Juniors,74.96,76,100,110,-127.5,110,50,-57.5,-57.5,50,115,125,135,135,295,SBD
1,Nina Huria,,F,2003,,,,Raw,Juniors,79,84,-125,130,-135,130,52.5,57.5,62.5,62.5,130,140,150,150,342.5,SBD
2,Jasmine Scarlet,,F,2004,,,,Raw,Juniors,78.78,84,-100,100,107.5,107.5,37.5,-42.5,-42.5,37.5,105,115,120,120,265,SBD
1,Evelyn Peglar,,F,2002,,,,Raw,Juniors,93.66,84+,-65,70,75,75,35,-40,-40,35,90,95,100,100,210,SBD
1,Jane Lee,,F,1978,,,,Raw,Masters 1,68.5,69,-90,90,92.5,92.5,50,52.5,55,55,120,125,130,130,277.5,SBD
1,Tracy Morrison-Judd,,F,1976,,,,Raw,Masters 1,87.68,84+,110,117.5,122.5,122.5,60,65,70,70,137.5,150,155,155,347.5,SBD
1,Nadine Kure,,F,1970,,,,Raw,Masters 2,72.88,76,75,77.5,80,80,45,47.5,-50,47.5,100,105,110,110,237.5,SBD
1,Jennie Hopkinson,,F,1973,,,,Raw,Masters 2,79.96,84,100,110,120,120,70,72.5,75,75,100,120,140,140,335,SBD
2,Jo Newlove,,F,1971,,,,Raw,Masters 2,78.3,84,-80,-82.5,82.5,82.5,52.5,55,60,60,107.5,110,120,120,262.5,SBD
1,Sue Moar,,F,1962,,,,Raw,Masters 3,60.14,63,-45,45,-55,45,30,-35,35,35,70,80,92.5,92.5,172.5,SBD
1,Emerson Pirker,,F,1999,,,,Raw,Open,62.34,63,117.5,122.5,125,125,55,60,62.5,62.5,142.5,152.5,155,155,342.5,SBD
1,Ariel Jeffcoat,,F,1996,,,,Raw,Open,68.22,69,85,90,92.5,92.5,50,52.5,55,55,110,120,125,125,272.5,SBD
1,Zara Mortimer,,F,1999,,,,Raw,Open,75.48,76,120,127.5,130,130,75,77.5,80,80,145,152.5,157.5,157.5,367.5,SBD
2,Jasmine Kupa,,F,1998,,,,Raw,Open,74.7,76,95,100,105,105,45,50,55,55,95,100,105,105,265,SBD
1,Kiriana Welsh-Phillips,,F,1997,,,,Raw,Open,128.99,84+,110,120,130,130,75,82.5,87.5,87.5,145,155,165,165,382.5,SBD
2,Larisa Isaeva,,F,1997,,,,Raw,Open,92.4,84+,80,85,90,90,55,60,-62.5,60,120,125,135,135,285,SBD
1,James Kong,,M,2004,,,,Raw,Juniors,73.34,74,140,150,-155,150,100,105,-107.5,105,200,210,222.5,222.5,477.5,SBD
2,Jonathan Cragg,,M,2004,,,,Raw,Juniors,72.4,74,130,140,150,150,-82.5,82.5,87.5,87.5,185,200,-207.5,200,437.5,SBD
1,Connor Baas,,M,1999,,,,Raw,Open,70.82,74,150,165,170,170,95,105,110,110,160,175,185,185,465,SBD
2,Ihaka Huatahi,,M,1997,,,,Raw,Open,72.58,74,135,145,-155,145,80,90,100,100,140,165,180,180,425,SBD
3,Arnold Avit Prased,,M,1985,,,,Raw,Open,69.78,74,110,120,127.5,127.5,70,-80,-80,70,130,140,150,150,347.5,SBD
1,Cory Rye,,M,2005,,,,Raw,Sub-Juniors,72.82,74,160,170,180,180,100,105,110,110,200,-210,210,210,500,SBD
2,William Ralph,,M,2005,,,,Raw,Sub-Juniors,68.28,74,130,145,-152.5,145,75,-85,-85,75,170,190,205,205,425,SBD
3,Frankie Clark,,M,2006,,,,Raw,Sub-Juniors,71.56,74,130,140,-150,140,90,97.5,-105,97.5,135,145,160,160,397.5,SBD
4,Theo Green,,M,2007,,,,Raw,Sub-Juniors,69.72,74,120,-130,130,130,85,-90,90,90,130,145,155,155,375,SBD
5,Ashlin Millard,,M,2007,,,,Raw,Sub-Juniors,68.8,74,100,110,115,115,50,-60,-60,50,125,-140,145,145,310,SBD
1,Trey Lush,,M,2007,,,,Raw,Sub-Juniors,77.2,83,135,145,-155,145,90,97.5,-105,97.5,165,180,190,190,432.5,SBD
1,Chris Ritchie,,M,1977,,,,Raw,Masters 1,82.86,83,,,,,120,127.5,-135,127.5,,,,,127.5,B
1,James Naylor,,M,2000,,,,Raw,Juniors,101.24,105,220,235,245,245,150,160,-165,160,240,255,270,270,675,SBD
1,Tafa Banya,,M,2001,,,,Raw,Juniors,81.1,83,175,185,200,200,125,132.5,137.5,137.5,235,245,260,260,597.5,SBD
1,Alex Morozow,,M,2002,,,,Raw,Juniors,90.8,93,207.5,212.5,220,220,127.5,137.5,-142.5,137.5,250,262.5,270,270,627.5,SBD
2,Gabriel Bielawski,,M,2002,,,,Raw,Juniors,89.32,93,-150,155,-162.5,155,-95,-95,95,95,180,190,-200,190,440,SBD
1,Luke Gumbley,,M,1982,,,,Raw,Masters 1,108.32,120,145,155,170,170,105,115,-125,115,190,200,215,215,500,SBD
1,Liam Jones,,M,1970,,,,Raw,Masters 2,117.86,120,185,192.5,200,200,125,135,140,140,200,215,220,220,560,SBD
1,Peter Walker,,M,1970,,,,Raw,Masters 2,82.52,83,127.5,137.5,142.5,142.5,77.5,82.5,85,85,172.5,182.5,190,190,417.5,SBD
1,George Frame,,M,1991,,,,Raw,Open,98.04,105,215,230,242.5,242.5,137.5,145,147.5,147.5,235,250,262.5,262.5,652.5,SBD
1,Andrew Tweeddale,,M,1988,,,,Raw,Open,110.5,120,-185,192.5,210,210,130,135,140,140,210,230,-240,230,580,SBD
2,Eric Wildschut,,M,1998,,,,Raw,Open,107.42,120,180,190,-200,190,110,120,-125,120,200,210,230,230,540,SBD
1,Sam Louie,,M,1996,,,,Raw,Open,75,83,-190,200,-205,200,107.5,112.5,115,115,235,250,260,260,575,SBD
2,Ludwig Petters,,M,1996,,,,Raw,Open,80.76,83,140,155,170,170,105,112.5,-122.5,112.5,190,210,220,220,502.5,SBD
3,Judah McNicholl,,M,1997,,,,Raw,Open,79.46,83,130,140,-160,140,80,85,90,90,175,185,-202.5,185,415,SBD
1,Tatenda Musoperp,,M,1989,,,,Raw,Open,92.36,93,200,220,-230,220,125,140,150,150,250,260,280,280,650,SBD
2,Rob Thompson,,M,1993,,,,Raw,Open,84.76,93,170,180,-190,180,100,110,112.5,112.5,180,200,210,210,502.5,SBD
1,Clark Sutcliffe,,M,2007,,,,Raw,Sub-Juniors,102.2,105,160,170,185,185,110,117.5,-125,117.5,-190,210,230,230,532.5,SBD
2,Tyrese Yin,,M,2006,,,,Raw,Sub-Juniors,96.22,105,125,140,155,155,95,105,-115,105,185,200,210,210,470,SBD
1,Jaiden Clark,,M,2007,,,,Raw,Sub-Juniors,82.16,83,170,180,-190,180,110,-120,120,120,180,195,210,210,510,SBD
2,Bradley Durrant,,M,2007,,,,Raw,Sub-Juniors,81.42,83,145,155,165,165,82.5,90,-92.5,90,185,200,207.5,207.5,462.5,SBD
3,Stephen Gittos,,M,2006,,,,Raw,Sub-Juniors,75.22,83,120,-135,140,140,105,112.5,115,115,150,170,180,180,435,SBD
1,Joseph Ikonomakis,,M,2008,,,,Raw,Sub-Juniors,90.5,93,167.5,175,-180,175,127.5,135,140,140,185,200,217.5,217.5,532.5,SBD
2,Jacob Emeny,,M,2006,,,,Raw,Sub-Juniors,91.3,93,155,160,165,165,100,110,-115,110,200,210,-215,210,485,SBD
3,Toby Scott,,M,2006,,,,Raw,Sub-Juniors,90.66,93,100,110,115,115,-70,-75,75,75,115,125,135,135,325,SBD
