<?xml version="1.0" encoding="UTF-8" standalone="no"?>
<svg
   xmlns:dc="http://purl.org/dc/elements/1.1/"
   xmlns:cc="http://creativecommons.org/ns#"
   xmlns:rdf="http://www.w3.org/1999/02/22-rdf-syntax-ns#"
   xmlns:svg="http://www.w3.org/2000/svg"
   xmlns="http://www.w3.org/2000/svg"
   width="79.473579"
   height="38"
   viewBox="0 0 21.027382 10.054167"
   version="1.1"
   id="svg973">
  <defs
     id="defs967" />
  <metadata
     id="metadata970">
    <rdf:RDF>
      <cc:Work
         rdf:about="">
        <dc:format>image/svg+xml</dc:format>
        <dc:type
           rdf:resource="http://purl.org/dc/dcmitype/StillImage" />
        <dc:title></dc:title>
      </cc:Work>
    </rdf:RDF>
  </metadata>
  <g
     id="layer1"
     transform="translate(-69.849113,-131.31772)">
    <g
       id="g1704"
       transform="matrix(0.50270833,0,0,0.50270833,34.735382,65.303206)">
      <g
         id="g981"
         transform="translate(35.3104,124.70323)">
        <path
           id="path975"
           style="fill:#eb0000;fill-opacity:1;stroke-width:0.132232;stroke-miterlimit:10"
           d="M 250.83594,25 A 37.795276,37.795276 0 0 0 215.20117,50.197266 H 286.4707 A 37.795276,37.795276 0 0 0 250.83594,25 Z"
           transform="scale(0.26458333)" />
        <path
           id="path977"
           style="fill:#f7f7f7;fill-opacity:1;stroke-width:0.132232;stroke-miterlimit:10"
           d="m 215.20117,50.197266 a 37.795276,37.795276 0 0 0 -2.16015,12.597656 37.795276,37.795276 0 0 0 2.1621,12.599609 h 71.26563 a 37.795276,37.795276 0 0 0 2.16211,-12.599609 37.795276,37.795276 0 0 0 -2.16016,-12.597656 z"
           transform="scale(0.26458333)" />
        <path
           id="path979"
           style="fill:#00a700;fill-opacity:1;stroke-width:0.132232;stroke-miterlimit:10"
           d="m 215.20312,75.394531 a 37.795276,37.795276 0 0 0 35.63282,25.195309 37.795276,37.795276 0 0 0 35.63281,-25.195309 z"
           transform="scale(0.26458333)" />
      </g>
      <g
         id="g993"
         transform="translate(64.697882,54.307897)">
        <circle
           style="fill:#f7f7f7;fill-opacity:1;stroke-width:0.0559689;stroke-miterlimit:10"
           id="circle989"
           cx="15.151358"
           cy="87.009819"
           r="10" />
        <path
           id="path991"
           style="color:#000000;font-style:normal;font-variant:normal;font-weight:normal;font-stretch:normal;font-size:medium;line-height:normal;font-family:sans-serif;font-variant-ligatures:normal;font-variant-position:normal;font-variant-caps:normal;font-variant-numeric:normal;font-variant-alternates:normal;font-variant-east-asian:normal;font-feature-settings:normal;font-variation-settings:normal;text-indent:0;text-align:start;text-decoration:none;text-decoration-line:none;text-decoration-style:solid;text-decoration-color:#000000;letter-spacing:normal;word-spacing:normal;text-transform:none;writing-mode:lr-tb;direction:ltr;text-orientation:mixed;dominant-baseline:auto;baseline-shift:baseline;text-anchor:start;white-space:normal;shape-padding:0;shape-margin:0;inline-size:0;clip-rule:nonzero;display:inline;overflow:visible;visibility:visible;opacity:1;isolation:auto;mix-blend-mode:normal;color-interpolation:sRGB;color-interpolation-filters:linearRGB;solid-color:#000000;solid-opacity:1;vector-effect:none;fill:#0052b4;fill-opacity:1;fill-rule:nonzero;stroke:none;stroke-width:12.0945;stroke-linecap:butt;stroke-linejoin:miter;stroke-miterlimit:4;stroke-dasharray:none;stroke-dashoffset:0;stroke-opacity:1;color-rendering:auto;image-rendering:auto;shape-rendering:auto;text-rendering:auto;enable-background:accumulate;stop-color:#000000;stop-opacity:1"
           d="m 69.1875,310.11719 a 37.795276,37.795276 0 0 0 -12.091797,4.28906 v 26.91406 h -18.8125 a 37.795276,37.795276 0 0 0 -0.488281,6.04492 37.795276,37.795276 0 0 0 0.486328,6.04688 h 18.814453 v 26.91406 a 37.795276,37.795276 0 0 0 12.091797,4.28711 v -31.20117 h 43.71094 a 37.795276,37.795276 0 0 0 0.48828,-6.04688 37.795276,37.795276 0 0 0 -0.48828,-6.04492 H 69.1875 Z"
           transform="matrix(0.26458333,0,0,0.26458333,-4.8486755,-4.8973216)" />
      </g>
    </g>
  </g>
</svg>
