<?xml version="1.0" encoding="UTF-8" standalone="no"?>
<!-- Created with Inkscape (http://www.inkscape.org/) -->

<svg
   width="62.536457mm"
   height="49.518642mm"
   viewBox="0 0 62.536457 49.518642"
   version="1.1"
   id="svg5240"
   xmlns="http://www.w3.org/2000/svg"
   xmlns:svg="http://www.w3.org/2000/svg">
  <defs
     id="defs5237" />
  <g
     id="layer1"
     transform="translate(-689.32894,-737.74915)">
    <path
       id="path3754"
       d="m 709.34717,752.82924 v -2.8125 h 5.625 v 2.8125 z"
       style="fill:none;stroke:#000000;stroke-width:0.396875;stroke-linecap:round;stroke-linejoin:round;stroke-miterlimit:4;stroke-dasharray:none;stroke-opacity:1" />
    <path
       style="fill:none;stroke:#000000;stroke-width:0.396875;stroke-linecap:round;stroke-linejoin:round;stroke-miterlimit:4;stroke-dasharray:none;stroke-opacity:1"
       d="m 700.90967,752.82924 v -2.8125 h 5.625 v 2.8125 z"
       id="path3756" />
    <path
       id="path3758"
       d="m 692.47217,752.82924 v -2.8125 h 5.625 v 2.8125 z"
       style="fill:none;stroke:#000000;stroke-width:0.396875;stroke-linecap:round;stroke-linejoin:round;stroke-miterlimit:4;stroke-dasharray:none;stroke-opacity:1" />
    <path
       style="fill:none;stroke:#000000;stroke-width:0.396875;stroke-linecap:round;stroke-linejoin:round;stroke-miterlimit:4;stroke-dasharray:none;stroke-opacity:1"
       d="m 734.65967,752.82924 v -2.8125 h 5.625 v 2.8125 z"
       id="path3760" />
    <path
       id="path3762"
       d="m 726.22217,752.82924 v -2.8125 h 5.625 v 2.8125 z"
       style="fill:none;stroke:#000000;stroke-width:0.396875;stroke-linecap:round;stroke-linejoin:round;stroke-miterlimit:4;stroke-dasharray:none;stroke-opacity:1" />
    <path
       style="fill:none;stroke:#000000;stroke-width:0.396875;stroke-linecap:round;stroke-linejoin:round;stroke-miterlimit:4;stroke-dasharray:none;stroke-opacity:1"
       d="m 717.78467,752.82924 v -2.8125 h 5.625 v 2.8125 z"
       id="path3764" />
    <path
       id="path3766"
       d="m 743.09717,752.82924 v -2.8125 h 5.625 v 2.8125 z"
       style="fill:none;stroke:#000000;stroke-width:0.396875;stroke-linecap:round;stroke-linejoin:round;stroke-miterlimit:4;stroke-dasharray:none;stroke-opacity:1" />
    <path
       id="path3768"
       d="m 689.65967,752.82924 h 61.875 v 28.125 h -61.875 z"
       style="fill:none;stroke:#000000;stroke-width:0.661458;stroke-linecap:round;stroke-linejoin:round;stroke-miterlimit:4;stroke-dasharray:none;stroke-opacity:1" />
    <path
       id="path3770"
       d="m 689.65967,764.55183 v 4.67982 c 1.29441,0 2.33991,-1.04549 2.33991,-2.33991 0,-1.29442 -1.0455,-2.33991 -2.33991,-2.33991 z"
       style="fill:none;stroke:#000000;stroke-width:0.661458;stroke-linecap:round;stroke-linejoin:round;stroke-miterlimit:4;stroke-dasharray:none;stroke-opacity:1" />
    <path
       style="fill:none;stroke:#000000;stroke-width:0.396875;stroke-linecap:round;stroke-linejoin:round;stroke-miterlimit:4;stroke-dasharray:none;stroke-opacity:1"
       d="m 709.34717,783.76674 v -2.8125 h 5.625 v 2.8125 z"
       id="path3792" />
    <path
       id="path3794"
       d="m 700.90967,783.76674 v -2.8125 h 5.625 v 2.8125 z"
       style="fill:none;stroke:#000000;stroke-width:0.396875;stroke-linecap:round;stroke-linejoin:round;stroke-miterlimit:4;stroke-dasharray:none;stroke-opacity:1" />
    <path
       style="fill:none;stroke:#000000;stroke-width:0.396875;stroke-linecap:round;stroke-linejoin:round;stroke-miterlimit:4;stroke-dasharray:none;stroke-opacity:1"
       d="m 692.47217,783.76674 v -2.8125 h 5.625 v 2.8125 z"
       id="path3796" />
    <path
       id="path3798"
       d="m 734.65967,783.76674 v -2.8125 h 5.625 v 2.8125 z"
       style="fill:none;stroke:#000000;stroke-width:0.396875;stroke-linecap:round;stroke-linejoin:round;stroke-miterlimit:4;stroke-dasharray:none;stroke-opacity:1" />
    <path
       style="fill:none;stroke:#000000;stroke-width:0.396875;stroke-linecap:round;stroke-linejoin:round;stroke-miterlimit:4;stroke-dasharray:none;stroke-opacity:1"
       d="m 726.22217,783.76674 v -2.8125 h 5.625 v 2.8125 z"
       id="path3800" />
    <path
       id="path3802"
       d="m 717.78467,783.76674 v -2.8125 h 5.625 v 2.8125 z"
       style="fill:none;stroke:#000000;stroke-width:0.396875;stroke-linecap:round;stroke-linejoin:round;stroke-miterlimit:4;stroke-dasharray:none;stroke-opacity:1" />
    <path
       style="fill:none;stroke:#000000;stroke-width:0.396875;stroke-linecap:round;stroke-linejoin:round;stroke-miterlimit:4;stroke-dasharray:none;stroke-opacity:1"
       d="m 743.09717,783.76674 v -2.8125 h 5.625 v 2.8125 z"
       id="path3804" />
    <text
       id="text3934"
       y="743.45422"
       x="716.24475"
       style="font-style:normal;font-variant:normal;font-weight:normal;font-stretch:normal;font-size:3.175px;line-height:0%;font-family:sans-serif;-inkscape-font-specification:Sans;text-align:start;letter-spacing:0px;word-spacing:0px;writing-mode:lr-tb;text-anchor:start;fill:#000000;fill-opacity:1;stroke:none;stroke-width:0.264583"
       xml:space="preserve"><tspan
         id="tspan3936"
         x="716.24475"
         y="743.45422"
         style="font-size:7.9375px;line-height:1.25;font-family:sans-serif;stroke-width:0.264583">27</tspan></text>
    <path
       id="path4159"
       d="m 734.65967,756.6323 h 6.5625 v 9.37499 h -6.5625 z"
       style="fill:none;stroke:#000000;stroke-width:0.396875;stroke-linecap:round;stroke-linejoin:round;stroke-miterlimit:4;stroke-dasharray:none;stroke-opacity:1" />
    <path
       id="path4161"
       d="m 708.40967,769.7573 v -6.5625 h -9.375 v 6.5625 z"
       style="fill:none;stroke:#000000;stroke-width:0.396875;stroke-linecap:round;stroke-linejoin:round;stroke-miterlimit:4;stroke-dasharray:none;stroke-opacity:1" />
    <path
       style="fill:none;stroke:#000000;stroke-width:0.396875;stroke-linecap:round;stroke-linejoin:round;stroke-miterlimit:4;stroke-dasharray:none;stroke-opacity:1"
       d="m 726.22217,777.25729 h 6.5625 v -9.375 h -6.5625 z"
       id="path4163" />
    <path
       d="m 703.72217,763.1948 v -2.8125 h 8.4375 v -7.50001 m -5.625,16.87501 v 8.43749 h -2.8125 v 2.8125 m -2.8125,-11.24999 v 2.81249 h -4.6875 V 757.5698 h 7.5 v -4.68751 m 0,16.87501 v 5.62499 h -8.4375 v 5.625"
       style="fill:none;stroke:#000000;stroke-width:0.396875;stroke-linecap:butt;stroke-linejoin:miter;stroke-miterlimit:4;stroke-dasharray:none;stroke-opacity:1"
       id="path4165" />
    <path
       d="M 712.15967,781.00729 V 769.7573 h 14.06249 m 6.56251,2.81249 h 4.6875 v 8.4375 m -11.25001,-8.4375 h -5.62499 v 8.4375 m 5.625,-5.625 h -2.8125 v 3.75 h 5.625 v 1.875"
       style="fill:none;stroke:#000000;stroke-width:0.396875;stroke-linecap:butt;stroke-linejoin:miter;stroke-miterlimit:4;stroke-dasharray:none;stroke-opacity:1"
       id="path4167" />
    <path
       d="m 734.65967,764.1323 h -14.0625 v -11.25001 m 20.625,8.4375 h 4.6875 v -8.4375 m -11.25,8.4375 h -5.625 v -8.4375 m 5.625,5.625 h -2.8125 v -3.75 h 5.625 v -1.875"
       style="fill:none;stroke:#000000;stroke-width:0.396875;stroke-linecap:butt;stroke-linejoin:miter;stroke-miterlimit:4;stroke-dasharray:none;stroke-opacity:1"
       id="path4169" />
    <text
       id="text3910"
       y="779.99042"
       x="692.01208"
       style="font-style:normal;font-variant:normal;font-weight:normal;font-stretch:normal;font-size:3.175px;line-height:0%;font-family:sans-serif;-inkscape-font-specification:Sans;text-align:start;letter-spacing:0px;word-spacing:0px;writing-mode:lr-tb;text-anchor:start;fill:#000000;fill-opacity:1;stroke:#000000;stroke-width:0.0529167;stroke-miterlimit:4;stroke-dasharray:none;stroke-opacity:1"
       xml:space="preserve"><tspan
         y="779.99042"
         x="692.01208"
         id="tspan3912"
         style="font-size:2.64583px;line-height:1.25;font-family:sans-serif;stroke-width:0.0529167">1</tspan></text>
    <text
       xml:space="preserve"
       style="font-style:normal;font-variant:normal;font-weight:normal;font-stretch:normal;font-size:3.175px;line-height:0%;font-family:sans-serif;-inkscape-font-specification:Sans;text-align:start;letter-spacing:0px;word-spacing:0px;writing-mode:lr-tb;text-anchor:start;fill:#000000;fill-opacity:1;stroke:#000000;stroke-width:0.0529167;stroke-miterlimit:4;stroke-dasharray:none;stroke-opacity:1"
       x="745.17133"
       y="779.99042"
       id="text3914"><tspan
         y="779.99042"
         x="745.17133"
         id="tspan3916"
         style="font-size:2.64583px;line-height:1.25;font-family:sans-serif;stroke-width:0.0529167">7</tspan></text>
    <text
       id="text3918"
       y="755.69476"
       x="747.53894"
       style="font-style:normal;font-variant:normal;font-weight:normal;font-stretch:normal;font-size:3.175px;line-height:0%;font-family:sans-serif;-inkscape-font-specification:Sans;text-align:start;letter-spacing:0px;word-spacing:0px;writing-mode:lr-tb;text-anchor:start;fill:#000000;fill-opacity:1;stroke:#000000;stroke-width:0.0529167;stroke-miterlimit:4;stroke-dasharray:none;stroke-opacity:1"
       xml:space="preserve"><tspan
         y="755.69476"
         x="747.53894"
         id="tspan3920"
         style="font-size:2.64583px;line-height:1.25;font-family:sans-serif;stroke-width:0.0529167">8</tspan></text>
    <text
       xml:space="preserve"
       style="font-style:normal;font-variant:normal;font-weight:normal;font-stretch:normal;font-size:3.175px;line-height:0%;font-family:sans-serif;-inkscape-font-specification:Sans;text-align:start;letter-spacing:0px;word-spacing:0px;writing-mode:lr-tb;text-anchor:start;fill:#000000;fill-opacity:1;stroke:#000000;stroke-width:0.0529167;stroke-miterlimit:4;stroke-dasharray:none;stroke-opacity:1"
       x="693.73242"
       y="755.69476"
       id="text3922"><tspan
         y="755.69476"
         x="693.73242"
         id="tspan3924"
         style="font-size:2.64583px;line-height:1.25;font-family:sans-serif;stroke-width:0.0529167">14</tspan></text>
    <text
       id="text3926"
       y="749.02637"
       x="692.4245"
       style="font-style:normal;font-variant:normal;font-weight:normal;font-stretch:normal;font-size:3.175px;line-height:0%;font-family:sans-serif;-inkscape-font-specification:Sans;text-align:start;letter-spacing:0px;word-spacing:0px;writing-mode:lr-tb;text-anchor:start;fill:#000000;fill-opacity:1;stroke:#000000;stroke-width:0.0529167;stroke-miterlimit:4;stroke-dasharray:none;stroke-opacity:1"
       xml:space="preserve"><tspan
         y="749.02637"
         x="692.4245"
         id="tspan3928"
         style="font-size:3.43958px;line-height:1.25;font-family:sans-serif;stroke-width:0.0529167">Vcc</tspan></text>
    <text
       id="text3930"
       y="787.19934"
       x="742.08801"
       style="font-style:normal;font-variant:normal;font-weight:normal;font-stretch:normal;font-size:3.175px;line-height:0%;font-family:sans-serif;-inkscape-font-specification:Sans;text-align:start;letter-spacing:0px;word-spacing:0px;writing-mode:lr-tb;text-anchor:start;fill:#000000;fill-opacity:1;stroke:#000000;stroke-width:0.0529167;stroke-miterlimit:4;stroke-dasharray:none;stroke-opacity:1"
       xml:space="preserve"><tspan
         y="787.19934"
         x="742.08801"
         id="tspan3932"
         style="font-size:3.43958px;line-height:1.25;font-family:sans-serif;stroke-width:0.0529167">GND</tspan></text>
    <text
       id="text4037"
       y="768.18756"
       x="702.57574"
       style="font-style:normal;font-variant:normal;font-weight:normal;font-stretch:normal;font-size:3.175px;line-height:0%;font-family:sans-serif;-inkscape-font-specification:Sans;text-align:start;letter-spacing:0px;word-spacing:0px;writing-mode:lr-tb;text-anchor:start;fill:#000000;fill-opacity:1;stroke:none;stroke-width:0.264583"
       xml:space="preserve"><tspan
         y="768.18756"
         x="702.57574"
         id="tspan4039"
         style="font-size:4.7625px;line-height:1.25;font-family:sans-serif;stroke-width:0.264583">1</tspan></text>
    <text
       xml:space="preserve"
       style="font-style:normal;font-variant:normal;font-weight:normal;font-stretch:normal;font-size:3.175px;line-height:0%;font-family:sans-serif;-inkscape-font-specification:Sans;text-align:start;letter-spacing:0px;word-spacing:0px;writing-mode:lr-tb;text-anchor:start;fill:#000000;fill-opacity:1;stroke:none;stroke-width:0.264583"
       x="736.79449"
       y="763.03131"
       id="text4171"><tspan
         id="tspan4173"
         x="736.79449"
         y="763.03131"
         style="font-size:4.7625px;line-height:1.25;font-family:sans-serif;stroke-width:0.264583">1</tspan></text>
    <text
       id="text4175"
       y="774.28131"
       x="728.35699"
       style="font-style:normal;font-variant:normal;font-weight:normal;font-stretch:normal;font-size:3.175px;line-height:0%;font-family:sans-serif;-inkscape-font-specification:Sans;text-align:start;letter-spacing:0px;word-spacing:0px;writing-mode:lr-tb;text-anchor:start;fill:#000000;fill-opacity:1;stroke:none;stroke-width:0.264583"
       xml:space="preserve"><tspan
         y="774.28131"
         x="728.35699"
         id="tspan4177"
         style="font-size:4.7625px;line-height:1.25;font-family:sans-serif;stroke-width:0.264583">1</tspan></text>
    <path
       style="fill:#ffffff;fill-opacity:1;stroke:#000000;stroke-width:0.396875;stroke-linecap:round;stroke-linejoin:round;stroke-miterlimit:4;stroke-dasharray:none;stroke-opacity:1"
       d="m 703.0088,762.42837 c 0,0.39398 0.31939,0.71337 0.71337,0.71337 0.39397,0 0.71336,-0.31939 0.71336,-0.71337 0,-0.39398 -0.31939,-0.71336 -0.71336,-0.71336 -0.39398,0 -0.71337,0.31938 -0.71337,0.71336 z"
       id="path7620" />
    <path
       id="path7622"
       d="m 741.22217,761.26674 c 0,0.39398 0.31939,0.71337 0.71336,0.71337 0.39398,0 0.71337,-0.31939 0.71337,-0.71337 0,-0.39398 -0.31939,-0.71336 -0.71337,-0.71336 -0.39397,0 -0.71336,0.31938 -0.71336,0.71336 z"
       style="fill:#ffffff;fill-opacity:1;stroke:#000000;stroke-width:0.396875;stroke-linecap:round;stroke-linejoin:round;stroke-miterlimit:4;stroke-dasharray:none;stroke-opacity:1" />
    <path
       style="fill:#ffffff;fill-opacity:1;stroke:#000000;stroke-width:0.396875;stroke-linecap:round;stroke-linejoin:round;stroke-miterlimit:4;stroke-dasharray:none;stroke-opacity:1"
       d="m 732.78467,772.51674 c 0,0.39398 0.31938,0.71337 0.71336,0.71337 0.39397,0 0.71337,-0.31939 0.71337,-0.71337 0,-0.39398 -0.3194,-0.71336 -0.71337,-0.71336 -0.39398,0 -0.71336,0.31938 -0.71336,0.71336 z"
       id="path7624" />
  </g>
</svg>
