<?xml version="1.0" encoding="UTF-8" standalone="no"?>
<!-- Created with Inkscape (http://www.inkscape.org/) -->

<svg
   width="87.896622mm"
   height="50.259232mm"
   viewBox="0 0 87.896622 50.259231"
   version="1.1"
   id="svg5240"
   xmlns="http://www.w3.org/2000/svg"
   xmlns:svg="http://www.w3.org/2000/svg">
  <defs
     id="defs5237" />
  <g
     id="layer1"
     transform="translate(-325.42489,-494.29889)">
    <path
       style="fill:none;stroke:#000000;stroke-width:0.396875;stroke-linecap:round;stroke-linejoin:round;stroke-miterlimit:4;stroke-dasharray:none;stroke-opacity:1"
       d="m 345.44312,509.37897 v -2.8125 h 5.625 v 2.8125 z"
       id="path3944" />
    <path
       id="path3946"
       d="m 337.00562,509.37897 v -2.8125 h 5.625 v 2.8125 z"
       style="fill:none;stroke:#000000;stroke-width:0.396875;stroke-linecap:round;stroke-linejoin:round;stroke-miterlimit:4;stroke-dasharray:none;stroke-opacity:1" />
    <path
       style="fill:none;stroke:#000000;stroke-width:0.396875;stroke-linecap:round;stroke-linejoin:round;stroke-miterlimit:4;stroke-dasharray:none;stroke-opacity:1"
       d="m 328.56812,509.37897 v -2.8125 h 5.625 v 2.8125 z"
       id="path3948" />
    <path
       id="path3950"
       d="m 370.75562,509.37897 v -2.8125 h 5.62497 v 2.8125 z"
       style="fill:none;stroke:#000000;stroke-width:0.396875;stroke-linecap:round;stroke-linejoin:round;stroke-miterlimit:4;stroke-dasharray:none;stroke-opacity:1" />
    <path
       style="fill:none;stroke:#000000;stroke-width:0.396875;stroke-linecap:round;stroke-linejoin:round;stroke-miterlimit:4;stroke-dasharray:none;stroke-opacity:1"
       d="m 362.31812,509.37897 v -2.8125 h 5.625 v 2.8125 z"
       id="path3952" />
    <path
       id="path3954"
       d="m 353.88062,509.37897 v -2.8125 h 5.625 v 2.8125 z"
       style="fill:none;stroke:#000000;stroke-width:0.396875;stroke-linecap:round;stroke-linejoin:round;stroke-miterlimit:4;stroke-dasharray:none;stroke-opacity:1" />
    <path
       style="fill:none;stroke:#000000;stroke-width:0.396875;stroke-linecap:round;stroke-linejoin:round;stroke-miterlimit:4;stroke-dasharray:none;stroke-opacity:1"
       d="m 379.19311,509.37897 v -2.8125 h 5.62499 v 2.8125 z"
       id="path3956" />
    <path
       style="fill:none;stroke:#000000;stroke-width:0.661458;stroke-linecap:round;stroke-linejoin:round;stroke-miterlimit:4;stroke-dasharray:none;stroke-opacity:1"
       d="m 325.75562,509.37897 87.23516,0.0531 v 28.125 l -87.23516,-0.053 z"
       id="path3958" />
    <path
       style="fill:none;stroke:#000000;stroke-width:0.661458;stroke-linecap:round;stroke-linejoin:round;stroke-miterlimit:4;stroke-dasharray:none;stroke-opacity:1"
       d="m 325.75562,521.10156 v 4.67982 c 1.29442,0 2.33991,-1.04549 2.33991,-2.33991 0,-1.29442 -1.04549,-2.33991 -2.33991,-2.33991 z"
       id="path3960" />
    <path
       id="path3962"
       d="m 345.44312,540.31647 v -2.8125 h 5.625 v 2.8125 z"
       style="fill:none;stroke:#000000;stroke-width:0.396875;stroke-linecap:round;stroke-linejoin:round;stroke-miterlimit:4;stroke-dasharray:none;stroke-opacity:1" />
    <path
       style="fill:none;stroke:#000000;stroke-width:0.396875;stroke-linecap:round;stroke-linejoin:round;stroke-miterlimit:4;stroke-dasharray:none;stroke-opacity:1"
       d="m 337.00562,540.31647 v -2.8125 h 5.625 v 2.8125 z"
       id="path3964" />
    <path
       id="path3966"
       d="m 328.56812,540.31647 v -2.8125 h 5.625 v 2.8125 z"
       style="fill:none;stroke:#000000;stroke-width:0.396875;stroke-linecap:round;stroke-linejoin:round;stroke-miterlimit:4;stroke-dasharray:none;stroke-opacity:1" />
    <path
       style="fill:none;stroke:#000000;stroke-width:0.396875;stroke-linecap:round;stroke-linejoin:round;stroke-miterlimit:4;stroke-dasharray:none;stroke-opacity:1"
       d="m 370.75562,540.31647 v -2.8125 h 5.62497 v 2.8125 z"
       id="path3968" />
    <path
       id="path3970"
       d="m 362.31812,540.31647 v -2.8125 h 5.625 v 2.8125 z"
       style="fill:none;stroke:#000000;stroke-width:0.396875;stroke-linecap:round;stroke-linejoin:round;stroke-miterlimit:4;stroke-dasharray:none;stroke-opacity:1" />
    <path
       style="fill:none;stroke:#000000;stroke-width:0.396875;stroke-linecap:round;stroke-linejoin:round;stroke-miterlimit:4;stroke-dasharray:none;stroke-opacity:1"
       d="m 353.88062,540.31647 v -2.8125 h 5.625 v 2.8125 z"
       id="path3972" />
    <path
       id="path3974"
       d="m 379.19311,540.31647 v -2.8125 h 5.62499 v 2.8125 z"
       style="fill:none;stroke:#000000;stroke-width:0.396875;stroke-linecap:round;stroke-linejoin:round;stroke-miterlimit:4;stroke-dasharray:none;stroke-opacity:1" />
    <text
       id="text4097"
       y="500.00397"
       x="362.82321"
       style="font-style:normal;font-variant:normal;font-weight:normal;font-stretch:normal;font-size:3.175px;line-height:0%;font-family:sans-serif;-inkscape-font-specification:Sans;text-align:start;letter-spacing:0px;word-spacing:0px;writing-mode:lr-tb;text-anchor:start;fill:#000000;fill-opacity:1;stroke:none;stroke-width:0.264583"
       xml:space="preserve"><tspan
         id="tspan4099"
         x="362.82321"
         y="500.00397"
         style="font-size:7.9375px;line-height:1.25;font-family:sans-serif;stroke-width:0.264583">244</tspan></text>
    <path
       style="fill:none;stroke:#000000;stroke-width:0.396875;stroke-linecap:round;stroke-linejoin:round;stroke-miterlimit:4;stroke-dasharray:none;stroke-opacity:1"
       d="m 349.24078,531.93202 v -5.625 h -7.5 v 5.625 z"
       id="path4267" />
    <path
       d="m 345.49078,526.30702 v -14.0625 h 2.8125 v -2.8125 m -2.8125,22.5 v 2.8125 h -5.625 v 2.8125"
       style="fill:none;stroke:#000000;stroke-width:0.396875;stroke-linecap:butt;stroke-linejoin:miter;stroke-miterlimit:4;stroke-dasharray:none;stroke-opacity:1"
       id="path4271" />
    <path
       id="path4279"
       d="m 344.55328,529.58827 0.9375,-0.9375 0.9375,0.9375"
       style="fill:none;stroke:#000000;stroke-width:0.396875;stroke-linecap:butt;stroke-linejoin:miter;stroke-miterlimit:4;stroke-dasharray:none;stroke-opacity:1" />
    <path
       id="path4281"
       d="m 387.67828,509.37897 v -2.8125 h 5.62498 v 2.8125 z"
       style="fill:none;stroke:#000000;stroke-width:0.396875;stroke-linecap:round;stroke-linejoin:round;stroke-miterlimit:4;stroke-dasharray:none;stroke-opacity:1" />
    <path
       style="fill:none;stroke:#000000;stroke-width:0.396875;stroke-linecap:round;stroke-linejoin:round;stroke-miterlimit:4;stroke-dasharray:none;stroke-opacity:1"
       d="m 396.11579,509.37897 v -2.8125 h 5.62498 v 2.8125 z"
       id="path4283" />
    <path
       id="path4285"
       d="m 404.55327,509.37897 v -2.8125 h 5.62499 v 2.8125 z"
       style="fill:none;stroke:#000000;stroke-width:0.396875;stroke-linecap:round;stroke-linejoin:round;stroke-miterlimit:4;stroke-dasharray:none;stroke-opacity:1" />
    <path
       style="fill:none;stroke:#000000;stroke-width:0.396875;stroke-linecap:round;stroke-linejoin:round;stroke-miterlimit:4;stroke-dasharray:none;stroke-opacity:1"
       d="m 387.67828,540.36952 v -2.8125 h 5.62498 v 2.8125 z"
       id="path4287" />
    <path
       id="path4289"
       d="m 396.11579,540.36952 v -2.8125 h 5.62498 v 2.8125 z"
       style="fill:none;stroke:#000000;stroke-width:0.396875;stroke-linecap:round;stroke-linejoin:round;stroke-miterlimit:4;stroke-dasharray:none;stroke-opacity:1" />
    <path
       style="fill:none;stroke:#000000;stroke-width:0.396875;stroke-linecap:round;stroke-linejoin:round;stroke-miterlimit:4;stroke-dasharray:none;stroke-opacity:1"
       d="m 404.55327,540.36952 v -2.8125 h 5.62499 v 2.8125 z"
       id="path4291" />
    <path
       id="path4293"
       d="m 350.17827,515.05702 v 5.62501 h 7.50001 v -5.625 z"
       style="fill:none;stroke:#000000;stroke-width:0.396875;stroke-linecap:round;stroke-linejoin:round;stroke-miterlimit:4;stroke-dasharray:none;stroke-opacity:1" />
    <path
       id="path4295"
       style="fill:none;stroke:#000000;stroke-width:0.396875;stroke-linecap:butt;stroke-linejoin:miter;stroke-miterlimit:4;stroke-dasharray:none;stroke-opacity:1"
       d="m 353.92828,520.68202 v 14.0625 h -5.625 v 2.8125 m 5.625,-22.5 v -2.8125 h 2.81249 v -2.8125" />
    <path
       style="fill:none;stroke:#000000;stroke-width:0.396875;stroke-linecap:butt;stroke-linejoin:miter;stroke-miterlimit:4;stroke-dasharray:none;stroke-opacity:1"
       d="m 354.86577,517.40078 -0.9375,0.93749 -0.9375,-0.93749"
       id="path4297" />
    <path
       id="path4299"
       d="m 333.25562,513.12897 v 5.625 h 7.5 v -5.625 z"
       style="fill:none;stroke:#000000;stroke-width:0.396875;stroke-linecap:round;stroke-linejoin:round;stroke-miterlimit:4;stroke-dasharray:none;stroke-opacity:1" />
    <path
       style="fill:none;stroke:#000000;stroke-width:0.396875;stroke-linecap:butt;stroke-linejoin:miter;stroke-miterlimit:4;stroke-dasharray:none;stroke-opacity:1"
       d="m 339.81812,509.37897 v 1.875 h -2.8125 v 1.875"
       id="path4301" />
    <path
       style="fill:none;stroke:#000000;stroke-width:0.396875;stroke-linecap:round;stroke-linejoin:round;stroke-miterlimit:4;stroke-dasharray:none;stroke-opacity:1"
       d="m 337.94312,533.75397 v -5.625 h -7.5 v 5.625 z"
       id="path4305" />
    <path
       id="path4307"
       d="m 331.38062,537.50397 v -1.875 h 2.8125 v -1.875"
       style="fill:none;stroke:#000000;stroke-width:0.396875;stroke-linecap:butt;stroke-linejoin:miter;stroke-miterlimit:4;stroke-dasharray:none;stroke-opacity:1" />
    <path
       id="path4309"
       d="m 366.11578,531.93202 v -5.625 h -7.5 v 5.625 z"
       style="fill:none;stroke:#000000;stroke-width:0.396875;stroke-linecap:round;stroke-linejoin:round;stroke-miterlimit:4;stroke-dasharray:none;stroke-opacity:1" />
    <path
       id="path4311"
       style="fill:none;stroke:#000000;stroke-width:0.396875;stroke-linecap:butt;stroke-linejoin:miter;stroke-miterlimit:4;stroke-dasharray:none;stroke-opacity:1"
       d="m 362.36578,526.30702 v -14.0625 h 2.8125 v -2.8125 m -2.8125,22.5 v 2.8125 h -5.625 v 2.8125" />
    <path
       style="fill:none;stroke:#000000;stroke-width:0.396875;stroke-linecap:butt;stroke-linejoin:miter;stroke-miterlimit:4;stroke-dasharray:none;stroke-opacity:1"
       d="m 361.42828,529.58827 0.9375,-0.9375 0.9375,0.9375"
       id="path4313" />
    <path
       style="fill:none;stroke:#000000;stroke-width:0.396875;stroke-linecap:round;stroke-linejoin:round;stroke-miterlimit:4;stroke-dasharray:none;stroke-opacity:1"
       d="m 367.05328,515.05702 v 5.62501 h 7.5 v -5.625 z"
       id="path4315" />
    <path
       d="m 370.80328,520.68202 v 14.0625 h -5.625 v 2.8125 m 5.625,-22.5 v -2.8125 h 2.8125 v -2.8125"
       style="fill:none;stroke:#000000;stroke-width:0.396875;stroke-linecap:butt;stroke-linejoin:miter;stroke-miterlimit:4;stroke-dasharray:none;stroke-opacity:1"
       id="path4317" />
    <path
       id="path4319"
       d="m 371.74077,517.40078 -0.9375,0.93749 -0.9375,-0.93749"
       style="fill:none;stroke:#000000;stroke-width:0.396875;stroke-linecap:butt;stroke-linejoin:miter;stroke-miterlimit:4;stroke-dasharray:none;stroke-opacity:1" />
    <path
       style="fill:none;stroke:#000000;stroke-width:0.396875;stroke-linecap:round;stroke-linejoin:round;stroke-miterlimit:4;stroke-dasharray:none;stroke-opacity:1"
       d="m 382.99079,531.93202 v -5.625 h -7.50002 v 5.625 z"
       id="path4321" />
    <path
       d="m 379.24077,526.30702 v -14.0625 h 2.81252 v -2.8125 m -2.81252,22.5 v 2.8125 h -5.62499 v 2.8125"
       style="fill:none;stroke:#000000;stroke-width:0.396875;stroke-linecap:butt;stroke-linejoin:miter;stroke-miterlimit:4;stroke-dasharray:none;stroke-opacity:1"
       id="path4323" />
    <path
       id="path4325"
       d="m 378.30327,529.58827 0.9375,-0.9375 0.93749,0.9375"
       style="fill:none;stroke:#000000;stroke-width:0.396875;stroke-linecap:butt;stroke-linejoin:miter;stroke-miterlimit:4;stroke-dasharray:none;stroke-opacity:1" />
    <path
       id="path4327"
       d="m 383.92828,515.05702 v 5.62501 h 7.49999 v -5.625 z"
       style="fill:none;stroke:#000000;stroke-width:0.396875;stroke-linecap:round;stroke-linejoin:round;stroke-miterlimit:4;stroke-dasharray:none;stroke-opacity:1" />
    <path
       id="path4329"
       style="fill:none;stroke:#000000;stroke-width:0.396875;stroke-linecap:butt;stroke-linejoin:miter;stroke-miterlimit:4;stroke-dasharray:none;stroke-opacity:1"
       d="m 387.67828,520.68202 v 14.0625 h -5.62499 v 2.8125 m 5.62499,-22.5 v -2.8125 h 2.81249 v -2.8125" />
    <path
       style="fill:none;stroke:#000000;stroke-width:0.396875;stroke-linecap:butt;stroke-linejoin:miter;stroke-miterlimit:4;stroke-dasharray:none;stroke-opacity:1"
       d="m 388.61577,517.40078 -0.93749,0.93749 -0.9375,-0.93749"
       id="path4331" />
    <path
       id="path4333"
       d="m 399.86578,531.93202 v -5.625 h -7.50001 v 5.625 z"
       style="fill:none;stroke:#000000;stroke-width:0.396875;stroke-linecap:round;stroke-linejoin:round;stroke-miterlimit:4;stroke-dasharray:none;stroke-opacity:1" />
    <path
       id="path4335"
       style="fill:none;stroke:#000000;stroke-width:0.396875;stroke-linecap:butt;stroke-linejoin:miter;stroke-miterlimit:4;stroke-dasharray:none;stroke-opacity:1"
       d="m 396.11576,526.30702 v -14.0625 h 2.81252 v -2.8125 m -2.81252,22.5 v 2.8125 h -5.62499 v 2.8125" />
    <path
       style="fill:none;stroke:#000000;stroke-width:0.396875;stroke-linecap:butt;stroke-linejoin:miter;stroke-miterlimit:4;stroke-dasharray:none;stroke-opacity:1"
       d="m 395.17826,529.58827 0.9375,-0.9375 0.9375,0.9375"
       id="path4337" />
    <path
       style="fill:none;stroke:#000000;stroke-width:0.396875;stroke-linecap:round;stroke-linejoin:round;stroke-miterlimit:4;stroke-dasharray:none;stroke-opacity:1"
       d="m 400.80328,515.05702 v 5.62501 h 7.49998 v -5.625 z"
       id="path4339" />
    <path
       d="m 404.55327,520.68202 v 14.0625 h -5.62499 v 2.8125 m 5.62499,-22.5 v -2.8125 h 2.81249 v -2.8125"
       style="fill:none;stroke:#000000;stroke-width:0.396875;stroke-linecap:butt;stroke-linejoin:miter;stroke-miterlimit:4;stroke-dasharray:none;stroke-opacity:1"
       id="path4341" />
    <path
       id="path4343"
       d="m 405.49077,517.40078 -0.9375,0.93749 -0.9375,-0.93749"
       style="fill:none;stroke:#000000;stroke-width:0.396875;stroke-linecap:butt;stroke-linejoin:miter;stroke-miterlimit:4;stroke-dasharray:none;stroke-opacity:1" />
    <path
       style="fill:none;stroke:#000000;stroke-width:0.396875;stroke-linecap:butt;stroke-linejoin:miter;stroke-miterlimit:4;stroke-dasharray:none;stroke-opacity:1"
       d="m 350.17827,517.86952 h -1.87499 v 4.6875"
       id="path4345" />
    <path
       style="fill:none;stroke:#000000;stroke-width:0.396875;stroke-linecap:butt;stroke-linejoin:miter;stroke-miterlimit:4;stroke-dasharray:none;stroke-opacity:1"
       d="m 367.05328,517.86952 h -1.875 v 4.6875"
       id="path4347" />
    <path
       style="fill:none;stroke:#000000;stroke-width:0.396875;stroke-linecap:butt;stroke-linejoin:miter;stroke-miterlimit:4;stroke-dasharray:none;stroke-opacity:1"
       d="m 383.92828,517.86952 h -1.87499 v 4.6875"
       id="path4349" />
    <path
       style="fill:none;stroke:#000000;stroke-width:0.396875;stroke-linecap:butt;stroke-linejoin:miter;stroke-miterlimit:4;stroke-dasharray:none;stroke-opacity:1"
       d="m 400.80328,517.86952 h -1.875 v 4.6875 l -61.92266,-0.053 v -2.8125"
       id="path4351" />
    <path
       style="fill:none;stroke:#000000;stroke-width:0.396875;stroke-linecap:butt;stroke-linejoin:miter;stroke-miterlimit:4;stroke-dasharray:none;stroke-opacity:1"
       d="m 341.74078,529.11952 h -1.875 v -4.6875"
       id="path4353" />
    <path
       style="fill:none;stroke:#000000;stroke-width:0.396875;stroke-linecap:butt;stroke-linejoin:miter;stroke-miterlimit:4;stroke-dasharray:none;stroke-opacity:1"
       d="m 358.61578,529.11952 h -1.87501 v -4.6875"
       id="path4355" />
    <path
       style="fill:none;stroke:#000000;stroke-width:0.396875;stroke-linecap:butt;stroke-linejoin:miter;stroke-miterlimit:4;stroke-dasharray:none;stroke-opacity:1"
       d="m 375.49077,529.11952 h -1.87499 v -4.6875"
       id="path4358" />
    <path
       style="fill:none;stroke:#000000;stroke-width:0.396875;stroke-linecap:butt;stroke-linejoin:miter;stroke-miterlimit:4;stroke-dasharray:none;stroke-opacity:1"
       d="m 392.36577,529.11952 h -1.875 v -4.6875 l -56.29765,-0.053 v 2.8125"
       id="path4360" />
    <path
       id="path4364"
       style="fill:#000000;fill-opacity:1;stroke:#000000;stroke-width:0.264583;stroke-linecap:butt;stroke-linejoin:miter;stroke-miterlimit:4;stroke-dasharray:none;stroke-opacity:1"
       d="m 339.86578,524.43202 h 0.5707 m 0,0 c 0,-0.31518 -0.25551,-0.57069 -0.5707,-0.57069 -0.31517,0 -0.57072,0.25551 -0.57072,0.57069 0,0.31518 0.25551,0.57069 0.57068,0.57069 0.3152,0 0.57074,-0.25551 0.57074,-0.57069 z" />
    <path
       d="m 356.74077,524.43202 h 0.57071 m 0,0 c 0,-0.31518 -0.25551,-0.57069 -0.57071,-0.57069 -0.31517,0 -0.57071,0.25551 -0.57071,0.57069 0,0.31518 0.2555,0.57069 0.57067,0.57069 0.3152,0 0.57075,-0.25551 0.57075,-0.57069 z"
       style="fill:#000000;fill-opacity:1;stroke:#000000;stroke-width:0.264583;stroke-linecap:butt;stroke-linejoin:miter;stroke-miterlimit:4;stroke-dasharray:none;stroke-opacity:1"
       id="path5141" />
    <path
       id="path5143"
       style="fill:#000000;fill-opacity:1;stroke:#000000;stroke-width:0.264583;stroke-linecap:butt;stroke-linejoin:miter;stroke-miterlimit:4;stroke-dasharray:none;stroke-opacity:1"
       d="m 373.61578,524.43202 h 0.5707 m 0,0 c 0,-0.31518 -0.25551,-0.57069 -0.5707,-0.57069 -0.31518,0 -0.57072,0.25551 -0.57072,0.57069 0,0.31518 0.2555,0.57069 0.57068,0.57069 0.31519,0 0.57074,-0.25551 0.57074,-0.57069 z" />
    <path
       d="m 382.05329,522.55701 0.5707,10e-6 m 0,0 c 0,-0.31518 -0.2555,-0.57069 -0.5707,-0.57069 -0.31517,0 -0.57074,0.25551 -0.57074,0.57069 0,0.31519 0.25551,0.57069 0.57068,0.57069 0.3152,0 0.57076,-0.2555 0.57076,-0.57069 z"
       style="fill:#000000;fill-opacity:1;stroke:#000000;stroke-width:0.264583;stroke-linecap:butt;stroke-linejoin:miter;stroke-miterlimit:4;stroke-dasharray:none;stroke-opacity:1"
       id="path5145" />
    <path
       id="path5147"
       style="fill:#000000;fill-opacity:1;stroke:#000000;stroke-width:0.264583;stroke-linecap:butt;stroke-linejoin:miter;stroke-miterlimit:4;stroke-dasharray:none;stroke-opacity:1"
       d="m 365.17828,522.55702 h 0.5707 m 0,0 c 0,-0.31518 -0.25551,-0.57069 -0.5707,-0.57069 -0.31518,0 -0.57074,0.25551 -0.57074,0.57069 0,0.31519 0.25551,0.57069 0.57068,0.57069 0.3152,0 0.57076,-0.2555 0.57076,-0.57069 z" />
    <path
       d="m 348.30328,522.55702 h 0.5707 m 0,0 c 0,-0.31518 -0.25551,-0.57069 -0.5707,-0.57069 -0.31518,0 -0.57074,0.25551 -0.57074,0.57069 0,0.31519 0.25551,0.57069 0.57068,0.57069 0.3152,0 0.57076,-0.2555 0.57076,-0.57069 z"
       style="fill:#000000;fill-opacity:1;stroke:#000000;stroke-width:0.264583;stroke-linecap:butt;stroke-linejoin:miter;stroke-miterlimit:4;stroke-dasharray:none;stroke-opacity:1"
       id="path5149" />
    <text
       xml:space="preserve"
       style="font-style:normal;font-variant:normal;font-weight:normal;font-stretch:normal;font-size:3.175px;line-height:0%;font-family:sans-serif;-inkscape-font-specification:Sans;text-align:start;letter-spacing:0px;word-spacing:0px;writing-mode:lr-tb;text-anchor:start;fill:#000000;fill-opacity:1;stroke:#000000;stroke-width:0.0529167;stroke-miterlimit:4;stroke-dasharray:none;stroke-opacity:1"
       x="407.53259"
       y="536.50494"
       id="text4065"><tspan
         y="536.50494"
         x="407.53259"
         id="tspan4067"
         style="font-size:2.64583px;line-height:1.25;font-family:sans-serif;stroke-width:0.0529167">10</tspan></text>
    <text
       id="text4069"
       y="512.23566"
       x="407.89172"
       style="font-style:normal;font-variant:normal;font-weight:normal;font-stretch:normal;font-size:3.175px;line-height:0%;font-family:sans-serif;-inkscape-font-specification:Sans;text-align:start;letter-spacing:0px;word-spacing:0px;writing-mode:lr-tb;text-anchor:start;fill:#000000;fill-opacity:1;stroke:#000000;stroke-width:0.0529167;stroke-miterlimit:4;stroke-dasharray:none;stroke-opacity:1"
       xml:space="preserve"><tspan
         y="512.23566"
         x="407.89172"
         id="tspan4071"
         style="font-size:2.64583px;line-height:1.25;font-family:sans-serif;stroke-width:0.0529167">11</tspan></text>
    <text
       xml:space="preserve"
       style="font-style:normal;font-variant:normal;font-weight:normal;font-stretch:normal;font-size:3.175px;line-height:0%;font-family:sans-serif;-inkscape-font-specification:Sans;text-align:start;letter-spacing:0px;word-spacing:0px;writing-mode:lr-tb;text-anchor:start;fill:#000000;fill-opacity:1;stroke:#000000;stroke-width:0.0529167;stroke-miterlimit:4;stroke-dasharray:none;stroke-opacity:1"
       x="329.93304"
       y="512.23572"
       id="text4073"><tspan
         y="512.23572"
         x="329.93304"
         id="tspan4075"
         style="font-size:2.64583px;line-height:1.25;font-family:sans-serif;stroke-width:0.0529167">20</tspan></text>
    <text
       id="text4077"
       y="505.56717"
       x="328.52045"
       style="font-style:normal;font-variant:normal;font-weight:normal;font-stretch:normal;font-size:3.175px;line-height:0%;font-family:sans-serif;-inkscape-font-specification:Sans;text-align:start;letter-spacing:0px;word-spacing:0px;writing-mode:lr-tb;text-anchor:start;fill:#000000;fill-opacity:1;stroke:#000000;stroke-width:0.0529167;stroke-miterlimit:4;stroke-dasharray:none;stroke-opacity:1"
       xml:space="preserve"><tspan
         y="505.56717"
         x="328.52045"
         id="tspan4079"
         style="font-size:3.43958px;line-height:1.25;font-family:sans-serif;stroke-width:0.0529167">Vcc</tspan></text>
    <text
       id="text4081"
       y="543.76685"
       x="403.5441"
       style="font-style:normal;font-variant:normal;font-weight:normal;font-stretch:normal;font-size:3.175px;line-height:0%;font-family:sans-serif;-inkscape-font-specification:Sans;text-align:start;letter-spacing:0px;word-spacing:0px;writing-mode:lr-tb;text-anchor:start;fill:#000000;fill-opacity:1;stroke:#000000;stroke-width:0.0529167;stroke-miterlimit:4;stroke-dasharray:none;stroke-opacity:1"
       xml:space="preserve"><tspan
         y="543.76685"
         x="403.5441"
         id="tspan4083"
         style="font-size:3.43958px;line-height:1.25;font-family:sans-serif;stroke-width:0.0529167">GND</tspan></text>
    <text
       xml:space="preserve"
       style="font-style:normal;font-variant:normal;font-weight:normal;font-stretch:normal;font-size:3.175px;line-height:0%;font-family:sans-serif;-inkscape-font-specification:Sans;text-align:start;letter-spacing:0px;word-spacing:0px;writing-mode:lr-tb;text-anchor:start;fill:#000000;fill-opacity:1;stroke:#000000;stroke-width:0.0529167;stroke-miterlimit:4;stroke-dasharray:none;stroke-opacity:1"
       x="328.10803"
       y="536.53131"
       id="text4085"><tspan
         id="tspan4087"
         x="328.10803"
         y="536.53131"
         style="font-size:2.64583px;line-height:1.25;font-family:sans-serif;stroke-width:0.0529167">1</tspan></text>
    <text
       id="text5152"
       y="517.70605"
       x="335.90683"
       style="font-style:normal;font-variant:normal;font-weight:normal;font-stretch:normal;font-size:3.175px;line-height:0%;font-family:sans-serif;-inkscape-font-specification:Sans;text-align:start;letter-spacing:0px;word-spacing:0px;writing-mode:lr-tb;text-anchor:start;fill:#000000;fill-opacity:1;stroke:none;stroke-width:0.264583"
       xml:space="preserve"><tspan
         y="517.70605"
         x="335.90683"
         id="tspan5154"
         style="font-size:4.7625px;line-height:1.25;font-family:sans-serif;stroke-width:0.264583">1</tspan></text>
    <text
       xml:space="preserve"
       style="font-style:normal;font-variant:normal;font-weight:normal;font-stretch:normal;font-size:3.175px;line-height:0%;font-family:sans-serif;-inkscape-font-specification:Sans;text-align:start;letter-spacing:0px;word-spacing:0px;writing-mode:lr-tb;text-anchor:start;fill:#000000;fill-opacity:1;stroke:none;stroke-width:0.264583"
       x="333.09433"
       y="532.70605"
       id="text5158"><tspan
         id="tspan5160"
         x="333.09433"
         y="532.70605"
         style="font-size:4.7625px;line-height:1.25;font-family:sans-serif;stroke-width:0.264583">1</tspan></text>
    <g
       id="g8197"
       transform="matrix(0.26458333,0,0,0.26458333,307.77368,304.91898)">
      <text
         id="text5162"
         y="905.46405"
         x="75.597687"
         style="font-style:normal;font-variant:normal;font-weight:normal;font-stretch:normal;line-height:0%;font-family:sans-serif;-inkscape-font-specification:Sans;text-align:start;letter-spacing:0px;word-spacing:0px;writing-mode:lr-tb;text-anchor:start;fill:#000000;fill-opacity:1;stroke:#000000;stroke-width:0.2;stroke-miterlimit:4;stroke-dasharray:none;stroke-opacity:1"
         xml:space="preserve"><tspan
           y="905.46405"
           x="75.597687"
           id="tspan5164"
           style="font-size:13px;line-height:1.25;font-family:sans-serif">1OE</tspan></text>
      <path
         id="path5166"
         d="M 100.78296,894.06339 H 83.55808"
         style="fill:none;stroke:#000000;stroke-width:1.5;stroke-linecap:butt;stroke-linejoin:miter;stroke-miterlimit:4;stroke-dasharray:none;stroke-opacity:1" />
    </g>
    <g
       id="g8189"
       transform="matrix(0.26458333,0,0,0.26458333,307.76199,304.78762)">
      <text
         xml:space="preserve"
         style="font-style:normal;font-variant:normal;font-weight:normal;font-stretch:normal;line-height:0%;font-family:sans-serif;-inkscape-font-specification:Sans;text-align:start;letter-spacing:0px;word-spacing:0px;writing-mode:lr-tb;text-anchor:start;fill:#000000;fill-opacity:1;stroke:#000000;stroke-width:0.2;stroke-miterlimit:4;stroke-dasharray:none;stroke-opacity:1"
         x="108.09316"
         y="758.78552"
         id="text5176"><tspan
           id="tspan5178"
           x="108.09316"
           y="758.78552"
           style="font-size:13px;line-height:1.25;font-family:sans-serif">2OE</tspan></text>
      <path
         style="fill:none;stroke:#000000;stroke-width:1.5;stroke-linecap:butt;stroke-linejoin:miter;stroke-miterlimit:4;stroke-dasharray:none;stroke-opacity:1"
         d="M 133.19005,747.42362 H 115.96517"
         id="path5180" />
    </g>
    <path
       id="path8089"
       d="m 336.29226,519.46733 c 0,0.39398 0.31938,0.71337 0.71336,0.71337 0.39397,0 0.71337,-0.31939 0.71337,-0.71337 0,-0.39397 -0.3194,-0.71336 -0.71337,-0.71336 -0.39398,0 -0.71336,0.31939 -0.71336,0.71336 z"
       style="fill:#ffffff;fill-opacity:1;stroke:#000000;stroke-width:0.396875;stroke-linecap:round;stroke-linejoin:round;stroke-miterlimit:4;stroke-dasharray:none;stroke-opacity:1" />
    <path
       style="fill:#ffffff;fill-opacity:1;stroke:#000000;stroke-width:0.396875;stroke-linecap:round;stroke-linejoin:round;stroke-miterlimit:4;stroke-dasharray:none;stroke-opacity:1"
       d="m 333.47976,527.4156 c 0,0.39398 0.31938,0.71337 0.71336,0.71337 0.39397,0 0.71337,-0.31939 0.71337,-0.71337 0,-0.39398 -0.3194,-0.71336 -0.71337,-0.71336 -0.39398,0 -0.71336,0.31938 -0.71336,0.71336 z"
       id="path8244" />
  </g>
</svg>
