<?xml version="1.0" encoding="UTF-8" standalone="no"?>
<!-- Created with Inkscape (http://www.inkscape.org/) -->

<svg
   width="84.63842mm"
   height="79.457237mm"
   viewBox="0 0 84.638422 79.457237"
   version="1.1"
   id="svg37530"
   xmlns="http://www.w3.org/2000/svg"
   xmlns:svg="http://www.w3.org/2000/svg">
  <defs
     id="defs37527" />
  <g
     id="layer1"
     transform="translate(39.734581,-117.93015)">
    <circle
       style="fill:none;stroke:#000000;stroke-width:0.5;stroke-linecap:round;stroke-linejoin:round;stroke-dasharray:none;stroke-opacity:1"
       id="circle14390"
       cx="24.240427"
       cy="167.51485"
       r="5.6246567" />
    <path
       style="fill:none;stroke:#000000;stroke-width:0.4;stroke-linecap:butt;stroke-linejoin:miter;stroke-dasharray:none;stroke-opacity:1"
       d="m 21.865091,163.51485 v 8"
       id="path14392" />
    <path
       style="fill:none;stroke:#000000;stroke-width:0.4;stroke-linecap:butt;stroke-linejoin:miter;stroke-dasharray:none;stroke-opacity:1"
       d="m 21.865091,165.51485 4,-3 v -10"
       id="path14394" />
    <path
       style="fill:none;stroke:#000000;stroke-width:0.4;stroke-linecap:butt;stroke-linejoin:miter;stroke-dasharray:none;stroke-opacity:1"
       d="m 21.865091,169.51485 4,3 v 20"
       id="path14396" />
    <path
       style="fill:#000000;fill-opacity:1;stroke:none;stroke-width:0.264583px;stroke-linecap:butt;stroke-linejoin:miter;stroke-opacity:1"
       d="m 23.969601,172.34426 1.19889,-1.60083 0.8416,1.87963 z"
       id="path14398" />
    <g
       aria-label="GND"
       id="text14402"
       style="font-size:3.88056px;line-height:100%;font-family:Sans;-inkscape-font-specification:Sans;letter-spacing:0px;word-spacing:0px;stroke:#000000;stroke-width:0">
      <path
         d="m 23.152676,196.2505 v -0.32591 l 1.176674,-0.002 v 1.03077 q -0.270957,0.21601 -0.558967,0.32591 -0.288011,0.108 -0.59118,0.108 -0.409277,0 -0.744658,-0.17432 -0.333485,-0.17622 -0.504018,-0.50781 -0.170532,-0.33159 -0.170532,-0.74087 0,-0.40548 0.168637,-0.75602 0.170533,-0.35244 0.48886,-0.52297 0.318327,-0.17053 0.733289,-0.17053 0.301274,0 0.543809,0.0985 0.24443,0.0966 0.382751,0.27095 0.138321,0.17433 0.210323,0.45476 l -0.331591,0.0909 q -0.06253,-0.21222 -0.155374,-0.33349 -0.09285,-0.12126 -0.265272,-0.19327 -0.172427,-0.0739 -0.382751,-0.0739 -0.252009,0 -0.435805,0.0777 -0.183796,0.0758 -0.297484,0.20085 -0.111794,0.12506 -0.174322,0.27475 -0.106109,0.25769 -0.106109,0.55897 0,0.37138 0.126952,0.62149 0.128846,0.25012 0.373276,0.37138 0.24443,0.12127 0.519177,0.12127 0.238745,0 0.466122,-0.0909 0.227376,-0.0928 0.344854,-0.19706 v -0.51728 z"
         style="font-family:sans-serif;-inkscape-font-specification:sans-serif"
         id="path157901" />
      <path
         d="m 24.867474,197.34001 v -2.77778 h 0.377067 l 1.458999,2.18092 v -2.18092 h 0.352434 v 2.77778 h -0.377066 l -1.459,-2.18281 v 2.18281 z"
         style="font-family:sans-serif;-inkscape-font-specification:sans-serif"
         id="path157903" />
      <path
         d="m 27.67368,197.34001 v -2.77778 h 0.956876 q 0.324012,0 0.494544,0.0398 0.238746,0.0549 0.407383,0.19895 0.219798,0.18569 0.327802,0.4756 0.109898,0.28801 0.109898,0.65939 0,0.31643 -0.0739,0.56086 -0.0739,0.24443 -0.189481,0.40549 -0.115583,0.15917 -0.253903,0.25201 -0.136426,0.0909 -0.331591,0.13832 -0.19327,0.0474 -0.445279,0.0474 z m 0.367592,-0.3278 h 0.593074 q 0.274747,0 0.430121,-0.0512 0.157268,-0.0512 0.250114,-0.144 0.130741,-0.13075 0.202744,-0.35054 0.0739,-0.2217 0.0739,-0.53623 0,-0.43581 -0.144005,-0.66887 -0.14211,-0.23495 -0.346749,-0.31454 -0.147795,-0.0568 -0.475596,-0.0568 h -0.5836 z"
         style="font-family:sans-serif;-inkscape-font-specification:sans-serif"
         id="path157905" />
    </g>
    <path
       style="fill:none;stroke:#000000;stroke-width:0.7;stroke-linecap:butt;stroke-linejoin:miter;stroke-miterlimit:4;stroke-dasharray:none;stroke-opacity:1"
       d="m 22.865091,192.51485 h 6"
       id="path14404" />
    <path
       id="path14406"
       style="fill:#000000;fill-opacity:1;stroke:none;stroke-width:1.04298;stroke-linecap:butt;stroke-linejoin:miter;stroke-miterlimit:4;stroke-dasharray:none;stroke-opacity:1"
       d="m 25.865091,152.51485 h 0.89999 m 0,0 c 0,-0.49703 -0.40293,-0.89996 -0.89999,-0.89996 -0.49702,0 -0.90001,0.40293 -0.90001,0.89996 0,0.49703 0.40293,0.89997 0.89995,0.89997 0.49706,0 0.90005,-0.40294 0.90005,-0.89997 z" />
    <path
       id="path14410"
       style="fill:none;fill-opacity:0.5;stroke:#000000;stroke-width:0.5;stroke-linecap:round;stroke-linejoin:round;stroke-dasharray:none"
       d="m 35.865091,151.51485 a 1,1 0 0 1 1,1 1,1 0 0 1 -1,1 1,1 0 0 1 -1,-1 1,1 0 0 1 1,-1 z" />
    <path
       style="fill:none;stroke:#000000;stroke-width:0.4;stroke-linecap:butt;stroke-linejoin:miter;stroke-dasharray:none;stroke-opacity:1"
       d="m 25.865091,152.51485 h 9"
       id="path14412" />
    <g
       aria-label="Out"
       id="text14416"
       style="font-size:3.88056px;line-height:100%;font-family:Sans;-inkscape-font-specification:Sans;letter-spacing:0px;word-spacing:0px;stroke:#000000;stroke-width:0">
      <path
         d="m 38.865099,152.55182 q 0,-0.69161 0.371381,-1.08194 0.371382,-0.39222 0.958772,-0.39222 0.384645,0 0.693498,0.1838 0.308853,0.18379 0.469912,0.51349 0.162953,0.3278 0.162953,0.74466 0,0.42254 -0.170533,0.75602 -0.170532,0.33349 -0.483175,0.50592 -0.312642,0.17053 -0.67455,0.17053 -0.392225,0 -0.701078,-0.18948 -0.308853,-0.18948 -0.468017,-0.51728 -0.159163,-0.3278 -0.159163,-0.6935 z m 0.378961,0.006 q 0,0.50213 0.269062,0.79203 0.270957,0.28801 0.67834,0.28801 0.414962,0 0.68213,-0.2918 0.269062,-0.2918 0.269062,-0.82803 0,-0.33917 -0.115583,-0.59118 -0.113688,-0.2539 -0.335381,-0.39222 -0.219797,-0.14022 -0.494544,-0.14022 -0.390329,0 -0.672655,0.26906 -0.280431,0.26717 -0.280431,0.89435 z"
         style="font-family:sans-serif;-inkscape-font-specification:sans-serif"
         id="path157839" />
      <path
         d="m 43.27052,153.90471 v -0.29559 q -0.234956,0.34106 -0.63855,0.34106 -0.178111,0 -0.333485,-0.0682 -0.153479,-0.0682 -0.229272,-0.17053 -0.0739,-0.10422 -0.104214,-0.25391 -0.02084,-0.10042 -0.02084,-0.31832 v -1.24678 h 0.341065 v 1.11604 q 0,0.26716 0.02084,0.36001 0.03221,0.13453 0.136426,0.21222 0.104214,0.0758 0.257693,0.0758 0.15348,0 0.288011,-0.0777 0.134531,-0.0796 0.18948,-0.21411 0.05684,-0.13643 0.05684,-0.39412 v -1.07814 h 0.341065 v 2.01228 z"
         style="font-family:sans-serif;-inkscape-font-specification:sans-serif"
         id="path157841" />
      <path
         d="m 44.854576,153.59965 0.04926,0.30127 q -0.144005,0.0303 -0.257693,0.0303 -0.185691,0 -0.288011,-0.0587 -0.102319,-0.0587 -0.144005,-0.15348 -0.04169,-0.0966 -0.04169,-0.4036 v -1.15772 h -0.250114 v -0.26527 h 0.250114 v -0.49834 l 0.339171,-0.20464 v 0.70298 h 0.342959 v 0.26527 h -0.342959 v 1.17667 q 0,0.1459 0.01705,0.18759 0.01895,0.0417 0.05874,0.0663 0.04169,0.0246 0.117478,0.0246 0.05684,0 0.149689,-0.0133 z"
         style="font-family:sans-serif;-inkscape-font-specification:sans-serif"
         id="path157843" />
    </g>
    <path
       style="fill:none;stroke:#000000;stroke-width:0.4;stroke-linecap:butt;stroke-linejoin:miter;stroke-dasharray:none;stroke-opacity:1"
       d="m 25.865091,124.51485 v 28"
       id="path14418" />
    <path
       id="path14420"
       d="m 27.365091,142.51485 h -3 v -9 h 3 z"
       style="fill:#ffffff;fill-opacity:1;stroke:#000000;stroke-width:0.5;stroke-linecap:butt;stroke-linejoin:miter;stroke-miterlimit:4;stroke-dasharray:none;stroke-opacity:1" />
    <g
       aria-label="T3"
       id="text14424"
       style="font-size:3.88056px;line-height:100%;font-family:Sans;-inkscape-font-specification:Sans;letter-spacing:0px;word-spacing:0px;stroke:#000000;stroke-width:0">
      <path
         d="m 32.780283,168.46559 v -2.44998 h -0.915191 v -0.3278 h 2.201763 v 0.3278 h -0.91898 v 2.44998 z"
         style="font-family:sans-serif;-inkscape-font-specification:sans-serif"
         id="path157884" />
      <path
         d="m 34.307495,167.7323 0.341065,-0.0455 q 0.05874,0.2899 0.198955,0.41875 0.14211,0.12695 0.344854,0.12695 0.24064,0 0.405488,-0.16674 0.166743,-0.16675 0.166743,-0.41307 0,-0.23496 -0.153479,-0.38654 -0.153479,-0.15348 -0.39033,-0.15348 -0.09663,0 -0.24064,0.0379 l 0.0379,-0.29938 q 0.03411,0.004 0.05495,0.004 0.217903,0 0.392225,-0.11369 0.174322,-0.11369 0.174322,-0.35054 0,-0.18759 -0.126952,-0.31075 -0.126952,-0.12316 -0.327801,-0.12316 -0.198955,0 -0.331591,0.12506 -0.132636,0.12505 -0.170533,0.37517 l -0.341064,-0.0606 q 0.06253,-0.34295 0.28422,-0.53054 0.221693,-0.18948 0.551389,-0.18948 0.227376,0 0.418751,0.0985 0.191376,0.0966 0.2918,0.26527 0.10232,0.16864 0.10232,0.35812 0,0.18001 -0.09663,0.3278 -0.09663,0.1478 -0.286116,0.23496 0.246325,0.0568 0.382751,0.23685 0.136426,0.17811 0.136426,0.44717 0,0.3638 -0.265273,0.61771 -0.265273,0.25201 -0.670761,0.25201 -0.365697,0 -0.608232,-0.21791 -0.24064,-0.2179 -0.274747,-0.56465 z"
         style="font-family:sans-serif;-inkscape-font-specification:sans-serif"
         id="path157886" />
    </g>
    <g
       aria-label="R2"
       id="text14428"
       style="font-size:3.88056px;line-height:100%;font-family:Sans;-inkscape-font-specification:Sans;letter-spacing:0px;word-spacing:0px;stroke:#000000;stroke-width:0">
      <path
         d="m 17.414196,137.51485 v -2.77779 h 1.231623 q 0.371382,0 0.564652,0.0758 0.19327,0.0739 0.308853,0.26337 0.115583,0.18948 0.115583,0.41876 0,0.29558 -0.191375,0.49833 -0.191375,0.20274 -0.591179,0.25769 0.1459,0.0701 0.221692,0.13832 0.161059,0.1478 0.305064,0.36949 l 0.483175,0.75603 h -0.462332 l -0.367593,-0.57792 q -0.161058,-0.25011 -0.265272,-0.38275 -0.104214,-0.13264 -0.187586,-0.18569 -0.08148,-0.0531 -0.166743,-0.0739 -0.06253,-0.0133 -0.204639,-0.0133 h -0.426331 v 1.23352 z m 0.367592,-1.55185 h 0.790134 q 0.252009,0 0.394119,-0.0512 0.142111,-0.0531 0.216008,-0.16674 0.0739,-0.11558 0.0739,-0.25011 0,-0.19706 -0.144005,-0.32402 -0.14211,-0.12695 -0.450963,-0.12695 h -0.87919 z"
         style="font-family:sans-serif;-inkscape-font-specification:sans-serif"
         id="path157846" />
      <path
         d="m 21.865092,137.18705 v 0.3278 h -1.836065 q -0.0038,-0.12317 0.03979,-0.23685 0.07011,-0.18759 0.223587,-0.36949 0.155374,-0.1819 0.447173,-0.42065 0.452859,-0.37138 0.612022,-0.58739 0.159164,-0.2179 0.159164,-0.41117 0,-0.20274 -0.1459,-0.34106 -0.144005,-0.14022 -0.377066,-0.14022 -0.246325,0 -0.394119,0.1478 -0.147795,0.14779 -0.14969,0.40927 l -0.350539,-0.036 q 0.036,-0.39222 0.270957,-0.59686 0.234956,-0.20654 0.63097,-0.20654 0.399804,0 0.632865,0.2217 0.233061,0.22169 0.233061,0.54949 0,0.16674 -0.06821,0.3278 -0.06821,0.16106 -0.227377,0.33917 -0.157268,0.17811 -0.524861,0.48886 -0.306958,0.25769 -0.394119,0.35054 -0.08716,0.0909 -0.144005,0.1838 z"
         style="font-family:sans-serif;-inkscape-font-specification:sans-serif"
         id="path157848" />
    </g>
    <g
       aria-label="10k"
       id="text14432"
       style="font-size:3.175px;line-height:100%;font-family:Sans;-inkscape-font-specification:Sans;letter-spacing:0px;word-spacing:0px;stroke:#000000;stroke-width:0">
      <path
         d="m 17.941298,141.79689 h -0.279052 v -1.77819 q -0.100769,0.0961 -0.265101,0.19224 -0.16278,0.0961 -0.293005,0.14418 v -0.26975 q 0.234094,-0.11007 0.409277,-0.26665 0.175184,-0.15658 0.248047,-0.30386 h 0.179834 z"
         style="font-family:sans-serif;-inkscape-font-specification:sans-serif"
         id="path157851" />
      <path
         d="m 18.655983,140.67603 q 0,-0.40308 0.08217,-0.64802 0.08372,-0.2465 0.246496,-0.37983 0.164331,-0.13332 0.412378,-0.13332 0.182935,0 0.320911,0.0744 0.137976,0.0729 0.227893,0.21239 0.08992,0.13798 0.141077,0.33797 0.05116,0.19843 0.05116,0.5364 0,0.39997 -0.08216,0.64647 -0.08217,0.24495 -0.246497,0.37982 -0.16278,0.13333 -0.412378,0.13333 -0.328662,0 -0.516247,-0.23565 -0.224793,-0.2837 -0.224793,-0.92397 z m 0.286805,0 q 0,0.55965 0.130224,0.74569 0.131775,0.18448 0.324011,0.18448 0.192237,0 0.322461,-0.18603 0.131775,-0.18604 0.131775,-0.74414 0,-0.56121 -0.131775,-0.74569 -0.130224,-0.18449 -0.325561,-0.18449 -0.192237,0 -0.306958,0.16278 -0.144177,0.20774 -0.144177,0.7674 z"
         style="font-family:sans-serif;-inkscape-font-specification:sans-serif"
         id="path157853" />
      <path
         d="m 20.500832,141.79689 v -2.27273 h 0.279053 v 1.29605 l 0.660424,-0.66973 h 0.361219 l -0.629419,0.61081 0.692981,1.0356 h -0.344165 l -0.544153,-0.84181 -0.196887,0.18914 v 0.65267 z"
         style="font-family:sans-serif;-inkscape-font-specification:sans-serif"
         id="path157855" />
    </g>
    <g
       aria-label="1M"
       id="text14440"
       style="font-size:3.175px;line-height:100%;font-family:Sans;-inkscape-font-specification:Sans;letter-spacing:0px;word-spacing:0px;stroke:#000000;stroke-width:0">
      <path
         d="m -16.122323,141.79689 h -0.279053 v -1.77819 q -0.100769,0.0961 -0.2651,0.19224 -0.162781,0.0961 -0.293005,0.14418 v -0.26975 q 0.234094,-0.11007 0.409277,-0.26665 0.175183,-0.15658 0.248047,-0.30386 h 0.179834 z"
         style="font-family:sans-serif;-inkscape-font-specification:sans-serif"
         id="path157863" />
      <path
         d="m -15.303769,141.79689 v -2.27273 h 0.452686 l 0.537952,1.6092 q 0.07441,0.2248 0.10852,0.33642 0.03876,-0.12402 0.120923,-0.36432 l 0.544153,-1.5813 h 0.404626 v 2.27273 h -0.289905 v -1.90221 l -0.660424,1.90221 h -0.271302 l -0.657324,-1.93477 v 1.93477 z"
         style="font-family:sans-serif;-inkscape-font-specification:sans-serif"
         id="path157865" />
    </g>
    <path
       id="path14446"
       style="fill:none;fill-opacity:0.5;stroke:#000000;stroke-width:0.5;stroke-linecap:round;stroke-linejoin:round;stroke-dasharray:none"
       d="m -34.134909,156.51485 a 1,1 0 0 1 1,1 1,1 0 0 1 -1,1 1,1 0 0 1 -1,-1 1,1 0 0 1 1,-1 z" />
    <path
       id="path14456"
       style="fill:none;fill-opacity:0.5;stroke:#000000;stroke-width:0.5;stroke-linecap:round;stroke-linejoin:round;stroke-dasharray:none"
       d="m -34.134909,171.51485 a 1,1 0 0 1 1,1 1,1 0 0 1 -1,1 1,1 0 0 1 -1,-1 1,1 0 0 1 1,-1 z" />
    <path
       style="fill:none;stroke:#000000;stroke-width:0.4;stroke-linecap:butt;stroke-linejoin:miter;stroke-dasharray:none;stroke-opacity:1"
       d="m 25.865091,128.51485 h -35 v 19"
       id="path14466" />
    <g
       aria-label="R1"
       id="text14476"
       style="font-size:3.88056px;line-height:100%;font-family:Sans;-inkscape-font-specification:Sans;letter-spacing:0px;word-spacing:0px;stroke:#000000;stroke-width:0">
      <path
         d="m -17.077999,137.51485 v -2.77779 h 1.231623 q 0.371382,0 0.564652,0.0758 0.19327,0.0739 0.308853,0.26337 0.115583,0.18948 0.115583,0.41876 0,0.29558 -0.191375,0.49833 -0.191375,0.20274 -0.591179,0.25769 0.1459,0.0701 0.221692,0.13832 0.161058,0.1478 0.305064,0.36949 l 0.483175,0.75603 h -0.462333 l -0.367592,-0.57792 q -0.161058,-0.25011 -0.265272,-0.38275 -0.104215,-0.13264 -0.187586,-0.18569 -0.08148,-0.0531 -0.166743,-0.0739 -0.06253,-0.0133 -0.204639,-0.0133 h -0.426331 v 1.23352 z m 0.367592,-1.55185 h 0.790134 q 0.252009,0 0.394119,-0.0512 0.142111,-0.0531 0.216008,-0.16674 0.0739,-0.11558 0.0739,-0.25011 0,-0.19706 -0.144005,-0.32402 -0.14211,-0.12695 -0.450963,-0.12695 h -0.87919 z"
         style="font-family:sans-serif;-inkscape-font-specification:sans-serif"
         id="path157858" />
      <path
         d="m -13.13491,137.51485 h -0.341065 v -2.17334 q -0.123162,0.11747 -0.324012,0.23495 -0.198954,0.11748 -0.358118,0.17622 v -0.3297 q 0.286116,-0.13453 0.500229,-0.3259 0.214113,-0.19138 0.303168,-0.37139 h 0.219798 z"
         style="font-family:sans-serif;-inkscape-font-specification:sans-serif"
         id="path157860" />
    </g>
    <g
       aria-label="A"
       id="text14484"
       style="font-size:3.88056px;line-height:100%;font-family:Sans;-inkscape-font-specification:Sans;letter-spacing:0px;word-spacing:0px;stroke:#000000;stroke-width:0">
      <path
         d="m -39.734582,158.90376 1.066776,-2.77778 h 0.396014 l 1.136882,2.77778 h -0.418751 l -0.324012,-0.84129 h -1.161515 l -0.305064,0.84129 z m 0.801503,-1.14067 h 0.941718 l -0.289905,-0.76929 q -0.132637,-0.35054 -0.19706,-0.57602 -0.05306,0.26717 -0.14969,0.53054 z"
         style="font-family:sans-serif;-inkscape-font-specification:sans-serif"
         id="path157878" />
    </g>
    <g
       aria-label="B"
       id="text14488"
       style="font-size:3.88056px;line-height:100%;font-family:Sans;-inkscape-font-specification:Sans;letter-spacing:0px;word-spacing:0px;stroke:#000000;stroke-width:0">
      <path
         d="m -39.232457,173.90379 v -2.77778 h 1.042142 q 0.318328,0 0.509703,0.0853 0.19327,0.0834 0.301274,0.25958 0.109898,0.17433 0.109898,0.3657 0,0.17811 -0.09663,0.33538 -0.09663,0.15727 -0.291799,0.25391 0.252009,0.0739 0.38654,0.252 0.136426,0.17812 0.136426,0.42065 0,0.19517 -0.08337,0.3638 -0.08148,0.16675 -0.202744,0.2577 -0.121267,0.0909 -0.305063,0.13832 -0.181902,0.0455 -0.447174,0.0455 z m 0.367592,-1.61058 h 0.600653 q 0.24443,0 0.350539,-0.0322 0.140215,-0.0417 0.210323,-0.13832 0.072,-0.0966 0.072,-0.24254 0,-0.13832 -0.06632,-0.24253 -0.06632,-0.10611 -0.189481,-0.14401 -0.123162,-0.0398 -0.422541,-0.0398 h -0.555178 z m 0,1.28278 h 0.691604 q 0.178111,0 0.250114,-0.0133 0.126952,-0.0227 0.212218,-0.0758 0.08527,-0.0531 0.140216,-0.15348 0.05495,-0.10232 0.05495,-0.23496 0,-0.15537 -0.07958,-0.26906 -0.07958,-0.11558 -0.221692,-0.16106 -0.140216,-0.0474 -0.405488,-0.0474 h -0.642339 z"
         style="font-family:sans-serif;-inkscape-font-specification:sans-serif"
         id="path157881" />
    </g>
    <path
       style="fill:none;stroke:#000000;stroke-width:0.4;stroke-linecap:butt;stroke-linejoin:miter;stroke-dasharray:none;stroke-opacity:1"
       d="m 21.865091,167.51485 h -11"
       id="path14490" />
    <path
       id="path14492"
       style="fill:none;fill-opacity:0.5;stroke:#000000;stroke-width:0.5;stroke-linecap:round;stroke-linejoin:round;stroke-dasharray:none"
       d="m 25.865091,122.51485 a 1,1 0 0 1 1,1 1,1 0 0 1 -1,1 1,1 0 0 1 -1,-1 1,1 0 0 1 1,-1 z" />
    <g
       aria-label="+VCC"
       id="text14498"
       style="font-size:3.88056px;line-height:100%;font-family:Sans;-inkscape-font-specification:Sans;letter-spacing:0px;word-spacing:0px;stroke:#000000;stroke-width:0">
      <path
         d="m 22.530188,120.25886 v -0.76171 h -0.756027 v -0.31833 h 0.756027 v -0.75602 h 0.322117 v 0.75602 h 0.756027 v 0.31833 h -0.756027 v 0.76171 z"
         style="font-family:sans-serif;-inkscape-font-specification:sans-serif"
         id="path157825" />
      <path
         d="m 24.917642,120.70793 -1.076249,-2.77778 h 0.397909 l 0.72192,2.01796 q 0.08716,0.24254 0.1459,0.45476 0.06442,-0.22738 0.14969,-0.45476 l 0.750343,-2.01796 h 0.375171 l -1.087618,2.77778 z"
         style="font-family:sans-serif;-inkscape-font-specification:sans-serif"
         id="path157827" />
      <path
         d="m 27.895517,120.85099 0.238934,0.0603 q -0.07513,0.29436 -0.270957,0.44954 -0.194596,0.15395 -0.476638,0.15395 -0.291894,0 -0.475406,-0.11823 -0.18228,-0.11947 -0.278347,-0.34486 -0.09483,-0.22538 -0.09483,-0.48402 0,-0.28205 0.107151,-0.49142 0.108383,-0.21061 0.306674,-0.31899 0.199523,-0.10962 0.438458,-0.10962 0.270957,0 0.455701,0.13795 0.184743,0.13794 0.257409,0.38796 l -0.23524,0.0554 q -0.06281,-0.19706 -0.18228,-0.28697 -0.119468,-0.0899 -0.300516,-0.0899 -0.208145,0 -0.34855,0.0998 -0.139173,0.0998 -0.195828,0.2685 -0.05665,0.1675 -0.05665,0.34608 0,0.23032 0.06651,0.40275 0.06774,0.17119 0.209376,0.25617 0.141637,0.085 0.306674,0.085 0.200755,0 0.339928,-0.11577 0.139174,-0.11577 0.188439,-0.34362 z"
         style="font-size:65%;baseline-shift:sub"
         id="path157829" />
      <path
         d="m 29.717087,120.85099 0.238935,0.0603 q -0.07513,0.29436 -0.270957,0.44954 -0.194597,0.15395 -0.476638,0.15395 -0.291895,0 -0.475407,-0.11823 -0.18228,-0.11947 -0.278347,-0.34486 -0.09483,-0.22538 -0.09483,-0.48402 0,-0.28205 0.107152,-0.49142 0.108382,-0.21061 0.306674,-0.31899 0.199523,-0.10962 0.438458,-0.10962 0.270957,0 0.4557,0.13795 0.184743,0.13794 0.257409,0.38796 l -0.23524,0.0554 q -0.06281,-0.19706 -0.18228,-0.28697 -0.119467,-0.0899 -0.300516,-0.0899 -0.208144,0 -0.348549,0.0998 -0.139174,0.0998 -0.195828,0.2685 -0.05666,0.1675 -0.05666,0.34608 0,0.23032 0.06651,0.40275 0.06774,0.17119 0.209376,0.25617 0.141636,0.085 0.306674,0.085 0.200754,0 0.339928,-0.11577 0.139173,-0.11577 0.188438,-0.34362 z"
         style="font-size:65%;baseline-shift:sub"
         id="path157831" />
    </g>
    <path
       style="fill:#000000;fill-opacity:1;stroke:none;stroke-width:0.264583px;stroke-linecap:butt;stroke-linejoin:miter;stroke-opacity:1"
       d="m 32.865091,121.51485 c -2,0 -3,1 -4,2 1,1 2,2 4,2 h 7 v -4 z"
       id="path14504" />
    <path
       style="fill:#000000;fill-opacity:0.25;stroke:none;stroke-width:0.264583px;stroke-linecap:butt;stroke-linejoin:miter;stroke-opacity:1"
       d="m 31.865091,122.51485 1,-1 h 6 v 4 h -6 l -1,-1 z"
       id="path14506" />
    <g
       aria-label="5V"
       id="text14510"
       style="font-size:3.175px;line-height:100%;font-family:Sans;-inkscape-font-specification:Sans;letter-spacing:0px;word-spacing:0px;fill:#ffffff;stroke:#000000;stroke-width:0">
      <path
         d="m 33.495439,124.04739 0.434082,-0.045 q 0.0186,0.14728 0.110071,0.2341 0.09147,0.0853 0.21084,0.0853 0.136426,0 0.230993,-0.11007 0.09457,-0.11162 0.09457,-0.33486 0,-0.20929 -0.09457,-0.31316 -0.09302,-0.10542 -0.243396,-0.10542 -0.187585,0 -0.336413,0.16588 l -0.353467,-0.0512 0.223242,-1.18287 h 1.151868 v 0.40772 h -0.821655 l -0.06821,0.38603 q 0.145727,-0.0729 0.297656,-0.0729 0.289905,0 0.491443,0.21084 0.201538,0.21084 0.201538,0.54726 0,0.2806 -0.162781,0.50074 -0.221692,0.30076 -0.615466,0.30076 -0.31471,0 -0.513147,-0.16898 -0.198438,-0.16899 -0.237195,-0.45424 z"
         style="font-weight:bold;font-family:sans-serif;-inkscape-font-specification:'sans-serif Bold'"
         id="path157834" />
      <path
         d="m 35.930949,124.63185 -0.812353,-2.27273 h 0.497644 l 0.575159,1.68207 0.556555,-1.68207 h 0.486792 l -0.813904,2.27273 z"
         style="font-weight:bold;font-family:sans-serif;-inkscape-font-specification:'sans-serif Bold'"
         id="path157836" />
    </g>
    <path
       id="path14518"
       style="fill:#000000;fill-opacity:1;stroke:none;stroke-width:1.04298;stroke-linecap:butt;stroke-linejoin:miter;stroke-miterlimit:4;stroke-dasharray:none;stroke-opacity:1"
       d="m 25.865091,128.51485 h 0.89999 m 0,0 c 0,-0.49703 -0.40293,-0.89996 -0.89999,-0.89996 -0.49702,0 -0.90001,0.40293 -0.90001,0.89996 0,0.49703 0.40293,0.89997 0.89995,0.89997 0.49706,0 0.90005,-0.40294 0.90005,-0.89997 z" />
    <path
       id="path14520"
       style="fill:#000000;fill-opacity:1;stroke:none;stroke-width:1.04298;stroke-linecap:butt;stroke-linejoin:miter;stroke-miterlimit:4;stroke-dasharray:none;stroke-opacity:1"
       d="m 10.865091,167.51485 h 0.89999 m 0,0 c 0,-0.49703 -0.40293,-0.89996 -0.89999,-0.89996 -0.49702,0 -0.90001,0.40293 -0.90001,0.89996 0,0.49703 0.40293,0.89997 0.89995,0.89997 0.49706,0 0.90005,-0.40294 0.90005,-0.89997 z" />
    <circle
       style="fill:none;stroke:#000000;stroke-width:0.5;stroke-linecap:round;stroke-linejoin:round;stroke-dasharray:none;stroke-opacity:1"
       id="circle16302"
       cx="155.89018"
       cy="18.984915"
       r="5.6246567"
       transform="rotate(90)" />
    <path
       style="fill:none;stroke:#000000;stroke-width:0.4;stroke-linecap:butt;stroke-linejoin:miter;stroke-dasharray:none;stroke-opacity:1"
       d="m -14.984909,153.51485 h -8"
       id="path16304" />
    <path
       style="fill:none;stroke:#000000;stroke-width:0.4;stroke-linecap:butt;stroke-linejoin:miter;stroke-dasharray:none;stroke-opacity:1"
       d="m -16.984909,153.51485 3,4 -0.15,10 h 25"
       id="path16306" />
    <path
       style="fill:none;stroke:#000000;stroke-width:0.4;stroke-linecap:butt;stroke-linejoin:miter;stroke-dasharray:none;stroke-opacity:1"
       d="m -20.984909,153.51485 -3,4 h -9.15"
       id="path16308" />
    <path
       style="fill:#000000;fill-opacity:1;stroke:none;stroke-width:0.264583px;stroke-linecap:butt;stroke-linejoin:miter;stroke-opacity:1"
       d="m -23.814319,155.61936 1.60083,1.19889 -1.87963,0.8416 z"
       id="path16310" />
    <path
       style="fill:none;stroke:#000000;stroke-width:0.4;stroke-linecap:butt;stroke-linejoin:miter;stroke-dasharray:none;stroke-opacity:1"
       d="m -19.134909,153.51485 v -6 h 10"
       id="path16312" />
    <path
       id="path14468"
       d="m -7.634909,142.51485 h -3 v -9 h 2.999997 z"
       style="fill:#ffffff;fill-opacity:1;stroke:#000000;stroke-width:0.5;stroke-linecap:butt;stroke-linejoin:miter;stroke-miterlimit:4;stroke-dasharray:none;stroke-opacity:1" />
    <g
       aria-label="T1"
       id="text24350"
       style="font-size:3.88056px;line-height:100%;font-family:Sans;-inkscape-font-specification:Sans;letter-spacing:0px;word-spacing:0px;stroke:#000000;stroke-width:0">
      <path
         d="m -25.944905,149.51485 v -2.44999 h -0.91519 v -0.3278 h 2.201763 v 0.3278 h -0.918981 v 2.44999 z"
         style="font-family:sans-serif;-inkscape-font-specification:sans-serif"
         id="path157873" />
      <path
         d="m -23.134909,149.51485 h -0.341065 v -2.17334 q -0.123163,0.11747 -0.324012,0.23495 -0.198954,0.11748 -0.358118,0.17622 v -0.3297 q 0.286116,-0.13453 0.500229,-0.3259 0.214112,-0.19138 0.303168,-0.37139 h 0.219798 z"
         style="font-family:sans-serif;-inkscape-font-specification:sans-serif"
         id="path157875" />
    </g>
    <g
       aria-label="T2"
       id="text24358"
       style="font-size:3.88056px;line-height:100%;font-family:Sans;-inkscape-font-specification:Sans;letter-spacing:0px;word-spacing:0px;stroke:#000000;stroke-width:0">
      <path
         d="m 5.7802821,149.51485 v -2.44999 H 4.8650915 v -0.3278 h 2.201763 v 0.3278 H 6.1478742 v 2.44999 z"
         style="font-family:sans-serif;-inkscape-font-specification:sans-serif"
         id="path157868" />
      <path
         d="m 9.0980851,149.18705 v 0.3278 H 7.2620194 q -0.00379,-0.12317 0.039791,-0.23685 0.070108,-0.18759 0.2235869,-0.36949 0.155374,-0.1819 0.4471739,-0.42065 0.4528583,-0.37138 0.6120219,-0.58739 0.1591636,-0.2179 0.1591636,-0.41117 0,-0.20274 -0.1458999,-0.34106 -0.1440052,-0.14022 -0.3770662,-0.14022 -0.2463246,0 -0.3941193,0.1478 -0.1477948,0.14779 -0.1496896,0.40927 l -0.3505389,-0.036 q 0.036001,-0.39222 0.2709571,-0.59686 0.2349558,-0.20654 0.63097,-0.20654 0.3998037,0 0.6328647,0.2217 0.233061,0.22169 0.233061,0.54949 0,0.16674 -0.068213,0.3278 -0.068213,0.16106 -0.2273765,0.33917 -0.1572688,0.17811 -0.5248609,0.48886 -0.3069584,0.25769 -0.3941194,0.35054 -0.087161,0.0909 -0.1440051,0.1838 z"
         style="font-family:sans-serif;-inkscape-font-specification:sans-serif"
         id="path157870" />
    </g>
    <circle
       style="fill:none;stroke:#000000;stroke-width:0.5;stroke-linecap:round;stroke-linejoin:round;stroke-dasharray:none;stroke-opacity:1"
       id="circle50315"
       cx="155.89018"
       cy="-1.0150849"
       r="5.6246567"
       transform="rotate(90)" />
    <path
       style="fill:none;stroke:#000000;stroke-width:0.4;stroke-linecap:butt;stroke-linejoin:miter;stroke-dasharray:none;stroke-opacity:1"
       d="m 5.015091,153.51485 h -8"
       id="path50317" />
    <path
       style="fill:none;stroke:#000000;stroke-width:0.4;stroke-linecap:butt;stroke-linejoin:miter;stroke-dasharray:none;stroke-opacity:1"
       d="m 3.015091,153.51485 3,4 h 4.85 v 10"
       id="path50319" />
    <path
       style="fill:none;stroke:#000000;stroke-width:0.4;stroke-linecap:butt;stroke-linejoin:miter;stroke-dasharray:none;stroke-opacity:1"
       d="m -0.984909,153.51485 -3,4 -0.15,15 h -29"
       id="path50321" />
    <path
       style="fill:#000000;fill-opacity:1;stroke:none;stroke-width:0.264583px;stroke-linecap:butt;stroke-linejoin:miter;stroke-opacity:1"
       d="m -3.814319,155.61936 1.60083,1.19889 -1.87963,0.8416 z"
       id="path50323" />
    <path
       style="fill:none;stroke:#000000;stroke-width:0.4;stroke-linecap:butt;stroke-linejoin:miter;stroke-dasharray:none;stroke-opacity:1"
       d="m 0.865091,153.51485 v -6 h -10"
       id="path50325" />
    <path
       id="path50329"
       style="fill:#000000;fill-opacity:1;stroke:none;stroke-width:1.04298;stroke-linecap:butt;stroke-linejoin:miter;stroke-miterlimit:4;stroke-dasharray:none;stroke-opacity:1"
       d="m -9.134909,147.51485 h 0.89999 m 0,0 c 0,-0.49703 -0.40293,-0.89996 -0.89999,-0.89996 -0.49702,0 -0.90001,0.40293 -0.90001,0.89996 0,0.49703 0.40293,0.89997 0.89995,0.89997 0.49706,0 0.90005,-0.40294 0.90005,-0.89997 z" />
    <path
       id="path51935"
       d="m 27.365091,186.51485 h -3 v -9 h 3 z"
       style="fill:#ffffff;fill-opacity:1;stroke:#000000;stroke-width:0.5;stroke-linecap:butt;stroke-linejoin:miter;stroke-miterlimit:4;stroke-dasharray:none;stroke-opacity:1" />
    <g
       aria-label="R3"
       id="text51939"
       style="font-size:3.88056px;line-height:100%;font-family:Sans;-inkscape-font-specification:Sans;letter-spacing:0px;word-spacing:0px;stroke:#000000;stroke-width:0">
      <path
         d="m 17.385777,181.46559 v -2.77778 H 18.6174 q 0.371382,0 0.564652,0.0758 0.19327,0.0739 0.308853,0.26338 0.115583,0.18948 0.115583,0.41875 0,0.29559 -0.191375,0.49833 -0.191376,0.20275 -0.591179,0.2577 0.1459,0.0701 0.221692,0.13832 0.161058,0.14779 0.305063,0.36948 l 0.483175,0.75603 h -0.462332 l -0.367592,-0.57791 q -0.161058,-0.25012 -0.265273,-0.38275 -0.104214,-0.13264 -0.187585,-0.1857 -0.08148,-0.0531 -0.166743,-0.0739 -0.06253,-0.0133 -0.204639,-0.0133 h -0.426331 v 1.23352 z m 0.367592,-1.55184 h 0.790133 q 0.252009,0 0.39412,-0.0512 0.14211,-0.0531 0.216008,-0.16675 0.0739,-0.11558 0.0739,-0.25011 0,-0.19706 -0.144005,-0.32401 -0.142111,-0.12695 -0.450964,-0.12695 h -0.879189 z"
         style="font-family:sans-serif;-inkscape-font-specification:sans-serif"
         id="path157889" />
      <path
         d="m 20.046083,180.7323 0.341064,-0.0455 q 0.05874,0.2899 0.198955,0.41875 0.14211,0.12695 0.344854,0.12695 0.240641,0 0.405489,-0.16674 0.166742,-0.16675 0.166742,-0.41307 0,-0.23496 -0.153479,-0.38654 -0.153479,-0.15348 -0.39033,-0.15348 -0.09664,0 -0.24064,0.0379 l 0.0379,-0.29938 q 0.03411,0.004 0.05495,0.004 0.217902,0 0.392224,-0.11369 0.174322,-0.11369 0.174322,-0.35054 0,-0.18759 -0.126952,-0.31075 -0.126952,-0.12316 -0.327801,-0.12316 -0.198954,0 -0.331591,0.12506 -0.132636,0.12505 -0.170532,0.37517 l -0.341065,-0.0606 q 0.06253,-0.34295 0.284221,-0.53054 0.221692,-0.18948 0.551388,-0.18948 0.227376,0 0.418752,0.0985 0.191375,0.0966 0.2918,0.26527 0.102319,0.16864 0.102319,0.35812 0,0.18001 -0.09663,0.3278 -0.09663,0.1478 -0.286115,0.23496 0.246324,0.0568 0.38275,0.23685 0.136426,0.17811 0.136426,0.44717 0,0.3638 -0.265273,0.61771 -0.265272,0.25201 -0.67076,0.25201 -0.365698,0 -0.608233,-0.21791 -0.24064,-0.2179 -0.274746,-0.56465 z"
         style="font-family:sans-serif;-inkscape-font-specification:sans-serif"
         id="path157891" />
    </g>
    <g
       aria-label="440"
       id="text51943"
       style="font-size:3.175px;line-height:100%;font-family:Sans;-inkscape-font-specification:Sans;letter-spacing:0px;word-spacing:0px;stroke:#000000;stroke-width:0">
      <path
         d="m 17.745961,185.79689 v -0.54415 h -0.985986 v -0.2558 l 1.037146,-1.47278 h 0.227893 v 1.47278 h 0.306958 v 0.2558 h -0.306958 v 0.54415 z m 0,-0.79995 v -1.02474 l -0.711584,1.02474 z"
         style="font-family:sans-serif;-inkscape-font-specification:sans-serif"
         id="path157894" />
      <path
         d="m 19.511745,185.79689 v -0.54415 h -0.985986 v -0.2558 l 1.037146,-1.47278 h 0.227893 v 1.47278 h 0.306958 v 0.2558 h -0.306958 v 0.54415 z m 0,-0.79995 v -1.02474 l -0.711584,1.02474 z"
         style="font-family:sans-serif;-inkscape-font-specification:sans-serif"
         id="path157896" />
      <path
         d="m 20.38301,184.67603 q 0,-0.40308 0.08216,-0.64802 0.08372,-0.2465 0.246497,-0.37983 0.164331,-0.13332 0.412378,-0.13332 0.182934,0 0.32091,0.0744 0.137976,0.0729 0.227893,0.21239 0.08992,0.13798 0.141077,0.33797 0.05116,0.19843 0.05116,0.5364 0,0.39997 -0.08217,0.64647 -0.08216,0.24495 -0.246496,0.37982 -0.162781,0.13333 -0.412378,0.13333 -0.328662,0 -0.516248,-0.23565 -0.224792,-0.2837 -0.224792,-0.92397 z m 0.286804,0 q 0,0.55965 0.130224,0.74569 0.131775,0.18448 0.324012,0.18448 0.192236,0 0.322461,-0.18603 0.131775,-0.18604 0.131775,-0.74414 0,-0.56121 -0.131775,-0.74569 -0.130225,-0.18449 -0.325562,-0.18449 -0.192236,0 -0.306958,0.16278 -0.144177,0.20774 -0.144177,0.7674 z"
         style="font-family:sans-serif;-inkscape-font-specification:sans-serif"
         id="path157898" />
    </g>
  </g>
</svg>
