<?xml version="1.0" encoding="UTF-8" standalone="no"?>
<!-- Created with Inkscape (http://www.inkscape.org/) -->

<svg
   width="32.791759mm"
   height="23.935122mm"
   viewBox="0 0 32.791759 23.935122"
   version="1.1"
   id="svg5046"
   xmlns="http://www.w3.org/2000/svg"
   xmlns:svg="http://www.w3.org/2000/svg">
  <defs
     id="defs5043" />
  <g
     id="layer1"
     transform="translate(-35.129663,-42.122385)">
    <g
       id="g6402"
       transform="matrix(0.33333,0,0,0.33333,23.419892,28.08173)">
      <g
         aria-label="C"
         transform="matrix(2.8578838,-1.65,3.3,1.9052558,-905.02509,20.091726)"
         id="g88988"
         style="font-size:3.52778px;line-height:1.25;stroke-width:0.529166">
        <path
           d="m 140.96987,169.36859 0.33417,0.0844 q -0.10507,0.41169 -0.37896,0.62873 -0.27216,0.21532 -0.66662,0.21532 -0.40825,0 -0.66491,-0.16537 -0.25494,-0.16709 -0.38929,-0.48231 -0.13264,-0.31523 -0.13264,-0.67696 0,-0.39447 0.14986,-0.6873 0.15159,-0.29456 0.42892,-0.44614 0.27905,-0.15331 0.61322,-0.15331 0.37896,0 0.63735,0.19293 0.25838,0.19292 0.36001,0.5426 l -0.32901,0.0775 q -0.0879,-0.27561 -0.25493,-0.40136 -0.16709,-0.12574 -0.42031,-0.12574 -0.29111,0 -0.48748,0.13952 -0.19465,0.13953 -0.27388,0.37552 -0.0792,0.23426 -0.0792,0.48403 0,0.32212 0.093,0.56328 0.0947,0.23943 0.29283,0.35829 0.19809,0.11885 0.42892,0.11885 0.28077,0 0.47542,-0.16192 0.19465,-0.16192 0.26355,-0.48059 z"
           id="path88986" />
      </g>
      <g
         aria-label="E"
         transform="matrix(2.8578838,-1.65,3.3,1.9052558,-875.8254,-32.333685)"
         id="g88992"
         style="font-size:3.52778px;line-height:1.25;stroke-width:0.529166">
        <path
           d="m 121.64127,173.22781 v -2.52525 h 1.8259 v 0.298 h -1.49173 v 0.77342 h 1.39699 v 0.29628 h -1.39699 v 0.85955 h 1.55029 v 0.298 z"
           id="path88990" />
      </g>
      <g
         aria-label="B"
         transform="matrix(2.8578838,-1.65,3.3,1.9052558,-843.4631,-15.370491)"
         id="g88996"
         style="font-size:3.52778px;line-height:1.25;stroke-width:0.529166">
        <path
           d="m 121.34195,167.33006 v -2.52525 h 0.94741 q 0.28938,0 0.46336,0.0775 0.1757,0.0758 0.27389,0.23599 0.0999,0.15847 0.0999,0.33245 0,0.16192 -0.0879,0.30489 -0.0879,0.14297 -0.26528,0.23082 0.2291,0.0672 0.3514,0.2291 0.12403,0.16192 0.12403,0.38241 0,0.17742 -0.0758,0.33073 -0.0741,0.15158 -0.18431,0.23427 -0.11024,0.0827 -0.27733,0.12574 -0.16536,0.0413 -0.40652,0.0413 z m 0.33418,-1.46416 h 0.54605 q 0.22221,0 0.31867,-0.0293 0.12747,-0.0379 0.1912,-0.12574 0.0655,-0.0879 0.0655,-0.22049 0,-0.12575 -0.0603,-0.22049 -0.0603,-0.0965 -0.17226,-0.13091 -0.11196,-0.0362 -0.38412,-0.0362 h -0.50471 z m 0,1.16616 h 0.62873 q 0.16192,0 0.22738,-0.0121 0.11541,-0.0207 0.19292,-0.0689 0.0775,-0.0482 0.12747,-0.13952 0.0499,-0.093 0.0499,-0.2136 0,-0.14125 -0.0723,-0.2446 -0.0724,-0.10508 -0.20154,-0.14642 -0.12747,-0.0431 -0.36863,-0.0431 h -0.58394 z"
           id="path88994" />
      </g>
      <g
         id="g36346"
         transform="matrix(1.1,0,0,1.1,-69.944675,-36.985487)">
        <path
           id="path81365"
           style="fill:#cececa;fill-opacity:1;stroke:#6a6a62;stroke-width:0.454545;stroke-linecap:butt;stroke-linejoin:miter;stroke-dasharray:none;stroke-opacity:1"
           d="m 162.5314,108.06975 c 0,-10.144055 -6.27678,-18.114385 -12.55357,-21.737245 -3.13866,-1.81159 -6.2773,-1.81145 -8.63212,-0.45222 l 22.19658,-12.76933 c 2.3547,-1.35926 5.49334,-1.35941 8.632,0.45219 6.27677,3.62288 12.55353,11.5932 12.55353,21.73725 0,3.64706 -1.59022,6.376265 -3.97035,7.725595 l -22.19643,12.76934 c 2.38013,-1.34932 3.97036,-4.07851 3.97036,-7.72558 z" />
        <path
           id="path81369"
           style="fill:#cececa;fill-opacity:1;stroke:#6a6a62;stroke-width:0.454545;stroke-linecap:butt;stroke-linejoin:miter;stroke-dasharray:none;stroke-opacity:1"
           d="m 163.16419,108.42891 c 0,-10.651235 -6.5906,-19.020075 -13.1812,-22.824085 -3.29562,-1.90218 -6.60845,-1.88361 -9.08102,-0.45639 l 1.27263,-0.743 c 2.47244,-1.42721 5.76804,-1.42735 9.06361,0.47481 6.5906,3.80401 13.18122,12.17284 13.18122,22.824095 0,3.82943 -1.66974,6.6951 -4.16886,8.11186 l -1.29152,0.69755 c 2.49912,-1.41676 4.20514,-4.25542 4.20514,-8.08484 z" />
        <path
           id="path28014"
           style="fill:#d19f48;fill-opacity:1;stroke:#a37729;stroke-width:0.454545;stroke-linecap:round;stroke-linejoin:round;stroke-dasharray:none;stroke-opacity:1"
           d="m 144.86096,84.114325 c -2.48191,-0.0124 -4.67599,1.05963 -6.14292,2.96246 l -3.88671,-2.16589 -0.99389,4.34852 3.16447,1.827 c -0.11984,0.6671 -0.18368,1.37346 -0.18368,2.11685 0,10.637855 6.58248,18.996165 13.16481,22.795415 6.58234,3.79924 13.1648,1.6e-4 13.1648,-7.59831 0,-10.637895 -6.58246,-18.996195 -13.1648,-22.795415 -1.74843,-1.00918 -3.49702,-1.4825 -5.12208,-1.49063 z" />
        <path
           style="fill:#4e5247;fill-opacity:1;stroke:none;stroke-width:0.361911;stroke-linecap:butt;stroke-linejoin:miter;stroke-dasharray:none;stroke-opacity:1"
           d="m 149.97786,88.708895 c 5.24746,3.02877 10.49493,9.69206 10.49493,18.172655 0,6.05755 -5.24747,9.08631 -10.49493,6.05755 -5.24749,-3.02879 -10.49495,-9.69209 -10.49495,-18.172675 0,-6.05753 5.24746,-9.08632 10.49495,-6.05753 z"
           id="path15571" />
        <path
           style="color:#000000;fill:#e7e7e4;fill-opacity:1"
           d="m 169.97665,72.819035 -19.63712,11.33717 c 1.01714,0.47909 1.89163,1.04865 2.6928,1.59674 l 19.877,-11.47651 c -1.09555,-0.70684 -1.9752,-1.14003 -2.93268,-1.4574 z"
           id="path21321" />
        <g
           id="g29687"
           transform="translate(91.402384,-70.240635)">
          <path
             style="fill:#d6aa5c;fill-opacity:1;stroke:#a37729;stroke-width:0.454545;stroke-linecap:round;stroke-linejoin:round;stroke-dasharray:none;stroke-opacity:1"
             d="m 53.538991,163.17878 -36.37306,21 1.25936,2.27274 36.33823,-20.97863 c 0.87276,-0.49976 -0.37895,-2.78018 -1.22453,-2.29411 z"
             id="path22422" />
          <path
             style="fill:#cc9533;fill-opacity:1;stroke:#a37729;stroke-width:0.454545;stroke-linecap:butt;stroke-linejoin:miter;stroke-dasharray:none;stroke-opacity:1"
             d="m 17.826651,184.20042 c 0.46395,0.27457 0.92789,0.87857 0.92789,1.64732 0,0.5491 -0.46394,0.82363 -0.92789,0.5491 -0.46396,-0.27454 -0.92791,-0.87858 -0.92791,-1.64732 0,-0.5491 0.46395,-0.82362 0.92791,-0.5491 z"
             id="path22424" />
          <path
             style="color:#000000;fill:#ead4ae;fill-opacity:1;stroke-linecap:round;stroke-linejoin:round"
             d="m 54.124692,163.48064 -35.900494,20.72667 c 0.121474,0.11146 0.215867,0.20171 0.316615,0.34319 l 35.905195,-20.72964 c -0.09155,-0.12622 -0.191753,-0.23974 -0.321316,-0.34022 z"
             id="path22426" />
        </g>
        <g
           id="g29703"
           transform="translate(100.06265,-55.240635)">
          <path
             style="fill:#d6aa5c;fill-opacity:1;stroke:#a37729;stroke-width:0.454545;stroke-linecap:round;stroke-linejoin:round;stroke-dasharray:none;stroke-opacity:1"
             d="m 53.538991,163.17878 -36.37306,21 1.25936,2.27274 36.33823,-20.97863 c 0.87276,-0.49976 -0.37895,-2.78018 -1.22453,-2.29411 z"
             id="path29697" />
          <path
             style="fill:#cc9533;fill-opacity:1;stroke:#a37729;stroke-width:0.454545;stroke-linecap:butt;stroke-linejoin:miter;stroke-dasharray:none;stroke-opacity:1"
             d="m 17.826651,184.20042 c 0.46395,0.27457 0.92789,0.87857 0.92789,1.64732 0,0.5491 -0.46394,0.82363 -0.92789,0.5491 -0.46396,-0.27454 -0.92791,-0.87858 -0.92791,-1.64732 0,-0.5491 0.46395,-0.82362 0.92791,-0.5491 z"
             id="path29699" />
          <path
             style="color:#000000;fill:#ead4ae;fill-opacity:1;stroke-linecap:round;stroke-linejoin:round"
             d="m 54.124692,163.48064 -35.900494,20.72667 c 0.121474,0.11146 0.215867,0.20171 0.316615,0.34319 l 35.905195,-20.72964 c -0.09155,-0.12622 -0.191753,-0.23974 -0.321316,-0.34022 z"
             id="path29701" />
        </g>
        <g
           id="g29695"
           transform="translate(100.06265,-65.240635)">
          <path
             style="fill:#d6aa5c;fill-opacity:1;stroke:#a37729;stroke-width:0.454545;stroke-linecap:round;stroke-linejoin:round;stroke-dasharray:none;stroke-opacity:1"
             d="m 53.538991,163.17878 -36.37306,21 1.25936,2.27274 36.33823,-20.97863 c 0.87276,-0.49976 -0.37895,-2.78018 -1.22453,-2.29411 z"
             id="path29689" />
          <path
             style="fill:#cc9533;fill-opacity:1;stroke:#a37729;stroke-width:0.454545;stroke-linecap:butt;stroke-linejoin:miter;stroke-dasharray:none;stroke-opacity:1"
             d="m 17.826651,184.20042 c 0.46395,0.27457 0.92789,0.87857 0.92789,1.64732 0,0.5491 -0.46394,0.82363 -0.92789,0.5491 -0.46396,-0.27454 -0.92791,-0.87858 -0.92791,-1.64732 0,-0.5491 0.46395,-0.82362 0.92791,-0.5491 z"
             id="path29691" />
          <path
             style="color:#000000;fill:#ead4ae;fill-opacity:1;stroke-linecap:round;stroke-linejoin:round"
             d="m 54.124692,163.48064 -35.900494,20.72667 c 0.121474,0.11146 0.215867,0.20171 0.316615,0.34319 l 35.905195,-20.72964 c -0.09155,-0.12622 -0.191753,-0.23974 -0.321316,-0.34022 z"
             id="path29693" />
        </g>
        <path
           style="color:#000000;fill:#e7e7e4;fill-opacity:1"
           d="m 148.14958,83.866695 -0.69369,0.40529 c 1.04144,0.29013 2.21027,0.84521 3.03662,1.3722 l 0.8054,-0.46509 c -1.13348,-0.67828 -2.18719,-1.07595 -3.14833,-1.3124 z"
           id="path29044" />
      </g>
    </g>
  </g>
</svg>
