<?xml version="1.0" encoding="UTF-8" standalone="no"?>
<!-- Created with Inkscape (http://www.inkscape.org/) -->

<svg
   width="17.25909"
   height="14.999999"
   viewBox="0 0 4.5664677 3.9687499"
   version="1.1"
   id="svg5"
   xmlns="http://www.w3.org/2000/svg"
   xmlns:svg="http://www.w3.org/2000/svg">
  <defs
     id="defs2" />
  <g
     id="layer1"
     transform="translate(-134.89413,-25.287882)">
    <g
       id="g15109"
       transform="matrix(0.07975823,0,0,0.07975823,124.13521,23.270965)">
      <path
         id="path10830"
         style="fill:#85c241;fill-opacity:1;stroke:none;stroke-width:0.298664;stroke-linecap:round;stroke-linejoin:round"
         d="m 163.07639,25.287881 a 24.879902,24.879902 0 0 0 -24.87962,24.880136 24.879902,24.879902 0 0 0 24.87962,24.879617 24.879902,24.879902 0 0 0 24.88014,-24.879617 24.879902,24.879902 0 0 0 -24.88014,-24.880136 z m 0,6.311244 a 18.568651,18.568651 0 0 1 18.5689,18.568892 18.568651,18.568651 0 0 1 -18.5689,18.568373 18.568651,18.568651 0 0 1 -18.56837,-18.568373 18.568651,18.568651 0 0 1 18.56837,-18.568892 z" />
      <path
         id="path10388"
         style="fill:#110f0e;fill-opacity:1;stroke:#ffffff;stroke-width:0.7;stroke-linecap:butt;stroke-linejoin:miter;stroke-miterlimit:4;stroke-dasharray:none;stroke-opacity:1"
         d="m 145.79941,36.233982 10.72803,13.914398 -20.60339,15.831592 h 16.55764 l 10.19835,-7.851201 6.05285,7.851201 h 13.5258 L 171.14515,51.611856 191.11964,36.233982 h -16.48375 l -9.65005,7.415051 -5.73505,-7.415051 z" />
    </g>
  </g>
</svg>
