<?xml version="1.0" encoding="UTF-8" standalone="no"?>
<!-- Created with Inkscape (http://www.inkscape.org/) -->

<svg
   width="54.638424mm"
   height="70.457222mm"
   viewBox="0 0 54.638424 70.457222"
   version="1.1"
   id="svg37530"
   xmlns="http://www.w3.org/2000/svg"
   xmlns:svg="http://www.w3.org/2000/svg">
  <defs
     id="defs37527" />
  <g
     id="layer1"
     transform="translate(-27.627253,-70.579406)">
    <circle
       style="fill:none;stroke:#000000;stroke-width:0.5;stroke-linecap:round;stroke-linejoin:round;stroke-dasharray:none;stroke-opacity:1"
       id="circle11116"
       cx="61.602268"
       cy="106.16409"
       r="5.6246567" />
    <path
       style="fill:none;stroke:#000000;stroke-width:0.4;stroke-linecap:butt;stroke-linejoin:miter;stroke-dasharray:none;stroke-opacity:1"
       d="m 59.226924,102.16409 v 8"
       id="path11118" />
    <path
       style="fill:none;stroke:#000000;stroke-width:0.4;stroke-linecap:butt;stroke-linejoin:miter;stroke-dasharray:none;stroke-opacity:1"
       d="m 59.226924,106.16409 h -25"
       id="path11120" />
    <path
       style="fill:none;stroke:#000000;stroke-width:0.4;stroke-linecap:butt;stroke-linejoin:miter;stroke-dasharray:none;stroke-opacity:1"
       d="m 59.226924,104.16409 4,-3 v -5"
       id="path11122" />
    <path
       style="fill:none;stroke:#000000;stroke-width:0.4;stroke-linecap:butt;stroke-linejoin:miter;stroke-dasharray:none;stroke-opacity:1"
       d="m 59.226924,108.16409 4,3 v 3"
       id="path11124" />
    <path
       style="fill:#000000;fill-opacity:1;stroke:none;stroke-width:0.264583px;stroke-linecap:butt;stroke-linejoin:miter;stroke-opacity:1"
       d="m 61.331434,110.9935 1.19889,-1.60083 0.8416,1.87963 z"
       id="path11126" />
    <path
       id="path11130"
       d="m 49.226924,104.66409 v 3 h -9 v -3 z"
       style="fill:#ffffff;fill-opacity:1;stroke:#000000;stroke-width:0.5;stroke-linecap:butt;stroke-linejoin:miter;stroke-miterlimit:4;stroke-dasharray:none;stroke-opacity:1" />
    <g
       aria-label="GND"
       id="text11134"
       style="font-size:3.88056px;line-height:100%;font-family:Sans;-inkscape-font-specification:Sans;letter-spacing:0px;word-spacing:0px;stroke:#000000;stroke-width:0">
      <path
         d="m 60.51451,139.89975 v -0.32591 l 1.176673,-0.002 v 1.03078 q -0.270957,0.21601 -0.558967,0.3259 -0.28801,0.10801 -0.591179,0.10801 -0.409278,0 -0.744658,-0.17432 -0.333486,-0.17622 -0.504018,-0.50781 -0.170533,-0.33159 -0.170533,-0.74087 0,-0.40549 0.168638,-0.75603 0.170532,-0.35243 0.48886,-0.52296 0.318327,-0.17054 0.733289,-0.17054 0.301274,0 0.543809,0.0985 0.24443,0.0966 0.38275,0.27096 0.138321,0.17432 0.210324,0.45475 l -0.331591,0.0909 q -0.06253,-0.21221 -0.155374,-0.33348 -0.09285,-0.12127 -0.265273,-0.19327 -0.172427,-0.0739 -0.38275,-0.0739 -0.252009,0 -0.435805,0.0777 -0.183796,0.0758 -0.297485,0.20085 -0.111793,0.12506 -0.174322,0.27474 -0.106109,0.2577 -0.106109,0.55897 0,0.37138 0.126952,0.6215 0.128847,0.25011 0.373277,0.37138 0.24443,0.12127 0.519176,0.12127 0.238746,0 0.466122,-0.0909 0.227377,-0.0928 0.344855,-0.19706 v -0.51728 z"
         style="font-family:sans-serif;-inkscape-font-specification:sans-serif"
         id="path103961" />
      <path
         d="m 62.229308,140.98926 v -2.77779 h 0.377066 l 1.459,2.18092 v -2.18092 h 0.352433 v 2.77779 h -0.377066 l -1.458999,-2.18282 v 2.18282 z"
         style="font-family:sans-serif;-inkscape-font-specification:sans-serif"
         id="path103963" />
      <path
         d="m 65.035514,140.98926 v -2.77779 h 0.956876 q 0.324012,0 0.494544,0.0398 0.238745,0.0549 0.407383,0.19895 0.219797,0.18569 0.327801,0.4756 0.109899,0.28801 0.109899,0.65939 0,0.31643 -0.0739,0.56086 -0.0739,0.24443 -0.189481,0.40549 -0.115583,0.15916 -0.253904,0.25201 -0.136426,0.0909 -0.331591,0.13832 -0.19327,0.0474 -0.445279,0.0474 z m 0.367592,-0.3278 h 0.593074 q 0.274746,0 0.43012,-0.0512 0.157269,-0.0512 0.250114,-0.14401 0.130742,-0.13074 0.202745,-0.35054 0.0739,-0.22169 0.0739,-0.53623 0,-0.4358 -0.144005,-0.66886 -0.142111,-0.23496 -0.346749,-0.31454 -0.147795,-0.0568 -0.475596,-0.0568 h -0.5836 z"
         style="font-family:sans-serif;-inkscape-font-specification:sans-serif"
         id="path103965" />
    </g>
    <path
       style="fill:none;stroke:#000000;stroke-width:0.7;stroke-linecap:butt;stroke-linejoin:miter;stroke-miterlimit:4;stroke-dasharray:none;stroke-opacity:1"
       d="m 60.226924,136.16409 h 6"
       id="path11136" />
    <path
       id="path11138"
       style="fill:#000000;fill-opacity:1;stroke:none;stroke-width:1.04298;stroke-linecap:butt;stroke-linejoin:miter;stroke-miterlimit:4;stroke-dasharray:none;stroke-opacity:1"
       d="m 63.226924,96.16409 h 0.89999 m 0,0 c 0,-0.49703 -0.40293,-0.89996 -0.89999,-0.89996 -0.49702,0 -0.90001,0.40293 -0.90001,0.89996 0,0.49703 0.40293,0.89997 0.89995,0.89997 0.49706,0 0.90005,-0.40294 0.90005,-0.89997 z" />
    <path
       id="path11142"
       style="fill:none;fill-opacity:0.5;stroke:#000000;stroke-width:0.5;stroke-linecap:round;stroke-linejoin:round;stroke-dasharray:none"
       d="m 63.226924,75.16409 a 1,1 0 0 1 1,1 1,1 0 0 1 -1,1 1,1 0 0 1 -1,-1 1,1 0 0 1 1,-1 z" />
    <path
       id="path11144"
       style="fill:none;fill-opacity:0.5;stroke:#000000;stroke-width:0.5;stroke-linecap:round;stroke-linejoin:round;stroke-dasharray:none"
       d="m 73.226924,95.16409 a 1,1 0 0 1 1,1 1,1 0 0 1 -1,1 1,1 0 0 1 -1,-1 1,1 0 0 1 1,-1 z" />
    <path
       style="fill:none;stroke:#000000;stroke-width:0.4;stroke-linecap:butt;stroke-linejoin:miter;stroke-dasharray:none;stroke-opacity:1"
       d="m 63.226924,96.16409 h 9"
       id="path11146" />
    <g
       aria-label="+VCC"
       id="text11152"
       style="font-size:3.88056px;line-height:100%;font-family:Sans;-inkscape-font-specification:Sans;letter-spacing:0px;word-spacing:0px;stroke:#000000;stroke-width:0">
      <path
         d="m 59.892022,72.908124 v -0.761711 h -0.756028 v -0.318327 h 0.756028 v -0.756027 h 0.322116 v 0.756027 h 0.756027 v 0.318327 h -0.756027 v 0.761711 z"
         style="font-family:sans-serif;-inkscape-font-specification:sans-serif"
         id="path103918" />
      <path
         d="m 62.279475,73.357193 -1.076249,-2.777784 h 0.397909 l 0.721921,2.017967 q 0.08716,0.242535 0.1459,0.454753 0.06442,-0.227376 0.14969,-0.454753 l 0.750342,-2.017967 h 0.375171 l -1.087617,2.777784 z"
         style="font-family:sans-serif;-inkscape-font-specification:sans-serif"
         id="path103920" />
      <path
         d="m 65.25735,73.500251 0.238935,0.06035 q -0.07513,0.294358 -0.270957,0.449543 -0.194596,0.153953 -0.476638,0.153953 -0.291895,0 -0.475407,-0.118236 -0.18228,-0.119468 -0.278346,-0.344855 -0.09484,-0.225387 -0.09484,-0.484028 0,-0.282041 0.107151,-0.491417 0.108383,-0.210608 0.306674,-0.31899 0.199523,-0.109615 0.438458,-0.109615 0.270957,0 0.4557,0.137942 0.184744,0.137942 0.257409,0.387961 l -0.23524,0.05542 q -0.06281,-0.19706 -0.18228,-0.286968 -0.119467,-0.08991 -0.300516,-0.08991 -0.208144,0 -0.348549,0.09976 -0.139173,0.09976 -0.195828,0.268494 -0.05665,0.1675 -0.05665,0.346086 0,0.230313 0.06651,0.402741 0.06774,0.171195 0.209376,0.256177 0.141636,0.08498 0.306674,0.08498 0.200754,0 0.339928,-0.115772 0.139173,-0.115773 0.188438,-0.343623 z"
         style="font-size:65%;baseline-shift:sub"
         id="path103922" />
      <path
         d="m 67.078921,73.500251 0.238934,0.06035 q -0.07513,0.294358 -0.270957,0.449543 -0.194596,0.153953 -0.476638,0.153953 -0.291894,0 -0.475406,-0.118236 -0.18228,-0.119468 -0.278347,-0.344855 -0.09484,-0.225387 -0.09484,-0.484028 0,-0.282041 0.107151,-0.491417 0.108383,-0.210608 0.306674,-0.31899 0.199523,-0.109615 0.438458,-0.109615 0.270957,0 0.455701,0.137942 0.184743,0.137942 0.257409,0.387961 l -0.23524,0.05542 q -0.06281,-0.19706 -0.18228,-0.286968 -0.119468,-0.08991 -0.300516,-0.08991 -0.208145,0 -0.34855,0.09976 -0.139173,0.09976 -0.195828,0.268494 -0.05665,0.1675 -0.05665,0.346086 0,0.230313 0.06651,0.402741 0.06774,0.171195 0.209376,0.256177 0.141637,0.08498 0.306674,0.08498 0.200755,0 0.339928,-0.115772 0.139174,-0.115773 0.188439,-0.343623 z"
         style="font-size:65%;baseline-shift:sub"
         id="path103924" />
    </g>
    <g
       aria-label="Out"
       id="text11156"
       style="font-size:3.88056px;line-height:100%;font-family:Sans;-inkscape-font-specification:Sans;letter-spacing:0px;word-spacing:0px;stroke:#000000;stroke-width:0">
      <path
         d="m 76.22693,96.201065 q 0,-0.691604 0.371382,-1.081934 0.371382,-0.392224 0.958771,-0.392224 0.384646,0 0.693499,0.183796 0.308853,0.183796 0.469911,0.513492 0.162954,0.327801 0.162954,0.744658 0,0.422541 -0.170533,0.756027 -0.170532,0.333486 -0.483175,0.505913 -0.312643,0.170532 -0.67455,0.170532 -0.392225,0 -0.701078,-0.18948 -0.308853,-0.189481 -0.468017,-0.517282 -0.159164,-0.327801 -0.159164,-0.693498 z m 0.378961,0.0057 q 0,0.502123 0.269063,0.792028 0.270957,0.288011 0.67834,0.288011 0.414962,0 0.682129,-0.2918 0.269063,-0.2918 0.269063,-0.82803 0,-0.33917 -0.115583,-0.591179 -0.113689,-0.253904 -0.335381,-0.392225 -0.219797,-0.140215 -0.494544,-0.140215 -0.39033,0 -0.672656,0.269062 -0.280431,0.267168 -0.280431,0.894348 z"
         style="font-family:sans-serif;-inkscape-font-specification:sans-serif"
         id="path103944" />
      <path
         d="m 80.632351,97.553955 v -0.295589 q -0.234956,0.341064 -0.638549,0.341064 -0.178112,0 -0.333486,-0.06821 -0.153479,-0.06821 -0.229271,-0.170532 -0.0739,-0.104214 -0.104214,-0.253904 -0.02084,-0.100424 -0.02084,-0.318327 v -1.246781 h 0.341065 v 1.116039 q 0,0.267168 0.02084,0.360013 0.03221,0.134531 0.136426,0.212218 0.104214,0.07579 0.257693,0.07579 0.153479,0 0.28801,-0.07769 0.134531,-0.07958 0.189481,-0.214113 0.05684,-0.136426 0.05684,-0.39412 v -1.078143 h 0.341065 v 2.012282 z"
         style="font-family:sans-serif;-inkscape-font-specification:sans-serif"
         id="path103946" />
      <path
         d="m 82.216408,97.248892 0.04927,0.301273 q -0.144005,0.03032 -0.257694,0.03032 -0.185691,0 -0.28801,-0.05874 -0.102319,-0.05874 -0.144005,-0.153479 -0.04169,-0.09663 -0.04169,-0.403593 v -1.157726 h -0.250114 v -0.265272 h 0.250114 v -0.498334 l 0.33917,-0.204639 v 0.702973 h 0.34296 v 0.265272 h -0.34296 v 1.176674 q 0,0.1459 0.01705,0.187586 0.01895,0.04169 0.05874,0.06632 0.04169,0.02463 0.117478,0.02463 0.05684,0 0.14969,-0.01326 z"
         style="font-family:sans-serif;-inkscape-font-specification:sans-serif"
         id="path103948" />
    </g>
    <g
       aria-label="A"
       id="text11160"
       style="font-size:3.88056px;line-height:100%;font-family:Sans;-inkscape-font-specification:Sans;letter-spacing:0px;word-spacing:0px;stroke:#000000;stroke-width:0">
      <path
         d="m 27.627254,107.55298 1.066775,-2.77779 h 0.396014 l 1.136883,2.77779 h -0.418752 l -0.324011,-0.84129 h -1.161516 l -0.305063,0.84129 z m 0.801502,-1.14067 h 0.941718 l -0.289905,-0.76929 q -0.132636,-0.35054 -0.19706,-0.57603 -0.05305,0.26717 -0.149689,0.53055 z"
         style="font-family:sans-serif;-inkscape-font-specification:sans-serif"
         id="path103971" />
    </g>
    <path
       style="fill:none;stroke:#000000;stroke-width:0.4;stroke-linecap:butt;stroke-linejoin:miter;stroke-dasharray:none;stroke-opacity:1"
       d="m 63.226924,77.16409 v 19"
       id="path11162" />
    <path
       id="path11164"
       d="m 64.726924,91.16409 h -3 v -9 h 3 z"
       style="fill:#ffffff;fill-opacity:1;stroke:#000000;stroke-width:0.5;stroke-linecap:butt;stroke-linejoin:miter;stroke-miterlimit:4;stroke-dasharray:none;stroke-opacity:1" />
    <path
       id="path11168"
       style="fill:none;fill-opacity:0.5;stroke:#000000;stroke-width:0.5;stroke-linecap:round;stroke-linejoin:round;stroke-dasharray:none"
       d="m 33.226924,105.16409 a 1,1 0 0 1 1,1 1,1 0 0 1 -1,1 1,1 0 0 1 -1,-1 1,1 0 0 1 1,-1 z" />
    <g
       aria-label="10k"
       id="text11172"
       style="font-size:3.175px;line-height:100%;font-family:Sans;-inkscape-font-specification:Sans;letter-spacing:0px;word-spacing:0px;stroke:#000000;stroke-width:0">
      <path
         d="m 47.06408,102.12534 h -0.279053 v -1.77818 q -0.100769,0.0961 -0.2651,0.19223 -0.162781,0.0961 -0.293005,0.14418 v -0.26975 q 0.234094,-0.11007 0.409277,-0.26665 0.175183,-0.15658 0.248047,-0.303858 h 0.179834 z"
         style="font-family:sans-serif;-inkscape-font-specification:sans-serif"
         id="path103979" />
      <path
         d="m 47.778765,101.00448 q 0,-0.40307 0.08217,-0.64802 0.08371,-0.2465 0.246496,-0.379823 0.164331,-0.133325 0.412378,-0.133325 0.182935,0 0.320911,0.07441 0.137976,0.07286 0.227893,0.212394 0.08992,0.13797 0.141076,0.33796 0.05116,0.19844 0.05116,0.5364 0,0.39998 -0.08217,0.64647 -0.08217,0.24495 -0.246497,0.37983 -0.162781,0.13332 -0.412378,0.13332 -0.328662,0 -0.516247,-0.23564 -0.224793,-0.28371 -0.224793,-0.92398 z m 0.286804,0 q 0,0.55966 0.130225,0.74569 0.131775,0.18449 0.324011,0.18449 0.192236,0 0.322461,-0.18604 0.131775,-0.18603 0.131775,-0.74414 0,-0.5612 -0.131775,-0.74569 -0.130225,-0.18448 -0.325561,-0.18448 -0.192237,0 -0.306958,0.16278 -0.144178,0.20774 -0.144178,0.76739 z"
         style="font-family:sans-serif;-inkscape-font-specification:sans-serif"
         id="path103981" />
      <path
         d="m 49.623614,102.12534 v -2.272726 h 0.279052 v 1.296046 l 0.660425,-0.66973 h 0.361218 l -0.629418,0.61082 0.69298,1.03559 h -0.344165 l -0.544152,-0.84181 -0.196888,0.18914 v 0.65267 z"
         style="font-family:sans-serif;-inkscape-font-specification:sans-serif"
         id="path103983" />
    </g>
    <g
       aria-label="R1"
       id="text11176"
       style="font-size:3.88056px;line-height:100%;font-family:Sans;-inkscape-font-specification:Sans;letter-spacing:0px;word-spacing:0px;stroke:#000000;stroke-width:0">
      <path
         d="m 40.226927,102.16409 v -2.777781 h 1.231623 q 0.371382,0 0.564652,0.07579 0.19327,0.0739 0.308853,0.263377 0.115583,0.189481 0.115583,0.418751 0,0.29559 -0.191375,0.49833 -0.191375,0.20275 -0.591179,0.2577 0.1459,0.0701 0.221692,0.13832 0.161058,0.14779 0.305064,0.36949 l 0.483175,0.75602 h -0.462333 l -0.367592,-0.57791 q -0.161058,-0.25012 -0.265272,-0.38275 -0.104215,-0.13264 -0.187586,-0.18569 -0.08148,-0.0531 -0.166743,-0.0739 -0.06253,-0.0133 -0.204639,-0.0133 h -0.426331 v 1.23351 z m 0.367592,-1.55184 h 0.790134 q 0.252009,0 0.394119,-0.0512 0.14211,-0.0531 0.216008,-0.16674 0.0739,-0.11559 0.0739,-0.25012 0,-0.197058 -0.144005,-0.32401 -0.14211,-0.126952 -0.450963,-0.126952 h -0.87919 z"
         style="font-family:sans-serif;-inkscape-font-specification:sans-serif"
         id="path103974" />
      <path
         d="m 44.170016,102.16409 h -0.341065 v -2.173338 q -0.123163,0.117478 -0.324012,0.234958 -0.198954,0.11748 -0.358118,0.17621 v -0.32969 q 0.286116,-0.134532 0.500229,-0.325908 0.214112,-0.191375 0.303168,-0.371381 h 0.219798 z"
         style="font-family:sans-serif;-inkscape-font-specification:sans-serif"
         id="path103976" />
    </g>
    <g
       aria-label="T1"
       id="text11180"
       style="font-size:3.88056px;line-height:100%;font-family:Sans;-inkscape-font-specification:Sans;letter-spacing:0px;word-spacing:0px;stroke:#000000;stroke-width:0">
      <path
         d="m 70.142112,107.16409 v -2.44998 h -0.91519 v -0.3278 h 2.201763 v 0.3278 h -0.918981 v 2.44998 z"
         style="font-family:sans-serif;-inkscape-font-specification:sans-serif"
         id="path103951" />
      <path
         d="m 72.952108,107.16409 h -0.341065 v -2.17334 q -0.123162,0.11748 -0.324012,0.23496 -0.198954,0.11748 -0.358118,0.17621 v -0.32969 q 0.286116,-0.13453 0.500229,-0.32591 0.214113,-0.19137 0.303168,-0.37138 h 0.219798 z"
         style="font-family:sans-serif;-inkscape-font-specification:sans-serif"
         id="path103953" />
    </g>
    <g
       aria-label="R3"
       id="text11184"
       style="font-size:3.88056px;line-height:100%;font-family:Sans;-inkscape-font-specification:Sans;letter-spacing:0px;word-spacing:0px;stroke:#000000;stroke-width:0">
      <path
         d="m 54.74761,85.953247 v -2.777784 h 1.231623 q 0.371382,0 0.564652,0.07579 0.19327,0.0739 0.308853,0.263377 0.115583,0.189481 0.115583,0.418752 0,0.29559 -0.191375,0.498334 -0.191375,0.202744 -0.591179,0.257693 0.1459,0.07011 0.221692,0.138321 0.161059,0.147795 0.305064,0.369487 l 0.483175,0.756027 h -0.462332 l -0.367592,-0.577915 q -0.161059,-0.250115 -0.265273,-0.382751 -0.104214,-0.132636 -0.187586,-0.185691 -0.08148,-0.05305 -0.166743,-0.0739 -0.06253,-0.01326 -0.204638,-0.01326 h -0.426332 v 1.233518 z m 0.367592,-1.551845 h 0.790134 q 0.252009,0 0.394119,-0.05116 0.142111,-0.05305 0.216008,-0.166742 0.0739,-0.115584 0.0739,-0.250115 0,-0.197059 -0.144006,-0.324011 -0.14211,-0.126952 -0.450963,-0.126952 h -0.87919 z"
         style="font-family:sans-serif;-inkscape-font-specification:sans-serif"
         id="path103932" />
      <path
         d="m 57.407916,85.219958 0.341065,-0.04548 q 0.05874,0.289905 0.198954,0.418752 0.142111,0.126952 0.344855,0.126952 0.24064,0 0.405488,-0.166743 0.166743,-0.166743 0.166743,-0.413067 0,-0.234956 -0.153479,-0.38654 -0.153479,-0.153479 -0.39033,-0.153479 -0.09664,0 -0.24064,0.0379 l 0.0379,-0.299379 q 0.03411,0.0038 0.05495,0.0038 0.217903,0 0.392225,-0.113688 0.174322,-0.113688 0.174322,-0.350539 0,-0.187586 -0.126952,-0.310748 -0.126952,-0.123162 -0.327801,-0.123162 -0.198955,0 -0.331591,0.125057 -0.132636,0.125057 -0.170533,0.375171 l -0.341064,-0.06063 q 0.06253,-0.342959 0.28422,-0.530545 0.221692,-0.18948 0.551388,-0.18948 0.227377,0 0.418752,0.09853 0.191376,0.09664 0.2918,0.265273 0.10232,0.168638 0.10232,0.358118 0,0.180007 -0.09663,0.327801 -0.09663,0.147795 -0.286116,0.234956 0.246325,0.05684 0.382751,0.236851 0.136426,0.178111 0.136426,0.447174 0,0.363802 -0.265273,0.617706 -0.265273,0.252009 -0.670761,0.252009 -0.365697,0 -0.608232,-0.217903 -0.24064,-0.217902 -0.274747,-0.564651 z"
         style="font-family:sans-serif;-inkscape-font-specification:sans-serif"
         id="path103934" />
    </g>
    <g
       aria-label="10k"
       id="text11188"
       style="font-size:3.175px;line-height:100%;font-family:Sans;-inkscape-font-specification:Sans;letter-spacing:0px;word-spacing:0px;stroke:#000000;stroke-width:0">
      <path
         d="M 55.303139,90.125336 H 55.024087 V 88.34715 q -0.100769,0.09612 -0.2651,0.192236 -0.162781,0.09612 -0.293006,0.144177 v -0.269751 q 0.234095,-0.110071 0.409278,-0.26665 0.175183,-0.15658 0.248046,-0.303858 h 0.179834 z"
         style="font-family:sans-serif;-inkscape-font-specification:sans-serif"
         id="path103937" />
      <path
         d="m 56.017825,89.004474 q 0,-0.403076 0.08216,-0.648023 0.08372,-0.246496 0.246497,-0.379821 0.164331,-0.133326 0.412378,-0.133326 0.182934,0 0.32091,0.07442 0.137976,0.07286 0.227893,0.21239 0.08992,0.137976 0.141077,0.337964 0.05116,0.198437 0.05116,0.536401 0,0.399975 -0.08217,0.646472 -0.08216,0.244946 -0.246497,0.379822 -0.16278,0.133325 -0.412377,0.133325 -0.328663,0 -0.516248,-0.235645 -0.224792,-0.283703 -0.224792,-0.923974 z m 0.286804,0 q 0,0.559656 0.130224,0.745691 0.131775,0.184485 0.324012,0.184485 0.192236,0 0.32246,-0.186035 0.131775,-0.186036 0.131775,-0.744141 0,-0.561206 -0.131775,-0.745691 -0.130224,-0.184485 -0.325561,-0.184485 -0.192236,0 -0.306958,0.162781 -0.144177,0.207739 -0.144177,0.767395 z"
         style="font-family:sans-serif;-inkscape-font-specification:sans-serif"
         id="path103939" />
      <path
         d="m 57.862673,90.125336 v -2.27273 h 0.279053 v 1.296045 l 0.660425,-0.669726 h 0.361218 l -0.629419,0.610815 0.692981,1.035596 h -0.344165 l -0.544153,-0.841809 -0.196887,0.189135 v 0.652674 z"
         style="font-family:sans-serif;-inkscape-font-specification:sans-serif"
         id="path103941" />
    </g>
    <path
       style="fill:#000000;fill-opacity:1;stroke:none;stroke-width:0.264583px;stroke-linecap:butt;stroke-linejoin:miter;stroke-opacity:1"
       d="m 70.226924,74.16409 c -2,0 -3,1 -4,2 1,1 2,2 4,2 h 7 v -4 z"
       id="path11195" />
    <path
       style="fill:#000000;fill-opacity:0.25;stroke:none;stroke-width:0.264583px;stroke-linecap:butt;stroke-linejoin:miter;stroke-opacity:1"
       d="m 69.226924,75.16409 1,-1 h 6 v 4 h -6 l -1,-1 z"
       id="path11197" />
    <g
       aria-label="5V"
       id="text11201"
       style="font-size:3.175px;line-height:100%;font-family:Sans;-inkscape-font-specification:Sans;letter-spacing:0px;word-spacing:0px;fill:#ffffff;stroke:#000000;stroke-width:0">
      <path
         d="m 70.857271,76.696606 0.434082,-0.04496 q 0.0186,0.147278 0.110071,0.234094 0.09147,0.08527 0.210839,0.08527 0.136426,0 0.230994,-0.11007 0.09457,-0.111622 0.09457,-0.334864 0,-0.209289 -0.09457,-0.313159 -0.09302,-0.10542 -0.243396,-0.10542 -0.187585,0 -0.336413,0.165881 l -0.353467,-0.05116 0.223242,-1.182874 h 1.151868 v 0.407727 h -0.821656 l -0.06821,0.386023 q 0.145728,-0.07286 0.297657,-0.07286 0.289904,0 0.491443,0.210839 0.201538,0.21084 0.201538,0.547254 0,0.280603 -0.162781,0.500744 -0.221692,0.300757 -0.615466,0.300757 -0.31471,0 -0.513147,-0.168982 -0.198438,-0.168982 -0.237195,-0.454236 z"
         style="font-weight:bold;font-family:sans-serif;-inkscape-font-specification:'sans-serif Bold'"
         id="path103927" />
      <path
         d="m 73.292781,77.281067 -0.812353,-2.27273 h 0.497644 l 0.575158,1.682068 0.556555,-1.682068 h 0.486792 l -0.813903,2.27273 z"
         style="font-weight:bold;font-family:sans-serif;-inkscape-font-specification:'sans-serif Bold'"
         id="path103929" />
    </g>
    <circle
       style="fill:none;stroke:#000000;stroke-width:0.5;stroke-linecap:round;stroke-linejoin:round;stroke-dasharray:none;stroke-opacity:1"
       id="circle11957"
       cx="61.602268"
       cy="121.16409"
       r="5.6246567" />
    <path
       style="fill:none;stroke:#000000;stroke-width:0.4;stroke-linecap:butt;stroke-linejoin:miter;stroke-dasharray:none;stroke-opacity:1"
       d="m 59.226924,117.16409 v 8"
       id="path11959" />
    <path
       style="fill:none;stroke:#000000;stroke-width:0.4;stroke-linecap:butt;stroke-linejoin:miter;stroke-dasharray:none;stroke-opacity:1"
       d="m 59.226924,121.16409 h -25"
       id="path11961" />
    <path
       style="fill:none;stroke:#000000;stroke-width:0.4;stroke-linecap:butt;stroke-linejoin:miter;stroke-dasharray:none;stroke-opacity:1"
       d="m 59.226924,119.16409 4,-3 v -3"
       id="path11963" />
    <path
       style="fill:none;stroke:#000000;stroke-width:0.4;stroke-linecap:butt;stroke-linejoin:miter;stroke-dasharray:none;stroke-opacity:1"
       d="m 59.226924,123.16409 4,3 v 10"
       id="path11965" />
    <path
       style="fill:#000000;fill-opacity:1;stroke:none;stroke-width:0.264583px;stroke-linecap:butt;stroke-linejoin:miter;stroke-opacity:1"
       d="m 61.331434,125.9935 1.19889,-1.60083 0.8416,1.87963 z"
       id="path11967" />
    <path
       id="path11971"
       d="m 49.226924,119.66409 v 3 h -9 v -3 z"
       style="fill:#ffffff;fill-opacity:1;stroke:#000000;stroke-width:0.5;stroke-linecap:butt;stroke-linejoin:miter;stroke-miterlimit:4;stroke-dasharray:none;stroke-opacity:1" />
    <g
       aria-label="B"
       id="text11977"
       style="font-size:3.88056px;line-height:100%;font-family:Sans;-inkscape-font-specification:Sans;letter-spacing:0px;word-spacing:0px;stroke:#000000;stroke-width:0">
      <path
         d="m 28.129378,122.55298 v -2.77779 h 1.042143 q 0.318327,0 0.509702,0.0853 0.19327,0.0834 0.301274,0.25959 0.109899,0.17432 0.109899,0.3657 0,0.17811 -0.09663,0.33538 -0.09664,0.15727 -0.2918,0.2539 0.252009,0.0739 0.38654,0.25201 0.136426,0.17811 0.136426,0.42065 0,0.19516 -0.08337,0.3638 -0.08148,0.16674 -0.202744,0.25769 -0.121268,0.091 -0.305064,0.13832 -0.181901,0.0455 -0.447174,0.0455 z m 0.367592,-1.61059 h 0.600653 q 0.24443,0 0.350539,-0.0322 0.140216,-0.0417 0.210324,-0.13832 0.072,-0.0966 0.072,-0.24253 0,-0.13832 -0.06632,-0.24254 -0.06632,-0.10611 -0.18948,-0.144 -0.123163,-0.0398 -0.422542,-0.0398 H 28.49697 Z m 0,1.28279 h 0.691604 q 0.178112,0 0.250114,-0.0133 0.126952,-0.0227 0.212218,-0.0758 0.08527,-0.053 0.140216,-0.15348 0.05495,-0.10232 0.05495,-0.23495 0,-0.15538 -0.07958,-0.26907 -0.07958,-0.11558 -0.221693,-0.16105 -0.140215,-0.0474 -0.405488,-0.0474 H 28.49697 Z"
         style="font-family:sans-serif;-inkscape-font-specification:sans-serif"
         id="path103968" />
    </g>
    <path
       id="path11979"
       style="fill:none;fill-opacity:0.5;stroke:#000000;stroke-width:0.5;stroke-linecap:round;stroke-linejoin:round;stroke-dasharray:none"
       d="m 33.226924,120.16409 a 1,1 0 0 1 1,1 1,1 0 0 1 -1,1 1,1 0 0 1 -1,-1 1,1 0 0 1 1,-1 z" />
    <g
       aria-label="10k"
       id="text11983"
       style="font-size:3.175px;line-height:100%;font-family:Sans;-inkscape-font-specification:Sans;letter-spacing:0px;word-spacing:0px;stroke:#000000;stroke-width:0">
      <path
         d="m 47.06408,117.12534 h -0.279053 v -1.77818 q -0.100769,0.0961 -0.2651,0.19223 -0.162781,0.0961 -0.293005,0.14418 v -0.26975 q 0.234094,-0.11007 0.409277,-0.26665 0.175183,-0.15658 0.248047,-0.30386 h 0.179834 z"
         style="font-family:sans-serif;-inkscape-font-specification:sans-serif"
         id="path103991" />
      <path
         d="m 47.778765,116.00448 q 0,-0.40307 0.08217,-0.64802 0.08371,-0.2465 0.246496,-0.37982 0.164331,-0.13333 0.412378,-0.13333 0.182935,0 0.320911,0.0744 0.137976,0.0729 0.227893,0.21239 0.08992,0.13797 0.141076,0.33796 0.05116,0.19844 0.05116,0.5364 0,0.39998 -0.08217,0.64647 -0.08217,0.24495 -0.246497,0.37983 -0.162781,0.13332 -0.412378,0.13332 -0.328662,0 -0.516247,-0.23564 -0.224793,-0.28371 -0.224793,-0.92398 z m 0.286804,0 q 0,0.55966 0.130225,0.74569 0.131775,0.18449 0.324011,0.18449 0.192236,0 0.322461,-0.18604 0.131775,-0.18603 0.131775,-0.74414 0,-0.5612 -0.131775,-0.74569 -0.130225,-0.18448 -0.325561,-0.18448 -0.192237,0 -0.306958,0.16278 -0.144178,0.20774 -0.144178,0.76739 z"
         style="font-family:sans-serif;-inkscape-font-specification:sans-serif"
         id="path103993" />
      <path
         d="m 49.623614,117.12534 v -2.27273 h 0.279052 v 1.29605 l 0.660425,-0.66973 h 0.361218 l -0.629418,0.61082 0.69298,1.03559 h -0.344165 l -0.544152,-0.84181 -0.196888,0.18914 v 0.65267 z"
         style="font-family:sans-serif;-inkscape-font-specification:sans-serif"
         id="path103995" />
    </g>
    <g
       aria-label="R2"
       id="text11987"
       style="font-size:3.88056px;line-height:100%;font-family:Sans;-inkscape-font-specification:Sans;letter-spacing:0px;word-spacing:0px;stroke:#000000;stroke-width:0">
      <path
         d="m 40.226927,117.16409 v -2.77778 h 1.231623 q 0.371382,0 0.564652,0.0758 0.19327,0.0739 0.308853,0.26338 0.115583,0.18948 0.115583,0.41875 0,0.29559 -0.191375,0.49833 -0.191375,0.20275 -0.591179,0.2577 0.1459,0.0701 0.221692,0.13832 0.161058,0.14779 0.305064,0.36949 l 0.483175,0.75602 h -0.462333 l -0.367592,-0.57791 q -0.161058,-0.25012 -0.265272,-0.38275 -0.104215,-0.13264 -0.187586,-0.18569 -0.08148,-0.0531 -0.166743,-0.0739 -0.06253,-0.0133 -0.204639,-0.0133 h -0.426331 v 1.23351 z m 0.367592,-1.55184 h 0.790134 q 0.252009,0 0.394119,-0.0512 0.14211,-0.0531 0.216008,-0.16674 0.0739,-0.11559 0.0739,-0.25012 0,-0.19706 -0.144005,-0.32401 -0.14211,-0.12695 -0.450963,-0.12695 h -0.87919 z"
         style="font-family:sans-serif;-inkscape-font-specification:sans-serif"
         id="path103986" />
      <path
         d="m 44.677823,116.83629 v 0.3278 h -1.836065 q -0.0038,-0.12316 0.03979,-0.23685 0.07011,-0.18758 0.223587,-0.36948 0.155374,-0.18191 0.447174,-0.42065 0.452859,-0.37138 0.612022,-0.58739 0.159164,-0.2179 0.159164,-0.41117 0,-0.20275 -0.1459,-0.34107 -0.144005,-0.14021 -0.377066,-0.14021 -0.246325,0 -0.39412,0.14779 -0.147794,0.1478 -0.149689,0.40928 l -0.350539,-0.036 q 0.036,-0.39223 0.270957,-0.59687 0.234956,-0.20653 0.63097,-0.20653 0.399804,0 0.632865,0.22169 0.233061,0.22169 0.233061,0.5495 0,0.16674 -0.06821,0.3278 -0.06821,0.16106 -0.227377,0.33917 -0.157269,0.17811 -0.524861,0.48886 -0.306958,0.25769 -0.394119,0.35054 -0.08716,0.0909 -0.144005,0.18379 z"
         style="font-family:sans-serif;-inkscape-font-specification:sans-serif"
         id="path103988" />
    </g>
    <g
       aria-label="T1"
       id="text11991"
       style="font-size:3.88056px;line-height:100%;font-family:Sans;-inkscape-font-specification:Sans;letter-spacing:0px;word-spacing:0px;stroke:#000000;stroke-width:0">
      <path
         d="m 70.142112,122.16409 v -2.44998 h -0.91519 v -0.3278 h 2.201763 v 0.3278 h -0.918981 v 2.44998 z"
         style="font-family:sans-serif;-inkscape-font-specification:sans-serif"
         id="path103956" />
      <path
         d="m 72.952108,122.16409 h -0.341065 v -2.17334 q -0.123162,0.11748 -0.324012,0.23496 -0.198954,0.11748 -0.358118,0.17621 v -0.32969 q 0.286116,-0.13453 0.500229,-0.32591 0.214113,-0.19137 0.303168,-0.37138 h 0.219798 z"
         style="font-family:sans-serif;-inkscape-font-specification:sans-serif"
         id="path103958" />
    </g>
  </g>
</svg>
