<?xml version="1.0" encoding="UTF-8" standalone="no"?>
<svg
   xmlns:dc="http://purl.org/dc/elements/1.1/"
   xmlns:cc="http://creativecommons.org/ns#"
   xmlns:rdf="http://www.w3.org/1999/02/22-rdf-syntax-ns#"
   xmlns:svg="http://www.w3.org/2000/svg"
   xmlns="http://www.w3.org/2000/svg"
   xmlns:xlink="http://www.w3.org/1999/xlink"
   width="12.386666"
   height="15"
   viewBox="0 0 3.2773054 3.96875"
   version="1.1"
   id="svg963">
  <defs
     id="defs957">
    <linearGradient
       id="linearGradient2746">
      <stop
         style="stop-color:#90adc1;stop-opacity:1"
         offset="0"
         id="stop2742" />
      <stop
         style="stop-color:#000000;stop-opacity:0;"
         offset="1"
         id="stop2744" />
    </linearGradient>
    <linearGradient
       id="linearGradient2738">
      <stop
         style="stop-color:#1f91cd;stop-opacity:1;"
         offset="0"
         id="stop2734" />
      <stop
         style="stop-color:#1f91cd;stop-opacity:0;"
         offset="1"
         id="stop2736" />
    </linearGradient>
    <linearGradient
       xlink:href="#linearGradient2738"
       id="linearGradient2740"
       x1="106.52113"
       y1="99.5"
       x2="123.84163"
       y2="115.5"
       gradientUnits="userSpaceOnUse"
       gradientTransform="matrix(0.89720475,0,0,0.89720475,49.194575,-21.18212)" />
    <linearGradient
       xlink:href="#linearGradient2746"
       id="linearGradient2748"
       x1="112.58331"
       y1="125"
       x2="111.71728"
       y2="96.5"
       gradientUnits="userSpaceOnUse"
       gradientTransform="matrix(0.89720475,0,0,0.89720475,49.194575,-21.18212)" />
  </defs>
  <metadata
     id="metadata960">
    <rdf:RDF>
      <cc:Work
         rdf:about="">
        <dc:format>image/svg+xml</dc:format>
        <dc:type
           rdf:resource="http://purl.org/dc/dcmitype/StillImage" />
        <dc:title></dc:title>
      </cc:Work>
    </rdf:RDF>
  </metadata>
  <g
     id="layer1"
     transform="translate(-137.86704,-59.999998)">
    <g
       id="g2762"
       transform="matrix(0.13706453,0,0,0.13706453,118.97036,51.776126)">
      <path
         id="path2724"
         style="fill:url(#linearGradient2740);fill-opacity:1;stroke:url(#linearGradient2748);stroke-width:0.897205;stroke-linecap:round;stroke-linejoin:round;stroke-miterlimit:4;stroke-dasharray:none"
         d="M 161.32912,77 A 11.506735,11.506735 0 0 1 149.82239,88.506735 11.506735,11.506735 0 0 1 138.31565,77 11.506735,11.506735 0 0 1 149.82239,65.493265 11.506735,11.506735 0 0 1 161.32912,77 Z" />
      <g
         id="g2753">
        <path
           style="fill:#9acce8;fill-opacity:1;stroke:none;stroke-width:0.265;stroke-linecap:round;stroke-linejoin:round;stroke-miterlimit:4;stroke-dasharray:none;stroke-opacity:1"
           d="m 142.89419,72.499998 6.92821,4 6.9282,-4 -6.92821,-3 z"
           id="path2716" />
        <path
           style="fill:#bfe0f1;fill-opacity:1;stroke:none;stroke-width:0.265;stroke-linecap:round;stroke-linejoin:round;stroke-miterlimit:4;stroke-dasharray:none;stroke-opacity:1"
           d="m 142.89418,72.499993 0.86604,7.500005 6.06217,4.499998 v -7.999998 z"
           id="path2718" />
        <path
           style="fill:#1f91cd;fill-opacity:1;stroke:none;stroke-width:0.265;stroke-linecap:round;stroke-linejoin:round;stroke-miterlimit:4;stroke-dasharray:none;stroke-opacity:1"
           d="m 156.75061,72.499993 -0.86604,7.500005 -6.06217,4.499998 v -7.999998 z"
           id="path2720" />
      </g>
      <path
         style="fill:#1f91cd;fill-opacity:1;stroke:none;stroke-width:0.264583px;stroke-linecap:butt;stroke-linejoin:miter;stroke-opacity:1"
         d="m 147.22431,59.999998 7.79424,6.5 -7.79424,6.500001 z"
         id="path2722" />
    </g>
  </g>
</svg>
