<?xml version="1.0" encoding="UTF-8" standalone="no"?>
<!-- Created with Inkscape (http://www.inkscape.org/) -->

<svg
   width="195mm"
   height="139.32996mm"
   viewBox="0 0 195 139.32996"
   version="1.1"
   id="svg1"
   xmlns:xlink="http://www.w3.org/1999/xlink"
   xmlns="http://www.w3.org/2000/svg"
   xmlns:svg="http://www.w3.org/2000/svg">
  <defs
     id="defs1">
    <linearGradient
       xlink:href="#e399c19f-b68f-429d-b176-18c2117ff73c"
       id="linearGradient140"
       gradientUnits="userSpaceOnUse"
       gradientTransform="matrix(0.08977539,0,0,-0.08977539,69.59786,139.37257)"
       x1="-1032.172"
       y1="145.312"
       x2="-1059.213"
       y2="65.426003" />
    <linearGradient
       id="e399c19f-b68f-429d-b176-18c2117ff73c"
       x1="-1032.172"
       x2="-1059.213"
       y1="145.312"
       y2="65.426003"
       gradientTransform="matrix(0.08977539,0,0,-0.08977539,69.59786,139.37257)"
       gradientUnits="userSpaceOnUse">
      <stop
         offset="0"
         stop-color="#114a8b"
         id="stop1-35" />
      <stop
         offset="1"
         stop-color="#0669bc"
         id="stop2-62" />
    </linearGradient>
    <linearGradient
       xlink:href="#ac2a6fc2-ca48-4327-9a3c-d4dcc3256e15"
       id="linearGradient141"
       gradientUnits="userSpaceOnUse"
       gradientTransform="matrix(0.08977539,0,0,-0.08977539,69.59786,139.37257)"
       x1="-1023.725"
       y1="108.083"
       x2="-1029.98"
       y2="105.968" />
    <linearGradient
       id="ac2a6fc2-ca48-4327-9a3c-d4dcc3256e15"
       x1="-1023.725"
       x2="-1029.98"
       y1="108.083"
       y2="105.968"
       gradientTransform="matrix(0.08977539,0,0,-0.08977539,69.59786,139.37257)"
       gradientUnits="userSpaceOnUse">
      <stop
         offset="0"
         stop-opacity=".3"
         id="stop3-91" />
      <stop
         offset=".071"
         stop-opacity=".2"
         id="stop4-27" />
      <stop
         offset=".321"
         stop-opacity=".1"
         id="stop5-0" />
      <stop
         offset=".623"
         stop-opacity=".05"
         id="stop6-9" />
      <stop
         offset="1"
         stop-opacity="0"
         id="stop7-3" />
    </linearGradient>
    <linearGradient
       xlink:href="#a7fee970-a784-4bb1-af8d-63d18e5f7db9"
       id="linearGradient142"
       gradientUnits="userSpaceOnUse"
       gradientTransform="matrix(0.08977539,0,0,-0.08977539,69.59786,139.37257)"
       x1="-1027.165"
       y1="147.642"
       x2="-997.48199"
       y2="68.560997" />
    <linearGradient
       id="a7fee970-a784-4bb1-af8d-63d18e5f7db9"
       x1="-1027.165"
       x2="-997.48199"
       y1="147.642"
       y2="68.560997"
       gradientTransform="matrix(0.08977539,0,0,-0.08977539,69.59786,139.37257)"
       gradientUnits="userSpaceOnUse">
      <stop
         offset="0"
         stop-color="#3ccbf4"
         id="stop8-6" />
      <stop
         offset="1"
         stop-color="#2892df"
         id="stop9-0" />
    </linearGradient>
    <linearGradient
       xlink:href="#f34d9569-2bd0-4002-8f16-3d01d8106cb5"
       id="linearGradient100"
       gradientUnits="userSpaceOnUse"
       x1="8.8800001"
       y1="12.21"
       x2="8.8800001"
       y2="0.20999999" />
    <linearGradient
       id="f34d9569-2bd0-4002-8f16-3d01d8106cb5"
       x1="8.8800001"
       y1="12.21"
       x2="8.8800001"
       y2="0.20999999"
       gradientUnits="userSpaceOnUse">
      <stop
         offset="0"
         stop-color="#0078d4"
         id="stop1-6" />
      <stop
         offset="0.82"
         stop-color="#5ea0ef"
         id="stop2-0" />
    </linearGradient>
    <linearGradient
       xlink:href="#bdb45a0b-eb58-4970-a60a-fb2ce314f866"
       id="linearGradient101"
       gradientUnits="userSpaceOnUse"
       x1="8.8800001"
       y1="16.84"
       x2="8.8800001"
       y2="12.21" />
    <linearGradient
       id="bdb45a0b-eb58-4970-a60a-fb2ce314f866"
       x1="8.8800001"
       y1="16.84"
       x2="8.8800001"
       y2="12.21"
       gradientUnits="userSpaceOnUse">
      <stop
         offset="0.15"
         stop-color="#ccc"
         id="stop3-6" />
      <stop
         offset="1"
         stop-color="#707070"
         id="stop4-2" />
    </linearGradient>
    <radialGradient
       id="e2cf8746-c9a8-4eee-86c2-4951983c6032-1"
       cx="13428.81"
       cy="3518.8601"
       r="56.669998"
       gradientTransform="matrix(0.15,0,0,0.15,-2005.33,-518.83)"
       gradientUnits="userSpaceOnUse">
      <stop
         offset="0.18"
         stop-color="#5ea0ef"
         id="stop1-0" />
      <stop
         offset="1"
         stop-color="#0078d4"
         id="stop2-63" />
    </radialGradient>
    <linearGradient
       xlink:href="#bdd213dd-d313-473c-8ff4-0133fd3a9033"
       id="linearGradient105"
       gradientUnits="userSpaceOnUse"
       x1="4.4000001"
       y1="11.48"
       x2="4.3699999"
       y2="7.5300002" />
    <linearGradient
       id="bdd213dd-d313-473c-8ff4-0133fd3a9033"
       x1="4.4000001"
       y1="11.48"
       x2="4.3699999"
       y2="7.5300002"
       gradientUnits="userSpaceOnUse">
      <stop
         offset="0"
         stop-color="#ccc"
         id="stop3-73" />
      <stop
         offset="1"
         stop-color="#fcfcfc"
         id="stop4-6" />
    </linearGradient>
    <linearGradient
       xlink:href="#afcc63c5-3649-4476-a742-bcb53a569f3c"
       id="linearGradient106"
       gradientUnits="userSpaceOnUse"
       x1="10.13"
       y1="15.45"
       x2="10.13"
       y2="11.9" />
    <linearGradient
       id="afcc63c5-3649-4476-a742-bcb53a569f3c"
       x1="10.13"
       y1="15.45"
       x2="10.13"
       y2="11.9"
       gradientUnits="userSpaceOnUse">
      <stop
         offset="0"
         stop-color="#ccc"
         id="stop5-1" />
      <stop
         offset="1"
         stop-color="#fcfcfc"
         id="stop6-29" />
    </linearGradient>
    <linearGradient
       id="bd873f0b-9954-4aa5-a3df-9f4c64e8729d-4"
       x1="14.18"
       y1="11.15"
       x2="14.18"
       y2="7.3800001"
       gradientUnits="userSpaceOnUse">
      <stop
         offset="0"
         stop-color="#ccc"
         id="stop7-7" />
      <stop
         offset="1"
         stop-color="#fcfcfc"
         id="stop8-65" />
    </linearGradient>
    <linearGradient
       id="f97360fa-fd13-420b-9b43-74b8dde83a11"
       x1="6.6999998"
       y1="7.2600002"
       x2="6.6999998"
       y2="18.360001"
       gradientUnits="userSpaceOnUse">
      <stop
         offset="0.22"
         stop-color="#32d4f5"
         id="stop1-68" />
      <stop
         offset="1"
         stop-color="#198ab3"
         id="stop2-92" />
    </linearGradient>
    <linearGradient
       id="b2ab4071-529d-4450-9443-e6dc0939cc4e"
       x1="6.4200001"
       y1="1.3200001"
       x2="7.23"
       y2="11.39"
       gradientUnits="userSpaceOnUse">
      <stop
         offset="0.22"
         stop-color="#32d4f5"
         id="stop3-66" />
      <stop
         offset="1"
         stop-color="#198ab3"
         id="stop4-4" />
    </linearGradient>
    <linearGradient
       id="b39dcf83-187e-4c64-98df-431bb60809d2-7"
       x1="0.5"
       y1="10.04"
       x2="13.18"
       y2="10.04"
       gradientUnits="userSpaceOnUse"
       gradientTransform="matrix(1.0015773,0,0,1.0015773,7.4180673,245.96713)">
      <stop
         offset="0"
         stop-color="#005ba1"
         id="stop1-4" />
      <stop
         offset="0.07"
         stop-color="#0060a9"
         id="stop2-4" />
      <stop
         offset="0.36"
         stop-color="#0071c8"
         id="stop3-30" />
      <stop
         offset="0.52"
         stop-color="#0078d4"
         id="stop4-78" />
      <stop
         offset="0.64"
         stop-color="#0074cd"
         id="stop5-68" />
      <stop
         offset="0.82"
         stop-color="#006abb"
         id="stop6-8" />
      <stop
         offset="1"
         stop-color="#005ba1"
         id="stop7-4" />
    </linearGradient>
    <linearGradient
       id="uuid-38c07977-ab9a-48eb-a668-cda3102bbd85"
       x1="7.697"
       y1="779.16803"
       x2="14.082"
       y2="786.63098"
       gradientTransform="matrix(1,0,0,-1,0,791.516)"
       gradientUnits="userSpaceOnUse">
      <stop
         offset="0"
         stop-color="#225086"
         id="stop1-22" />
      <stop
         offset="1"
         stop-color="#0055c5"
         id="stop2-610" />
    </linearGradient>
    <linearGradient
       id="uuid-aed4a7bc-b380-4c34-b841-2d0f34d24f17"
       x1="6.3639998"
       y1="778.164"
       x2="6.3639998"
       y2="794.41199"
       gradientTransform="matrix(1,0,0,-1,0,791.516)"
       gradientUnits="userSpaceOnUse">
      <stop
         offset="0"
         stop-color="#6df"
         id="stop3-61" />
      <stop
         offset="1"
         stop-color="#0294e4"
         id="stop4-59" />
    </linearGradient>
    <linearGradient
       id="uuid-e2a7b7f2-bf16-4a76-ba27-7d149ab8a194"
       x1="9.0010004"
       y1="775.95599"
       x2="9.0010004"
       y2="794.84497"
       gradientTransform="matrix(1,0,0,-1,0,791.516)"
       gradientUnits="userSpaceOnUse">
      <stop
         offset="0"
         stop-color="#44dbf9"
         id="stop5-4" />
      <stop
         offset="1"
         stop-color="#cbf8ff"
         id="stop6-90" />
    </linearGradient>
    <linearGradient
       id="uuid-c67f3364-071c-41f9-a175-d3de1f837e0a"
       x1="13.5"
       y1="774.72101"
       x2="13.5"
       y2="790.78198"
       gradientTransform="matrix(1,0,0,-1,0,791.516)"
       gradientUnits="userSpaceOnUse">
      <stop
         offset="0"
         stop-color="#041642"
         id="stop7-91" />
      <stop
         offset="1"
         stop-color="#041642"
         stop-opacity=".25"
         id="stop8-7" />
    </linearGradient>
    <marker
       style="overflow:visible"
       id="marker125"
       refX="0"
       refY="0"
       orient="auto-start-reverse"
       markerWidth="0.75"
       markerHeight="0.75"
       viewBox="0 0 1 1"
       preserveAspectRatio="xMidYMid">
      <path
         transform="scale(0.5)"
         style="fill:context-stroke;fill-rule:evenodd;stroke:context-stroke;stroke-width:1pt"
         d="M 5.77,0 -2.88,5 V -5 Z"
         id="path125" />
    </marker>
    <marker
       style="overflow:visible"
       id="marker126"
       refX="0"
       refY="0"
       orient="auto-start-reverse"
       markerWidth="0.75"
       markerHeight="0.75"
       viewBox="0 0 1 1"
       preserveAspectRatio="xMidYMid">
      <path
         transform="scale(0.5)"
         style="fill:context-stroke;fill-rule:evenodd;stroke:context-stroke;stroke-width:1pt"
         d="M 5.77,0 -2.88,5 V -5 Z"
         id="path126" />
    </marker>
    <linearGradient
       id="a24f9983-911f-4df7-920f-f964c8c10f82"
       x1="9"
       y1="15.834"
       x2="9"
       y2="5.7880001"
       gradientUnits="userSpaceOnUse">
      <stop
         offset="0"
         stop-color="#32bedd"
         id="stop1-67" />
      <stop
         offset="0.175"
         stop-color="#32caea"
         id="stop2-53" />
      <stop
         offset="0.41"
         stop-color="#32d2f2"
         id="stop3-5" />
      <stop
         offset="0.775"
         stop-color="#32d4f5"
         id="stop4-62" />
    </linearGradient>
    <linearGradient
       id="ba88ea91-3b3a-4da0-9b97-9a10ebaa3e50"
       x1="12.805"
       y1="15.237"
       x2="12.805"
       y2="7.9619999"
       gradientUnits="userSpaceOnUse">
      <stop
         offset="0"
         stop-color="#0078d4"
         id="stop1-60" />
      <stop
         offset=".156"
         stop-color="#1380da"
         id="stop2-626" />
      <stop
         offset=".528"
         stop-color="#3c91e5"
         id="stop3-1" />
      <stop
         offset=".822"
         stop-color="#559cec"
         id="stop4-8" />
      <stop
         offset="1"
         stop-color="#5ea0ef"
         id="stop5-7" />
    </linearGradient>
    <linearGradient
       xlink:href="#e399c19f-b68f-429d-b176-18c2117ff73c"
       id="linearGradient111"
       gradientUnits="userSpaceOnUse"
       gradientTransform="matrix(0.08977539,0,0,-0.08977539,91.256626,126.06159)"
       x1="-1032.172"
       y1="145.312"
       x2="-1059.213"
       y2="65.426003" />
    <linearGradient
       xlink:href="#ac2a6fc2-ca48-4327-9a3c-d4dcc3256e15"
       id="linearGradient112"
       gradientUnits="userSpaceOnUse"
       gradientTransform="matrix(0.08977539,0,0,-0.08977539,91.256626,126.06159)"
       x1="-1023.725"
       y1="108.083"
       x2="-1029.98"
       y2="105.968" />
    <linearGradient
       xlink:href="#a7fee970-a784-4bb1-af8d-63d18e5f7db9"
       id="linearGradient113"
       gradientUnits="userSpaceOnUse"
       gradientTransform="matrix(0.08977539,0,0,-0.08977539,91.256626,126.06159)"
       x1="-1027.165"
       y1="147.642"
       x2="-997.48199"
       y2="68.560997" />
    <linearGradient
       xlink:href="#bdd213dd-d313-473c-8ff4-0133fd3a9033"
       id="linearGradient1"
       gradientUnits="userSpaceOnUse"
       x1="4.4000001"
       y1="11.48"
       x2="4.3699999"
       y2="7.5300002" />
    <linearGradient
       xlink:href="#afcc63c5-3649-4476-a742-bcb53a569f3c"
       id="linearGradient2"
       gradientUnits="userSpaceOnUse"
       x1="10.13"
       y1="15.45"
       x2="10.13"
       y2="11.9" />
  </defs>
  <g
     id="layer1"
     transform="translate(-26.19375,-46.831249)">
    <g
       id="g82"
       transform="translate(138.7952,-6.203982)">
      <path
         fill="url(#e399c19f-b68f-429d-b176-18c2117ff73c)"
         d="m -23.917752,125.77555 h 2.337572 l -2.426629,7.18984 a 0.37274742,0.37274742 0 0 1 -0.353087,0.25353 h -1.819208 a 0.37211899,0.37211899 0 0 1 -0.352638,-0.49107 l 2.260814,-6.69877 a 0.37274742,0.37274742 0 0 1 0.353176,-0.25362 z"
         id="path9-2"
         style="fill:url(#linearGradient140);stroke-width:0.41341" />
      <path
         fill="#0078d4"
         d="m -20.520921,130.59801 h -3.706825 a 0.17156077,0.17156077 0 0 0 -0.117157,0.29707 l 2.38192,2.2232 a 0.37445315,0.37445315 0 0 0 0.255501,0.10064 h 2.098949 z"
         id="path10-6"
         style="stroke-width:0.41341" />
      <path
         fill="url(#ac2a6fc2-ca48-4327-9a3c-d4dcc3256e15)"
         d="m -23.917752,125.77555 a 0.36969506,0.36969506 0 0 0 -0.353984,0.25846 l -2.257223,6.68773 a 0.37167011,0.37167011 0 0 0 0.350842,0.49718 h 1.866161 a 0.39887206,0.39887206 0 0 0 0.306134,-0.26035 l 0.450134,-1.32661 1.607877,1.4997 a 0.38037833,0.38037833 0 0 0 0.239342,0.0873 h 2.091138 l -0.917146,-2.62091 -2.673601,6.3e-4 1.636336,-4.82309 z"
         id="path11-1"
         style="fill:url(#linearGradient141);stroke-width:0.41341" />
      <path
         fill="url(#a7fee970-a784-4bb1-af8d-63d18e5f7db9)"
         d="m -20.932092,126.02872 a 0.37211899,0.37211899 0 0 0 -0.352638,-0.25317 h -2.605192 a 0.37220877,0.37220877 0 0 1 0.352638,0.25317 l 2.260903,6.69904 a 0.37220877,0.37220877 0 0 1 -0.352637,0.49125 h 2.605282 a 0.37220877,0.37220877 0 0 0 0.352548,-0.49125 z"
         id="path12-8"
         style="fill:url(#linearGradient142);stroke-width:0.41341" />
      <g
         id="g71"
         style="stroke-width:0.354168"
         transform="matrix(0.74705826,0,0,0.74705826,-29.324977,122.7735)">
        <path
           d="m 0.5,15.08 a 0.16,0.16 0 0 0 0.08,0.14 L 1.74,15.87 3.7,17 A 0.17,0.17 0 0 0 3.93,16.94 L 4.59,15.82 A 0.16,0.16 0 0 0 4.53,15.61 l -2.3,-1.3 A 0.17,0.17 0 0 1 2.15,14.17 V 3.85 A 0.16,0.16 0 0 1 2.23,3.71 l 2.3,-1.3 A 0.16,0.16 0 0 0 4.59,2.2 L 3.93,1.08 A 0.17,0.17 0 0 0 3.7,1 L 1.78,2.11 0.58,2.78 A 0.16,0.16 0 0 0 0.5,2.92 Z"
           fill="#949494"
           id="path69"
           style="stroke-width:0.354168" />
        <path
           d="M 2.14,3.77 2.2,3.71 4.5,2.41 A 0.14,0.14 0 0 0 4.56,2.2 L 3.9,1.08 A 0.15,0.15 0 0 0 3.68,1 L 1.75,2.11 0.56,2.78 c 0,0 -0.05,0 -0.06,0.06 l 0.9,0.51 z"
           fill="#a3a3a3"
           id="path70"
           style="stroke-width:0.354168" />
        <path
           d="M 4.5,15.59 2.2,14.29 A 0.22,0.22 0 0 1 2.13,14.2 l -1.62,1 h 0.05 l 1.15,0.65 2,1.11 A 0.15,0.15 0 0 0 3.93,16.9 L 4.59,15.78 A 0.14,0.14 0 0 0 4.5,15.59 Z"
           fill="#a3a3a3"
           id="path71"
           style="stroke-width:0.354168" />
      </g>
      <path
         d="m -16.251457,134.03914 a 0.11952932,0.11952932 0 0 1 -0.05977,0.10459 l -0.866588,0.48558 -1.464234,0.84418 a 0.1269999,0.1269999 0 0 1 -0.171823,-0.0448 l -0.493059,-0.83671 a 0.11952932,0.11952932 0 0 1 0.04482,-0.15688 l 1.718234,-0.97118 a 0.1269999,0.1269999 0 0 0 0.05976,-0.10458 v -7.70965 a 0.11952932,0.11952932 0 0 0 -0.05976,-0.10458 l -1.718234,-0.97118 a 0.11952932,0.11952932 0 0 1 -0.04482,-0.15688 l 0.493059,-0.83671 a 0.1269999,0.1269999 0 0 1 0.171823,-0.0598 l 1.434352,0.81429 0.89647,0.50053 a 0.11952932,0.11952932 0 0 1 0.05977,0.10459 z"
         fill="#949494"
         id="path72"
         style="stroke-width:0.264584" />
      <path
         d="m -17.476633,125.58991 -0.04482,-0.0448 -1.718234,-0.97118 a 0.10458816,0.10458816 0 0 1 -0.04482,-0.15688 l 0.493058,-0.83671 a 0.11205874,0.11205874 0 0 1 0.164353,-0.0598 l 1.441823,0.81429 0.888999,0.50053 c 0,0 0,0 0.04482,0.0448 l -0.672353,0.381 z"
         fill="#a3a3a3"
         id="path73"
         style="stroke-width:0.264584" />
      <path
         d="m -19.23969,134.42014 1.718234,-0.97118 a 0.16435282,0.16435282 0 0 0 0.05229,-0.0672 l 1.210234,0.74706 v 0 l -0.859117,0.48558 -1.494117,0.82924 a 0.11205874,0.11205874 0 0 1 -0.164352,-0.0448 l -0.493059,-0.8367 a 0.10458816,0.10458816 0 0 1 0.02988,-0.14194 z"
         fill="#a3a3a3"
         id="path75"
         style="stroke-width:0.264584" />
    </g>
    <path
       id="path87"
       style="fill:none;stroke:#4d4d4d;stroke-linecap:round;stroke-linejoin:round"
       d="m 124.69375,124.69111 h 24.00001 c 1.108,0 2,0.892 2,2 v 11 c 0,1.108 -0.892,2 -2,2 H 83.69375 c -1.108,0 -2,-0.892 -2,-2 v -11 c 0,-1.108 0.892,-2 2,-2 h 24" />
    <text
       xml:space="preserve"
       style="font-style:normal;font-weight:normal;font-size:5.29167px;line-height:1.05;font-family:sans-serif;fill:#4d4d4d;fill-opacity:1;stroke:none;stroke-width:0.264583"
       x="116.16015"
       y="134.8969"
       id="text88"><tspan
         style="font-style:normal;font-variant:normal;font-weight:bold;font-stretch:normal;font-size:5.29167px;line-height:1.05;font-family:Sans;-inkscape-font-specification:Sans;text-align:center;text-anchor:middle;fill:#4d4d4d;fill-opacity:1;stroke-width:0.264583"
         x="116.16015"
         y="134.8969"
         id="tspan88">Azure Resource Manager</tspan></text>
    <g
       id="g100"
       transform="matrix(0.70555556,0,0,0.70555556,50.428417,161.54294)"
       style="stroke-width:0.375">
      <rect
         x="-0.12"
         y="0.20999999"
         width="18"
         height="12"
         rx="0.60000002"
         fill="url(#f34d9569-2bd0-4002-8f16-3d01d8106cb5)"
         id="rect88"
         style="fill:url(#linearGradient100);stroke-width:0.375" />
      <polygon
         points="11.88,7.95 8.88,9.71 8.88,6.21 11.88,4.46 "
         fill="#50e6ff"
         id="polygon89"
         style="stroke-width:0.375" />
      <polygon
         points="8.88,6.22 5.88,4.46 8.88,2.71 11.88,4.46 "
         fill="#c3f1ff"
         id="polygon90"
         style="stroke-width:0.375" />
      <polygon
         points="8.88,9.71 5.88,7.95 5.88,4.46 8.88,6.22 "
         fill="#9cebff"
         id="polygon91"
         style="stroke-width:0.375" />
      <polygon
         points="8.88,9.71 5.88,7.95 8.88,6.21 "
         fill="#c3f1ff"
         id="polygon92"
         style="stroke-width:0.375" />
      <polygon
         points="8.88,9.71 11.88,7.95 8.88,6.21 "
         fill="#9cebff"
         id="polygon93"
         style="stroke-width:0.375" />
      <path
         d="M 12.49,15.84 C 10.71,15.56 10.64,14.28 10.64,12.21 H 7.11 c 0,2.07 -0.06,3.35 -1.84,3.63 a 1,1 0 0 0 -0.89,1 h 9 a 1,1 0 0 0 -0.89,-1 z"
         fill="url(#bdb45a0b-eb58-4970-a60a-fb2ce314f866)"
         id="path100"
         style="fill:url(#linearGradient101);stroke-width:0.375" />
    </g>
    <g
       id="g18-6"
       transform="matrix(0.74850894,0,0,0.74850894,109.97142,161.2932)"
       style="stroke-width:0.353479">
      <path
         id="ee75dd06-1aca-4f76-9d11-d05a284020ad"
         d="M 14.21,15.72 A 8.5030877,8.5030877 0 0 1 3.79,2.28 L 3.88,2.22 a 8.5,8.5 0 0 1 10.33,13.5"
         fill="url(#e2cf8746-c9a8-4eee-86c2-4951983c6032)"
         style="fill:url(#e2cf8746-c9a8-4eee-86c2-4951983c6032-1);stroke-width:0.353479" />
      <path
         d="M 6.69,7.23 A 13,13 0 0 1 15.6,3.65 8.47,8.47 0 0 0 14.11,2.21 14.34,14.34 0 0 0 9.42,3.31 12.54,12.54 0 0 0 5.34,6.13 2.76,2.76 0 0 1 6.69,7.23 Z"
         fill="#ffffff"
         opacity="0.6"
         id="path8-9"
         style="stroke-width:0.353479" />
      <path
         d="m 2.48,10.65 a 17.86,17.86 0 0 0 -0.83,2.62 7.82,7.82 0 0 0 0.62,0.92 c 0.18,0.23 0.35,0.44 0.55,0.65 A 17.94,17.94 0 0 1 3.9,11.37 2.76,2.76 0 0 1 2.48,10.65 Z"
         fill="#ffffff"
         opacity="0.6"
         id="path9-3"
         style="stroke-width:0.353479" />
      <path
         d="M 3.46,6.11 A 12,12 0 0 1 2.77,3.17 8.15,8.15 0 0 0 1.67,4.62 12.69,12.69 0 0 0 2.24,7 2.69,2.69 0 0 1 3.46,6.11 Z"
         fill="#f2f2f2"
         opacity="0.55"
         id="path10-7"
         style="stroke-width:0.353479" />
      <circle
         cx="4.3800001"
         cy="8.6800003"
         r="2.73"
         fill="url(#bdd213dd-d313-473c-8ff4-0133fd3a9033)"
         id="circle10"
         style="fill:url(#linearGradient1);stroke-width:0.353479" />
      <path
         d="M 8.36,13.67 A 1.77,1.77 0 0 1 8.9,12.4 11.88,11.88 0 0 1 6.37,10.54 2.74,2.74 0 0 1 4.88,11.37 13.1,13.1 0 0 0 6.33,12.65 12.12,12.12 0 0 0 8.38,13.9 1.79,1.79 0 0 1 8.36,13.67 Z"
         fill="#f2f2f2"
         opacity="0.55"
         id="path11-4"
         style="stroke-width:0.353479" />
      <path
         d="m 14.66,13.88 a 12,12 0 0 1 -2.76,-0.32 0.41,0.41 0 0 1 0,0.11 1.75,1.75 0 0 1 -0.51,1.24 13.69,13.69 0 0 0 3.42,0.24 8.21,8.21 0 0 0 1.19,-1.34 11.5,11.5 0 0 1 -1.34,0.07 z"
         fill="#f2f2f2"
         opacity="0.55"
         id="path12-5"
         style="stroke-width:0.353479" />
      <circle
         cx="10.13"
         cy="13.67"
         r="1.78"
         fill="url(#afcc63c5-3649-4476-a742-bcb53a569f3c)"
         id="circle12"
         style="fill:url(#linearGradient2);stroke-width:0.353479" />
      <path
         d="m 12.32,8.93 a 1.83,1.83 0 0 1 0.61,-1 25.5,25.5 0 0 1 -4.46,-4.14 16.91,16.91 0 0 1 -2,-2.92 7.64,7.64 0 0 0 -1.09,0.42 18.14,18.14 0 0 0 2.15,3.18 26.44,26.44 0 0 0 4.79,4.46 z"
         fill="#f2f2f2"
         opacity="0.7"
         id="path13-2"
         style="stroke-width:0.353479" />
      <circle
         cx="14.18"
         cy="9.2700005"
         r="1.89"
         fill="url(#bd873f0b-9954-4aa5-a3df-9f4c64e8729d)"
         id="circle13"
         style="fill:url(#bd873f0b-9954-4aa5-a3df-9f4c64e8729d-4);stroke-width:0.353479" />
      <path
         d="M 17.35,10.54 17,10.37 v 0 L 16.7,10.21 H 16.64 L 16.38,10 H 16.31 L 16,9.8 a 1.76,1.76 0 0 1 -0.64,0.92 c 0.12,0.08 0.25,0.15 0.38,0.22 l 0.08,0.05 0.35,0.19 v 0 l 0.86,0.45 v 0 a 8.63,8.63 0 0 0 0.29,-1.11 z"
         fill="#f2f2f2"
         opacity="0.55"
         id="path14-5"
         style="stroke-width:0.353479" />
      <circle
         cx="4.3800001"
         cy="8.6800003"
         r="2.73"
         fill="url(#bdd213dd-d313-473c-8ff4-0133fd3a9033)"
         id="circle14"
         style="fill:url(#linearGradient105);stroke-width:0.353479" />
      <circle
         cx="10.13"
         cy="13.67"
         r="1.78"
         fill="url(#afcc63c5-3649-4476-a742-bcb53a569f3c)"
         id="circle15"
         style="fill:url(#linearGradient106);stroke-width:0.353479" />
    </g>
    <g
       id="g7-95"
       transform="matrix(0.70451201,0,0,0.70451201,140.34775,160.53571)"
       style="stroke-width:0.375555">
      <path
         d="M 17.22,13.92 A 0.79,0.79 0 0 0 18.02,13.13 0.28,0.28 0 0 0 18,13 C 17.69,10.5 16.26,8.46 13.54,8.46 10.82,8.46 9.35,10.22 9.07,13 a 0.81,0.81 0 0 0 0.72,0.88 h 7.43 z"
         fill="#0078d4"
         id="path4-04"
         style="stroke-width:0.375555" />
      <path
         d="m 13.55,9.09 a 2.44,2.44 0 0 1 -1.36,-0.4 l 1.35,3.52 1.33,-3.49 a 2.54,2.54 0 0 1 -1.32,0.37 z"
         fill="#ffffff"
         opacity="0.8"
         id="path5-8"
         style="stroke-width:0.0528907" />
      <circle
         cx="13.55"
         cy="6.5799999"
         r="2.51"
         fill="#0078d4"
         id="circle5-7"
         style="stroke-width:0.375555" />
      <path
         d="m 12.19,16.36 a 1.19,1.19 0 0 0 1.19,-1.19 0.66,0.66 0 0 0 0,-0.14 C 12.91,11.29 10.78,8.25 6.72,8.25 2.66,8.25 0.44,10.83 0,15 a 1.2,1.2 0 0 0 1.07,1.31 h 11.1 z"
         fill="url(#f97360fa-fd13-420b-9b43-74b8dde83a11)"
         id="path6-1"
         style="fill:url(#f97360fa-fd13-420b-9b43-74b8dde83a11);stroke-width:0.375555" />
      <path
         d="m 6.77,9.14 a 3.72,3.72 0 0 1 -2,-0.6 l 2,5.25 2,-5.21 a 3.81,3.81 0 0 1 -2,0.56 z"
         fill="#ffffff"
         opacity="0.8"
         id="path7-72"
         style="stroke-width:0.0528907" />
      <circle
         cx="6.7399998"
         cy="5.3899999"
         r="3.75"
         fill="url(#b2ab4071-529d-4450-9443-e6dc0939cc4e)"
         id="circle7-7"
         style="fill:url(#b2ab4071-529d-4450-9443-e6dc0939cc4e);stroke-width:0.375555" />
    </g>
    <text
       xml:space="preserve"
       style="font-style:normal;font-weight:normal;font-size:4.7625px;line-height:1.05;font-family:sans-serif;text-align:start;text-anchor:start;fill:#4d4d4d;fill-opacity:1;stroke:none;stroke-width:0.264583"
       x="53.29163"
       y="180.10017"
       id="text110"><tspan
         style="font-style:normal;font-variant:normal;font-weight:normal;font-stretch:normal;font-size:4.7625px;line-height:1.05;font-family:Sans;-inkscape-font-specification:Sans;text-align:start;text-anchor:start;fill:#4d4d4d;fill-opacity:1;stroke-width:0.264583"
         x="53.29163"
         y="180.10017"
         id="tspan110">VM</tspan></text>
    <text
       xml:space="preserve"
       style="font-style:normal;font-weight:normal;font-size:4.7625px;line-height:1.05;font-family:sans-serif;text-align:start;text-anchor:start;fill:#4d4d4d;fill-opacity:1;stroke:none;stroke-width:0.264583"
       x="86.71933"
       y="180.10017"
       id="text111"><tspan
         style="font-style:normal;font-variant:normal;font-weight:normal;font-stretch:normal;font-size:4.7625px;line-height:1.05;font-family:Sans;-inkscape-font-specification:Sans;text-align:center;text-anchor:middle;fill:#4d4d4d;fill-opacity:1;stroke-width:0.264583"
         x="86.71933"
         y="180.10017"
         id="tspan111">Data</tspan><tspan
         style="font-style:normal;font-variant:normal;font-weight:normal;font-stretch:normal;font-size:4.7625px;line-height:1.05;font-family:Sans;-inkscape-font-specification:Sans;text-align:center;text-anchor:middle;fill:#4d4d4d;fill-opacity:1;stroke-width:0.264583"
         x="86.71933"
         y="185.1008"
         id="tspan114">store</tspan></text>
    <text
       xml:space="preserve"
       style="font-style:normal;font-weight:normal;font-size:4.7625px;line-height:1.05;font-family:sans-serif;text-align:start;text-anchor:start;fill:#4d4d4d;fill-opacity:1;stroke:none;stroke-width:0.264583"
       x="116.76002"
       y="180.10017"
       id="text112"><tspan
         style="font-style:normal;font-variant:normal;font-weight:normal;font-stretch:normal;font-size:4.7625px;line-height:1.05;font-family:Sans;-inkscape-font-specification:Sans;text-align:center;text-anchor:middle;fill:#4d4d4d;fill-opacity:1;stroke-width:0.264583"
         x="116.76002"
         y="180.10017"
         id="tspan115">Web App</tspan></text>
    <text
       xml:space="preserve"
       style="font-style:normal;font-weight:normal;font-size:4.7625px;line-height:1.05;font-family:sans-serif;text-align:start;text-anchor:start;fill:#4d4d4d;fill-opacity:1;stroke:none;stroke-width:0.264583"
       x="146.53444"
       y="180.15831"
       id="text113"><tspan
         style="font-style:normal;font-variant:normal;font-weight:normal;font-stretch:normal;font-size:4.7625px;line-height:1.05;font-family:Sans;-inkscape-font-specification:Sans;text-align:center;text-anchor:middle;fill:#4d4d4d;fill-opacity:1;stroke-width:0.264583"
         x="146.53444"
         y="180.15831"
         id="tspan113">Service</tspan><tspan
         style="font-style:normal;font-variant:normal;font-weight:normal;font-stretch:normal;font-size:4.7625px;line-height:1.05;font-family:Sans;-inkscape-font-specification:Sans;text-align:center;text-anchor:middle;fill:#4d4d4d;fill-opacity:1;stroke-width:0.264583"
         x="146.53444"
         y="185.15894"
         id="tspan116">Management</tspan></text>
    <g
       id="g154"
       transform="matrix(0.82677165,0,0,0.82677165,74.896665,-42.073319)"
       style="stroke-width:1.20953">
      <path
         d="m 14.268856,251.06516 c -3.50552,0 -6.3500001,-1.00157 -6.3500001,-2.30362 v 12.22925 c 0,1.26199 2.7944011,2.2836 6.2598581,2.30363 h 0.09014 c 3.505521,0 6.35,-1.00158 6.35,-2.30363 v -12.22925 c 0,1.272 -2.844479,2.30362 -6.35,2.30362 z"
         fill="url(#b39dcf83-187e-4c64-98df-431bb60809d2)"
         id="path7-3"
         style="fill:url(#b39dcf83-187e-4c64-98df-431bb60809d2-7);stroke-width:0.320021" />
      <path
         d="m 20.618856,248.76154 c 0,1.272 -2.844479,2.30362 -6.35,2.30362 -3.50552,0 -6.3500001,-1.03162 -6.3500001,-2.30362 0,-1.27201 2.8444801,-2.30363 6.3500001,-2.30363 3.505521,0 6.35,1.00157 6.35,2.30363"
         fill="#e8e8e8"
         id="path8-1"
         style="stroke-width:0.320021" />
      <path
         d="m 19.136522,248.57124 c 0,0.81127 -2.183439,1.4623 -4.867666,1.4623 -2.684227,0 -4.8476341,-0.65103 -4.8476341,-1.4623 0,-0.81128 2.1634071,-1.46231 4.8476341,-1.46231 2.684227,0 4.867666,0.66104 4.867666,1.46231"
         fill="#50e6ff"
         id="path9-4"
         style="stroke-width:0.320021" />
      <path
         d="m 14.268856,248.91177 a 12.018928,12.018928 0 0 0 -3.846057,0.55087 11.267745,11.267745 0 0 0 3.856073,0.5709 11.267745,11.267745 0 0 0 3.856073,-0.5709 12.018928,12.018928 0 0 0 -3.866089,-0.55087 z"
         fill="#198ab3"
         id="path10-92"
         style="stroke-width:0.320021" />
    </g>
    <text
       xml:space="preserve"
       style="font-style:normal;font-weight:normal;font-size:4.7625px;line-height:1.05;font-family:sans-serif;text-align:start;text-anchor:start;fill:#4d4d4d;fill-opacity:1;stroke:none;stroke-width:0.264583"
       x="176.67862"
       y="180.16063"
       id="text117"><tspan
         style="font-style:normal;font-variant:normal;font-weight:normal;font-stretch:normal;font-size:4.7625px;line-height:1.05;font-family:Sans;-inkscape-font-specification:Sans;text-align:center;text-anchor:middle;fill:#4d4d4d;fill-opacity:1;stroke-width:0.264583"
         x="176.67862"
         y="180.16063"
         id="tspan117">Other</tspan><tspan
         style="font-style:normal;font-variant:normal;font-weight:normal;font-stretch:normal;font-size:4.7625px;line-height:1.05;font-family:Sans;-inkscape-font-specification:Sans;text-align:center;text-anchor:middle;fill:#4d4d4d;fill-opacity:1;stroke-width:0.264583"
         x="176.67862"
         y="185.16125"
         id="tspan118">Services</tspan></text>
    <text
       xml:space="preserve"
       style="font-style:normal;font-weight:normal;font-size:16.9333px;line-height:1.05;font-family:sans-serif;text-align:start;text-anchor:start;fill:#4d4d4d;fill-opacity:1;stroke:none;stroke-width:0.264583"
       x="176.66893"
       y="169.01445"
       id="text120"><tspan
         style="font-style:normal;font-variant:normal;font-weight:bold;font-stretch:normal;font-size:16.9333px;line-height:1.05;font-family:Sans;-inkscape-font-specification:Sans;text-align:center;text-anchor:middle;fill:#4d4d4d;fill-opacity:1;stroke-width:0.264583"
         x="176.66893"
         y="169.01445"
         id="tspan120">...</tspan></text>
    <g
       id="g12-7"
       transform="matrix(0.70555584,0,0,0.70555584,179.34375,117.27526)"
       style="stroke-width:0.375">
      <g
         id="g10-1"
         style="stroke-width:0.375">
        <path
           d="m 17.647,9.906 -7.5,-8.461 C 9.548,0.769 8.453,0.769 7.853,1.445 l -7.5,8.461 c -0.579,0.654 -0.428,1.641 0.323,2.111 l 7.499,4.688 c 0.5,0.313 1.148,0.313 1.648,0 l 7.499,-4.688 c 0.751,-0.469 0.902,-1.457 0.323,-2.111 v 0 z"
           fill="url(#uuid-38c07977-ab9a-48eb-a668-cda3102bbd85)"
           stroke-width="0"
           id="path8-15"
           style="fill:url(#uuid-38c07977-ab9a-48eb-a668-cda3102bbd85)" />
        <path
           d="M 10.148,1.445 C 9.549,0.769 8.454,0.769 7.854,1.445 l -7.5,8.461 c -0.579,0.654 -0.428,1.641 0.323,2.111 0,0 2.776,1.735 3.126,1.954 0.388,0.242 1.033,0.511 1.715,0.511 0.621,0 1.197,-0.18 1.676,-0.487 0,0 0,0 0.002,-10e-4 L 9,12.866 4.636,10.138 9.11,5.091 c 0.55,-0.627 1.377,-1.026 2.302,-1.026 0.472,0 0.917,0.107 1.314,0.292 L 10.147,1.448 V 1.446 Z"
           fill="url(#uuid-aed4a7bc-b380-4c34-b841-2d0f34d24f17)"
           stroke-width="0"
           id="path9-9"
           style="fill:url(#uuid-aed4a7bc-b380-4c34-b841-2d0f34d24f17)" />
        <polygon
           points="13.365,10.138 13.366,10.138 13.365,10.138 9.001,5.214 4.636,10.138 4.688,10.17 9.001,12.866 "
           fill="url(#uuid-e2a7b7f2-bf16-4a76-ba27-7d149ab8a194)"
           stroke-width="0"
           id="polygon9-7"
           style="fill:url(#uuid-e2a7b7f2-bf16-4a76-ba27-7d149ab8a194)" />
        <path
           d="m 9.001,16.939 c 0.287,0 0.574,-0.078 0.824,-0.234 l 7.499,-4.688 c 0.751,-0.469 0.902,-1.457 0.323,-2.111 L 10.148,1.445 C 9.848,1.107 9.425,0.938 9.001,0.938 Z"
           fill="url(#uuid-c67f3364-071c-41f9-a175-d3de1f837e0a)"
           fill-opacity="0.5"
           isolation="isolate"
           opacity="0.5"
           stroke-width="0"
           id="path10-76"
           style="fill:url(#uuid-c67f3364-071c-41f9-a175-d3de1f837e0a)" />
      </g>
      <g
         id="g11-7"
         style="stroke-width:0.375">
        <path
           id="uuid-f6648d86-048a-4f40-a6df-7ce120116a98"
           d="m 16.512,10.831 c 0.464,-0.458 0.468,-1.206 0.01,-1.67 -0.003,-0.003 -0.006,-0.006 -0.01,-0.01 v 0 L 14.477,7.116 c -0.461,-0.461 -1.208,-0.461 -1.669,0 v 0 l -2.035,2.035 c -0.456,0.467 -0.456,1.213 0,1.679 l 1.7,1.7 c 0.061,0.063 0.094,0.147 0.092,0.234 v 3.155 c -0.003,0.108 0.041,0.213 0.122,0.285 l 0.773,0.773 c 0.095,0.104 0.255,0.112 0.359,0.017 0.006,-0.005 0.012,-0.011 0.017,-0.017 l 0.743,-0.743 v 0 l 0.448,-0.448 c 0.058,-0.059 0.058,-0.154 0,-0.214 l -0.316,-0.315 c -0.067,-0.059 -0.074,-0.162 -0.014,-0.23 0.005,-0.005 0.009,-0.01 0.014,-0.014 l 0.316,-0.316 c 0.059,-0.063 0.059,-0.161 0,-0.224 l -0.316,-0.316 c -0.065,-0.054 -0.073,-0.15 -0.019,-0.215 0.006,-0.007 0.012,-0.013 0.019,-0.019 l 0.316,-0.326 c 0.058,-0.059 0.058,-0.154 0,-0.214 l -0.448,-0.448 v -0.163 l 1.934,-1.944 z m -2.87,-3.226 c 0.371,0 0.672,0.301 0.672,0.672 0,0.371 -0.301,0.672 -0.672,0.672 -0.371,0 -0.672,-0.301 -0.672,-0.672 v 0 c 0,-0.371 0.301,-0.672 0.672,-0.672 z"
           fill="#ffca00"
           stroke-width="0" />
        <path
           id="uuid-e1697bf4-8e5d-4d62-90c9-6569d79d4944"
           d="m 13.133,16.042 v 0 c 0.055,0.057 0.145,0.058 0.201,0.003 0.031,-0.03 0.047,-0.072 0.043,-0.115 v -2.605 c 0.002,-0.051 -0.021,-0.1 -0.061,-0.132 v 0 c -0.064,-0.045 -0.153,-0.03 -0.199,0.034 -0.02,0.029 -0.029,0.064 -0.025,0.098 v 2.555 c -0.02,0.058 -0.004,0.122 0.041,0.163 z"
           fill="#ff9300"
           isolation="isolate"
           opacity="0.75"
           stroke-width="0" />
        <rect
           id="uuid-c930d4c2-9f41-48c7-adf7-acbd73af6fbf"
           x="12.014"
           y="9.8339996"
           width="3.348"
           height="0.39700001"
           rx="0.183"
           ry="0.183"
           fill="#ff9300"
           isolation="isolate"
           opacity="0.75"
           stroke-width="0" />
        <rect
           id="uuid-755aaa46-8b89-45f5-9da0-8a42782c5ddd"
           x="12.014"
           y="10.475"
           width="3.348"
           height="0.39700001"
           rx="0.183"
           ry="0.183"
           fill="#ff9300"
           isolation="isolate"
           opacity="0.75"
           stroke-width="0" />
      </g>
    </g>
    <path
       id="path123"
       style="fill:none;stroke:#4d4d4d;stroke-linecap:round;stroke-linejoin:round"
       d="m 193.69376,124.69111 h 10 c 1.108,0 2,0.892 2,2 v 11 c 0,1.108 -0.892,2 -2,2 h -36 c -1.108,0 -2,-0.892 -2,-2 v -11 c 0,-1.108 0.892,-2 2,-2 h 10" />
    <text
       xml:space="preserve"
       style="font-style:normal;font-weight:normal;font-size:5.29167px;line-height:1.05;font-family:sans-serif;fill:#4d4d4d;fill-opacity:1;stroke:none;stroke-width:0.264583"
       x="185.4705"
       y="134.8969"
       id="text123"><tspan
         style="font-style:normal;font-variant:normal;font-weight:normal;font-stretch:normal;font-size:5.29167px;line-height:1.05;font-family:Sans;-inkscape-font-specification:Sans;text-align:center;text-anchor:middle;fill:#4d4d4d;fill-opacity:1;stroke-width:0.264583"
         x="185.4705"
         y="134.8969"
         id="tspan123">Authentication</tspan></text>
    <path
       style="fill:none;stroke:#4d4d4d;stroke-width:1;stroke-linecap:round;stroke-linejoin:round;stroke-dasharray:none;stroke-opacity:1;marker-start:url(#marker125);marker-end:url(#marker126)"
       d="m 154.69376,132.69111 h 7"
       id="path124" />
    <path
       style="fill:none;stroke:#4d4d4d;stroke-width:1;stroke-linecap:round;stroke-linejoin:round;stroke-dasharray:none;stroke-opacity:1;marker-end:url(#marker126)"
       d="m 86.69375,141.69111 v 2 l -30,6 v 8"
       id="path127" />
    <path
       style="fill:none;stroke:#4d4d4d;stroke-width:1;stroke-linecap:round;stroke-linejoin:round;stroke-dasharray:none;stroke-opacity:1;marker-end:url(#marker126)"
       d="m 146.69376,141.69111 v 2 l 30,6 v 8"
       id="path79" />
    <path
       style="fill:none;stroke:#4d4d4d;stroke-width:1;stroke-linecap:round;stroke-linejoin:round;stroke-dasharray:none;stroke-opacity:1;marker-end:url(#marker126)"
       d="m 101.69375,141.69111 v 2 l -15,6 v 8"
       id="path80" />
    <path
       style="fill:none;stroke:#4d4d4d;stroke-width:1;stroke-linecap:round;stroke-linejoin:round;stroke-dasharray:none;stroke-opacity:1;marker-end:url(#marker126)"
       d="m 116.69375,141.69111 v 16"
       id="path89" />
    <path
       style="fill:none;stroke:#4d4d4d;stroke-width:1;stroke-linecap:round;stroke-linejoin:round;stroke-dasharray:none;stroke-opacity:1;marker-end:url(#marker126)"
       d="m 131.69375,141.69111 v 2 l 15.00001,6 v 8"
       id="path90" />
    <g
       id="g7-1"
       style="stroke-width:0.354166"
       transform="matrix(0.74705882,0,0,0.74705882,93.970222,46.87065)">
      <path
         d="m 0.5,5.788 h 17 v 9.478 a 0.568,0.568 0 0 1 -0.568,0.568 H 1.068 A 0.568,0.568 0 0 1 0.5,15.266 Z"
         fill="url(#a24f9983-911f-4df7-920f-f964c8c10f82)"
         id="path4-2"
         style="fill:url(#a24f9983-911f-4df7-920f-f964c8c10f82);stroke-width:0.354166" />
      <path
         d="m 1.071,2.166 h 15.858 a 0.568,0.568 0 0 1 0.568,0.568 V 5.788 H 0.5 V 2.734 A 0.568,0.568 0 0 1 1.071,2.166 Z"
         fill="#0078d4"
         id="path5-7"
         style="stroke-width:0.354166" />
      <path
         d="M 4.292,7.153 H 4.815 A 0.167,0.167 0 0 1 4.982,7.32 v 3.858 A 0.335,0.335 0 0 1 4.647,11.513 H 4.125 V 7.321 A 0.167,0.167 0 0 1 4.292,7.154 Z"
         transform="rotate(-45.081,4.5529301,9.3334607)"
         fill="#f2f2f2"
         id="path6-0"
         style="stroke-width:0.354166" />
      <path
         d="M 4.32,9.647 H 4.843 A 0.167,0.167 0 0 1 5.01,9.814 v 4.131 H 4.488 A 0.335,0.335 0 0 1 4.153,13.61 V 9.81 A 0.167,0.167 0 0 1 4.32,9.643 Z"
         transform="rotate(-135.081,4.5815119,11.796673)"
         fill="#e6e6e6"
         id="path7-9"
         style="stroke-width:0.354166" />
      <rect
         x="7.2210002"
         y="12.64"
         width="4.7709999"
         height="1.011"
         rx="0.29100001"
         fill="#f2f2f2"
         id="rect7"
         style="stroke-width:0.354166" />
    </g>
    <g
       id="g9-9"
       transform="matrix(0.71052926,0,0,0.71052926,147.799,48.07267)"
       style="stroke-width:0.372375">
      <path
         d="M 15.6,5.7 H 0.067 V 2.99 A 0.226,0.226 0 0 1 0.293,2.764 H 15.37 a 0.227,0.227 0 0 1 0.227,0.226 z"
         fill="#949494"
         id="path5-20"
         style="stroke-width:0.372375" />
      <path
         d="m 0.063,5.7 h 15.53 v 9.254 a 0.231,0.231 0 0 1 -0.231,0.231 H 0.294 A 0.231,0.231 0 0 1 0.063,14.954 Z"
         fill="#bfbfbf"
         id="path6-2"
         style="stroke-width:0.372375" />
      <path
         fill="#005ba1"
         d="m 1.135,6.5 h 13.37 v 7.57 H 1.135 Z"
         id="path7-37"
         style="stroke-width:0.372375" />
      <g
         fill="#ffffff"
         id="g8-5"
         style="stroke-width:0.372375">
        <rect
           x="4.5760002"
           y="10.738"
           width="2.8369999"
           height="0.52700001"
           rx="0.26300001"
           id="rect7-9"
           style="stroke-width:0.372375" />
        <path
           d="M 2.675,11.215 4.35,9.54 a 0.169,0.169 0 0 0 0,-0.243 L 2.65,7.664 A 0.17,0.17 0 0 0 2.406,7.674 L 2.28,7.8 A 0.17,0.17 0 0 0 2.29,8.036 L 3.623,9.3 a 0.171,0.171 0 0 1 0,0.242 l -1.3,1.333 a 0.171,0.171 0 0 0 0,0.239 l 0.1,0.1 a 0.17,0.17 0 0 0 0.252,10e-4 z"
           id="path8-2"
           style="stroke-width:0.372375" />
      </g>
      <path
         d="m 17.937,12.958 a 2.3,2.3 0 0 0 -2,-2.216 2.906,2.906 0 0 0 -2.994,-2.78 2.982,2.982 0 0 0 -2.851,1.938 2.752,2.752 0 0 0 -2.42,2.648 2.793,2.793 0 0 0 2.89,2.684 l 0.255,-0.01 H 15.5 a 0.465,0.465 0 0 0 0.124,-0.019 2.333,2.333 0 0 0 2.313,-2.244 z"
         fill="url(#ba88ea91-3b3a-4da0-9b97-9a10ebaa3e50)"
         id="path9-28"
         style="fill:url(#ba88ea91-3b3a-4da0-9b97-9a10ebaa3e50);stroke-width:0.372375" />
    </g>
    <g
       id="g113"
       transform="matrix(1.6076707,0,0,1.6076707,45.709277,-133.9746)"
       style="stroke-width:0.622018">
      <path
         fill="url(#e399c19f-b68f-429d-b176-18c2117ff73c)"
         d="m -2.258986,112.46457 h 2.337572 l -2.426629,7.18984 a 0.37274742,0.37274742 0 0 1 -0.353087,0.25353 h -1.819208 a 0.37211899,0.37211899 0 0 1 -0.352638,-0.49107 l 2.260814,-6.69877 a 0.37274742,0.37274742 0 0 1 0.353176,-0.25362 z"
         id="path91"
         style="fill:url(#linearGradient111);stroke-width:0.257148" />
      <path
         fill="#0078d4"
         d="M 1.137845,117.28703 H -2.56898 a 0.17156077,0.17156077 0 0 0 -0.117157,0.29707 l 2.38192,2.2232 a 0.37445315,0.37445315 0 0 0 0.255501,0.10064 h 2.098949 z"
         id="path101"
         style="stroke-width:0.257148" />
      <path
         fill="url(#ac2a6fc2-ca48-4327-9a3c-d4dcc3256e15)"
         d="m -2.258986,112.46457 a 0.36969506,0.36969506 0 0 0 -0.353984,0.25846 l -2.257223,6.68773 a 0.37167011,0.37167011 0 0 0 0.350842,0.49718 h 1.866161 a 0.39887206,0.39887206 0 0 0 0.306134,-0.26035 l 0.450134,-1.32661 1.607877,1.4997 a 0.38037833,0.38037833 0 0 0 0.239342,0.0873 h 2.091138 l -0.917146,-2.62091 -2.673601,6.3e-4 1.636336,-4.82309 z"
         id="path102"
         style="fill:url(#linearGradient112);stroke-width:0.257148" />
      <path
         fill="url(#a7fee970-a784-4bb1-af8d-63d18e5f7db9)"
         d="m 0.726674,112.71775 a 0.37211899,0.37211899 0 0 0 -0.352638,-0.25317 h -2.605192 a 0.37220877,0.37220877 0 0 1 0.352638,0.25317 l 2.260903,6.69904 a 0.37220877,0.37220877 0 0 1 -0.352637,0.49125 H 2.63503 a 0.37220877,0.37220877 0 0 0 0.352548,-0.49125 z"
         id="path105"
         style="fill:url(#linearGradient113);stroke-width:0.257148" />
    </g>
    <path
       id="path113"
       style="fill:none;stroke:#4d4d4d;stroke-linecap:round;stroke-linejoin:round"
       d="m 52.693751,54.69111 h 7 c 1.108,0 2,0.892 2,2 v 11 c 0,1.108 -0.892,2 -2,2 H 28.69375 c -1.108,0 -2,-0.892 -2,-2 v -11 c 0,-1.108 0.892,-2 2,-2 h 6.999998" />
    <text
       xml:space="preserve"
       style="font-style:normal;font-weight:normal;font-size:5.29167px;line-height:1.05;font-family:sans-serif;fill:#4d4d4d;fill-opacity:1;stroke:none;stroke-width:0.264583"
       x="44.383659"
       y="64.896904"
       id="text119"><tspan
         style="font-style:normal;font-variant:normal;font-weight:normal;font-stretch:normal;font-size:5.29167px;line-height:1.05;font-family:Sans;-inkscape-font-specification:Sans;text-align:center;text-anchor:middle;fill:#4d4d4d;fill-opacity:1;stroke-width:0.264583"
         x="44.383659"
         y="64.896904"
         id="tspan119">Azure Portal</tspan></text>
    <text
       xml:space="preserve"
       style="font-style:normal;font-weight:normal;font-size:5.29167px;line-height:1.05;font-family:sans-serif;fill:#4d4d4d;fill-opacity:1;stroke:none;stroke-width:0.264583"
       x="100.88366"
       y="64.896904"
       id="text136"><tspan
         style="font-style:normal;font-variant:normal;font-weight:normal;font-stretch:normal;font-size:5.29167px;line-height:1.05;font-family:Sans;-inkscape-font-specification:Sans;text-align:center;text-anchor:middle;fill:#4d4d4d;fill-opacity:1;stroke-width:0.264583"
         x="100.88366"
         y="64.896904"
         id="tspan136">Azure PowerShell</tspan></text>
    <path
       id="path136"
       style="fill:none;stroke:#4d4d4d;stroke-linecap:round;stroke-linejoin:round"
       d="m 109.25709,54.69111 h 13.43666 c 1.108,0 2,0.892 2,2 v 11 c 0,1.108 -0.892,2 -2,2 H 78.693751 c -1.108,0 -2,-0.892 -2,-2 v -11 c 0,-1.108 0.892,-2 2,-2 h 13.563341" />
    <path
       id="path137"
       style="fill:none;stroke:#4d4d4d;stroke-linecap:round;stroke-linejoin:round"
       d="m 162.69376,54.69111 h 4 c 1.108,0 2,0.892 2,2 v 11 c 0,1.108 -0.892,2 -2,2 h -25.00001 c -1.108,0 -2,-0.892 -2,-2 v -11 c 0,-1.108 0.892,-2 2,-2 h 4" />
    <text
       xml:space="preserve"
       style="font-style:normal;font-weight:normal;font-size:5.29167px;line-height:1.05;font-family:sans-serif;fill:#4d4d4d;fill-opacity:1;stroke:none;stroke-width:0.264583"
       x="154.43533"
       y="64.896904"
       id="text137"><tspan
         style="font-style:normal;font-variant:normal;font-weight:normal;font-stretch:normal;font-size:5.29167px;line-height:1.05;font-family:Sans;-inkscape-font-specification:Sans;text-align:center;text-anchor:middle;fill:#4d4d4d;fill-opacity:1;stroke-width:0.264583"
         x="154.43533"
         y="64.896904"
         id="tspan137">Azure CLI</tspan></text>
    <path
       id="path138"
       style="fill:none;stroke:#4d4d4d;stroke-linecap:round;stroke-linejoin:round"
       d="m 218.69375,54.69111 c 1.108,0 2,0.892 2,2 v 11 c 0,1.108 -0.892,2 -2,2 h -33 c -1.108,0 -2,-0.892 -2,-2 v -11 c 0,-1.108 0.892,-2 2,-2 z" />
    <text
       xml:space="preserve"
       style="font-style:normal;font-weight:normal;font-size:5.29167px;line-height:1.05;font-family:sans-serif;fill:#4d4d4d;fill-opacity:1;stroke:none;stroke-width:0.264583"
       x="202.08778"
       y="64.08503"
       id="text139"><tspan
         style="font-style:normal;font-variant:normal;font-weight:normal;font-stretch:normal;font-size:5.29167px;line-height:1.05;font-family:Sans;-inkscape-font-specification:Sans;text-align:center;text-anchor:middle;fill:#4d4d4d;fill-opacity:1;stroke-width:0.264583"
         x="202.08778"
         y="64.08503"
         id="tspan139">REST Clients</tspan></text>
    <path
       id="path139"
       style="fill:none;stroke:#4d4d4d;stroke-linecap:round;stroke-linejoin:round"
       d="m 136.69375,89.69111 c 1.108,0 2,0.892 2,2 v 11 c 0,1.108 -0.892,2 -2,2 h -33 c -1.108,0 -2,-0.892 -2,-2 v -11 c 0,-1.108 0.892,-2 2,-2 z" />
    <text
       xml:space="preserve"
       style="font-style:normal;font-weight:normal;font-size:5.29167px;line-height:1.05;font-family:sans-serif;fill:#4d4d4d;fill-opacity:1;stroke:none;stroke-width:0.264583"
       x="120.0878"
       y="99.085014"
       id="text140"><tspan
         style="font-style:normal;font-variant:normal;font-weight:normal;font-stretch:normal;font-size:5.29167px;line-height:1.05;font-family:Sans;-inkscape-font-specification:Sans;text-align:center;text-anchor:middle;fill:#4d4d4d;fill-opacity:1;stroke-width:0.264583"
         x="120.0878"
         y="99.085014"
         id="tspan140">SDKs</tspan></text>
    <path
       style="fill:none;stroke:#4d4d4d;stroke-width:1;stroke-linecap:round;stroke-linejoin:round;stroke-dasharray:none;stroke-opacity:1;marker-end:url(#marker126)"
       d="m 119.69375,106.69111 v 2 l -3.46381,4 v 3"
       id="path142" />
    <path
       style="fill:none;stroke:#4d4d4d;stroke-width:1;stroke-linecap:round;stroke-linejoin:round;stroke-dasharray:none;stroke-opacity:1;marker-end:url(#marker126)"
       d="m 100.69375,71.69111 v 3 l 6,5 v 6"
       id="path143" />
    <path
       style="fill:none;stroke:#4d4d4d;stroke-width:1;stroke-linecap:round;stroke-linejoin:round;stroke-dasharray:none;stroke-opacity:1;marker-end:url(#marker126)"
       d="m 44.693751,71.69111 v 43 h 56.999999 l 5,3"
       id="path145" />
    <path
       style="fill:none;stroke:#4d4d4d;stroke-width:1;stroke-linecap:round;stroke-linejoin:round;stroke-dasharray:none;stroke-opacity:1;marker-end:url(#marker126)"
       d="m 201.69375,71.69111 v 43 h -71 l -5,3"
       id="path150" />
    <g
       id="g153"
       transform="matrix(-1,0,0,1,172.96261,-85.185066)">
      <path
         style="fill:none;stroke:#4d4d4d;stroke-width:1;stroke-linecap:round;stroke-linejoin:round;stroke-dasharray:none;stroke-opacity:1;marker-end:url(#marker126)"
         d="m 18.268857,156.87618 v 3 l 20.999999,4.99998 v 6"
         id="path152" />
    </g>
  </g>
</svg>
