<?xml version="1.0" encoding="UTF-8" standalone="no"?>
<!-- Created with Inkscape (http://www.inkscape.org/) -->

<svg
   width="134.63844mm"
   height="123.45721mm"
   viewBox="0 0 134.63844 123.45721"
   version="1.1"
   id="svg37530"
   xmlns="http://www.w3.org/2000/svg"
   xmlns:svg="http://www.w3.org/2000/svg">
  <defs
     id="defs37527" />
  <g
     id="layer1"
     transform="translate(-2.1589414,-160.19028)">
    <g
       aria-label="D2"
       id="text34475"
       style="font-size:3.88056px;line-height:100%;font-family:Sans;-inkscape-font-specification:Sans;letter-spacing:0px;word-spacing:0px;stroke:#000000;stroke-width:0">
      <path
         d="m 36.758623,249.77498 v -2.77778 h 0.956876 q 0.324012,0 0.494544,0.0398 0.238746,0.0549 0.407383,0.19895 0.219798,0.18569 0.327801,0.4756 0.109899,0.28801 0.109899,0.65939 0,0.31643 -0.0739,0.56086 -0.0739,0.24443 -0.189481,0.40549 -0.115583,0.15916 -0.253904,0.25201 -0.136425,0.0909 -0.33159,0.13832 -0.19327,0.0474 -0.445279,0.0474 z m 0.367592,-0.3278 h 0.593074 q 0.274747,0 0.430121,-0.0512 0.157268,-0.0512 0.250114,-0.14401 0.130741,-0.13074 0.202744,-0.35054 0.0739,-0.22169 0.0739,-0.53623 0,-0.4358 -0.144005,-0.66886 -0.14211,-0.23496 -0.346749,-0.31454 -0.147795,-0.0568 -0.475596,-0.0568 h -0.5836 z"
         style="font-family:sans-serif;-inkscape-font-specification:sans-serif"
         id="path169950" />
      <path
         d="m 41.215203,249.44718 v 0.3278 h -1.836065 q -0.0038,-0.12316 0.03979,-0.23685 0.07011,-0.18759 0.223587,-0.36949 0.155374,-0.1819 0.447173,-0.42065 0.452859,-0.37138 0.612022,-0.58738 0.159164,-0.21791 0.159164,-0.41118 0,-0.20274 -0.1459,-0.34106 -0.144005,-0.14022 -0.377066,-0.14022 -0.246325,0 -0.394119,0.1478 -0.147795,0.14779 -0.14969,0.40927 l -0.350539,-0.036 q 0.036,-0.39222 0.270957,-0.59686 0.234956,-0.20653 0.63097,-0.20653 0.399804,0 0.632865,0.22169 0.233061,0.22169 0.233061,0.54949 0,0.16674 -0.06821,0.3278 -0.06821,0.16106 -0.227377,0.33917 -0.157268,0.17811 -0.524861,0.48886 -0.306958,0.2577 -0.394119,0.35054 -0.08716,0.0909 -0.144005,0.1838 z"
         style="font-family:sans-serif;-inkscape-font-specification:sans-serif"
         id="path169952" />
    </g>
    <path
       style="fill:none;stroke:#000000;stroke-width:0.4;stroke-linecap:butt;stroke-linejoin:miter;stroke-dasharray:none;stroke-opacity:1"
       d="m 83.75862,193.77498 4,-3 h 24.99999"
       id="path34477" />
    <path
       style="fill:none;stroke:#000000;stroke-width:0.4;stroke-linecap:butt;stroke-linejoin:miter;stroke-dasharray:none;stroke-opacity:1"
       d="m 83.75862,197.77498 4,3 -10e-6,5 h 10.00001"
       id="path34479" />
    <path
       style="fill:#000000;fill-opacity:1;stroke:none;stroke-width:0.264583px;stroke-linecap:butt;stroke-linejoin:miter;stroke-opacity:1"
       d="m 85.86313,200.60439 1.19889,-1.60083 0.8416,1.87963 z"
       id="path34481" />
    <g
       aria-label="GND"
       id="text34485"
       style="font-size:3.88056px;line-height:100%;font-family:Sans;-inkscape-font-specification:Sans;letter-spacing:0px;word-spacing:0px;stroke:#000000;stroke-width:0">
      <path
         d="m 110.04622,282.51062 v -0.32591 l 1.17668,-0.002 v 1.03078 q -0.27096,0.21601 -0.55897,0.3259 -0.28801,0.10801 -0.59118,0.10801 -0.40928,0 -0.74466,-0.17432 -0.33349,-0.17622 -0.50402,-0.50781 -0.17053,-0.33159 -0.17053,-0.74087 0,-0.40549 0.16864,-0.75603 0.17053,-0.35243 0.48886,-0.52296 0.31832,-0.17054 0.73329,-0.17054 0.30127,0 0.54381,0.0985 0.24443,0.0966 0.38275,0.27096 0.13832,0.17432 0.21032,0.45475 l -0.33159,0.091 q -0.0625,-0.21222 -0.15538,-0.33349 -0.0928,-0.12127 -0.26527,-0.19327 -0.17243,-0.0739 -0.38275,-0.0739 -0.25201,0 -0.4358,0.0777 -0.1838,0.0758 -0.29749,0.20085 -0.11179,0.12506 -0.17432,0.27474 -0.10611,0.2577 -0.10611,0.55897 0,0.37138 0.12695,0.6215 0.12885,0.25011 0.37328,0.37138 0.24443,0.12127 0.51918,0.12127 0.23874,0 0.46612,-0.0909 0.22737,-0.0928 0.34485,-0.19706 v -0.51728 z"
         style="font-family:sans-serif;-inkscape-font-specification:sans-serif"
         id="path170031" />
      <path
         d="m 111.76102,283.60013 v -2.77779 h 0.37707 l 1.459,2.18092 v -2.18092 h 0.35243 v 2.77779 h -0.37707 l -1.459,-2.18282 v 2.18282 z"
         style="font-family:sans-serif;-inkscape-font-specification:sans-serif"
         id="path170033" />
      <path
         d="m 114.56723,283.60013 v -2.77779 h 0.95687 q 0.32401,0 0.49455,0.0398 0.23874,0.0549 0.40738,0.19895 0.2198,0.18569 0.3278,0.4756 0.1099,0.28801 0.1099,0.65939 0,0.31643 -0.0739,0.56086 -0.0739,0.24443 -0.18948,0.40549 -0.11558,0.15916 -0.2539,0.25201 -0.13643,0.0909 -0.33159,0.13832 -0.19327,0.0474 -0.44528,0.0474 z m 0.36759,-0.3278 h 0.59307 q 0.27475,0 0.43012,-0.0512 0.15727,-0.0512 0.25012,-0.14401 0.13074,-0.13074 0.20274,-0.35054 0.0739,-0.22169 0.0739,-0.53623 0,-0.4358 -0.14401,-0.66886 -0.14211,-0.23496 -0.34675,-0.31454 -0.14779,-0.0568 -0.47559,-0.0568 h -0.5836 z"
         style="font-family:sans-serif;-inkscape-font-specification:sans-serif"
         id="path170035" />
    </g>
    <path
       style="fill:none;stroke:#000000;stroke-width:0.7;stroke-linecap:butt;stroke-linejoin:miter;stroke-miterlimit:4;stroke-dasharray:none;stroke-opacity:1"
       d="m 109.75863,278.77498 h 6"
       id="path34487" />
    <path
       id="path34489"
       style="fill:#000000;fill-opacity:1;stroke:none;stroke-width:1.04298;stroke-linecap:butt;stroke-linejoin:miter;stroke-miterlimit:4;stroke-dasharray:none;stroke-opacity:1"
       d="m 97.75863,205.77498 h 0.89999 m 0,0 c 0,-0.49703 -0.40293,-0.89996 -0.89999,-0.89996 -0.49702,0 -0.90001,0.40293 -0.90001,0.89996 0,0.49703 0.40293,0.89997 0.89995,0.89997 0.49706,0 0.90005,-0.40294 0.90005,-0.89997 z" />
    <path
       id="path34491"
       style="fill:none;fill-opacity:0.5;stroke:#000000;stroke-width:0.5;stroke-linecap:round;stroke-linejoin:round;stroke-dasharray:none"
       d="m 127.75862,218.77498 c 0.55228,0 1,0.44772 1,1 0,0.55228 -0.44772,1 -1,1 -0.55228,0 -1,-0.44772 -1,-1 0,-0.55228 0.44772,-1 1,-1 z" />
    <path
       style="fill:none;stroke:#000000;stroke-width:0.4;stroke-linecap:butt;stroke-linejoin:miter;stroke-dasharray:none;stroke-opacity:1"
       d="m 97.75862,205.77498 h 10.99999"
       id="path34493" />
    <g
       aria-label="Out"
       id="text34497"
       style="font-size:3.88056px;line-height:100%;font-family:Sans;-inkscape-font-specification:Sans;letter-spacing:0px;word-spacing:0px;stroke:#000000;stroke-width:0">
      <path
         d="m 130.75865,219.81192 q 0,-0.6916 0.37138,-1.08193 0.37138,-0.39223 0.95877,-0.39223 0.38464,0 0.6935,0.1838 0.30885,0.18379 0.46991,0.51349 0.16295,0.3278 0.16295,0.74466 0,0.42254 -0.17053,0.75603 -0.17053,0.33348 -0.48318,0.50591 -0.31264,0.17053 -0.67455,0.17053 -0.39222,0 -0.70107,-0.18948 -0.30886,-0.18948 -0.46802,-0.51728 -0.15916,-0.3278 -0.15916,-0.6935 z m 0.37896,0.006 q 0,0.50213 0.26906,0.79203 0.27096,0.28801 0.67834,0.28801 0.41496,0 0.68213,-0.2918 0.26906,-0.2918 0.26906,-0.82803 0,-0.33917 -0.11558,-0.59118 -0.11369,-0.2539 -0.33538,-0.39222 -0.2198,-0.14022 -0.49455,-0.14022 -0.39033,0 -0.67265,0.26907 -0.28043,0.26716 -0.28043,0.89434 z"
         style="font-family:sans-serif;-inkscape-font-specification:sans-serif"
         id="path170024" />
      <path
         d="m 135.16407,221.16481 v -0.29559 q -0.23496,0.34107 -0.63855,0.34107 -0.17811,0 -0.33349,-0.0682 -0.15348,-0.0682 -0.22927,-0.17053 -0.0739,-0.10421 -0.10421,-0.2539 -0.0208,-0.10043 -0.0208,-0.31833 v -1.24678 h 0.34107 v 1.11604 q 0,0.26717 0.0208,0.36001 0.0322,0.13453 0.13643,0.21222 0.10421,0.0758 0.25769,0.0758 0.15348,0 0.28801,-0.0777 0.13453,-0.0796 0.18948,-0.21411 0.0568,-0.13643 0.0568,-0.39412 v -1.07814 h 0.34106 v 2.01228 z"
         style="font-family:sans-serif;-inkscape-font-specification:sans-serif"
         id="path170026" />
      <path
         d="m 136.74812,220.85975 0.0493,0.30127 q -0.14401,0.0303 -0.2577,0.0303 -0.18569,0 -0.28801,-0.0587 -0.10232,-0.0587 -0.144,-0.15348 -0.0417,-0.0966 -0.0417,-0.40359 v -1.15773 h -0.25011 v -0.26527 h 0.25011 v -0.49834 l 0.33917,-0.20463 v 0.70297 h 0.34296 v 0.26527 h -0.34296 v 1.17667 q 0,0.1459 0.0171,0.18759 0.0189,0.0417 0.0587,0.0663 0.0417,0.0246 0.11747,0.0246 0.0568,0 0.14969,-0.0133 z"
         style="font-family:sans-serif;-inkscape-font-specification:sans-serif"
         id="path170028" />
    </g>
    <path
       style="fill:none;stroke:#000000;stroke-width:0.4;stroke-linecap:butt;stroke-linejoin:miter;stroke-dasharray:none;stroke-opacity:1"
       d="m 97.75862,205.77498 v 24"
       id="path34499" />
    <path
       id="path34501"
       d="m 99.25862,224.77498 h -3 v -9 h 3 z"
       style="fill:#ffffff;fill-opacity:1;stroke:#000000;stroke-width:0.5;stroke-linecap:butt;stroke-linejoin:miter;stroke-miterlimit:4;stroke-dasharray:none;stroke-opacity:1" />
    <g
       aria-label="R2"
       id="text34505"
       style="font-size:3.88056px;line-height:100%;font-family:Sans;-inkscape-font-specification:Sans;letter-spacing:0px;word-spacing:0px;stroke:#000000;stroke-width:0">
      <path
         d="m 39.307734,229.77498 v -2.77778 h 1.231623 q 0.371382,0 0.564652,0.0758 0.19327,0.0739 0.308853,0.26338 0.115583,0.18948 0.115583,0.41875 0,0.29559 -0.191375,0.49833 -0.191376,0.20274 -0.591179,0.25769 0.1459,0.0701 0.221692,0.13832 0.161058,0.1478 0.305063,0.36949 l 0.483175,0.75603 h -0.462332 l -0.367592,-0.57792 q -0.161058,-0.25011 -0.265273,-0.38275 -0.104214,-0.13263 -0.187585,-0.18569 -0.08148,-0.0531 -0.166743,-0.0739 -0.06253,-0.0133 -0.204639,-0.0133 h -0.426331 v 1.23352 z m 0.367592,-1.55185 h 0.790133 q 0.252009,0 0.39412,-0.0512 0.14211,-0.053 0.216008,-0.16674 0.0739,-0.11558 0.0739,-0.25011 0,-0.19706 -0.144005,-0.32401 -0.142111,-0.12696 -0.450964,-0.12696 h -0.879189 z"
         style="font-family:sans-serif;-inkscape-font-specification:sans-serif"
         id="path169933" />
      <path
         d="m 43.75863,229.44718 v 0.3278 h -1.836066 q -0.0038,-0.12316 0.03979,-0.23685 0.07011,-0.18759 0.223587,-0.36949 0.155374,-0.1819 0.447174,-0.42065 0.452858,-0.37138 0.612022,-0.58738 0.159163,-0.21791 0.159163,-0.41118 0,-0.20274 -0.145899,-0.34106 -0.144006,-0.14022 -0.377067,-0.14022 -0.246324,0 -0.394119,0.1478 -0.147795,0.14779 -0.14969,0.40927 l -0.350538,-0.036 q 0.036,-0.39222 0.270957,-0.59686 0.234955,-0.20653 0.63097,-0.20653 0.399803,0 0.632864,0.22169 0.233061,0.22169 0.233061,0.54949 0,0.16674 -0.06821,0.3278 -0.06821,0.16106 -0.227376,0.33917 -0.157269,0.17811 -0.524861,0.48886 -0.306958,0.2577 -0.394119,0.35054 -0.08716,0.0909 -0.144006,0.1838 z"
         style="font-family:sans-serif;-inkscape-font-specification:sans-serif"
         id="path169935" />
    </g>
    <path
       style="fill:none;stroke:#000000;stroke-width:0.4;stroke-linecap:butt;stroke-linejoin:miter;stroke-dasharray:none;stroke-opacity:1"
       d="M 83.75862,195.77498 H 62.75861"
       id="path34507" />
    <path
       id="path34509"
       style="fill:none;fill-opacity:0.5;stroke:#000000;stroke-width:0.5;stroke-linecap:round;stroke-linejoin:round;stroke-dasharray:none"
       d="m 112.75861,164.77498 c 0.55228,0 1,0.44772 1,1 0,0.55228 -0.44772,1 -1,1 -0.55228,0 -1,-0.44772 -1,-1 0,-0.55228 0.44772,-1 1,-1 z" />
    <g
       aria-label="+VCC"
       id="text34515"
       style="font-size:3.88056px;line-height:100%;font-family:Sans;-inkscape-font-specification:Sans;letter-spacing:0px;word-spacing:0px;stroke:#000000;stroke-width:0">
      <path
         d="m 109.42372,162.51899 v -0.76171 h -0.75603 v -0.31832 h 0.75603 v -0.75603 h 0.32211 v 0.75603 h 0.75603 v 0.31832 h -0.75603 v 0.76171 z"
         style="font-family:sans-serif;-inkscape-font-specification:sans-serif"
         id="path169874" />
      <path
         d="m 111.81117,162.96806 -1.07625,-2.77778 h 0.39791 l 0.72192,2.01797 q 0.0872,0.24253 0.1459,0.45475 0.0644,-0.22738 0.14969,-0.45475 l 0.75034,-2.01797 h 0.37518 l -1.08762,2.77778 z"
         style="font-family:sans-serif;-inkscape-font-specification:sans-serif"
         id="path169876" />
      <path
         d="m 114.78905,163.11112 0.23893,0.0603 q -0.0751,0.29436 -0.27096,0.44954 -0.19459,0.15396 -0.47663,0.15396 -0.2919,0 -0.47541,-0.11824 -0.18228,-0.11947 -0.27835,-0.34485 -0.0948,-0.22539 -0.0948,-0.48403 0,-0.28204 0.10715,-0.49142 0.10838,-0.21061 0.30667,-0.31899 0.19953,-0.10961 0.43846,-0.10961 0.27096,0 0.4557,0.13794 0.18474,0.13794 0.25741,0.38796 l -0.23524,0.0554 q -0.0628,-0.19706 -0.18228,-0.28697 -0.11947,-0.0899 -0.30052,-0.0899 -0.20814,0 -0.34854,0.0998 -0.13918,0.0998 -0.19583,0.26849 -0.0567,0.1675 -0.0567,0.34609 0,0.23031 0.0665,0.40274 0.0677,0.17119 0.20938,0.25617 0.14163,0.085 0.30667,0.085 0.20075,0 0.33993,-0.11578 0.13917,-0.11577 0.18844,-0.34362 z"
         style="font-size:65%;baseline-shift:sub"
         id="path169878" />
      <path
         d="m 116.61062,163.11112 0.23893,0.0603 q -0.0751,0.29436 -0.27096,0.44954 -0.19459,0.15396 -0.47663,0.15396 -0.2919,0 -0.47541,-0.11824 -0.18228,-0.11947 -0.27835,-0.34485 -0.0948,-0.22539 -0.0948,-0.48403 0,-0.28204 0.10715,-0.49142 0.10838,-0.21061 0.30667,-0.31899 0.19953,-0.10961 0.43846,-0.10961 0.27096,0 0.4557,0.13794 0.18475,0.13794 0.25741,0.38796 l -0.23524,0.0554 q -0.0628,-0.19706 -0.18228,-0.28697 -0.11947,-0.0899 -0.30052,-0.0899 -0.20814,0 -0.34854,0.0998 -0.13918,0.0998 -0.19583,0.26849 -0.0567,0.1675 -0.0567,0.34609 0,0.23031 0.0665,0.40274 0.0677,0.17119 0.20938,0.25617 0.14163,0.085 0.30667,0.085 0.20076,0 0.33993,-0.11578 0.13917,-0.11577 0.18844,-0.34362 z"
         style="font-size:65%;baseline-shift:sub"
         id="path169880" />
    </g>
    <path
       style="fill:none;stroke:#000000;stroke-width:0.4;stroke-linecap:butt;stroke-linejoin:miter;stroke-dasharray:none;stroke-opacity:1"
       d="m 108.75862,237.77498 4,-3 -10e-6,-19"
       id="path34517" />
    <path
       style="fill:none;stroke:#000000;stroke-width:0.4;stroke-linecap:butt;stroke-linejoin:miter;stroke-dasharray:none;stroke-opacity:1"
       d="m 108.75862,241.77498 4,3 1e-5,34"
       id="path34519" />
    <path
       style="fill:#000000;fill-opacity:1;stroke:none;stroke-width:0.264583px;stroke-linecap:butt;stroke-linejoin:miter;stroke-opacity:1"
       d="m 110.86313,244.60439 1.19889,-1.60083 0.8416,1.87963 z"
       id="path34521" />
    <path
       style="fill:none;stroke:#000000;stroke-width:0.4;stroke-linecap:butt;stroke-linejoin:miter;stroke-dasharray:none;stroke-opacity:1"
       d="m 108.75862,239.77498 h -61 v -30"
       id="path34523" />
    <path
       style="fill:none;stroke:#000000;stroke-width:0.4;stroke-linecap:butt;stroke-linejoin:miter;stroke-dasharray:none;stroke-opacity:1"
       d="m 108.75861,201.77498 v 8"
       id="path34525" />
    <path
       style="fill:none;stroke:#000000;stroke-width:0.4;stroke-linecap:butt;stroke-linejoin:miter;stroke-dasharray:none;stroke-opacity:1"
       d="m 108.75861,203.77498 4,-3 v -34"
       id="path34527" />
    <path
       style="fill:none;stroke:#000000;stroke-width:0.4;stroke-linecap:butt;stroke-linejoin:miter;stroke-dasharray:none;stroke-opacity:1"
       d="m 108.75861,207.77498 4,3 -1e-5,5"
       id="path34529" />
    <path
       style="fill:#000000;fill-opacity:1;stroke:none;stroke-width:0.264583px;stroke-linecap:butt;stroke-linejoin:miter;stroke-opacity:1"
       d="m 110.86312,210.60439 1.19889,-1.60083 0.8416,1.87963 z"
       id="path34531" />
    <path
       id="path34533"
       d="m 114.25861,184.77498 h -3 v -9 h 3 z"
       style="fill:#ffffff;fill-opacity:1;stroke:#000000;stroke-width:0.5;stroke-linecap:butt;stroke-linejoin:miter;stroke-miterlimit:4;stroke-dasharray:none;stroke-opacity:1" />
    <g
       aria-label="R4"
       id="text34537"
       style="font-size:3.88056px;line-height:100%;font-family:Sans;-inkscape-font-specification:Sans;letter-spacing:0px;word-spacing:0px;stroke:#000000;stroke-width:0">
      <path
         d="m 54.290675,248.77498 v -2.77778 h 1.231623 q 0.371381,0 0.564651,0.0758 0.19327,0.0739 0.308853,0.26338 0.115584,0.18948 0.115584,0.41875 0,0.29559 -0.191376,0.49833 -0.191375,0.20274 -0.591179,0.25769 0.1459,0.0701 0.221692,0.13832 0.161059,0.1478 0.305064,0.36949 l 0.483175,0.75603 H 56.27643 l -0.367592,-0.57792 q -0.161059,-0.25011 -0.265273,-0.38275 -0.104214,-0.13263 -0.187586,-0.18569 -0.08148,-0.0531 -0.166742,-0.0739 -0.06253,-0.0133 -0.204639,-0.0133 h -0.426331 v 1.23352 z m 0.367592,-1.55185 H 55.4484 q 0.252009,0 0.39412,-0.0512 0.14211,-0.053 0.216007,-0.16674 0.0739,-0.11558 0.0739,-0.25011 0,-0.19706 -0.144006,-0.32401 -0.14211,-0.12696 -0.450963,-0.12696 h -0.879189 z"
         style="font-family:sans-serif;-inkscape-font-specification:sans-serif"
         id="path169955" />
      <path
         d="m 58.042388,248.77498 v -0.66508 h -1.205096 v -0.31264 l 1.267624,-1.80006 h 0.278537 v 1.80006 h 0.375171 v 0.31264 h -0.375171 v 0.66508 z m 0,-0.97772 v -1.25247 l -0.869716,1.25247 z"
         style="font-family:sans-serif;-inkscape-font-specification:sans-serif"
         id="path169957" />
    </g>
    <g
       aria-label="1.5k"
       id="text34541"
       style="font-size:3.175px;line-height:100%;font-family:Sans;-inkscape-font-specification:Sans;letter-spacing:0px;word-spacing:0px;stroke:#000000;stroke-width:0">
      <path
         d="m 53.952725,253.05702 h -0.279053 v -1.77818 q -0.100769,0.0961 -0.2651,0.19223 -0.16278,0.0961 -0.293005,0.14418 v -0.26975 q 0.234094,-0.11007 0.409277,-0.26665 0.175183,-0.15658 0.248047,-0.30386 h 0.179834 z"
         style="font-family:sans-serif;-inkscape-font-specification:sans-serif"
         id="path169960" />
      <path
         d="m 54.82399,253.05702 v -0.31781 h 0.31781 v 0.31781 z"
         style="font-family:sans-serif;-inkscape-font-specification:sans-serif"
         id="path169962" />
      <path
         d="m 55.549527,252.46171 0.293005,-0.0248 q 0.03256,0.21395 0.150379,0.32247 0.119372,0.10697 0.286804,0.10697 0.201538,0 0.341064,-0.15193 0.139527,-0.15193 0.139527,-0.40308 0,-0.23874 -0.134876,-0.37672 -0.133325,-0.13798 -0.350366,-0.13798 -0.134875,0 -0.243396,0.062 -0.10852,0.0605 -0.170532,0.15813 l -0.262,-0.0341 0.220142,-1.16737 h 1.130163 v 0.26665 H 56.04252 l -0.122473,0.61081 q 0.204639,-0.14262 0.429431,-0.14262 0.297656,0 0.502295,0.20619 0.204639,0.20619 0.204639,0.5302 0,0.3085 -0.179834,0.5333 -0.218592,0.27595 -0.596863,0.27595 -0.310059,0 -0.506946,-0.17363 -0.195337,-0.17364 -0.223242,-0.46044 z"
         style="font-family:sans-serif;-inkscape-font-specification:sans-serif"
         id="path169964" />
      <path
         d="m 57.394375,253.05702 v -2.27273 h 0.279053 v 1.29605 l 0.660425,-0.66973 h 0.361218 l -0.629419,0.61082 0.692981,1.03559 h -0.344165 l -0.544153,-0.84181 -0.196887,0.18914 v 0.65267 z"
         style="font-family:sans-serif;-inkscape-font-specification:sans-serif"
         id="path169966" />
    </g>
    <path
       id="path34543"
       style="fill:#000000;fill-opacity:1;stroke:none;stroke-width:1.04298;stroke-linecap:butt;stroke-linejoin:miter;stroke-miterlimit:4;stroke-dasharray:none;stroke-opacity:1"
       d="m 112.75861,170.77498 h 0.89999 m 0,0 c 0,-0.49703 -0.40293,-0.89996 -0.89999,-0.89996 -0.49702,0 -0.90001,0.40293 -0.90001,0.89996 0,0.49703 0.40293,0.89997 0.89995,0.89997 0.49706,0 0.90005,-0.40294 0.90005,-0.89997 z" />
    <g
       aria-label="R3"
       id="text34547"
       style="font-size:3.88056px;line-height:100%;font-family:Sans;-inkscape-font-specification:Sans;letter-spacing:0px;word-spacing:0px;stroke:#000000;stroke-width:0">
      <path
         d="m 66.758631,179.72572 v -2.77778 h 1.231623 q 0.371382,0 0.564652,0.0758 0.19327,0.0739 0.308853,0.26338 0.115583,0.18948 0.115583,0.41875 0,0.29559 -0.191375,0.49834 -0.191375,0.20274 -0.591179,0.25769 0.1459,0.0701 0.221692,0.13832 0.161058,0.14779 0.305063,0.36949 l 0.483176,0.75602 h -0.462333 l -0.367592,-0.57791 q -0.161058,-0.25012 -0.265272,-0.38275 -0.104215,-0.13264 -0.187586,-0.18569 -0.08148,-0.0531 -0.166743,-0.0739 -0.06253,-0.0133 -0.204639,-0.0133 h -0.426331 v 1.23351 z m 0.367592,-1.55184 h 0.790134 q 0.252009,0 0.394119,-0.0512 0.14211,-0.0531 0.216008,-0.16674 0.0739,-0.11559 0.0739,-0.25012 0,-0.19706 -0.144005,-0.32401 -0.14211,-0.12695 -0.450963,-0.12695 h -0.87919 z"
         style="font-family:sans-serif;-inkscape-font-specification:sans-serif"
         id="path169895" />
      <path
         d="m 69.418937,178.99243 0.341065,-0.0455 q 0.05874,0.2899 0.198954,0.41875 0.14211,0.12695 0.344855,0.12695 0.24064,0 0.405488,-0.16674 0.166743,-0.16674 0.166743,-0.41307 0,-0.23495 -0.15348,-0.38654 -0.153479,-0.15348 -0.390329,-0.15348 -0.09664,0 -0.240641,0.0379 l 0.0379,-0.29938 q 0.03411,0.004 0.05495,0.004 0.217902,0 0.392224,-0.11369 0.174322,-0.11369 0.174322,-0.35054 0,-0.18758 -0.126951,-0.31075 -0.126952,-0.12316 -0.327802,-0.12316 -0.198954,0 -0.33159,0.12506 -0.132637,0.12506 -0.170533,0.37517 l -0.341065,-0.0606 q 0.06253,-0.34296 0.284221,-0.53055 0.221692,-0.18948 0.551388,-0.18948 0.227377,0 0.418752,0.0985 0.191375,0.0966 0.2918,0.26527 0.102319,0.16864 0.102319,0.35812 0,0.18001 -0.09664,0.3278 -0.09663,0.1478 -0.286115,0.23496 0.246324,0.0568 0.38275,0.23685 0.136426,0.17811 0.136426,0.44717 0,0.36381 -0.265272,0.61771 -0.265273,0.25201 -0.670761,0.25201 -0.365698,0 -0.608233,-0.2179 -0.24064,-0.21791 -0.274746,-0.56466 z"
         style="font-family:sans-serif;-inkscape-font-specification:sans-serif"
         id="path169897" />
    </g>
    <g
       aria-label="8k"
       id="text34551"
       style="font-size:3.175px;line-height:100%;font-family:Sans;-inkscape-font-specification:Sans;letter-spacing:0px;word-spacing:0px;stroke:#000000;stroke-width:0">
      <path
         d="m 67.191165,182.82454 q -0.173633,-0.0636 -0.257348,-0.18139 -0.08372,-0.11782 -0.08372,-0.28215 0,-0.24805 0.178283,-0.41703 0.178284,-0.16898 0.47439,-0.16898 0.297656,0 0.479041,0.17363 0.181384,0.17209 0.181384,0.42013 0,0.15813 -0.08372,0.27596 -0.08217,0.11627 -0.251147,0.17983 0.209289,0.0682 0.31781,0.22014 0.11007,0.15193 0.11007,0.36277 0,0.29145 -0.206189,0.48989 -0.206189,0.19844 -0.542602,0.19844 -0.336414,0 -0.542603,-0.19844 -0.206189,-0.19999 -0.206189,-0.49764 0,-0.22169 0.111622,-0.37052 0.113171,-0.15038 0.32091,-0.20464 z m -0.05581,-0.47284 q 0,0.16123 0.103869,0.26355 0.10387,0.10232 0.269751,0.10232 0.161231,0 0.26355,-0.10077 0.10387,-0.10232 0.10387,-0.2496 0,-0.15348 -0.106971,-0.25735 -0.105419,-0.10542 -0.263549,-0.10542 -0.159681,0 -0.2651,0.10232 -0.10542,0.10232 -0.10542,0.24495 z m -0.08992,1.04955 q 0,0.11937 0.05581,0.23099 0.05736,0.11162 0.168982,0.17363 0.111621,0.0605 0.240295,0.0605 0.199988,0 0.330213,-0.12868 0.130225,-0.12867 0.130225,-0.32711 0,-0.20154 -0.134876,-0.33331 -0.133325,-0.13178 -0.334863,-0.13178 -0.196887,0 -0.327112,0.13023 -0.128674,0.13022 -0.128674,0.32556 z"
         style="font-family:sans-serif;-inkscape-font-specification:sans-serif"
         id="path169900" />
      <path
         d="m 68.606583,184.05702 v -2.27273 h 0.279052 v 1.29605 l 0.660425,-0.66973 h 0.361218 l -0.629419,0.61082 0.692981,1.03559 h -0.344165 l -0.544152,-0.84181 -0.196888,0.18914 v 0.65267 z"
         style="font-family:sans-serif;-inkscape-font-specification:sans-serif"
         id="path169902" />
    </g>
    <path
       id="path34555"
       style="fill:#000000;fill-opacity:1;stroke:none;stroke-width:1.04298;stroke-linecap:butt;stroke-linejoin:miter;stroke-miterlimit:4;stroke-dasharray:none;stroke-opacity:1"
       d="m 112.75862,219.77498 h 0.89999 m 0,0 c 0,-0.49703 -0.40293,-0.89996 -0.89999,-0.89996 -0.49702,0 -0.90001,0.40293 -0.90001,0.89996 0,0.49703 0.40293,0.89997 0.89995,0.89997 0.49706,0 0.90005,-0.40294 0.90005,-0.89997 z" />
    <path
       id="path34557"
       style="fill:#000000;fill-opacity:1;stroke:none;stroke-width:1.04298;stroke-linecap:butt;stroke-linejoin:miter;stroke-miterlimit:4;stroke-dasharray:none;stroke-opacity:1"
       d="m 112.75863,273.77498 h 0.89999 m 0,0 c 0,-0.49703 -0.40293,-0.89996 -0.89999,-0.89996 -0.49702,0 -0.90001,0.40293 -0.90001,0.89996 0,0.49703 0.40293,0.89997 0.89995,0.89997 0.49706,0 0.90005,-0.40294 0.90005,-0.89997 z" />
    <path
       style="fill:none;stroke:#000000;stroke-width:0.4;stroke-linecap:butt;stroke-linejoin:miter;stroke-dasharray:none;stroke-opacity:1"
       d="m 126.75862,219.77498 h -14"
       id="path34559" />
    <g
       aria-label="T3"
       id="text34563"
       style="font-size:3.88056px;line-height:100%;font-family:Sans;-inkscape-font-specification:Sans;letter-spacing:0px;word-spacing:0px;stroke:#000000;stroke-width:0">
      <path
         d="m 90.67382,196.56413 v -2.44998 h -0.915191 v -0.3278 h 2.201763 v 0.3278 h -0.91898 v 2.44998 z"
         style="font-family:sans-serif;-inkscape-font-specification:sans-serif"
         id="path169999" />
      <path
         d="m 92.201033,195.83084 0.341065,-0.0455 q 0.05874,0.2899 0.198954,0.41875 0.14211,0.12695 0.344854,0.12695 0.240641,0 0.405489,-0.16674 0.166742,-0.16674 0.166742,-0.41307 0,-0.23495 -0.153479,-0.38654 -0.153479,-0.15348 -0.390329,-0.15348 -0.09663,0 -0.240641,0.0379 l 0.0379,-0.29938 q 0.03411,0.004 0.05495,0.004 0.217902,0 0.392224,-0.11369 0.174322,-0.11369 0.174322,-0.35054 0,-0.18758 -0.126952,-0.31075 -0.126951,-0.12316 -0.327801,-0.12316 -0.198954,0 -0.331591,0.12506 -0.132636,0.12506 -0.170532,0.37517 l -0.341065,-0.0606 q 0.06253,-0.34296 0.284221,-0.53055 0.221692,-0.18948 0.551388,-0.18948 0.227377,0 0.418752,0.0985 0.191375,0.0966 0.2918,0.26527 0.102319,0.16864 0.102319,0.35812 0,0.18001 -0.09663,0.3278 -0.09664,0.1478 -0.286115,0.23496 0.246324,0.0568 0.38275,0.23685 0.136426,0.17811 0.136426,0.44717 0,0.3638 -0.265272,0.61771 -0.265273,0.25201 -0.670761,0.25201 -0.365698,0 -0.608233,-0.2179 -0.24064,-0.21791 -0.274746,-0.56466 z"
         style="font-family:sans-serif;-inkscape-font-specification:sans-serif"
         id="path170001" />
    </g>
    <g
       aria-label="T4"
       id="text34567"
       style="font-size:3.88056px;line-height:100%;font-family:Sans;-inkscape-font-specification:Sans;letter-spacing:0px;word-spacing:0px;stroke:#000000;stroke-width:0">
      <path
         d="m 115.67382,206.55275 v -2.44998 h -0.91519 v -0.3278 h 2.20176 v 0.3278 h -0.91898 v 2.44998 z"
         style="font-family:sans-serif;-inkscape-font-specification:sans-serif"
         id="path170014" />
      <path
         d="m 118.29244,206.55275 v -0.66508 h -1.2051 v -0.31264 l 1.26763,-1.80006 h 0.27854 v 1.80006 h 0.37517 v 0.31264 h -0.37517 v 0.66508 z m 0,-0.97772 v -1.25247 l -0.86972,1.25247 z"
         style="font-family:sans-serif;-inkscape-font-specification:sans-serif"
         id="path170016" />
    </g>
    <g
       aria-label="20k"
       id="text34571"
       style="font-size:3.175px;line-height:100%;font-family:Sans;-inkscape-font-specification:Sans;letter-spacing:0px;word-spacing:0px;stroke:#000000;stroke-width:0">
      <path
         d="m 40.250314,183.78882 v 0.2682 H 38.74808 q -0.0031,-0.10077 0.03256,-0.19378 0.05736,-0.15348 0.182934,-0.30231 0.127124,-0.14883 0.365869,-0.34417 0.37052,-0.30385 0.500745,-0.48059 0.130225,-0.17828 0.130225,-0.33641 0,-0.16588 -0.119373,-0.27905 -0.117822,-0.11473 -0.308508,-0.11473 -0.201538,0 -0.322461,0.12093 -0.120923,0.12092 -0.122473,0.33486 l -0.286805,-0.0294 q 0.02946,-0.32092 0.221692,-0.48835 0.192237,-0.16898 0.516248,-0.16898 0.327112,0 0.517798,0.18139 0.190686,0.18138 0.190686,0.44958 0,0.13643 -0.05581,0.2682 -0.05581,0.13178 -0.186035,0.2775 -0.128674,0.14573 -0.429431,0.39998 -0.251148,0.21084 -0.322461,0.2868 -0.07131,0.0744 -0.117822,0.15038 z"
         style="font-family:sans-serif;-inkscape-font-specification:sans-serif"
         id="path169910" />
      <path
         d="m 40.549521,182.93616 q 0,-0.40308 0.08217,-0.64802 0.08372,-0.2465 0.246497,-0.37982 0.164331,-0.13333 0.412378,-0.13333 0.182934,0 0.320911,0.0744 0.137976,0.0729 0.227893,0.2124 0.08992,0.13797 0.141076,0.33796 0.05116,0.19844 0.05116,0.5364 0,0.39998 -0.08217,0.64647 -0.08217,0.24495 -0.246496,0.37982 -0.162781,0.13333 -0.412378,0.13333 -0.328662,0 -0.516248,-0.23565 -0.224792,-0.2837 -0.224792,-0.92397 z m 0.286804,0 q 0,0.55966 0.130225,0.74569 0.131775,0.18449 0.324011,0.18449 0.192236,0 0.322461,-0.18604 0.131775,-0.18603 0.131775,-0.74414 0,-0.56121 -0.131775,-0.74569 -0.130225,-0.18449 -0.325562,-0.18449 -0.192236,0 -0.306958,0.16279 -0.144177,0.20773 -0.144177,0.76739 z"
         style="font-family:sans-serif;-inkscape-font-specification:sans-serif"
         id="path169912" />
      <path
         d="m 42.394369,184.05702 v -2.27273 h 0.279053 v 1.29605 l 0.660425,-0.66973 h 0.361218 l -0.629419,0.61082 0.692981,1.03559 h -0.344165 l -0.544153,-0.84181 -0.196887,0.18914 v 0.65267 z"
         style="font-family:sans-serif;-inkscape-font-specification:sans-serif"
         id="path169914" />
    </g>
    <path
       id="path34573"
       style="fill:none;fill-opacity:0.5;stroke:#000000;stroke-width:0.5;stroke-linecap:round;stroke-linejoin:round;stroke-dasharray:none"
       d="m 7.75862,218.77498 c 0.55228,0 1,0.44772 1,1 0,0.55228 -0.44772,1 -1,1 -0.55228,0 -1,-0.44772 -1,-1 0,-0.55228 0.44772,-1 1,-1 z" />
    <path
       id="path34575"
       style="fill:none;fill-opacity:0.5;stroke:#000000;stroke-width:0.5;stroke-linecap:round;stroke-linejoin:round;stroke-dasharray:none"
       d="m 7.75862,208.77498 c 0.55228,0 1,0.44772 1,1 0,0.55228 -0.44772,1 -1,1 -0.55228,0 -1,-0.44772 -1,-1 0,-0.55228 0.44772,-1 1,-1 z" />
    <g
       aria-label="R1"
       id="text34579"
       style="font-size:3.88056px;line-height:100%;font-family:Sans;-inkscape-font-specification:Sans;letter-spacing:0px;word-spacing:0px;stroke:#000000;stroke-width:0">
      <path
         d="m 39.815546,179.77498 v -2.77778 h 1.231623 q 0.371382,0 0.564652,0.0758 0.19327,0.0739 0.308853,0.26338 0.115583,0.18948 0.115583,0.41875 0,0.29559 -0.191375,0.49833 -0.191375,0.20274 -0.591179,0.25769 0.1459,0.0701 0.221692,0.13832 0.161059,0.1478 0.305064,0.36949 l 0.483175,0.75603 h -0.462332 l -0.367592,-0.57792 q -0.161059,-0.25011 -0.265273,-0.38275 -0.104214,-0.13263 -0.187586,-0.18569 -0.08148,-0.0531 -0.166743,-0.0739 -0.06253,-0.0133 -0.204639,-0.0133 h -0.426331 v 1.23352 z m 0.367592,-1.55185 h 0.790134 q 0.252009,0 0.394119,-0.0512 0.142111,-0.053 0.216008,-0.16674 0.0739,-0.11558 0.0739,-0.25011 0,-0.19706 -0.144005,-0.32401 -0.14211,-0.12696 -0.450963,-0.12696 h -0.87919 z"
         style="font-family:sans-serif;-inkscape-font-specification:sans-serif"
         id="path169905" />
      <path
         d="M 43.758635,179.77498 H 43.41757 v -2.17334 q -0.123162,0.11748 -0.324012,0.23495 -0.198954,0.11748 -0.358118,0.17622 v -0.3297 q 0.286116,-0.13453 0.500229,-0.3259 0.214113,-0.19138 0.303168,-0.37138 h 0.219798 z"
         style="font-family:sans-serif;-inkscape-font-specification:sans-serif"
         id="path169907" />
    </g>
    <g
       aria-label="A"
       id="text34583"
       style="font-size:3.88056px;line-height:100%;font-family:Sans;-inkscape-font-specification:Sans;letter-spacing:0px;word-spacing:0px;stroke:#000000;stroke-width:0">
      <path
         d="m 2.1589415,211.16386 1.066775,-2.77778 h 0.3960142 l 1.1368827,2.77778 H 4.3398616 L 4.01585,210.32257 H 2.8543348 l -0.3050636,0.84129 z m 0.8015023,-1.14067 H 3.9021617 L 3.6122566,209.2539 q -0.1326363,-0.35054 -0.1970596,-0.57602 -0.053055,0.26717 -0.1496896,0.53055 z"
         style="font-family:sans-serif;-inkscape-font-specification:sans-serif"
         id="path169917" />
    </g>
    <g
       aria-label="B"
       id="text34587"
       style="font-size:3.88056px;line-height:100%;font-family:Sans;-inkscape-font-specification:Sans;letter-spacing:0px;word-spacing:0px;stroke:#000000;stroke-width:0">
      <path
         d="m 2.6610658,221.16386 v -2.77778 h 1.0421426 q 0.3183272,0 0.5097024,0.0853 0.1932701,0.0834 0.301274,0.25958 0.1098986,0.17433 0.1098986,0.3657 0,0.17811 -0.096635,0.33538 -0.096635,0.15727 -0.2917999,0.25391 0.252009,0.0739 0.3865401,0.25201 0.136426,0.17811 0.136426,0.42064 0,0.19517 -0.083371,0.3638 -0.081477,0.16675 -0.2027441,0.2577 -0.1212675,0.0909 -0.3050636,0.13832 -0.1819012,0.0455 -0.4471739,0.0455 z m 0.3675921,-1.61058 H 3.629311 q 0.2444298,0 0.3505389,-0.0322 0.1402155,-0.0417 0.2103233,-0.13832 0.072002,-0.0966 0.072002,-0.24254 0,-0.13832 -0.066318,-0.24253 -0.066318,-0.10611 -0.1894805,-0.14401 -0.1231623,-0.0398 -0.4225414,-0.0398 H 3.0286579 Z m 0,1.28278 h 0.6916037 q 0.1781117,0 0.2501142,-0.0133 0.1269519,-0.0227 0.2122182,-0.0758 0.085266,-0.0531 0.1402155,-0.15348 0.054949,-0.10232 0.054949,-0.23496 0,-0.15537 -0.079582,-0.26906 -0.079582,-0.11558 -0.2216921,-0.16106 -0.1402156,-0.0474 -0.4054882,-0.0474 H 3.0286579 Z"
         style="font-family:sans-serif;-inkscape-font-specification:sans-serif"
         id="path169920" />
    </g>
    <path
       id="path34589"
       style="fill:#000000;fill-opacity:1;stroke:none;stroke-width:1.04298;stroke-linecap:butt;stroke-linejoin:miter;stroke-miterlimit:4;stroke-dasharray:none;stroke-opacity:1"
       d="m 21.75862,209.77498 h 0.89999 m 0,0 c 0,-0.49703 -0.40293,-0.89996 -0.89999,-0.89996 -0.49702,0 -0.90001,0.40293 -0.90001,0.89996 0,0.49703 0.40293,0.89997 0.89995,0.89997 0.49706,0 0.90005,-0.40294 0.90005,-0.89997 z" />
    <g
       aria-label="T1"
       id="text34597"
       style="font-size:3.88056px;line-height:100%;font-family:Sans;-inkscape-font-specification:Sans;letter-spacing:0px;word-spacing:0px;stroke:#000000;stroke-width:0">
      <path
         d="m 65.67382,220.56413 v -2.44998 h -0.915191 v -0.3278 h 2.201763 v 0.3278 h -0.91898 v 2.44998 z"
         style="font-family:sans-serif;-inkscape-font-specification:sans-serif"
         id="path169984" />
      <path
         d="m 68.483815,220.56413 h -0.341064 v -2.17334 q -0.123163,0.11748 -0.324012,0.23496 -0.198954,0.11748 -0.358118,0.17621 v -0.32969 q 0.286115,-0.13453 0.500228,-0.32591 0.214113,-0.19137 0.303169,-0.37138 h 0.219797 z"
         style="font-family:sans-serif;-inkscape-font-specification:sans-serif"
         id="path169986" />
    </g>
    <path
       style="fill:none;stroke:#000000;stroke-width:0.4;stroke-linecap:butt;stroke-linejoin:miter;stroke-dasharray:none;stroke-opacity:1"
       d="m 47.75862,209.77498 h -39"
       id="path34601" />
    <path
       id="path34605"
       style="fill:#000000;fill-opacity:1;stroke:none;stroke-width:1.04298;stroke-linecap:butt;stroke-linejoin:miter;stroke-miterlimit:4;stroke-dasharray:none;stroke-opacity:1"
       d="m 62.75861,170.77498 h 0.89999 m 0,0 c 0,-0.49703 -0.40293,-0.89996 -0.89999,-0.89996 -0.49702,0 -0.90001,0.40293 -0.90001,0.89996 0,0.49703 0.40293,0.89997 0.89995,0.89997 0.49706,0 0.90005,-0.40294 0.90005,-0.89997 z" />
    <path
       style="fill:none;stroke:#000000;stroke-width:0.4;stroke-linecap:butt;stroke-linejoin:miter;stroke-dasharray:none;stroke-opacity:1"
       d="M 112.75862,170.77498 H 47.75861 l 1e-5,39"
       id="path34607" />
    <path
       id="path34609"
       d="m 49.25861,184.77498 h -3 v -9 h 3 z"
       style="fill:#ffffff;fill-opacity:1;stroke:#000000;stroke-width:0.5;stroke-linecap:butt;stroke-linejoin:miter;stroke-miterlimit:4;stroke-dasharray:none;stroke-opacity:1" />
    <g
       aria-label="12k"
       id="text34613"
       style="font-size:3.175px;line-height:100%;font-family:Sans;-inkscape-font-specification:Sans;letter-spacing:0px;word-spacing:0px;stroke:#000000;stroke-width:0">
      <path
         d="m 39.834836,234.05702 h -0.279053 v -1.77818 q -0.100769,0.0961 -0.2651,0.19223 -0.162781,0.0961 -0.293005,0.14418 v -0.26975 q 0.234094,-0.11007 0.409277,-0.26665 0.175183,-0.15658 0.248047,-0.30386 h 0.179834 z"
         style="font-family:sans-serif;-inkscape-font-specification:sans-serif"
         id="path169938" />
      <path
         d="m 42.016098,233.78882 v 0.2682 h -1.502234 q -0.0031,-0.10077 0.03256,-0.19378 0.05736,-0.15348 0.182935,-0.30231 0.127124,-0.14883 0.365869,-0.34417 0.37052,-0.30385 0.500745,-0.48059 0.130224,-0.17828 0.130224,-0.33641 0,-0.16588 -0.119372,-0.27905 -0.117823,-0.11473 -0.308509,-0.11473 -0.201538,0 -0.322461,0.12093 -0.120922,0.12092 -0.122473,0.33486 l -0.286804,-0.0294 q 0.02946,-0.32092 0.221692,-0.48835 0.192236,-0.16898 0.516248,-0.16898 0.327111,0 0.517797,0.18139 0.190686,0.18138 0.190686,0.44958 0,0.13643 -0.05581,0.2682 -0.05581,0.13178 -0.186035,0.2775 -0.128675,0.14573 -0.429431,0.39998 -0.251148,0.21084 -0.322461,0.2868 -0.07131,0.0744 -0.117823,0.15038 z"
         style="font-family:sans-serif;-inkscape-font-specification:sans-serif"
         id="path169940" />
      <path
         d="m 42.394369,234.05702 v -2.27273 h 0.279053 v 1.29605 l 0.660425,-0.66973 h 0.361218 l -0.629419,0.61082 0.692981,1.03559 h -0.344165 l -0.544153,-0.84181 -0.196887,0.18914 v 0.65267 z"
         style="font-family:sans-serif;-inkscape-font-specification:sans-serif"
         id="path169942" />
    </g>
    <path
       style="fill:#000000;fill-opacity:1;stroke:none;stroke-width:0.264583px;stroke-linecap:butt;stroke-linejoin:miter;stroke-opacity:1"
       d="m 119.75861,163.77498 c -2,0 -3,1 -4,2 1,1 2,2 4,2 h 17 v -4 z"
       id="path34615" />
    <path
       style="fill:#000000;fill-opacity:0.25;stroke:none;stroke-width:0.264583px;stroke-linecap:butt;stroke-linejoin:miter;stroke-opacity:1"
       d="m 118.75861,164.77498 1,-1 h 16 v 4 h -16 l -1,-1 z"
       id="path34617" />
    <g
       aria-label="4.75-5.25V"
       id="text34621"
       style="font-size:3.175px;line-height:100%;font-family:Sans;-inkscape-font-specification:Sans;letter-spacing:0px;word-spacing:0px;fill:#ffffff;stroke:#000000;stroke-width:0">
      <path
         d="m 120.45285,166.89662 v -0.45733 h -0.93018 v -0.38138 l 0.98599,-1.44332 h 0.36587 v 1.44177 h 0.28215 v 0.38293 h -0.28215 v 0.45733 z m 0,-0.84026 v -0.77669 l -0.52245,0.77669 z"
         style="font-weight:bold;font-family:sans-serif;-inkscape-font-specification:'sans-serif Bold'"
         id="path169853" />
      <path
         d="m 121.45744,166.89662 v -0.43563 h 0.43563 v 0.43563 z"
         style="font-weight:bold;font-family:sans-serif;-inkscape-font-specification:'sans-serif Bold'"
         id="path169855" />
      <path
         d="m 122.24654,165.05952 v -0.40462 h 1.48983 v 0.31626 q -0.18449,0.18138 -0.37517,0.5209 -0.19069,0.33951 -0.29146,0.72243 -0.0992,0.38137 -0.0977,0.68213 h -0.42013 q 0.0109,-0.47129 0.19379,-0.96118 0.18449,-0.48989 0.49144,-0.87592 z"
         style="font-weight:bold;font-family:sans-serif;-inkscape-font-specification:'sans-serif Bold'"
         id="path169857" />
      <path
         d="m 124.01852,166.31216 0.43408,-0.045 q 0.0186,0.14728 0.11007,0.2341 0.0915,0.0853 0.21084,0.0853 0.13643,0 0.231,-0.11007 0.0946,-0.11162 0.0946,-0.33486 0,-0.20929 -0.0946,-0.31316 -0.093,-0.10542 -0.2434,-0.10542 -0.18758,0 -0.33641,0.16588 l -0.35347,-0.0512 0.22324,-1.18287 h 1.15187 v 0.40773 h -0.82165 l -0.0682,0.38602 q 0.14573,-0.0729 0.29766,-0.0729 0.2899,0 0.49144,0.21084 0.20154,0.21084 0.20154,0.54726 0,0.2806 -0.16278,0.50074 -0.22169,0.30076 -0.61547,0.30076 -0.31471,0 -0.51314,-0.16898 -0.19844,-0.16898 -0.2372,-0.45424 z"
         style="font-weight:bold;font-family:sans-serif;-inkscape-font-specification:'sans-serif Bold'"
         id="path169859" />
      <path
         d="m 125.82151,166.29046 v -0.43564 h 0.85576 v 0.43564 z"
         style="font-weight:bold;font-family:sans-serif;-inkscape-font-specification:'sans-serif Bold'"
         id="path169861" />
      <path
         d="m 126.8416,166.31216 0.43409,-0.045 q 0.0186,0.14728 0.11007,0.2341 0.0915,0.0853 0.21084,0.0853 0.13642,0 0.23099,-0.11007 0.0946,-0.11162 0.0946,-0.33486 0,-0.20929 -0.0946,-0.31316 -0.093,-0.10542 -0.2434,-0.10542 -0.18758,0 -0.33641,0.16588 l -0.35347,-0.0512 0.22325,-1.18287 h 1.15186 v 0.40773 h -0.82165 l -0.0682,0.38602 q 0.14572,-0.0729 0.29765,-0.0729 0.28991,0 0.49145,0.21084 0.20153,0.21084 0.20153,0.54726 0,0.2806 -0.16278,0.50074 -0.22169,0.30076 -0.61546,0.30076 -0.31471,0 -0.51315,-0.16898 -0.19844,-0.16898 -0.2372,-0.45424 z"
         style="font-weight:bold;font-family:sans-serif;-inkscape-font-specification:'sans-serif Bold'"
         id="path169863" />
      <path
         d="m 128.6942,166.89662 v -0.43563 h 0.43564 v 0.43563 z"
         style="font-weight:bold;font-family:sans-serif;-inkscape-font-specification:'sans-serif Bold'"
         id="path169865" />
      <path
         d="m 130.95453,166.492 v 0.40462 h -1.52704 q 0.0248,-0.22944 0.14883,-0.43408 0.12402,-0.20619 0.48989,-0.5457 0.29456,-0.27441 0.36122,-0.37207 0.0899,-0.13488 0.0899,-0.26665 0,-0.14573 -0.0791,-0.22325 -0.0775,-0.0791 -0.21549,-0.0791 -0.13642,0 -0.21704,0.0822 -0.0806,0.0822 -0.093,0.27286 l -0.43408,-0.0434 q 0.0388,-0.35967 0.2434,-0.51625 0.20464,-0.15658 0.5116,-0.15658 0.33641,0 0.52864,0.18138 0.19224,0.18139 0.19224,0.45114 0,0.15348 -0.0558,0.29301 -0.0543,0.13797 -0.17363,0.2899 -0.0791,0.10077 -0.28526,0.2899 -0.20618,0.18914 -0.262,0.25115 -0.0543,0.062 -0.0884,0.12093 z"
         style="font-weight:bold;font-family:sans-serif;-inkscape-font-specification:'sans-serif Bold'"
         id="path169867" />
      <path
         d="m 131.25529,166.31216 0.43408,-0.045 q 0.0186,0.14728 0.11007,0.2341 0.0915,0.0853 0.21084,0.0853 0.13643,0 0.231,-0.11007 0.0946,-0.11162 0.0946,-0.33486 0,-0.20929 -0.0946,-0.31316 -0.093,-0.10542 -0.2434,-0.10542 -0.18759,0 -0.33641,0.16588 l -0.35347,-0.0512 0.22324,-1.18287 h 1.15187 v 0.40773 h -0.82166 l -0.0682,0.38602 q 0.14573,-0.0729 0.29766,-0.0729 0.2899,0 0.49144,0.21084 0.20154,0.21084 0.20154,0.54726 0,0.2806 -0.16278,0.50074 -0.2217,0.30076 -0.61547,0.30076 -0.31471,0 -0.51315,-0.16898 -0.19843,-0.16898 -0.23719,-0.45424 z"
         style="font-weight:bold;font-family:sans-serif;-inkscape-font-specification:'sans-serif Bold'"
         id="path169869" />
      <path
         d="m 133.6908,166.89662 -0.81235,-2.27273 h 0.49764 l 0.57516,1.68207 0.55655,-1.68207 h 0.48679 l -0.8139,2.27273 z"
         style="font-weight:bold;font-family:sans-serif;-inkscape-font-specification:'sans-serif Bold'"
         id="path169871" />
    </g>
    <path
       style="fill:none;stroke:#000000;stroke-width:0.4;stroke-linecap:butt;stroke-linejoin:miter;stroke-dasharray:none;stroke-opacity:1"
       d="m 58.75862,219.77498 h -50"
       id="path34623" />
    <path
       style="fill:none;stroke:#000000;stroke-width:0.4;stroke-linecap:butt;stroke-linejoin:miter;stroke-dasharray:none;stroke-opacity:1"
       d="m 58.75861,217.77498 4,-3 v -44"
       id="path34627" />
    <path
       style="fill:none;stroke:#000000;stroke-width:0.4;stroke-linecap:butt;stroke-linejoin:miter;stroke-dasharray:none;stroke-opacity:1"
       d="m 58.75861,221.77498 4,3 1e-5,39 h 11"
       id="path34629" />
    <path
       style="fill:#000000;fill-opacity:1;stroke:none;stroke-width:0.264583px;stroke-linecap:butt;stroke-linejoin:miter;stroke-opacity:1"
       d="m 60.86312,224.60439 1.19889,-1.60083 0.8416,1.87963 z"
       id="path34631" />
    <path
       style="fill:none;stroke:#000000;stroke-width:0.4;stroke-linecap:butt;stroke-linejoin:miter;stroke-dasharray:none;stroke-opacity:1"
       d="m 73.75863,261.77498 4,-3 -1e-5,-19"
       id="path34635" />
    <path
       style="fill:none;stroke:#000000;stroke-width:0.4;stroke-linecap:butt;stroke-linejoin:miter;stroke-dasharray:none;stroke-opacity:1"
       d="m 73.75863,265.77498 4,3 -1e-5,5"
       id="path34637" />
    <path
       style="fill:#000000;fill-opacity:1;stroke:none;stroke-width:0.264583px;stroke-linecap:butt;stroke-linejoin:miter;stroke-opacity:1"
       d="m 75.86314,268.60439 1.19889,-1.60083 0.8416,1.87963 z"
       id="path34639" />
    <g
       aria-label="T5"
       id="text34643"
       style="font-size:3.88056px;line-height:100%;font-family:Sans;-inkscape-font-specification:Sans;letter-spacing:0px;word-spacing:0px;stroke:#000000;stroke-width:0">
      <path
         d="m 115.67382,240.55275 v -2.44998 h -0.91519 v -0.3278 h 2.20176 v 0.3278 h -0.91898 v 2.44998 z"
         style="font-family:sans-serif;-inkscape-font-specification:sans-serif"
         id="path170019" />
      <path
         d="m 117.19914,239.82514 0.35812,-0.0303 q 0.0398,0.26148 0.18379,0.39412 0.1459,0.13074 0.35054,0.13074 0.24633,0 0.41686,-0.18569 0.17053,-0.18569 0.17053,-0.49265 0,-0.2918 -0.16485,-0.46044 -0.16295,-0.16864 -0.42822,-0.16864 -0.16485,0 -0.29749,0.0758 -0.13263,0.0739 -0.20843,0.19327 l -0.32022,-0.0417 0.26906,-1.42679 h 1.38132 v 0.32591 h -1.10846 l -0.14969,0.74655 q 0.25011,-0.17432 0.52486,-0.17432 0.3638,0 0.61391,0.25201 0.25012,0.25201 0.25012,0.64802 0,0.37707 -0.2198,0.65181 -0.26717,0.33728 -0.7295,0.33728 -0.37896,0 -0.6196,-0.21222 -0.23875,-0.21222 -0.27285,-0.56276 z"
         style="font-family:sans-serif;-inkscape-font-specification:sans-serif"
         id="path170021" />
    </g>
    <path
       style="fill:none;stroke:#000000;stroke-width:0.3;stroke-linecap:butt;stroke-linejoin:miter;stroke-dasharray:none;stroke-opacity:1"
       d="M 73.75863,263.77498 H 72.75862"
       id="path34645" />
    <path
       id="path34649"
       style="fill:#000000;fill-opacity:1;stroke:none;stroke-width:1.04298;stroke-linecap:butt;stroke-linejoin:miter;stroke-miterlimit:4;stroke-dasharray:none;stroke-opacity:1"
       d="m 62.75861,195.77498 h 0.89999 m 0,0 c 0,-0.49703 -0.40293,-0.89996 -0.89999,-0.89996 -0.49702,0 -0.90001,0.40293 -0.90001,0.89996 0,0.49703 0.40293,0.89997 0.89995,0.89997 0.49706,0 0.90005,-0.40294 0.90005,-0.89997 z" />
    <path
       id="path34651"
       style="fill:#000000;fill-opacity:1;stroke:none;stroke-width:1.04298;stroke-linecap:butt;stroke-linejoin:miter;stroke-miterlimit:4;stroke-dasharray:none;stroke-opacity:1"
       d="m 112.75861,190.77498 h 0.89999 m 0,0 c 0,-0.49703 -0.40293,-0.89996 -0.89999,-0.89996 -0.49702,0 -0.90001,0.40293 -0.90001,0.89996 0,0.49703 0.40293,0.89997 0.89995,0.89997 0.49706,0 0.90005,-0.40294 0.90005,-0.89997 z" />
    <g
       aria-label="D1"
       id="text34655"
       style="font-size:3.88056px;line-height:100%;font-family:Sans;-inkscape-font-specification:Sans;letter-spacing:0px;word-spacing:0px;stroke:#000000;stroke-width:0">
      <path
         d="m 12.809861,249.77498 v -2.77778 h 0.956876 q 0.324012,0 0.494544,0.0398 0.238746,0.0549 0.407383,0.19895 0.219798,0.18569 0.327802,0.4756 0.109898,0.28801 0.109898,0.65939 0,0.31643 -0.0739,0.56086 -0.0739,0.24443 -0.189481,0.40549 -0.115583,0.15916 -0.253903,0.25201 -0.136426,0.0909 -0.331591,0.13832 -0.19327,0.0474 -0.445279,0.0474 z m 0.367592,-0.3278 h 0.593074 q 0.274747,0 0.430121,-0.0512 0.157268,-0.0512 0.250114,-0.14401 0.130741,-0.13074 0.202744,-0.35054 0.0739,-0.22169 0.0739,-0.53623 0,-0.4358 -0.144005,-0.66886 -0.14211,-0.23496 -0.346749,-0.31454 -0.147795,-0.0568 -0.475596,-0.0568 h -0.5836 z"
         style="font-family:sans-serif;-inkscape-font-specification:sans-serif"
         id="path169945" />
      <path
         d="m 16.758634,249.77498 h -0.341065 v -2.17334 q -0.123162,0.11748 -0.324012,0.23495 -0.198954,0.11748 -0.358118,0.17622 v -0.3297 q 0.286116,-0.13453 0.500229,-0.3259 0.214113,-0.19138 0.303169,-0.37138 h 0.219797 z"
         style="font-family:sans-serif;-inkscape-font-specification:sans-serif"
         id="path169947" />
    </g>
    <path
       id="path34657"
       d="m 64.25861,184.77498 h -3 v -9 h 3 z"
       style="fill:#ffffff;fill-opacity:1;stroke:#000000;stroke-width:0.5;stroke-linecap:butt;stroke-linejoin:miter;stroke-miterlimit:4;stroke-dasharray:none;stroke-opacity:1" />
    <path
       id="path34661"
       d="m 79.25862,253.77498 h -3 v -9 h 3 z"
       style="fill:#ffffff;fill-opacity:1;stroke:#000000;stroke-width:0.5;stroke-linecap:butt;stroke-linejoin:miter;stroke-miterlimit:4;stroke-dasharray:none;stroke-opacity:1" />
    <path
       id="path34663"
       d="m 28.75862,251.77498 h 6 l -3,-6 z"
       style="fill:none;stroke:#000000;stroke-width:0.5;stroke-linecap:butt;stroke-linejoin:miter;stroke-miterlimit:4;stroke-dasharray:none;stroke-opacity:1" />
    <path
       id="path34665"
       d="m 29.75862,244.77498 h -1 v 1 h 6 v 1 h -1"
       style="fill:none;stroke:#000000;stroke-width:0.5;stroke-linecap:butt;stroke-linejoin:miter;stroke-miterlimit:4;stroke-dasharray:none;stroke-opacity:1" />
    <path
       style="fill:none;stroke:#000000;stroke-width:0.4;stroke-linecap:butt;stroke-linejoin:miter;stroke-dasharray:none;stroke-opacity:1"
       d="m 31.75862,273.77498 v -54"
       id="path34667" />
    <path
       id="path34669"
       d="m 18.75862,251.77498 h 6 l -3,-6 z"
       style="fill:none;stroke:#000000;stroke-width:0.5;stroke-linecap:butt;stroke-linejoin:miter;stroke-miterlimit:4;stroke-dasharray:none;stroke-opacity:1" />
    <path
       id="path34671"
       d="m 19.75862,244.77498 h -1 v 1 h 6 v 1 h -1"
       style="fill:none;stroke:#000000;stroke-width:0.5;stroke-linecap:butt;stroke-linejoin:miter;stroke-miterlimit:4;stroke-dasharray:none;stroke-opacity:1" />
    <path
       style="fill:none;stroke:#000000;stroke-width:0.4;stroke-linecap:butt;stroke-linejoin:miter;stroke-dasharray:none;stroke-opacity:1"
       d="M 31.85863,273.77498 H 21.75862 v -64"
       id="path34673" />
    <path
       style="fill:none;stroke:#000000;stroke-width:0.4;stroke-linecap:butt;stroke-linejoin:miter;stroke-dasharray:none;stroke-opacity:1"
       d="m 112.75863,273.77498 h -80.9"
       id="path34675" />
    <path
       id="path34677"
       style="fill:#000000;fill-opacity:1;stroke:none;stroke-width:1.04298;stroke-linecap:butt;stroke-linejoin:miter;stroke-miterlimit:4;stroke-dasharray:none;stroke-opacity:1"
       d="m 31.75862,219.77498 h 0.89999 m 0,0 c 0,-0.49703 -0.40293,-0.89996 -0.89999,-0.89996 -0.49702,0 -0.90001,0.40293 -0.90001,0.89996 0,0.49703 0.40293,0.89997 0.89995,0.89997 0.49706,0 0.90005,-0.40294 0.90005,-0.89997 z" />
    <path
       id="path34679"
       style="fill:#000000;fill-opacity:1;stroke:none;stroke-width:1.04298;stroke-linecap:butt;stroke-linejoin:miter;stroke-miterlimit:4;stroke-dasharray:none;stroke-opacity:1"
       d="m 77.75862,273.77498 h 0.89999 m 0,0 c 0,-0.49703 -0.40293,-0.89996 -0.89999,-0.89996 -0.49702,0 -0.90001,0.40293 -0.90001,0.89996 0,0.49703 0.40293,0.89997 0.89995,0.89997 0.49706,0 0.90005,-0.40294 0.90005,-0.89997 z" />
    <path
       id="path34681"
       style="fill:#000000;fill-opacity:1;stroke:none;stroke-width:1.04298;stroke-linecap:butt;stroke-linejoin:miter;stroke-miterlimit:4;stroke-dasharray:none;stroke-opacity:1"
       d="m 77.75862,239.77498 h 0.89999 m 0,0 c 0,-0.49703 -0.40293,-0.89996 -0.89999,-0.89996 -0.49702,0 -0.90001,0.40293 -0.90001,0.89996 0,0.49703 0.40293,0.89997 0.89995,0.89997 0.49706,0 0.90005,-0.40294 0.90005,-0.89997 z" />
    <path
       id="path34683"
       style="fill:#000000;fill-opacity:1;stroke:none;stroke-width:1.04298;stroke-linecap:butt;stroke-linejoin:miter;stroke-miterlimit:4;stroke-dasharray:none;stroke-opacity:1"
       d="m 31.75862,273.77498 h 0.89999 m 0,0 c 0,-0.49703 -0.40293,-0.89996 -0.89999,-0.89996 -0.49702,0 -0.90001,0.40293 -0.90001,0.89996 0,0.49703 0.40293,0.89997 0.89995,0.89997 0.49706,0 0.90005,-0.40294 0.90005,-0.89997 z" />
    <g
       aria-label="T2"
       id="text34687"
       style="font-size:3.88056px;line-height:100%;font-family:Sans;-inkscape-font-specification:Sans;letter-spacing:0px;word-spacing:0px;stroke:#000000;stroke-width:0">
      <path
         d="m 80.67382,264.56412 v -2.44998 h -0.915191 v -0.32781 h 2.201763 v 0.32781 h -0.91898 v 2.44998 z"
         style="font-family:sans-serif;-inkscape-font-specification:sans-serif"
         id="path169979" />
      <path
         d="m 83.991623,264.23632 v 0.3278 h -1.836066 q -0.0038,-0.12316 0.03979,-0.23685 0.07011,-0.18759 0.223587,-0.36949 0.155374,-0.1819 0.447174,-0.42065 0.452858,-0.37138 0.612022,-0.58739 0.159164,-0.2179 0.159164,-0.41117 0,-0.20274 -0.1459,-0.34106 -0.144005,-0.14022 -0.377066,-0.14022 -0.246325,0 -0.39412,0.1478 -0.147795,0.14779 -0.149689,0.40927 l -0.350539,-0.036 q 0.036,-0.39222 0.270957,-0.59686 0.234956,-0.20654 0.63097,-0.20654 0.399804,0 0.632865,0.2217 0.23306,0.22169 0.23306,0.54949 0,0.16674 -0.06821,0.3278 -0.06821,0.16106 -0.227377,0.33917 -0.157269,0.17811 -0.524861,0.48886 -0.306958,0.25769 -0.394119,0.35054 -0.08716,0.0909 -0.144005,0.1838 z"
         style="font-family:sans-serif;-inkscape-font-specification:sans-serif"
         id="path169981" />
    </g>
    <g
       aria-label="R5"
       id="text34691"
       style="font-size:3.88056px;line-height:100%;font-family:Sans;-inkscape-font-specification:Sans;letter-spacing:0px;word-spacing:0px;stroke:#000000;stroke-width:0">
      <path
         d="m 81.758631,248.72762 v -2.77779 h 1.231623 q 0.371382,0 0.564652,0.0758 0.19327,0.0739 0.308853,0.26338 0.115583,0.18948 0.115583,0.41875 0,0.29559 -0.191375,0.49834 -0.191375,0.20274 -0.591179,0.25769 0.1459,0.0701 0.221692,0.13832 0.161058,0.1478 0.305063,0.36949 l 0.483176,0.75603 h -0.462333 l -0.367592,-0.57792 q -0.161058,-0.25011 -0.265272,-0.38275 -0.104215,-0.13264 -0.187586,-0.18569 -0.08148,-0.0531 -0.166743,-0.0739 -0.06253,-0.0133 -0.204639,-0.0133 h -0.426331 v 1.23352 z m 0.367592,-1.55185 h 0.790134 q 0.252009,0 0.394119,-0.0512 0.14211,-0.053 0.216008,-0.16674 0.0739,-0.11559 0.0739,-0.25012 0,-0.19706 -0.144005,-0.32401 -0.14211,-0.12695 -0.450963,-0.12695 h -0.87919 z"
         style="font-family:sans-serif;-inkscape-font-specification:sans-serif"
         id="path169969" />
      <path
         d="m 84.417042,248.00001 0.358118,-0.0303 q 0.03979,0.26149 0.183796,0.39412 0.1459,0.13074 0.350539,0.13074 0.246325,0 0.416857,-0.18569 0.170532,-0.18569 0.170532,-0.49265 0,-0.2918 -0.164848,-0.46043 -0.162953,-0.16864 -0.428225,-0.16864 -0.164848,0 -0.297485,0.0758 -0.132636,0.0739 -0.208428,0.19327 l -0.320222,-0.0417 0.269062,-1.42679 h 1.381313 v 0.3259 H 85.01959 l -0.14969,0.74656 q 0.250115,-0.17432 0.524861,-0.17432 0.363803,0 0.613917,0.252 0.250114,0.25201 0.250114,0.64803 0,0.37706 -0.219797,0.65181 -0.267168,0.33728 -0.7295,0.33728 -0.378961,0 -0.619601,-0.21222 -0.238746,-0.21222 -0.272852,-0.56276 z"
         style="font-family:sans-serif;-inkscape-font-specification:sans-serif"
         id="path169971" />
    </g>
    <g
       aria-label="3k"
       id="text34695"
       style="font-size:3.175px;line-height:100%;font-family:Sans;-inkscape-font-specification:Sans;letter-spacing:0px;word-spacing:0px;stroke:#000000;stroke-width:0">
      <path
         d="m 81.758615,252.45706 0.279053,-0.0372 q 0.04806,0.2372 0.162781,0.34262 0.116272,0.10387 0.282153,0.10387 0.196887,0 0.331763,-0.13643 0.136425,-0.13643 0.136425,-0.33796 0,-0.19224 -0.125573,-0.31626 -0.125574,-0.12558 -0.319361,-0.12558 -0.07906,0 -0.196887,0.031 l 0.03101,-0.24495 q 0.02791,0.003 0.04496,0.003 0.178284,0 0.320911,-0.093 0.142627,-0.093 0.142627,-0.28681 0,-0.15348 -0.10387,-0.25425 -0.103869,-0.10077 -0.2682,-0.10077 -0.162781,0 -0.271302,0.10232 -0.10852,0.10232 -0.139526,0.30696 l -0.279053,-0.0496 q 0.05116,-0.2806 0.232544,-0.43408 0.181385,-0.15503 0.451136,-0.15503 0.186035,0 0.342614,0.0806 0.15658,0.0791 0.238745,0.21704 0.08372,0.13797 0.08372,0.293 0,0.14728 -0.07906,0.2682 -0.07906,0.12093 -0.234094,0.19224 0.201538,0.0465 0.313159,0.19379 0.111621,0.14572 0.111621,0.36587 0,0.29765 -0.217041,0.50539 -0.217041,0.20619 -0.548803,0.20619 -0.299207,0 -0.497644,-0.17828 -0.196888,-0.17829 -0.224793,-0.46199 z"
         style="font-family:sans-serif;-inkscape-font-specification:sans-serif"
         id="path169974" />
      <path
         d="m 83.601913,253.05702 v -2.27273 h 0.279053 v 1.29605 l 0.660425,-0.66973 h 0.361218 l -0.629419,0.61082 0.692981,1.03559 h -0.344165 l -0.544153,-0.84181 -0.196887,0.18914 v 0.65267 z"
         style="font-family:sans-serif;-inkscape-font-specification:sans-serif"
         id="path169976" />
    </g>
    <g
       aria-label="R6"
       id="text34699"
       style="font-size:3.88056px;line-height:100%;font-family:Sans;-inkscape-font-specification:Sans;letter-spacing:0px;word-spacing:0px;stroke:#000000;stroke-width:0">
      <path
         d="m 101.75863,219.72762 v -2.77779 h 1.23162 q 0.37139,0 0.56466,0.0758 0.19327,0.0739 0.30885,0.26338 0.11558,0.18948 0.11558,0.41875 0,0.29559 -0.19137,0.49834 -0.19138,0.20274 -0.59118,0.25769 0.1459,0.0701 0.22169,0.13832 0.16106,0.1478 0.30506,0.36949 l 0.48318,0.75603 h -0.46233 l -0.3676,-0.57792 q -0.16105,-0.25011 -0.26527,-0.38275 -0.10421,-0.13264 -0.18758,-0.18569 -0.0815,-0.0531 -0.16675,-0.0739 -0.0625,-0.0133 -0.20464,-0.0133 h -0.42633 v 1.23352 z m 0.36759,-1.55185 h 0.79014 q 0.25201,0 0.39412,-0.0512 0.14211,-0.053 0.216,-0.16674 0.0739,-0.11559 0.0739,-0.25012 0,-0.19706 -0.144,-0.32401 -0.14211,-0.12695 -0.45097,-0.12695 h -0.87919 z"
         style="font-family:sans-serif;-inkscape-font-specification:sans-serif"
         id="path170004" />
      <path
         d="m 106.18679,217.63007 -0.33917,0.0265 q -0.0455,-0.20085 -0.12885,-0.2918 -0.13832,-0.1459 -0.34106,-0.1459 -0.16296,0 -0.28612,0.091 -0.16106,0.11748 -0.2539,0.34296 -0.0928,0.22549 -0.0966,0.64234 0.12317,-0.18758 0.30128,-0.27853 0.17811,-0.0909 0.37327,-0.0909 0.34107,0 0.57981,0.25201 0.24064,0.25011 0.24064,0.64802 0,0.26148 -0.11368,0.48696 -0.1118,0.22359 -0.30886,0.34296 -0.19706,0.11938 -0.44717,0.11938 -0.42633,0 -0.69539,-0.31265 -0.26907,-0.31453 -0.26907,-1.03456 0,-0.80529 0.29749,-1.17099 0.25959,-0.31833 0.69918,-0.31833 0.3278,0 0.53623,0.1838 0.21032,0.1838 0.25201,0.50781 z m -1.39268,1.19751 q 0,0.17622 0.0739,0.33728 0.0758,0.16106 0.21032,0.24632 0.13453,0.0834 0.28232,0.0834 0.21601,0 0.37139,-0.17432 0.15537,-0.17432 0.15537,-0.4737 0,-0.28801 -0.15348,-0.45286 -0.15348,-0.16674 -0.38654,-0.16674 -0.23117,0 -0.39222,0.16674 -0.16106,0.16485 -0.16106,0.43391 z"
         style="font-family:sans-serif;-inkscape-font-specification:sans-serif"
         id="path170006" />
    </g>
    <g
       aria-label="4k"
       id="text34703"
       style="font-size:3.175px;line-height:100%;font-family:Sans;-inkscape-font-specification:Sans;letter-spacing:0px;word-spacing:0px;stroke:#000000;stroke-width:0">
      <path
         d="m 102.7446,224.04771 v -0.54415 h -0.98598 v -0.2558 l 1.03714,-1.47278 h 0.22789 v 1.47278 h 0.30696 v 0.2558 h -0.30696 v 0.54415 z m 0,-0.79995 v -1.02474 l -0.71158,1.02474 z"
         style="font-family:sans-serif;-inkscape-font-specification:sans-serif"
         id="path170009" />
      <path
         d="m 103.69493,224.04771 v -2.27273 h 0.27905 v 1.29605 l 0.66043,-0.66973 h 0.36122 l -0.62942,0.61082 0.69298,1.03559 h -0.34417 l -0.54415,-0.8418 -0.19689,0.18913 v 0.65267 z"
         style="font-family:sans-serif;-inkscape-font-specification:sans-serif"
         id="path170011" />
    </g>
    <path
       id="path34705"
       d="m 57.75862,223.77498 v 1 h 1 v -10 h 1 v 1"
       style="fill:none;stroke:#000000;stroke-width:0.5;stroke-linecap:butt;stroke-linejoin:miter;stroke-miterlimit:4;stroke-dasharray:none;stroke-opacity:1" />
    <path
       id="path34707"
       d="m 72.75862,267.77498 v 1 h 1 v -10 h 1 v 1"
       style="fill:none;stroke:#000000;stroke-width:0.5;stroke-linecap:butt;stroke-linejoin:miter;stroke-miterlimit:4;stroke-dasharray:none;stroke-opacity:1" />
    <path
       id="path34709"
       d="m 107.75863,243.77498 v 1 h 1 v -10 h 1 v 1"
       style="fill:none;stroke:#000000;stroke-width:0.5;stroke-linecap:butt;stroke-linejoin:miter;stroke-miterlimit:4;stroke-dasharray:none;stroke-opacity:1" />
    <path
       id="path34711"
       d="m 82.75861,199.77498 v 1 h 1 v -10 h 1 v 1"
       style="fill:none;stroke:#000000;stroke-width:0.5;stroke-linecap:butt;stroke-linejoin:miter;stroke-miterlimit:4;stroke-dasharray:none;stroke-opacity:1" />
    <path
       style="fill:none;stroke:#000000;stroke-width:0.4;stroke-linecap:butt;stroke-linejoin:miter;stroke-dasharray:none;stroke-opacity:1"
       d="m 112.75862,229.77498 h -40 l -10e-6,-34"
       id="path40393" />
    <path
       style="fill:none;stroke:#000000;stroke-width:0.4;stroke-linecap:butt;stroke-linejoin:miter;stroke-dasharray:none;stroke-opacity:1"
       d="M 97.75862,210.77498 H 72.75861"
       id="path40395" />
    <path
       id="path45944"
       d="m 49.25862,234.77498 h -3 v -9 h 3 z"
       style="fill:#ffffff;fill-opacity:1;stroke:#000000;stroke-width:0.5;stroke-linecap:butt;stroke-linejoin:miter;stroke-miterlimit:4;stroke-dasharray:none;stroke-opacity:1" />
    <path
       id="path47798"
       style="fill:#000000;fill-opacity:1;stroke:none;stroke-width:1.04298;stroke-linecap:butt;stroke-linejoin:miter;stroke-miterlimit:4;stroke-dasharray:none;stroke-opacity:1"
       d="m 47.75862,209.77498 h 0.89999 m 0,0 c 0,-0.49703 -0.40293,-0.89996 -0.89999,-0.89996 -0.49702,0 -0.90001,0.40293 -0.90001,0.89996 0,0.49703 0.40293,0.89997 0.89995,0.89997 0.49706,0 0.90005,-0.40294 0.90005,-0.89997 z" />
    <path
       id="path47802"
       d="m 42.75862,222.77498 v -6 l -6,3 z"
       style="fill:none;stroke:#000000;stroke-width:0.5;stroke-linecap:butt;stroke-linejoin:miter;stroke-miterlimit:4;stroke-dasharray:none;stroke-opacity:1" />
    <path
       id="path47804"
       d="m 35.75862,221.77498 v 1 h 1 v -6 h 1 v 1"
       style="fill:none;stroke:#000000;stroke-width:0.5;stroke-linecap:butt;stroke-linejoin:miter;stroke-miterlimit:4;stroke-dasharray:none;stroke-opacity:1" />
    <path
       id="path47806"
       d="m 42.75862,212.77498 v -6 l -6,3 z"
       style="fill:none;stroke:#000000;stroke-width:0.5;stroke-linecap:butt;stroke-linejoin:miter;stroke-miterlimit:4;stroke-dasharray:none;stroke-opacity:1" />
    <path
       id="path47808"
       d="m 35.75862,211.77498 v 1 h 1 v -6 h 1 v 1"
       style="fill:none;stroke:#000000;stroke-width:0.5;stroke-linecap:butt;stroke-linejoin:miter;stroke-miterlimit:4;stroke-dasharray:none;stroke-opacity:1" />
    <path
       id="path47810"
       d="m 83.75861,213.77498 v -6 l -6,3 z"
       style="fill:none;stroke:#000000;stroke-width:0.5;stroke-linecap:butt;stroke-linejoin:miter;stroke-miterlimit:4;stroke-dasharray:none;stroke-opacity:1" />
    <path
       id="path47812"
       d="m 76.75861,212.77498 v 1 h 1 v -6 h 1 v 1"
       style="fill:none;stroke:#000000;stroke-width:0.5;stroke-linecap:butt;stroke-linejoin:miter;stroke-miterlimit:4;stroke-dasharray:none;stroke-opacity:1" />
    <path
       id="path47814"
       d="m 83.75862,232.77498 v -6 l -6,3 z"
       style="fill:none;stroke:#000000;stroke-width:0.5;stroke-linecap:butt;stroke-linejoin:miter;stroke-miterlimit:4;stroke-dasharray:none;stroke-opacity:1" />
    <path
       id="path47816"
       d="m 76.75862,231.77498 v 1 h 1 v -6 h 1 v 1"
       style="fill:none;stroke:#000000;stroke-width:0.5;stroke-linecap:butt;stroke-linejoin:miter;stroke-miterlimit:4;stroke-dasharray:none;stroke-opacity:1" />
    <path
       id="path47820"
       style="fill:#000000;fill-opacity:1;stroke:none;stroke-width:1.04298;stroke-linecap:butt;stroke-linejoin:miter;stroke-miterlimit:4;stroke-dasharray:none;stroke-opacity:1"
       d="m 72.75861,210.77498 h 0.89999 m 0,0 c 0,-0.49703 -0.40293,-0.89996 -0.89999,-0.89996 -0.49702,0 -0.90001,0.40293 -0.90001,0.89996 0,0.49703 0.40293,0.89997 0.89995,0.89997 0.49706,0 0.90005,-0.40294 0.90005,-0.89997 z" />
    <path
       id="path47822"
       style="fill:#000000;fill-opacity:1;stroke:none;stroke-width:1.04298;stroke-linecap:butt;stroke-linejoin:miter;stroke-miterlimit:4;stroke-dasharray:none;stroke-opacity:1"
       d="m 97.75862,229.77498 h 0.89999 m 0,0 c 0,-0.49703 -0.40293,-0.89996 -0.89999,-0.89996 -0.49702,0 -0.90001,0.40293 -0.90001,0.89996 0,0.49703 0.40293,0.89997 0.89995,0.89997 0.49706,0 0.90005,-0.40294 0.90005,-0.89997 z" />
    <path
       id="path47824"
       style="fill:#000000;fill-opacity:1;stroke:none;stroke-width:1.04298;stroke-linecap:butt;stroke-linejoin:miter;stroke-miterlimit:4;stroke-dasharray:none;stroke-opacity:1"
       d="m 112.75862,229.77498 h 0.89999 m 0,0 c 0,-0.49703 -0.40293,-0.89996 -0.89999,-0.89996 -0.49702,0 -0.90001,0.40293 -0.90001,0.89996 0,0.49703 0.40293,0.89997 0.89995,0.89997 0.49706,0 0.90005,-0.40294 0.90005,-0.89997 z" />
    <path
       id="path49688"
       style="fill:#000000;fill-opacity:1;stroke:none;stroke-width:1.04298;stroke-linecap:butt;stroke-linejoin:miter;stroke-miterlimit:4;stroke-dasharray:none;stroke-opacity:1"
       d="m 47.75862,219.77498 h 0.89999 m 0,0 c 0,-0.49703 -0.40293,-0.89996 -0.89999,-0.89996 -0.49702,0 -0.90001,0.40293 -0.90001,0.89996 0,0.49703 0.40293,0.89997 0.89995,0.89997 0.49706,0 0.90005,-0.40294 0.90005,-0.89997 z" />
    <path
       id="path34659"
       d="m 64.25862,253.77498 h -3 v -9 h 3 z"
       style="fill:#ffffff;fill-opacity:1;stroke:#000000;stroke-width:0.5;stroke-linecap:butt;stroke-linejoin:miter;stroke-miterlimit:4;stroke-dasharray:none;stroke-opacity:1" />
    <path
       id="path53418"
       style="fill:#000000;fill-opacity:1;stroke:none;stroke-width:1.04298;stroke-linecap:butt;stroke-linejoin:miter;stroke-miterlimit:4;stroke-dasharray:none;stroke-opacity:1"
       d="m 62.75862,239.77498 h 0.89999 m 0,0 c 0,-0.49703 -0.40293,-0.89996 -0.89999,-0.89996 -0.49702,0 -0.90001,0.40293 -0.90001,0.89996 0,0.49703 0.40293,0.89997 0.89995,0.89997 0.49706,0 0.90005,-0.40294 0.90005,-0.89997 z" />
    <g
       aria-label="R7"
       id="text53422"
       style="font-size:3.88056px;line-height:100%;font-family:Sans;-inkscape-font-specification:Sans;letter-spacing:0px;word-spacing:0px;stroke:#000000;stroke-width:0">
      <path
         d="m 104.27929,179.77498 v -2.77778 h 1.23162 q 0.37139,0 0.56466,0.0758 0.19327,0.0739 0.30885,0.26338 0.11558,0.18948 0.11558,0.41875 0,0.29559 -0.19137,0.49833 -0.19138,0.20274 -0.59118,0.25769 0.1459,0.0701 0.22169,0.13832 0.16106,0.1478 0.30506,0.36949 l 0.48318,0.75603 h -0.46233 l -0.3676,-0.57792 q -0.16105,-0.25011 -0.26527,-0.38275 -0.10421,-0.13263 -0.18758,-0.18569 -0.0815,-0.0531 -0.16675,-0.0739 -0.0625,-0.0133 -0.20464,-0.0133 h -0.42633 v 1.23352 z m 0.36759,-1.55185 h 0.79014 q 0.25201,0 0.39412,-0.0512 0.14211,-0.053 0.216,-0.16674 0.0739,-0.11558 0.0739,-0.25011 0,-0.19706 -0.144,-0.32401 -0.14211,-0.12696 -0.45097,-0.12696 h -0.87919 z"
         style="font-family:sans-serif;-inkscape-font-specification:sans-serif"
         id="path169883" />
      <path
         d="m 106.96044,177.361 v -0.3278 h 1.79817 v 0.26527 q -0.26527,0.28232 -0.52676,0.75034 -0.25958,0.46802 -0.40169,0.96256 -0.10232,0.34865 -0.13075,0.76361 h -0.35054 q 0.006,-0.3278 0.12885,-0.79203 0.12316,-0.46423 0.35244,-0.89435 0.23116,-0.43201 0.49075,-0.7276 z"
         style="font-family:sans-serif;-inkscape-font-specification:sans-serif"
         id="path169885" />
    </g>
    <g
       aria-label="120"
       id="text53426"
       style="font-size:3.175px;line-height:100%;font-family:Sans;-inkscape-font-specification:Sans;letter-spacing:0px;word-spacing:0px;stroke:#000000;stroke-width:0">
      <path
         d="m 104.79607,184.05702 h -0.27905 v -1.77818 q -0.10077,0.0961 -0.2651,0.19223 -0.16278,0.0961 -0.29301,0.14418 v -0.26975 q 0.2341,-0.11007 0.40928,-0.26665 0.17518,-0.15658 0.24805,-0.30386 h 0.17983 z"
         style="font-family:sans-serif;-inkscape-font-specification:sans-serif"
         id="path169888" />
      <path
         d="m 106.97733,183.78882 v 0.2682 h -1.50223 q -0.003,-0.10077 0.0326,-0.19378 0.0574,-0.15348 0.18293,-0.30231 0.12712,-0.14883 0.36587,-0.34417 0.37052,-0.30385 0.50074,-0.48059 0.13023,-0.17828 0.13023,-0.33641 0,-0.16588 -0.11937,-0.27905 -0.11783,-0.11473 -0.30851,-0.11473 -0.20154,0 -0.32246,0.12093 -0.12093,0.12092 -0.12248,0.33486 l -0.2868,-0.0294 q 0.0294,-0.32092 0.22169,-0.48835 0.19224,-0.16898 0.51625,-0.16898 0.32711,0 0.5178,0.18139 0.19068,0.18138 0.19068,0.44958 0,0.13643 -0.0558,0.2682 -0.0558,0.13178 -0.18603,0.2775 -0.12868,0.14573 -0.42943,0.39998 -0.25115,0.21084 -0.32247,0.2868 -0.0713,0.0744 -0.11782,0.15038 z"
         style="font-family:sans-serif;-inkscape-font-specification:sans-serif"
         id="path169890" />
      <path
         d="m 107.27654,182.93616 q 0,-0.40308 0.0822,-0.64802 0.0837,-0.2465 0.24649,-0.37982 0.16433,-0.13333 0.41238,-0.13333 0.18293,0 0.32091,0.0744 0.13798,0.0729 0.22789,0.2124 0.0899,0.13797 0.14108,0.33796 0.0512,0.19844 0.0512,0.5364 0,0.39998 -0.0822,0.64647 -0.0822,0.24495 -0.24649,0.37982 -0.16278,0.13333 -0.41238,0.13333 -0.32866,0 -0.51625,-0.23565 -0.22479,-0.2837 -0.22479,-0.92397 z m 0.2868,0 q 0,0.55966 0.13023,0.74569 0.13177,0.18449 0.32401,0.18449 0.19224,0 0.32246,-0.18604 0.13178,-0.18603 0.13178,-0.74414 0,-0.56121 -0.13178,-0.74569 -0.13022,-0.18449 -0.32556,-0.18449 -0.19224,0 -0.30696,0.16279 -0.14418,0.20773 -0.14418,0.76739 z"
         style="font-family:sans-serif;-inkscape-font-specification:sans-serif"
         id="path169892" />
    </g>
    <g
       aria-label="D4"
       id="text53430"
       style="font-size:3.88056px;line-height:100%;font-family:Sans;-inkscape-font-specification:Sans;letter-spacing:0px;word-spacing:0px;stroke:#000000;stroke-width:0">
      <path
         d="m 30.284988,217.77498 v -2.77778 h 0.956877 q 0.324011,0 0.494544,0.0398 0.238745,0.0549 0.407383,0.19895 0.219797,0.18569 0.327801,0.4756 0.109898,0.28801 0.109898,0.65939 0,0.31643 -0.0739,0.56086 -0.0739,0.24443 -0.18948,0.40549 -0.115584,0.15916 -0.253904,0.25201 -0.136426,0.0909 -0.331591,0.13832 -0.19327,0.0474 -0.445279,0.0474 z m 0.367592,-0.3278 h 0.593074 q 0.274747,0 0.430121,-0.0512 0.157269,-0.0512 0.250114,-0.14401 0.130742,-0.13074 0.202744,-0.35054 0.0739,-0.22169 0.0739,-0.53623 0,-0.4358 -0.144005,-0.66886 -0.14211,-0.23496 -0.346749,-0.31454 -0.147795,-0.0568 -0.475596,-0.0568 h -0.5836 z"
         style="font-family:sans-serif;-inkscape-font-specification:sans-serif"
         id="path169928" />
      <path
         d="M 34.042386,217.77498 V 217.1099 H 32.83729 v -0.31264 l 1.267624,-1.80006 h 0.278537 v 1.80006 h 0.375171 v 0.31264 h -0.375171 v 0.66508 z m 0,-0.97772 v -1.25247 l -0.869716,1.25247 z"
         style="font-family:sans-serif;-inkscape-font-specification:sans-serif"
         id="path169930" />
    </g>
    <g
       aria-label="D5"
       id="text53434"
       style="font-size:3.88056px;line-height:100%;font-family:Sans;-inkscape-font-specification:Sans;letter-spacing:0px;word-spacing:0px;stroke:#000000;stroke-width:0">
      <path
         d="m 78.252764,205.72762 v -2.77779 h 0.956876 q 0.324011,0 0.494544,0.0398 0.238745,0.0549 0.407383,0.19896 0.219797,0.18569 0.327801,0.47559 0.109899,0.28801 0.109899,0.6594 0,0.31643 -0.0739,0.56086 -0.0739,0.24443 -0.18948,0.40549 -0.115583,0.15916 -0.253904,0.252 -0.136426,0.091 -0.331591,0.13833 -0.19327,0.0474 -0.445279,0.0474 z m 0.367592,-0.32781 h 0.593073 q 0.274747,0 0.430121,-0.0512 0.157269,-0.0512 0.250114,-0.144 0.130742,-0.13074 0.202744,-0.35054 0.0739,-0.22169 0.0739,-0.53623 0,-0.4358 -0.144005,-0.66887 -0.142111,-0.23495 -0.34675,-0.31453 -0.147794,-0.0569 -0.475596,-0.0569 h -0.583599 z"
         style="font-family:sans-serif;-inkscape-font-specification:sans-serif"
         id="path169989" />
      <path
         d="m 80.916859,205.00001 0.358118,-0.0303 q 0.03979,0.26149 0.183796,0.39412 0.1459,0.13074 0.350539,0.13074 0.246324,0 0.416857,-0.18569 0.170532,-0.18569 0.170532,-0.49265 0,-0.2918 -0.164848,-0.46043 -0.162953,-0.16864 -0.428226,-0.16864 -0.164848,0 -0.297484,0.0758 -0.132636,0.0739 -0.208428,0.19327 l -0.320222,-0.0417 0.269062,-1.42679 h 1.381312 v 0.3259 h -1.10846 l -0.14969,0.74656 q 0.250114,-0.17432 0.524861,-0.17432 0.363803,0 0.613917,0.252 0.250114,0.25201 0.250114,0.64803 0,0.37706 -0.219797,0.65181 -0.267168,0.33728 -0.7295,0.33728 -0.378961,0 -0.619601,-0.21222 -0.238746,-0.21222 -0.272852,-0.56276 z"
         style="font-family:sans-serif;-inkscape-font-specification:sans-serif"
         id="path169991" />
    </g>
    <path
       id="path55307"
       style="fill:#000000;fill-opacity:1;stroke:none;stroke-width:1.04298;stroke-linecap:butt;stroke-linejoin:miter;stroke-miterlimit:4;stroke-dasharray:none;stroke-opacity:1"
       d="m 97.75862,210.77498 h 0.89999 m 0,0 c 0,-0.49703 -0.40293,-0.89996 -0.89999,-0.89996 -0.49702,0 -0.90001,0.40293 -0.90001,0.89996 0,0.49703 0.40293,0.89997 0.89995,0.89997 0.49706,0 0.90005,-0.40294 0.90005,-0.89997 z" />
    <g
       aria-label="D6"
       id="text55311"
       style="font-size:3.88056px;line-height:100%;font-family:Sans;-inkscape-font-specification:Sans;letter-spacing:0px;word-spacing:0px;stroke:#000000;stroke-width:0">
      <path
         d="m 78.275499,224.72762 v -2.77779 h 0.956876 q 0.324012,0 0.494544,0.0398 0.238746,0.0549 0.407383,0.19896 0.219798,0.18569 0.327802,0.47559 0.109898,0.28801 0.109898,0.6594 0,0.31643 -0.0739,0.56086 -0.0739,0.24443 -0.18948,0.40549 -0.115584,0.15916 -0.253904,0.252 -0.136426,0.091 -0.331591,0.13833 -0.19327,0.0474 -0.445279,0.0474 z m 0.367592,-0.32781 h 0.593074 q 0.274747,0 0.430121,-0.0512 0.157269,-0.0512 0.250114,-0.144 0.130741,-0.13074 0.202744,-0.35054 0.0739,-0.22169 0.0739,-0.53623 0,-0.4358 -0.144005,-0.66887 -0.14211,-0.23495 -0.346749,-0.31453 -0.147795,-0.0569 -0.475596,-0.0569 h -0.5836 z"
         style="font-family:sans-serif;-inkscape-font-specification:sans-serif"
         id="path169994" />
      <path
         d="m 82.709342,222.63007 -0.33917,0.0265 q -0.04547,-0.20085 -0.128847,-0.2918 -0.13832,-0.1459 -0.341065,-0.1459 -0.162953,0 -0.286115,0.091 -0.161058,0.11748 -0.253904,0.34296 -0.09284,0.22549 -0.09664,0.64234 0.123162,-0.18758 0.301274,-0.27853 0.178112,-0.0909 0.373277,-0.0909 0.341064,0 0.57981,0.25201 0.24064,0.25011 0.24064,0.64802 0,0.26148 -0.113688,0.48696 -0.111794,0.22359 -0.308853,0.34296 -0.19706,0.11938 -0.447174,0.11938 -0.426331,0 -0.695394,-0.31265 -0.269062,-0.31453 -0.269062,-1.03456 0,-0.80529 0.297484,-1.17099 0.259589,-0.31833 0.699183,-0.31833 0.327801,0 0.53623,0.1838 0.210323,0.1838 0.252009,0.50781 z m -1.392681,1.19751 q 0,0.17622 0.0739,0.33728 0.07579,0.16106 0.210323,0.24632 0.134531,0.0834 0.282326,0.0834 0.216008,0 0.371382,-0.17432 0.155374,-0.17432 0.155374,-0.4737 0,-0.28801 -0.153479,-0.45286 -0.153479,-0.16674 -0.38654,-0.16674 -0.231167,0 -0.392225,0.16674 -0.161058,0.16485 -0.161058,0.43391 z"
         style="font-family:sans-serif;-inkscape-font-specification:sans-serif"
         id="path169996" />
    </g>
    <g
       aria-label="D3"
       id="text55315"
       style="font-size:3.88056px;line-height:100%;font-family:Sans;-inkscape-font-specification:Sans;letter-spacing:0px;word-spacing:0px;stroke:#000000;stroke-width:0">
      <path
         d="m 30.273605,207.72572 v -2.77778 h 0.956876 q 0.324012,0 0.494544,0.0398 0.238746,0.0549 0.407383,0.19896 0.219798,0.18569 0.327802,0.47559 0.109898,0.28801 0.109898,0.65939 0,0.31644 -0.0739,0.56087 -0.0739,0.24442 -0.18948,0.40548 -0.115584,0.15917 -0.253904,0.25201 -0.136426,0.0909 -0.331591,0.13832 -0.19327,0.0474 -0.445279,0.0474 z m 0.367592,-0.3278 h 0.593074 q 0.274747,0 0.430121,-0.0512 0.157269,-0.0512 0.250114,-0.144 0.130741,-0.13074 0.202744,-0.35054 0.0739,-0.22169 0.0739,-0.53623 0,-0.43581 -0.144005,-0.66887 -0.14211,-0.23495 -0.346749,-0.31454 -0.147795,-0.0568 -0.475596,-0.0568 h -0.5836 z"
         style="font-family:sans-serif;-inkscape-font-specification:sans-serif"
         id="path169923" />
      <path
         d="m 32.939595,206.99243 0.341065,-0.0455 q 0.05874,0.2899 0.198955,0.41875 0.14211,0.12695 0.344854,0.12695 0.24064,0 0.405488,-0.16674 0.166743,-0.16674 0.166743,-0.41307 0,-0.23495 -0.153479,-0.38654 -0.153479,-0.15348 -0.39033,-0.15348 -0.09663,0 -0.24064,0.0379 l 0.0379,-0.29938 q 0.03411,0.004 0.05495,0.004 0.217903,0 0.392225,-0.11369 0.174322,-0.11369 0.174322,-0.35054 0,-0.18758 -0.126952,-0.31075 -0.126952,-0.12316 -0.327801,-0.12316 -0.198955,0 -0.331591,0.12506 -0.132636,0.12506 -0.170532,0.37517 l -0.341065,-0.0606 q 0.06253,-0.34296 0.28422,-0.53055 0.221693,-0.18948 0.551389,-0.18948 0.227376,0 0.418751,0.0985 0.191376,0.0966 0.2918,0.26527 0.10232,0.16864 0.10232,0.35812 0,0.18001 -0.09663,0.3278 -0.09664,0.1478 -0.286116,0.23496 0.246325,0.0568 0.382751,0.23685 0.136426,0.17811 0.136426,0.44717 0,0.36381 -0.265273,0.61771 -0.265273,0.25201 -0.670761,0.25201 -0.365697,0 -0.608232,-0.2179 -0.24064,-0.21791 -0.274747,-0.56466 z"
         style="font-family:sans-serif;-inkscape-font-specification:sans-serif"
         id="path169925" />
    </g>
    <path
       id="path2405"
       style="fill:#000000;fill-opacity:1;stroke:none;stroke-width:1.04298;stroke-linecap:butt;stroke-linejoin:miter;stroke-miterlimit:4;stroke-dasharray:none;stroke-opacity:1"
       d="m 72.75862,195.77498 h 0.89999 m 0,0 c 0,-0.49703 -0.40293,-0.89996 -0.89999,-0.89996 -0.49702,0 -0.90001,0.40293 -0.90001,0.89996 0,0.49703 0.40293,0.89997 0.89995,0.89997 0.49706,0 0.90005,-0.40294 0.90005,-0.89997 z" />
  </g>
</svg>
