<?xml version="1.0" encoding="UTF-8" standalone="no"?>
<svg
   xmlns:dc="http://purl.org/dc/elements/1.1/"
   xmlns:cc="http://creativecommons.org/ns#"
   xmlns:rdf="http://www.w3.org/1999/02/22-rdf-syntax-ns#"
   xmlns:svg="http://www.w3.org/2000/svg"
   xmlns="http://www.w3.org/2000/svg"
   xmlns:xlink="http://www.w3.org/1999/xlink"
   width="3.96875mm"
   height="3.9687533mm"
   viewBox="0 0 14.062499 14.062511"
   id="svg8326"
   version="1.1">
  <defs
     id="defs8328">
    <radialGradient
       xlink:href="#linearGradient6062"
       id="radialGradient6078"
       cx="604.57355"
       cy="-19.574995"
       fx="604.57355"
       fy="-19.574995"
       r="94.627533"
       gradientUnits="userSpaceOnUse"
       gradientTransform="matrix(0.18475678,0,0,0.19818494,-349.88821,986.84648)" />
    <linearGradient
       id="linearGradient6062">
      <stop
         style="stop-color:#94ef16;stop-opacity:1"
         offset="0"
         id="stop6064" />
      <stop
         style="stop-color:#557334;stop-opacity:1"
         offset="1"
         id="stop6066" />
    </linearGradient>
    <linearGradient
       xlink:href="#linearGradient3468"
       id="linearGradient6084"
       x1="604.547"
       y1="-104.44051"
       x2="604.547"
       y2="-0.038252577"
       gradientUnits="userSpaceOnUse"
       gradientTransform="matrix(0.1661641,0,0,0.1661641,-338.64757,986.21967)" />
    <linearGradient
       id="linearGradient3468">
      <stop
         id="stop3470"
         offset="0"
         style="stop-color:#fdfdfc;stop-opacity:0.78431374" />
      <stop
         id="stop3472"
         offset="1"
         style="stop-color:#ffffff;stop-opacity:0.05172414" />
    </linearGradient>
  </defs>
  <metadata
     id="metadata8331">
    <rdf:RDF>
      <cc:Work
         rdf:about="">
        <dc:format>image/svg+xml</dc:format>
        <dc:type
           rdf:resource="http://purl.org/dc/dcmitype/StillImage" />
        <dc:title></dc:title>
      </cc:Work>
    </rdf:RDF>
  </metadata>
  <g
     id="layer1"
     transform="translate(256.00164,-965.15453)">
    <g
       id="g878"
       transform="matrix(0.39473685,0,0,0.39473685,-154.94836,584.17247)">
      <path
         id="circle6100"
         style="fill:#ffffff;fill-opacity:1;fill-rule:nonzero;stroke:#387fc8;stroke-width:0.747738;stroke-linecap:round;stroke-linejoin:round;stroke-miterlimit:4;stroke-dasharray:none;stroke-opacity:1"
         d="m -220.75052,982.96704 a 17.438631,17.438631 0 0 1 -17.43863,17.43866 17.438631,17.438631 0 0 1 -17.43863,-17.43866 17.438631,17.438631 0 0 1 17.43863,-17.43863 17.438631,17.438631 0 0 1 17.43863,17.43863 z" />
      <path
         id="path6060"
         style="fill:url(#radialGradient6078);fill-opacity:1;fill-rule:nonzero;stroke:none;stroke-width:1.44002;stroke-linecap:round;stroke-linejoin:round;stroke-miterlimit:4;stroke-dasharray:none;stroke-opacity:1"
         d="m -222.46545,982.96704 a 15.723699,15.723699 0 0 1 -15.7237,15.7237 15.723699,15.723699 0 0 1 -15.7237,-15.7237 15.723699,15.723699 0 0 1 15.7237,-15.7237 15.723699,15.723699 0 0 1 15.7237,15.7237 z" />
      <path
         id="circle6080"
         style="fill:url(#linearGradient6084);fill-opacity:1;fill-rule:nonzero;stroke:none;stroke-width:1.44002;stroke-linecap:round;stroke-linejoin:round;stroke-miterlimit:4;stroke-dasharray:none;stroke-opacity:1"
         d="m -226.1587,977.29749 a 12.030451,9.0174208 0 0 1 -12.03045,9.01742 12.030451,9.0174208 0 0 1 -12.03045,-9.01742 12.030451,9.0174208 0 0 1 12.03045,-9.01743 12.030451,9.0174208 0 0 1 12.03045,9.01743 z" />
      <g
         transform="matrix(0.1661641,0,0,0.1661641,-339.57209,986.21967)"
         id="g6094">
        <g
           aria-label="AIX"
           id="text6086"
           style="font-style:normal;font-weight:normal;line-height:0%;font-family:sans-serif;letter-spacing:0px;word-spacing:0px;fill:#000000;fill-opacity:1;stroke:#628c2e;stroke-width:1.5;stroke-linecap:butt;stroke-linejoin:miter;stroke-miterlimit:4;stroke-dasharray:none;stroke-opacity:1">
          <path
             d="m 571.96368,-1.8662519 h -21.31103 l -3.36304,9.6289062 h -13.69995 l 19.57642,-52.8527833 h 16.24878 L 588.99127,7.7626543 H 575.29132 Z M 554.05109,-11.67216 h 14.47876 l -7.22168,-21.027832 z"
             style="font-style:normal;font-variant:normal;font-weight:bold;font-stretch:normal;font-size:72.5px;line-height:1.25;font-family:sans-serif;-inkscape-font-specification:'sans-serif Bold';fill:#ffffff;fill-opacity:1;stroke:#628c2e;stroke-width:1.5;stroke-miterlimit:4;stroke-dasharray:none;stroke-opacity:1"
             id="path858" />
          <path
             d="M 596.00055,-45.090129 H 609.6297 V 7.7626543 h -13.62915 z"
             style="font-style:normal;font-variant:normal;font-weight:bold;font-stretch:normal;font-size:72.5px;line-height:1.25;font-family:sans-serif;-inkscape-font-specification:'sans-serif Bold';fill:#ffffff;fill-opacity:1;stroke:#628c2e;stroke-width:1.5;stroke-miterlimit:4;stroke-dasharray:none;stroke-opacity:1"
             id="path860" />
          <path
             d="m 652.42877,-19.212443 18.3374,26.9750973 H 656.57062 L 644.21588,-10.291545 631.96735,7.7626543 H 617.70099 L 636.03839,-19.212443 618.409,-45.090129 h 14.23095 l 11.57593,17.027588 11.54053,-17.027588 h 14.30176 z"
             style="font-style:normal;font-variant:normal;font-weight:bold;font-stretch:normal;font-size:72.5px;line-height:1.25;font-family:sans-serif;-inkscape-font-specification:'sans-serif Bold';fill:#ffffff;fill-opacity:1;stroke:#628c2e;stroke-width:1.5;stroke-miterlimit:4;stroke-dasharray:none;stroke-opacity:1"
             id="path862" />
        </g>
        <g
           aria-label="®"
           id="text6090"
           style="font-style:normal;font-weight:normal;line-height:0%;font-family:sans-serif;letter-spacing:0px;word-spacing:0px;fill:#000000;fill-opacity:1;stroke:none;stroke-width:1.5;stroke-linecap:butt;stroke-linejoin:miter;stroke-miterlimit:4;stroke-dasharray:none;stroke-opacity:1">
          <path
             d="m 680.65118,-3.6730146 q -1.10778,0 -2.05993,0.402832 -0.95215,0.3936767 -1.74866,1.1901855 -0.79651,0.7965088 -1.19934,1.74865726 -0.39368,0.94299317 -0.39368,2.05993654 0,1.1077881 0.39368,2.0599365 0.40283,0.9429932 1.19934,1.739502 0.78735,0.7873535 1.7395,1.1810302 0.96131,0.3936768 2.06909,0.3936768 1.1261,0 2.0691,-0.3845215 0.94299,-0.3936767 1.7395,-1.1901855 0.79651,-0.7965088 1.19018,-1.739502 0.40284,-0.9521484 0.40284,-2.0599365 0,-1.11694337 -0.40284,-2.05993654 -0.39367,-0.95214846 -1.19018,-1.74865726 -0.80567,-0.805664 -1.75781,-1.1993408 -0.943,-0.3936767 -2.05079,-0.3936767 z m -0.52185,2.70080562 h -0.32043 v 1.8951416 h 0.32043 q 0.71411,0 1.07117,-0.2380371 0.36621,-0.24719239 0.36621,-0.72326661 0,-0.47607421 -0.35705,-0.70495605 -0.3479,-0.22888184 -1.08033,-0.22888184 z m 0.33875,-1.26342772 q 1.61133,0 2.40784,0.5493164 0.7965,0.5401611 0.7965,1.64794921 0,0.78735352 -0.48523,1.30004879 -0.47607,0.5126954 -1.35498,0.668335 0.37537,0.201416 0.69581,0.567627 0.32958,0.3662109 0.59509,0.8972168 l 1.01623,2.0233154 h -2.09655 l -0.97962,-1.9500733 q -0.3479,-0.7141113 -0.6134,-1.00708 -0.2655,-0.3021241 -0.53101,-0.3021241 h -0.10986 v 3.2592774 h -1.95007 v -7.6538086 z m 0.1831,-2.8472901 q 1.39161,0 2.59095,0.5035401 1.20849,0.50354 2.20642,1.5014648 0.99792,0.9979248 1.49231,2.19726566 0.49438,1.19934082 0.49438,2.60925294 0,1.3916015 -0.49438,2.5909424 -0.49439,1.1901855 -1.49231,2.1881103 -0.99793,0.9979248 -2.20642,1.5014649 -1.19934,0.50354 -2.59095,0.50354 -1.3916,0 -2.60009,-0.50354 -1.19934,-0.5035401 -2.19727,-1.5014649 -0.99792,-0.9979248 -1.49231,-2.1881103 -0.49438,-1.1993409 -0.49438,-2.5909424 0,-1.40991212 0.49438,-2.60925294 0.49439,-1.19934086 1.49231,-2.19726566 0.99793,-0.9979248 2.19727,-1.5014648 1.20849,-0.5035401 2.60009,-0.5035401 z"
             style="font-style:normal;font-variant:normal;font-weight:bold;font-stretch:normal;font-size:18.75px;line-height:1.25;font-family:sans-serif;-inkscape-font-specification:'sans-serif Bold';fill:#ffffff;fill-opacity:1;stroke:none;stroke-width:1.5;stroke-miterlimit:4;stroke-dasharray:none;stroke-opacity:1"
             id="path865" />
        </g>
      </g>
    </g>
  </g>
</svg>
