<?xml version="1.0" encoding="UTF-8" standalone="no"?>
<!-- Created with Inkscape (http://www.inkscape.org/) -->

<svg
   width="159.13675mm"
   height="95.872475mm"
   viewBox="0 0 159.13675 95.872475"
   version="1.1"
   id="svg58183"
   xmlns="http://www.w3.org/2000/svg"
   xmlns:svg="http://www.w3.org/2000/svg">
  <defs
     id="defs58180" />
  <g
     id="layer1"
     transform="translate(-28.660442,-89.237492)">
    <path
       id="path98657"
       style="fill:#000000;fill-opacity:1;stroke:none;stroke-width:0.264583px;stroke-linecap:butt;stroke-linejoin:miter;stroke-opacity:1"
       d="m 61.79719,108.2377 v 3.99976 l 6.99538,-3e-4 c 0.0799,0 0.1022,0.0294 0.11749,0.0917 0.28868,1.30983 1.08788,2.10935 1.88713,2.9086 0.79883,-0.79883 1.5976,-1.5979 1.88667,-2.9065 0.0206,-0.064 0.0525,-0.0938 0.11322,-0.0938 l 7.00011,3e-4 v -4 z" />
    <path
       style="fill:#000000;fill-opacity:0.25;stroke:none;stroke-width:0.264583px;stroke-linecap:butt;stroke-linejoin:miter;stroke-opacity:1"
       d="m 77.79719,108.23746 h -14 v 4 h 14 z"
       id="path98659" />
    <g
       aria-label="2.54-4.89V"
       id="text98663"
       style="font-size:3.175px;line-height:100%;font-family:Sans;-inkscape-font-specification:Sans;letter-spacing:0px;word-spacing:0px;fill:#ffffff;stroke:#000000;stroke-width:0">
      <path
         d="m 64.598333,110.9537 v 0.40463 h -1.527039 q 0.02481,-0.22944 0.148829,-0.43408 0.124023,-0.20619 0.489892,-0.54571 0.294556,-0.2744 0.361218,-0.37207 0.08992,-0.13487 0.08992,-0.26665 0,-0.14572 -0.07906,-0.22324 -0.07751,-0.0791 -0.21549,-0.0791 -0.136426,0 -0.217041,0.0822 -0.08062,0.0822 -0.09302,0.27285 l -0.434082,-0.0434 q 0.03876,-0.35967 0.243396,-0.51625 0.204639,-0.15658 0.511597,-0.15658 0.336413,0 0.52865,0.18138 0.192236,0.18139 0.192236,0.45114 0,0.15348 -0.05581,0.293 -0.05426,0.13798 -0.173632,0.28991 -0.07906,0.10077 -0.285254,0.2899 -0.206189,0.18914 -0.262,0.25115 -0.05426,0.062 -0.08837,0.12092 z"
         style="font-weight:bold;font-family:sans-serif;-inkscape-font-specification:'sans-serif Bold'"
         id="path60476" />
      <path
         d="m 64.985906,111.35833 v -0.43563 h 0.435633 v 0.43563 z"
         style="font-weight:bold;font-family:sans-serif;-inkscape-font-specification:'sans-serif Bold'"
         id="path60478" />
      <path
         d="m 65.781206,110.77387 0.434082,-0.045 q 0.0186,0.14728 0.110071,0.2341 0.09147,0.0853 0.21084,0.0853 0.136426,0 0.230994,-0.11007 0.09457,-0.11162 0.09457,-0.33486 0,-0.20929 -0.09457,-0.31316 -0.09302,-0.10542 -0.243396,-0.10542 -0.187586,0 -0.336414,0.16588 l -0.353467,-0.0512 0.223243,-1.18287 h 1.151867 v 0.40772 h -0.821655 l -0.06821,0.38603 q 0.145728,-0.0729 0.297656,-0.0729 0.289905,0 0.491443,0.21084 0.201538,0.21084 0.201538,0.54726 0,0.2806 -0.16278,0.50074 -0.221692,0.30076 -0.615467,0.30076 -0.314709,0 -0.513147,-0.16898 -0.198437,-0.16899 -0.237195,-0.45424 z"
         style="font-weight:bold;font-family:sans-serif;-inkscape-font-specification:'sans-serif Bold'"
         id="path60480" />
      <path
         d="m 68.395,111.35833 v -0.45734 h -0.930176 v -0.38137 l 0.985987,-1.44332 h 0.365869 v 1.44177 h 0.282153 v 0.38292 H 68.81668 v 0.45734 z m 0,-0.84026 v -0.7767 l -0.522448,0.7767 z"
         style="font-weight:bold;font-family:sans-serif;-inkscape-font-specification:'sans-serif Bold'"
         id="path60482" />
      <path
         d="m 69.349981,110.75217 v -0.43564 h 0.855762 v 0.43564 z"
         style="font-weight:bold;font-family:sans-serif;-inkscape-font-specification:'sans-serif Bold'"
         id="path60484" />
      <path
         d="m 71.218084,111.35833 v -0.45734 h -0.930176 v -0.38137 l 0.985986,-1.44332 h 0.365869 v 1.44177 h 0.282154 v 0.38292 h -0.282154 v 0.45734 z m 0,-0.84026 v -0.7767 l -0.522449,0.7767 z"
         style="font-weight:bold;font-family:sans-serif;-inkscape-font-specification:'sans-serif Bold'"
         id="path60486" />
      <path
         d="m 72.222674,111.35833 v -0.43563 h 0.435632 v 0.43563 z"
         style="font-weight:bold;font-family:sans-serif;-inkscape-font-specification:'sans-serif Bold'"
         id="path60488" />
      <path
         d="m 73.385393,110.13205 q -0.168982,-0.0713 -0.246497,-0.19534 -0.07596,-0.12557 -0.07596,-0.2744 0,-0.25425 0.176733,-0.42013 0.178284,-0.16588 0.505396,-0.16588 0.324011,0 0.502295,0.16588 0.179834,0.16588 0.179834,0.42013 0,0.15813 -0.08217,0.28215 -0.08216,0.12248 -0.230993,0.18759 0.189135,0.076 0.286804,0.22169 0.09922,0.14573 0.09922,0.33641 0,0.31471 -0.201539,0.5116 -0.199987,0.19689 -0.5333,0.19689 -0.310059,0 -0.516248,-0.16278 -0.243396,-0.19224 -0.243396,-0.5271 0,-0.18449 0.09147,-0.33797 0.09147,-0.15503 0.288355,-0.23874 z m 0.08992,-0.43873 q 0,0.13022 0.07286,0.20308 0.07441,0.0729 0.196887,0.0729 0.124023,0 0.198437,-0.0729 0.07441,-0.0744 0.07441,-0.20464 0,-0.12247 -0.07441,-0.19533 -0.07286,-0.0744 -0.193786,-0.0744 -0.125574,0 -0.199988,0.0744 -0.07441,0.0744 -0.07441,0.19689 z m -0.04031,0.97358 q 0,0.17983 0.09147,0.2806 0.09302,0.10077 0.230993,0.10077 0.134876,0 0.223242,-0.0961 0.08837,-0.0977 0.08837,-0.2806 0,-0.15968 -0.08992,-0.2558 -0.08992,-0.0977 -0.227893,-0.0977 -0.15968,0 -0.238745,0.11007 -0.07752,0.11007 -0.07752,0.23875 z"
         style="font-weight:bold;font-family:sans-serif;-inkscape-font-specification:'sans-serif Bold'"
         id="path60490" />
      <path
         d="m 74.786858,110.83278 0.42168,-0.0465 q 0.0155,0.12868 0.08061,0.19069 0.06511,0.062 0.172083,0.062 0.134875,0 0.229443,-0.12402 0.09457,-0.12403 0.120923,-0.5147 -0.164331,0.19068 -0.410828,0.19068 -0.2682,0 -0.463537,-0.20618 -0.193787,-0.20774 -0.193787,-0.53951 0,-0.34571 0.204639,-0.55655 0.206189,-0.21239 0.523999,-0.21239 0.345715,0 0.567407,0.2682 0.221692,0.26665 0.221692,0.87902 0,0.62321 -0.230994,0.89917 -0.230993,0.27595 -0.601513,0.27595 -0.266651,0 -0.430982,-0.14108 -0.164331,-0.14263 -0.21084,-0.42478 z m 0.985987,-0.95188 q 0,-0.21084 -0.09767,-0.32711 -0.09612,-0.11627 -0.223242,-0.11627 -0.120923,0 -0.201538,0.0961 -0.07906,0.0946 -0.07906,0.31161 0,0.22015 0.08682,0.32402 0.08682,0.10231 0.217041,0.10231 0.125574,0 0.21084,-0.0992 0.08682,-0.0992 0.08682,-0.29146 z"
         style="font-weight:bold;font-family:sans-serif;-inkscape-font-specification:'sans-serif Bold'"
         id="path60492" />
      <path
         d="m 77.219268,111.35833 -0.812354,-2.27273 h 0.497644 l 0.575159,1.68207 0.556555,-1.68207 h 0.486792 l -0.813904,2.27273 z"
         style="font-weight:bold;font-family:sans-serif;-inkscape-font-specification:'sans-serif Bold'"
         id="path60494" />
    </g>
    <path
       style="fill:none;stroke:#000000;stroke-width:0.7;stroke-linecap:butt;stroke-linejoin:miter;stroke-miterlimit:4;stroke-dasharray:none;stroke-opacity:1"
       d="m 52.79719,142.23746 h 6"
       id="path11804" />
    <path
       id="path11806"
       style="fill:#000000;fill-opacity:1;stroke:none;stroke-width:1.04298;stroke-linecap:butt;stroke-linejoin:miter;stroke-miterlimit:4;stroke-dasharray:none;stroke-opacity:1"
       d="m 55.79719,137.23746 h 0.89999 m 0,0 c 0,-0.49703 -0.402929,-0.89996 -0.89999,-0.89996 -0.497017,0 -0.90001,0.40293 -0.90001,0.89996 0,0.49703 0.402929,0.89997 0.899949,0.89997 0.49706,0 0.900051,-0.40294 0.900051,-0.89997 z" />
    <path
       style="fill:none;stroke:#000000;stroke-width:0.4;stroke-linecap:butt;stroke-linejoin:miter;stroke-dasharray:none;stroke-opacity:1"
       d="m 55.79719,137.23746 v 5"
       id="path11808" />
    <path
       style="fill:none;stroke:#000000;stroke-width:0.4;stroke-linecap:butt;stroke-linejoin:miter;stroke-dasharray:none;stroke-opacity:1"
       d="m 69.79719,137.23746 h -14 v -19"
       id="path11812" />
    <g
       aria-label="DC out"
       id="text11816"
       style="font-size:3.88056px;line-height:125%;font-family:Sans;-inkscape-font-specification:Sans;letter-spacing:0px;word-spacing:0px;stroke:#000000;stroke-width:0">
      <path
         d="m 73.797189,119.62635 v -2.77778 h 0.956877 q 0.324011,0 0.494544,0.0398 0.238745,0.0549 0.407383,0.19895 0.219797,0.18569 0.327801,0.4756 0.109899,0.28801 0.109899,0.65939 0,0.31643 -0.0739,0.56086 -0.0739,0.24443 -0.18948,0.40549 -0.115583,0.15916 -0.253904,0.25201 -0.136426,0.091 -0.331591,0.13832 -0.19327,0.0474 -0.445279,0.0474 z m 0.367593,-0.3278 h 0.593073 q 0.274747,0 0.430121,-0.0512 0.157269,-0.0512 0.250114,-0.14401 0.130742,-0.13074 0.202744,-0.35053 0.0739,-0.2217 0.0739,-0.53623 0,-0.43581 -0.144005,-0.66887 -0.142111,-0.23496 -0.34675,-0.31454 -0.147794,-0.0568 -0.475596,-0.0568 h -0.583599 z"
         style="line-height:125%;font-family:sans-serif;-inkscape-font-specification:sans-serif"
         id="path60465" />
      <path
         d="m 78.581571,118.65242 0.367592,0.0928 q -0.115583,0.45285 -0.416857,0.6916 -0.299379,0.23685 -0.733289,0.23685 -0.449069,0 -0.731395,-0.1819 -0.280431,-0.1838 -0.428226,-0.53055 -0.145899,-0.34675 -0.145899,-0.74465 0,-0.43391 0.164848,-0.75603 0.166742,-0.32401 0.471806,-0.49076 0.306958,-0.16863 0.67455,-0.16863 0.416857,0 0.701078,0.21221 0.284221,0.21222 0.396014,0.59687 l -0.361907,0.0853 q -0.09663,-0.30316 -0.280432,-0.44149 -0.183796,-0.13832 -0.462332,-0.13832 -0.320222,0 -0.53623,0.15348 -0.214113,0.15348 -0.301274,0.41307 -0.08716,0.25769 -0.08716,0.53244 0,0.35433 0.10232,0.6196 0.104214,0.26338 0.322117,0.39412 0.217902,0.13074 0.471806,0.13074 0.308853,0 0.522966,-0.17811 0.214113,-0.17811 0.289905,-0.52865 z"
         style="line-height:125%;font-family:sans-serif;-inkscape-font-specification:sans-serif"
         id="path60467" />
      <path
         d="m 80.309633,118.62021 q 0,-0.55897 0.310748,-0.82803 0.259588,-0.22359 0.632865,-0.22359 0.414962,0 0.67834,0.27285 0.263377,0.27096 0.263377,0.75035 0,0.38843 -0.117477,0.61202 -0.115583,0.22169 -0.33917,0.34485 -0.221693,0.12317 -0.48507,0.12317 -0.422542,0 -0.684025,-0.27096 -0.259588,-0.27096 -0.259588,-0.78066 z m 0.350539,0 q 0,0.38654 0.168637,0.57981 0.168638,0.19137 0.424437,0.19137 0.253903,0 0.422541,-0.19327 0.168638,-0.19327 0.168638,-0.58928 0,-0.37328 -0.170533,-0.56465 -0.168637,-0.19327 -0.420646,-0.19327 -0.255799,0 -0.424437,0.19137 -0.168637,0.19138 -0.168637,0.57792 z"
         style="line-height:125%;font-family:sans-serif;-inkscape-font-specification:sans-serif"
         id="path60469" />
      <path
         d="m 83.913551,119.62635 v -0.29559 q -0.234956,0.34107 -0.638549,0.34107 -0.178112,0 -0.333486,-0.0682 -0.153479,-0.0682 -0.229271,-0.17053 -0.0739,-0.10421 -0.104214,-0.2539 -0.02084,-0.10043 -0.02084,-0.31833 v -1.24678 h 0.341065 v 1.11604 q 0,0.26717 0.02084,0.36001 0.03221,0.13453 0.136426,0.21222 0.104215,0.0758 0.257694,0.0758 0.153479,0 0.28801,-0.0777 0.134531,-0.0796 0.189481,-0.21411 0.05684,-0.13642 0.05684,-0.39412 v -1.07814 h 0.341064 v 2.01228 z"
         style="line-height:125%;font-family:sans-serif;-inkscape-font-specification:sans-serif"
         id="path60471" />
      <path
         d="m 85.497608,119.32129 0.04927,0.30127 q -0.144005,0.0303 -0.257693,0.0303 -0.185691,0 -0.288011,-0.0587 -0.102319,-0.0587 -0.144005,-0.15348 -0.04169,-0.0966 -0.04169,-0.40359 v -1.15773 h -0.250115 v -0.26527 h 0.250115 v -0.49834 l 0.33917,-0.20463 v 0.70297 h 0.342959 v 0.26527 h -0.342959 v 1.17667 q 0,0.1459 0.01705,0.18759 0.01895,0.0417 0.05874,0.0663 0.04169,0.0246 0.117478,0.0246 0.05684,0 0.149689,-0.0133 z"
         style="line-height:125%;font-family:sans-serif;-inkscape-font-specification:sans-serif"
         id="path60473" />
    </g>
    <path
       id="path11818"
       style="fill:none;fill-opacity:0.5;stroke:#000000;stroke-width:0.5;stroke-linecap:round;stroke-linejoin:round;stroke-dasharray:none"
       d="m 40.79719,98.237462 c 0.55229,0 1,0.44772 1,1 0,0.55229 -0.44771,0.999998 -1,0.999998 -0.55228,0 -1,-0.447708 -1,-0.999998 0,-0.55228 0.44772,-1 1,-1 z" />
    <path
       id="path11820"
       style="fill:none;fill-opacity:0.5;stroke:#000000;stroke-width:0.5;stroke-linecap:round;stroke-linejoin:round;stroke-dasharray:none"
       d="m 40.79719,136.23746 c 0.552285,0 1,0.44772 1,1 0,0.55229 -0.447715,1 -1,1 -0.552285,0 -1,-0.44771 -1,-1 0,-0.55228 0.447715,-1 1,-1 z" />
    <path
       style="fill:none;stroke:#000000;stroke-width:0.4;stroke-linecap:butt;stroke-linejoin:miter;stroke-dasharray:none;stroke-opacity:1"
       d="m 41.79719,137.23746 h 14"
       id="path11822" />
    <path
       id="path11826"
       style="fill:none;fill-opacity:0.5;stroke:#000000;stroke-width:0.5;stroke-linecap:round;stroke-linejoin:round;stroke-dasharray:none"
       d="m 70.79719,138.23746 a 1,1 0 0 1 -1,-1 1,1 0 0 1 1,-1 1,1 0 0 1 1,1 1,1 0 0 1 -1,1 z" />
    <path
       id="path11828"
       style="fill:none;fill-opacity:0.5;stroke:#000000;stroke-width:0.5;stroke-linecap:round;stroke-linejoin:round;stroke-dasharray:none"
       d="m 70.797187,119.23747 a 1,1 0 0 1 -1,-1 1,1 0 0 1 1,-1 1,1 0 0 1 1,1 1,1 0 0 1 -1,1 z" />
    <path
       style="fill:none;stroke:#000000;stroke-width:0.4;stroke-linecap:butt;stroke-linejoin:miter;stroke-dasharray:none;stroke-opacity:1"
       d="m 69.797187,118.23747 h -14"
       id="path11830" />
    <path
       id="path11834"
       style="fill:#000000;fill-opacity:1;stroke:none;stroke-width:1.04298;stroke-linecap:butt;stroke-linejoin:miter;stroke-miterlimit:4;stroke-dasharray:none;stroke-opacity:1"
       d="m 55.79719,118.23746 h 0.89999 m 0,0 c 0,-0.49703 -0.40293,-0.89996 -0.89999,-0.89996 -0.49702,0 -0.90001,0.40293 -0.90001,0.89996 0,0.49703 0.40293,0.89997 0.89995,0.89997 0.49706,0 0.90005,-0.40294 0.90005,-0.89997 z" />
    <g
       aria-label="P1"
       id="text11838"
       style="font-size:3.88056px;line-height:125%;font-family:Sans;-inkscape-font-specification:Sans;letter-spacing:0px;word-spacing:0px;stroke:#000000;stroke-width:0">
      <path
         d="m 46.062544,108.23746 v -2.77779 h 1.047827 q 0.276641,0 0.422541,0.0265 0.204639,0.0341 0.34296,0.13074 0.13832,0.0947 0.221692,0.26717 0.08527,0.17243 0.08527,0.37896 0,0.35433 -0.225482,0.60065 -0.225481,0.24443 -0.814766,0.24443 h -0.712446 v 1.12931 z m 0.367592,-1.45711 h 0.718131 q 0.356223,0 0.505913,-0.13263 0.149689,-0.13264 0.149689,-0.37328 0,-0.17432 -0.08906,-0.29748 -0.08716,-0.12506 -0.231166,-0.16485 -0.09284,-0.0246 -0.342959,-0.0246 h -0.710552 z"
         style="line-height:125%;font-family:sans-serif;-inkscape-font-specification:sans-serif"
         id="path60434" />
      <path
         d="m 49.797204,108.23746 h -0.341065 v -2.17334 q -0.123163,0.11747 -0.324012,0.23495 -0.198954,0.11748 -0.358118,0.17622 v -0.3297 q 0.286116,-0.13453 0.500228,-0.3259 0.214113,-0.19138 0.303169,-0.37139 h 0.219798 z"
         style="line-height:125%;font-family:sans-serif;-inkscape-font-specification:sans-serif"
         id="path60436" />
    </g>
    <g
       aria-label="DC in"
       id="text11842"
       style="font-size:3.88056px;line-height:125%;font-family:Sans;-inkscape-font-specification:Sans;letter-spacing:0px;word-spacing:0px;stroke:#000000;stroke-width:0">
      <path
         d="m 28.660442,100.62635 v -2.777783 h 0.956876 q 0.324012,0 0.494544,0.03979 0.238746,0.05495 0.407383,0.198954 0.219798,0.185691 0.327802,0.475596 0.109898,0.28801 0.109898,0.659392 0,0.316433 -0.0739,0.560862 -0.0739,0.244428 -0.18948,0.405488 -0.115584,0.15916 -0.253904,0.25201 -0.136426,0.091 -0.331591,0.13832 -0.19327,0.0474 -0.445279,0.0474 z m 0.367592,-0.3278 h 0.593074 q 0.274747,0 0.430121,-0.0512 0.157269,-0.0512 0.250114,-0.14401 0.130741,-0.130737 0.202744,-0.350535 0.0739,-0.221692 0.0739,-0.536229 0,-0.435805 -0.144005,-0.668866 -0.14211,-0.234956 -0.346749,-0.314538 -0.147795,-0.05684 -0.475596,-0.05684 h -0.5836 z"
         style="line-height:125%;font-family:sans-serif;-inkscape-font-specification:sans-serif"
         id="path60425" />
      <path
         d="m 33.444824,99.652421 0.367592,0.09284 q -0.115583,0.452854 -0.416857,0.691604 -0.299379,0.23685 -0.733289,0.23685 -0.449069,0 -0.731395,-0.1819 -0.280431,-0.1838 -0.428226,-0.530546 -0.1459,-0.346749 -0.1459,-0.744658 0,-0.433911 0.164848,-0.756027 0.166743,-0.324012 0.471807,-0.490755 0.306958,-0.168637 0.67455,-0.168637 0.416857,0 0.701078,0.212218 0.28422,0.212218 0.396014,0.596863 l -0.361908,0.08527 q -0.09663,-0.303168 -0.280431,-0.441489 -0.183796,-0.138321 -0.462332,-0.138321 -0.320222,0 -0.53623,0.153479 -0.214113,0.15348 -0.301274,0.413068 -0.08716,0.257693 -0.08716,0.53244 0,0.354328 0.10232,0.619601 0.104214,0.263378 0.322116,0.394118 0.217903,0.13074 0.471807,0.13074 0.308853,0 0.522966,-0.17811 0.214113,-0.17811 0.289905,-0.528649 z"
         style="line-height:125%;font-family:sans-serif;-inkscape-font-specification:sans-serif"
         id="path60427" />
      <path
         d="m 35.301732,98.240791 v -0.392224 h 0.341065 v 0.392224 z m 0,2.385559 v -2.012282 h 0.341065 v 2.012282 z"
         style="line-height:125%;font-family:sans-serif;-inkscape-font-specification:sans-serif"
         id="path60429" />
      <path
         d="m 36.161974,100.62635 v -2.012282 h 0.306958 v 0.286115 q 0.221692,-0.33159 0.640444,-0.33159 0.181901,0 0.333486,0.06632 0.153479,0.06442 0.229271,0.170532 0.07579,0.106109 0.106109,0.252009 0.01895,0.09474 0.01895,0.331591 v 1.237307 h -0.341065 v -1.224043 q 0,-0.208429 -0.03979,-0.310748 -0.03979,-0.104215 -0.14211,-0.164848 -0.100425,-0.06253 -0.23685,-0.06253 -0.217903,0 -0.377067,0.138321 -0.157268,0.138321 -0.157268,0.524861 v 1.098986 z"
         style="line-height:125%;font-family:sans-serif;-inkscape-font-specification:sans-serif"
         id="path60431" />
    </g>
    <g
       aria-label="GND"
       id="text11846"
       style="font-size:3.88056px;line-height:125%;font-family:Sans;-inkscape-font-specification:Sans;letter-spacing:0px;word-spacing:0px;stroke:#000000;stroke-width:0">
      <path
         d="m 53.084792,145.97309 v -0.3259 l 1.176673,-0.002 v 1.03078 q -0.270957,0.216 -0.558967,0.3259 -0.28801,0.10801 -0.591179,0.10801 -0.409278,0 -0.744658,-0.17433 -0.333486,-0.17621 -0.504018,-0.5078 -0.170533,-0.33159 -0.170533,-0.74087 0,-0.40549 0.168638,-0.75603 0.170532,-0.35243 0.48886,-0.52296 0.318327,-0.17054 0.733289,-0.17054 0.301274,0 0.543809,0.0985 0.24443,0.0966 0.38275,0.27096 0.138321,0.17432 0.210324,0.45475 l -0.331591,0.0909 q -0.06253,-0.21221 -0.155374,-0.33348 -0.09285,-0.12127 -0.265273,-0.19327 -0.172427,-0.0739 -0.38275,-0.0739 -0.252009,0 -0.435805,0.0777 -0.183796,0.0758 -0.297485,0.20085 -0.111793,0.12505 -0.174322,0.27474 -0.106109,0.2577 -0.106109,0.55897 0,0.37138 0.126952,0.6215 0.128847,0.25011 0.373277,0.37138 0.244429,0.12127 0.519176,0.12127 0.238746,0 0.466122,-0.0909 0.227377,-0.0928 0.344855,-0.19706 v -0.51729 z"
         style="line-height:125%;font-family:sans-serif;-inkscape-font-specification:sans-serif"
         id="path60458" />
      <path
         d="m 54.79959,147.06261 v -2.77779 h 0.377066 l 1.459,2.18092 v -2.18092 h 0.352433 v 2.77779 h -0.377066 l -1.458999,-2.18282 v 2.18282 z"
         style="line-height:125%;font-family:sans-serif;-inkscape-font-specification:sans-serif"
         id="path60460" />
      <path
         d="m 57.605796,147.06261 v -2.77779 h 0.956876 q 0.324012,0 0.494544,0.0398 0.238745,0.0549 0.407383,0.19896 0.219797,0.18569 0.327801,0.47559 0.109899,0.28801 0.109899,0.6594 0,0.31643 -0.0739,0.56086 -0.0739,0.24443 -0.18948,0.40549 -0.115583,0.15916 -0.253904,0.25201 -0.136426,0.0909 -0.331591,0.13832 -0.19327,0.0474 -0.445279,0.0474 z m 0.367592,-0.3278 h 0.593074 q 0.274746,0 0.43012,-0.0512 0.157269,-0.0512 0.250114,-0.14401 0.130742,-0.13074 0.202745,-0.35054 0.0739,-0.22169 0.0739,-0.53623 0,-0.4358 -0.144005,-0.66886 -0.142111,-0.23496 -0.346749,-0.31454 -0.147795,-0.0568 -0.475596,-0.0568 h -0.5836 z"
         style="line-height:125%;font-family:sans-serif;-inkscape-font-specification:sans-serif"
         id="path60462" />
    </g>
    <path
       id="path11848"
       d="m 57.29719,132.23746 h -3 v -9 h 3 z"
       style="fill:#ffffff;fill-opacity:1;stroke:#000000;stroke-width:0.5;stroke-linecap:butt;stroke-linejoin:miter;stroke-miterlimit:4;stroke-dasharray:none;stroke-opacity:1" />
    <g
       aria-label="10k"
       id="text11852"
       style="font-size:3.88056px;line-height:125%;font-family:Sans;-inkscape-font-specification:Sans;letter-spacing:0px;word-spacing:0px;stroke:#000000;stroke-width:0">
      <path
         d="m 47.001442,113.02662 h -0.341065 v -2.17334 q -0.123162,0.11748 -0.324011,0.23495 -0.198955,0.11748 -0.358119,0.17622 v -0.3297 q 0.286116,-0.13453 0.500229,-0.3259 0.214113,-0.19138 0.303169,-0.37138 h 0.219797 z"
         style="line-height:125%;font-family:sans-serif;-inkscape-font-specification:sans-serif"
         id="path60439" />
      <path
         d="m 47.874947,111.65668 q 0,-0.49265 0.100424,-0.79203 0.10232,-0.30128 0.301274,-0.46423 0.20085,-0.16295 0.504018,-0.16295 0.223587,0 0.392225,0.0909 0.168638,0.0891 0.278536,0.25959 0.109899,0.16863 0.172427,0.41306 0.06253,0.24254 0.06253,0.65561 0,0.48885 -0.100425,0.79013 -0.100424,0.29938 -0.301274,0.46423 -0.198954,0.16295 -0.504018,0.16295 -0.401698,0 -0.63097,-0.28801 -0.274746,-0.34675 -0.274746,-1.1293 z m 0.350539,0 q 0,0.68402 0.159163,0.9114 0.161059,0.22548 0.396014,0.22548 0.234956,0 0.39412,-0.22738 0.161058,-0.22738 0.161058,-0.9095 0,-0.68592 -0.161058,-0.91141 -0.159164,-0.22548 -0.397909,-0.22548 -0.234956,0 -0.375172,0.19896 -0.176216,0.2539 -0.176216,0.93793 z"
         style="line-height:125%;font-family:sans-serif;-inkscape-font-specification:sans-serif"
         id="path60441" />
      <path
         d="m 50.129764,113.02662 v -2.77778 h 0.341065 v 1.58405 l 0.807187,-0.81855 h 0.441489 l -0.76929,0.74655 0.846977,1.26573 h -0.420646 l -0.665077,-1.02888 -0.24064,0.23117 v 0.79771 z"
         style="line-height:125%;font-family:sans-serif;-inkscape-font-specification:sans-serif"
         id="path60443" />
    </g>
    <g
       aria-label="R1"
       id="text11856"
       style="font-size:3.88056px;line-height:125%;font-family:Sans;-inkscape-font-specification:Sans;letter-spacing:0px;word-spacing:0px;stroke:#000000;stroke-width:0">
      <path
         d="m 47.854086,127.23746 v -2.77779 h 1.231623 q 0.371382,0 0.564652,0.0758 0.19327,0.0739 0.308853,0.26337 0.115583,0.18948 0.115583,0.41876 0,0.29559 -0.191375,0.49833 -0.191375,0.20274 -0.591179,0.25769 0.1459,0.0701 0.221692,0.13832 0.161058,0.1478 0.305064,0.36949 l 0.483175,0.75603 h -0.462333 l -0.367592,-0.57792 q -0.161058,-0.25011 -0.265272,-0.38275 -0.104215,-0.13264 -0.187586,-0.18569 -0.08148,-0.053 -0.166743,-0.0739 -0.06253,-0.0133 -0.204639,-0.0133 h -0.426331 v 1.23352 z m 0.367592,-1.55185 h 0.790134 q 0.252009,0 0.394119,-0.0512 0.142111,-0.053 0.216008,-0.16674 0.0739,-0.11558 0.0739,-0.25011 0,-0.19706 -0.144005,-0.32402 -0.14211,-0.12695 -0.450963,-0.12695 h -0.87919 z"
         style="line-height:125%;font-family:sans-serif;-inkscape-font-specification:sans-serif"
         id="path60446" />
      <path
         d="M 51.797175,127.23746 H 51.45611 v -2.17334 q -0.123162,0.11747 -0.324012,0.23495 -0.198954,0.11748 -0.358118,0.17622 v -0.3297 q 0.286116,-0.13453 0.500229,-0.3259 0.214113,-0.19138 0.303168,-0.37139 h 0.219798 z"
         style="line-height:125%;font-family:sans-serif;-inkscape-font-specification:sans-serif"
         id="path60448" />
    </g>
    <g
       aria-label="10k"
       id="text11860"
       style="font-size:3.88056px;line-height:125%;font-family:Sans;-inkscape-font-specification:Sans;letter-spacing:0px;word-spacing:0px;stroke:#000000;stroke-width:0">
      <path
         d="m 47.001442,132.02661 h -0.341065 v -2.17334 q -0.123162,0.11748 -0.324011,0.23496 -0.198955,0.11747 -0.358119,0.17621 v -0.32969 q 0.286116,-0.13453 0.500229,-0.32591 0.214113,-0.19137 0.303169,-0.37138 h 0.219797 z"
         style="line-height:125%;font-family:sans-serif;-inkscape-font-specification:sans-serif"
         id="path60451" />
      <path
         d="m 47.874947,130.65667 q 0,-0.49265 0.100424,-0.79203 0.10232,-0.30127 0.301274,-0.46423 0.20085,-0.16295 0.504018,-0.16295 0.223587,0 0.392225,0.0909 0.168638,0.0891 0.278536,0.25959 0.109899,0.16864 0.172427,0.41307 0.06253,0.24253 0.06253,0.6556 0,0.48886 -0.100425,0.79013 -0.100424,0.29938 -0.301274,0.46423 -0.198954,0.16295 -0.504018,0.16295 -0.401698,0 -0.63097,-0.28801 -0.274746,-0.34675 -0.274746,-1.1293 z m 0.350539,0 q 0,0.68402 0.159163,0.9114 0.161059,0.22548 0.396014,0.22548 0.234956,0 0.39412,-0.22738 0.161058,-0.22737 0.161058,-0.9095 0,-0.68592 -0.161058,-0.9114 -0.159164,-0.22549 -0.397909,-0.22549 -0.234956,0 -0.375172,0.19896 -0.176216,0.2539 -0.176216,0.93793 z"
         style="line-height:125%;font-family:sans-serif;-inkscape-font-specification:sans-serif"
         id="path60453" />
      <path
         d="m 50.129764,132.02661 v -2.77778 h 0.341065 v 1.58405 l 0.807187,-0.81855 h 0.441489 l -0.76929,0.74655 0.846977,1.26573 h -0.420646 l -0.665077,-1.02888 -0.24064,0.23117 v 0.79771 z"
         style="line-height:125%;font-family:sans-serif;-inkscape-font-specification:sans-serif"
         id="path60455" />
    </g>
    <path
       id="path11862"
       style="fill:#000000;fill-opacity:1;stroke:none;stroke-width:0.264583px;stroke-linecap:butt;stroke-linejoin:miter;stroke-opacity:1"
       d="m 35.79719,89.237732 v 3.99976 l 2.99538,-3.3e-4 c 0.0799,0 0.1022,0.0294 0.11749,0.0917 0.28868,1.30983 1.08788,2.10935 1.88713,2.9086 0.79883,-0.79883 1.5976,-1.5979 1.88667,-2.9065 0.0206,-0.064 0.0525,-0.0938 0.11322,-0.0938 l 3.00011,3.3e-4 v -4 z" />
    <path
       style="fill:#000000;fill-opacity:0.25;stroke:none;stroke-width:0.264583px;stroke-linecap:butt;stroke-linejoin:miter;stroke-opacity:1"
       d="m 45.79719,89.237492 h -10 v 4 h 10 z"
       id="path11864" />
    <g
       aria-label="5V"
       id="text11868"
       style="font-size:3.175px;line-height:100%;font-family:Sans;-inkscape-font-specification:Sans;letter-spacing:0px;word-spacing:0px;fill:#ffffff;stroke:#000000;stroke-width:0">
      <path
         d="m 38.927526,91.770024 0.434082,-0.04496 q 0.0186,0.147277 0.110071,0.234094 0.09147,0.08527 0.21084,0.08527 0.136426,0 0.230993,-0.110071 0.09457,-0.111621 0.09457,-0.334863 0,-0.20929 -0.09457,-0.313159 -0.09302,-0.10542 -0.243396,-0.10542 -0.187585,0 -0.336413,0.165881 l -0.353467,-0.05116 0.223242,-1.182873 h 1.151868 v 0.407727 h -0.821655 l -0.06821,0.386023 q 0.145727,-0.07286 0.297656,-0.07286 0.289905,0 0.491443,0.21084 0.201538,0.21084 0.201538,0.547253 0,0.280603 -0.162781,0.500745 -0.221692,0.300757 -0.615466,0.300757 -0.31471,0 -0.513147,-0.168982 -0.198438,-0.168982 -0.237195,-0.454236 z"
         style="font-weight:bold;font-family:sans-serif;-inkscape-font-specification:'sans-serif Bold'"
         id="path60420" />
      <path
         d="m 41.363036,92.354485 -0.812353,-2.27273 h 0.497644 l 0.575159,1.682068 0.556555,-1.682068 h 0.486792 l -0.813904,2.27273 z"
         style="font-weight:bold;font-family:sans-serif;-inkscape-font-specification:'sans-serif Bold'"
         id="path60422" />
    </g>
    <path
       style="fill:none;stroke:#000000;stroke-width:0.4;stroke-linecap:butt;stroke-linejoin:miter;stroke-dasharray:none;stroke-opacity:1"
       d="m 55.79719,113.23746 v 5"
       id="path34777-3" />
    <path
       id="path34779-6"
       d="m 54.29719,113.23746 h 3 v -9 h -3 z"
       style="fill:none;fill-opacity:1;stroke:#000000;stroke-width:0.5;stroke-linecap:butt;stroke-linejoin:miter;stroke-miterlimit:4;stroke-dasharray:none;stroke-opacity:1" />
    <path
       style="fill:none;stroke:#000000;stroke-width:0.4;stroke-linecap:butt;stroke-linejoin:miter;stroke-dasharray:none;stroke-opacity:1"
       d="m 52.79719,106.23746 6,6"
       id="path34741-7" />
    <path
       style="fill:#000000;fill-opacity:1;stroke:none;stroke-width:0.264583px;stroke-linecap:butt;stroke-linejoin:miter;stroke-opacity:1"
       d="m 52.36307,107.21763 1.41426,-1.41417 -1.98014,-0.566 z"
       id="path34745-5" />
    <path
       style="fill:none;stroke:#000000;stroke-width:0.4;stroke-linecap:butt;stroke-linejoin:miter;stroke-dasharray:none;stroke-opacity:1"
       d="m 41.79719,99.237462 h 14 v 4.999998"
       id="path22042" />
    <path
       style="fill:none;stroke:#000000;stroke-width:0.7;stroke-linecap:butt;stroke-linejoin:miter;stroke-miterlimit:4;stroke-dasharray:none;stroke-opacity:1"
       d="m 142.79719,180.23746 h 6"
       id="path17616" />
    <path
       id="path17618"
       style="fill:#000000;fill-opacity:1;stroke:none;stroke-width:1.04298;stroke-linecap:butt;stroke-linejoin:miter;stroke-miterlimit:4;stroke-dasharray:none;stroke-opacity:1"
       d="m 145.79719,175.23746 h 0.89999 m 0,0 c 0,-0.49703 -0.40293,-0.89996 -0.89999,-0.89996 -0.49702,0 -0.90001,0.40293 -0.90001,0.89996 0,0.49703 0.40293,0.89997 0.89995,0.89997 0.49706,0 0.90005,-0.40294 0.90005,-0.89997 z" />
    <path
       style="fill:none;stroke:#000000;stroke-width:0.4;stroke-linecap:butt;stroke-linejoin:miter;stroke-dasharray:none;stroke-opacity:1"
       d="m 145.79719,175.23746 v 5"
       id="path17620" />
    <path
       style="fill:none;stroke:#000000;stroke-width:0.4;stroke-linecap:butt;stroke-linejoin:miter;stroke-dasharray:none;stroke-opacity:1"
       d="m 130.79719,175.23746 h -15 v -57"
       id="path17624" />
    <g
       aria-label="DC outs"
       id="text17628"
       style="font-size:3.88056px;line-height:125%;font-family:Sans;-inkscape-font-specification:Sans;letter-spacing:0px;word-spacing:0px;stroke:#000000;stroke-width:0">
      <path
         d="m 154.01283,113.1901 v -2.77778 h 0.95688 q 0.32401,0 0.49454,0.0398 0.23875,0.0549 0.40739,0.19895 0.2198,0.18569 0.3278,0.4756 0.1099,0.28801 0.1099,0.65939 0,0.31643 -0.0739,0.56086 -0.0739,0.24443 -0.18948,0.40549 -0.11558,0.15917 -0.2539,0.25201 -0.13643,0.091 -0.33159,0.13832 -0.19327,0.0474 -0.44528,0.0474 z m 0.3676,-0.3278 h 0.59307 q 0.27475,0 0.43012,-0.0512 0.15727,-0.0512 0.25012,-0.144 0.13074,-0.13075 0.20274,-0.35054 0.0739,-0.2217 0.0739,-0.53623 0,-0.43581 -0.14401,-0.66887 -0.14211,-0.23495 -0.34675,-0.31454 -0.14779,-0.0568 -0.47559,-0.0568 h -0.5836 z"
         style="line-height:125%;font-family:sans-serif;-inkscape-font-specification:sans-serif"
         id="path60665" />
      <path
         d="m 158.79722,112.21617 0.36759,0.0928 q -0.11558,0.45286 -0.41686,0.6916 -0.29938,0.23685 -0.73329,0.23685 -0.44907,0 -0.73139,-0.1819 -0.28043,-0.1838 -0.42823,-0.53054 -0.1459,-0.34675 -0.1459,-0.74466 0,-0.43391 0.16485,-0.75603 0.16674,-0.32401 0.47181,-0.49075 0.30695,-0.16864 0.67455,-0.16864 0.41685,0 0.70107,0.21222 0.28422,0.21221 0.39602,0.59686 l -0.36191,0.0853 q -0.0966,-0.30317 -0.28043,-0.44149 -0.1838,-0.13832 -0.46233,-0.13832 -0.32023,0 -0.53623,0.15347 -0.21412,0.15348 -0.30128,0.41307 -0.0872,0.2577 -0.0872,0.53244 0,0.35433 0.10232,0.6196 0.10422,0.26338 0.32212,0.39412 0.2179,0.13074 0.4718,0.13074 0.30886,0 0.52297,-0.17811 0.21411,-0.17811 0.28991,-0.52865 z"
         style="line-height:125%;font-family:sans-serif;-inkscape-font-specification:sans-serif"
         id="path60667" />
      <path
         d="m 160.52528,112.18396 q 0,-0.55897 0.31075,-0.82803 0.25958,-0.22359 0.63286,-0.22359 0.41496,0 0.67834,0.27286 0.26338,0.27095 0.26338,0.75034 0,0.38843 -0.11748,0.61202 -0.11558,0.22169 -0.33917,0.34485 -0.22169,0.12317 -0.48507,0.12317 -0.42254,0 -0.68402,-0.27096 -0.25959,-0.27096 -0.25959,-0.78066 z m 0.35054,0 q 0,0.38654 0.16863,0.57981 0.16864,0.19138 0.42444,0.19138 0.2539,0 0.42254,-0.19327 0.16864,-0.19327 0.16864,-0.58929 0,-0.37327 -0.17053,-0.56465 -0.16864,-0.19327 -0.42065,-0.19327 -0.2558,0 -0.42444,0.19137 -0.16863,0.19138 -0.16863,0.57792 z"
         style="line-height:125%;font-family:sans-serif;-inkscape-font-specification:sans-serif"
         id="path60669" />
      <path
         d="m 164.1292,113.1901 v -0.29559 q -0.23496,0.34107 -0.63855,0.34107 -0.17812,0 -0.33349,-0.0682 -0.15348,-0.0682 -0.22927,-0.17053 -0.0739,-0.10421 -0.10421,-0.2539 -0.0208,-0.10043 -0.0208,-0.31833 v -1.24678 h 0.34107 v 1.11604 q 0,0.26717 0.0208,0.36001 0.0322,0.13453 0.13643,0.21222 0.10421,0.0758 0.25769,0.0758 0.15348,0 0.28801,-0.0777 0.13453,-0.0796 0.18948,-0.21412 0.0568,-0.13642 0.0568,-0.39412 v -1.07814 h 0.34107 v 2.01228 z"
         style="line-height:125%;font-family:sans-serif;-inkscape-font-specification:sans-serif"
         id="path60671" />
      <path
         d="m 165.71325,112.88504 0.0493,0.30127 q -0.14401,0.0303 -0.2577,0.0303 -0.18569,0 -0.28801,-0.0587 -0.10232,-0.0587 -0.144,-0.15348 -0.0417,-0.0966 -0.0417,-0.40359 v -1.15773 h -0.25011 v -0.26527 h 0.25011 v -0.49833 l 0.33917,-0.20464 v 0.70297 h 0.34296 v 0.26527 h -0.34296 v 1.17668 q 0,0.1459 0.0171,0.18758 0.0189,0.0417 0.0587,0.0663 0.0417,0.0246 0.11747,0.0246 0.0568,0 0.14969,-0.0133 z"
         style="line-height:125%;font-family:sans-serif;-inkscape-font-specification:sans-serif"
         id="path60673" />
      <path
         d="m 165.91031,112.58945 0.33728,-0.0531 q 0.0284,0.20275 0.15727,0.31075 0.13074,0.10801 0.3638,0.10801 0.23495,0 0.34864,-0.0947 0.11369,-0.0966 0.11369,-0.22549 0,-0.11558 -0.10042,-0.1819 -0.0701,-0.0455 -0.34865,-0.11558 -0.37517,-0.0947 -0.52107,-0.16295 -0.144,-0.0701 -0.2198,-0.19138 -0.0739,-0.12316 -0.0739,-0.27096 0,-0.13453 0.0606,-0.24822 0.0625,-0.11558 0.16864,-0.19137 0.0796,-0.0587 0.21601,-0.0985 0.13832,-0.0417 0.29558,-0.0417 0.23686,0 0.41497,0.0682 0.18,0.0682 0.26527,0.18569 0.0853,0.11558 0.11748,0.31075 l -0.33349,0.0455 q -0.0227,-0.15537 -0.13263,-0.24253 -0.10801,-0.0872 -0.30696,-0.0872 -0.23496,0 -0.33538,0.0777 -0.10043,0.0777 -0.10043,0.1819 0,0.0663 0.0417,0.11938 0.0417,0.0549 0.13074,0.0909 0.0512,0.0189 0.30127,0.0872 0.36191,0.0966 0.50402,0.15916 0.14401,0.0606 0.22548,0.17811 0.0815,0.11748 0.0815,0.2918 0,0.17053 -0.10042,0.32212 -0.0985,0.14969 -0.28612,0.23306 -0.18759,0.0815 -0.42444,0.0815 -0.39222,0 -0.59875,-0.16296 -0.20464,-0.16295 -0.26149,-0.48317 z"
         style="line-height:125%;font-family:sans-serif;-inkscape-font-specification:sans-serif"
         id="path60675" />
    </g>
    <path
       id="path17630"
       style="fill:none;fill-opacity:0.5;stroke:#000000;stroke-width:0.5;stroke-linecap:round;stroke-linejoin:round;stroke-dasharray:none"
       d="m 100.79719,98.237462 c 0.55229,0 1,0.44772 1,1 0,0.55229 -0.44771,0.999998 -1,0.999998 -0.55228,0 -1,-0.447708 -1,-0.999998 0,-0.55228 0.44772,-1 1,-1 z" />
    <path
       id="path17632"
       style="fill:none;fill-opacity:0.5;stroke:#000000;stroke-width:0.5;stroke-linecap:round;stroke-linejoin:round;stroke-dasharray:none"
       d="m 100.79719,174.23747 c 0.55229,0 1,0.44771 1,1 0,0.55228 -0.44771,1 -1,1 -0.55228,0 -0.999997,-0.44772 -0.999997,-1 0,-0.55229 0.447717,-1 0.999997,-1 z" />
    <path
       style="fill:none;stroke:#000000;stroke-width:0.4;stroke-linecap:butt;stroke-linejoin:miter;stroke-dasharray:none;stroke-opacity:1"
       d="m 101.79719,175.23747 h 14"
       id="path17634" />
    <path
       id="path17638"
       style="fill:none;fill-opacity:0.5;stroke:#000000;stroke-width:0.5;stroke-linecap:round;stroke-linejoin:round;stroke-dasharray:none"
       d="m 160.79719,176.23746 a 1,1 0 0 1 -1,-1 1,1 0 0 1 1,-1 1,1 0 0 1 1,1 1,1 0 0 1 -1,1 z" />
    <path
       id="path17640"
       style="fill:none;fill-opacity:0.5;stroke:#000000;stroke-width:0.5;stroke-linecap:round;stroke-linejoin:round;stroke-dasharray:none"
       d="m 160.79719,119.23746 a 1,1 0 0 1 -1,-1 1,1 0 0 1 1,-1 1,1 0 0 1 1,1 1,1 0 0 1 -1,1 z" />
    <path
       style="fill:none;stroke:#000000;stroke-width:0.4;stroke-linecap:butt;stroke-linejoin:miter;stroke-dasharray:none;stroke-opacity:1"
       d="m 159.79719,118.23746 h -44"
       id="path17642" />
    <path
       id="path17646"
       style="fill:#000000;fill-opacity:1;stroke:none;stroke-width:1.04298;stroke-linecap:butt;stroke-linejoin:miter;stroke-miterlimit:4;stroke-dasharray:none;stroke-opacity:1"
       d="m 115.79719,118.23746 h 0.89999 m 0,0 c 0,-0.49703 -0.40293,-0.89996 -0.89999,-0.89996 -0.49702,0 -0.90001,0.40293 -0.90001,0.89996 0,0.49703 0.40293,0.89997 0.89995,0.89997 0.49706,0 0.90005,-0.40294 0.90005,-0.89997 z" />
    <g
       aria-label="P1"
       id="text17650"
       style="font-size:3.88056px;line-height:125%;font-family:Sans;-inkscape-font-specification:Sans;letter-spacing:0px;word-spacing:0px;stroke:#000000;stroke-width:0">
      <path
         d="m 106.06254,108.23746 v -2.77779 h 1.04783 q 0.27664,0 0.42254,0.0265 0.20464,0.0341 0.34296,0.13074 0.13832,0.0947 0.22169,0.26717 0.0853,0.17243 0.0853,0.37896 0,0.35433 -0.22549,0.60065 -0.22548,0.24443 -0.81476,0.24443 h -0.71245 v 1.12931 z m 0.36759,-1.45711 h 0.71813 q 0.35623,0 0.50592,-0.13263 0.14969,-0.13264 0.14969,-0.37328 0,-0.17432 -0.0891,-0.29748 -0.0872,-0.12506 -0.23117,-0.16485 -0.0928,-0.0246 -0.34296,-0.0246 h -0.71055 z"
         style="line-height:125%;font-family:sans-serif;-inkscape-font-specification:sans-serif"
         id="path60511" />
      <path
         d="m 109.7972,108.23746 h -0.34107 v -2.17334 q -0.12316,0.11747 -0.32401,0.23495 -0.19895,0.11748 -0.35811,0.17622 v -0.3297 q 0.28611,-0.13453 0.50022,-0.3259 0.21412,-0.19138 0.30317,-0.37139 h 0.2198 z"
         style="line-height:125%;font-family:sans-serif;-inkscape-font-specification:sans-serif"
         id="path60513" />
    </g>
    <g
       aria-label="DC in"
       id="text17654"
       style="font-size:3.88056px;line-height:125%;font-family:Sans;-inkscape-font-specification:Sans;letter-spacing:0px;word-spacing:0px;stroke:#000000;stroke-width:0">
      <path
         d="m 88.66044,100.62635 v -2.777783 h 0.956877 q 0.324011,0 0.494544,0.03979 0.238745,0.05495 0.407383,0.198954 0.219797,0.185691 0.327801,0.475596 0.109898,0.28801 0.109898,0.659392 0,0.316433 -0.0739,0.560862 -0.0739,0.244428 -0.18948,0.405488 -0.115583,0.15916 -0.253904,0.25201 -0.136426,0.091 -0.331591,0.13832 -0.19327,0.0474 -0.445279,0.0474 z m 0.367592,-0.3278 h 0.593074 q 0.274747,0 0.430121,-0.0512 0.157269,-0.0512 0.250114,-0.14401 0.130742,-0.130737 0.202744,-0.350535 0.0739,-0.221692 0.0739,-0.536229 0,-0.435805 -0.144006,-0.668866 -0.14211,-0.234956 -0.346749,-0.314538 -0.147795,-0.05684 -0.475596,-0.05684 h -0.5836 z"
         style="line-height:125%;font-family:sans-serif;-inkscape-font-specification:sans-serif"
         id="path60502" />
      <path
         d="m 93.444822,99.652421 0.367592,0.09284 q -0.115583,0.452854 -0.416857,0.691604 -0.299379,0.23685 -0.733289,0.23685 -0.449069,0 -0.731395,-0.1819 -0.280431,-0.1838 -0.428226,-0.530546 -0.1459,-0.346749 -0.1459,-0.744658 0,-0.433911 0.164848,-0.756027 0.166743,-0.324012 0.471807,-0.490755 0.306958,-0.168637 0.67455,-0.168637 0.416857,0 0.701078,0.212218 0.28422,0.212218 0.396014,0.596863 l -0.361908,0.08527 q -0.09664,-0.303168 -0.280431,-0.441489 -0.183796,-0.138321 -0.462332,-0.138321 -0.320222,0 -0.53623,0.153479 -0.214113,0.15348 -0.301274,0.413068 -0.08716,0.257693 -0.08716,0.53244 0,0.354328 0.10232,0.619601 0.104214,0.263378 0.322116,0.394118 0.217903,0.13074 0.471807,0.13074 0.308853,0 0.522966,-0.17811 0.214113,-0.17811 0.289905,-0.528649 z"
         style="line-height:125%;font-family:sans-serif;-inkscape-font-specification:sans-serif"
         id="path60504" />
      <path
         d="m 95.30173,98.240791 v -0.392224 h 0.341065 v 0.392224 z m 0,2.385559 v -2.012282 h 0.341065 v 2.012282 z"
         style="line-height:125%;font-family:sans-serif;-inkscape-font-specification:sans-serif"
         id="path60506" />
      <path
         d="m 96.161972,100.62635 v -2.012282 h 0.306958 v 0.286115 q 0.221692,-0.33159 0.640444,-0.33159 0.181901,0 0.333486,0.06632 0.153479,0.06442 0.229271,0.170532 0.07579,0.106109 0.106109,0.252009 0.01895,0.09474 0.01895,0.331591 v 1.237307 h -0.341065 v -1.224043 q 0,-0.208429 -0.03979,-0.310748 -0.03979,-0.104215 -0.142111,-0.164848 -0.100424,-0.06253 -0.23685,-0.06253 -0.217903,0 -0.377067,0.138321 -0.157268,0.138321 -0.157268,0.524861 v 1.098986 z"
         style="line-height:125%;font-family:sans-serif;-inkscape-font-specification:sans-serif"
         id="path60508" />
    </g>
    <g
       aria-label="GND"
       id="text17658"
       style="font-size:3.88056px;line-height:125%;font-family:Sans;-inkscape-font-specification:Sans;letter-spacing:0px;word-spacing:0px;stroke:#000000;stroke-width:0">
      <path
         d="m 143.08473,183.97308 v -0.32591 l 1.17668,-0.002 v 1.03077 q -0.27096,0.21601 -0.55897,0.32591 -0.28801,0.108 -0.59118,0.108 -0.40928,0 -0.74466,-0.17432 -0.33348,-0.17622 -0.50401,-0.50781 -0.17054,-0.33159 -0.17054,-0.74087 0,-0.40548 0.16864,-0.75602 0.17053,-0.35244 0.48886,-0.52297 0.31833,-0.17053 0.73329,-0.17053 0.30127,0 0.54381,0.0985 0.24443,0.0966 0.38275,0.27095 0.13832,0.17433 0.21032,0.45476 l -0.33159,0.0909 q -0.0625,-0.21222 -0.15537,-0.33349 -0.0929,-0.12126 -0.26527,-0.19327 -0.17243,-0.0739 -0.38276,-0.0739 -0.252,0 -0.4358,0.0777 -0.1838,0.0758 -0.29748,0.20085 -0.1118,0.12506 -0.17433,0.27475 -0.10611,0.25769 -0.10611,0.55897 0,0.37138 0.12696,0.62149 0.12884,0.25012 0.37327,0.37138 0.24443,0.12127 0.51918,0.12127 0.23874,0 0.46612,-0.0909 0.22738,-0.0928 0.34486,-0.19706 v -0.51728 z"
         style="line-height:125%;font-family:sans-serif;-inkscape-font-specification:sans-serif"
         id="path60583" />
      <path
         d="m 144.79953,185.06259 v -2.77778 h 0.37707 l 1.459,2.18092 v -2.18092 h 0.35243 v 2.77778 h -0.37706 l -1.459,-2.18281 v 2.18281 z"
         style="line-height:125%;font-family:sans-serif;-inkscape-font-specification:sans-serif"
         id="path60585" />
      <path
         d="m 147.60574,185.06259 v -2.77778 h 0.95687 q 0.32402,0 0.49455,0.0398 0.23874,0.0549 0.40738,0.19895 0.2198,0.18569 0.3278,0.4756 0.1099,0.28801 0.1099,0.65939 0,0.31643 -0.0739,0.56086 -0.0739,0.24443 -0.18948,0.40549 -0.11558,0.15917 -0.2539,0.25201 -0.13643,0.0909 -0.33159,0.13832 -0.19327,0.0474 -0.44528,0.0474 z m 0.36759,-0.3278 h 0.59307 q 0.27475,0 0.43013,-0.0512 0.15726,-0.0512 0.25011,-0.144 0.13074,-0.13075 0.20274,-0.35054 0.0739,-0.2217 0.0739,-0.53623 0,-0.43581 -0.144,-0.66887 -0.14211,-0.23495 -0.34675,-0.31454 -0.1478,-0.0568 -0.4756,-0.0568 h -0.5836 z"
         style="line-height:125%;font-family:sans-serif;-inkscape-font-specification:sans-serif"
         id="path60587" />
    </g>
    <path
       id="path17660"
       d="m 117.29719,132.23746 h -3 v -9 h 3 z"
       style="fill:#ffffff;fill-opacity:1;stroke:#000000;stroke-width:0.5;stroke-linecap:butt;stroke-linejoin:miter;stroke-miterlimit:4;stroke-dasharray:none;stroke-opacity:1" />
    <g
       aria-label="10k"
       id="text17664"
       style="font-size:3.88056px;line-height:125%;font-family:Sans;-inkscape-font-specification:Sans;letter-spacing:0px;word-spacing:0px;stroke:#000000;stroke-width:0">
      <path
         d="m 107.00144,113.02662 h -0.34107 v -2.17334 q -0.12316,0.11748 -0.32401,0.23495 -0.19895,0.11748 -0.35812,0.17622 v -0.3297 q 0.28612,-0.13453 0.50023,-0.3259 0.21411,-0.19138 0.30317,-0.37138 h 0.2198 z"
         style="line-height:125%;font-family:sans-serif;-inkscape-font-specification:sans-serif"
         id="path60516" />
      <path
         d="m 107.87494,111.65668 q 0,-0.49265 0.10043,-0.79203 0.10232,-0.30128 0.30127,-0.46423 0.20085,-0.16295 0.50402,-0.16295 0.22359,0 0.39222,0.0909 0.16864,0.0891 0.27854,0.25959 0.1099,0.16863 0.17243,0.41306 0.0625,0.24254 0.0625,0.65561 0,0.48885 -0.10043,0.79013 -0.10042,0.29938 -0.30127,0.46423 -0.19896,0.16295 -0.50402,0.16295 -0.4017,0 -0.63097,-0.28801 -0.27475,-0.34675 -0.27475,-1.1293 z m 0.35054,0 q 0,0.68402 0.15917,0.9114 0.16105,0.22548 0.39601,0.22548 0.23496,0 0.39412,-0.22738 0.16106,-0.22738 0.16106,-0.9095 0,-0.68592 -0.16106,-0.91141 -0.15916,-0.22548 -0.39791,-0.22548 -0.23496,0 -0.37517,0.19896 -0.17622,0.2539 -0.17622,0.93793 z"
         style="line-height:125%;font-family:sans-serif;-inkscape-font-specification:sans-serif"
         id="path60518" />
      <path
         d="m 110.12976,113.02662 v -2.77778 h 0.34107 v 1.58405 l 0.80718,-0.81855 h 0.44149 l -0.76929,0.74655 0.84698,1.26573 h -0.42065 l -0.66507,-1.02888 -0.24064,0.23117 v 0.79771 z"
         style="line-height:125%;font-family:sans-serif;-inkscape-font-specification:sans-serif"
         id="path60520" />
    </g>
    <g
       aria-label="R1"
       id="text17668"
       style="font-size:3.88056px;line-height:125%;font-family:Sans;-inkscape-font-specification:Sans;letter-spacing:0px;word-spacing:0px;stroke:#000000;stroke-width:0">
      <path
         d="m 107.3463,127.23746 v -2.77779 h 1.23162 q 0.37139,0 0.56466,0.0758 0.19327,0.0739 0.30885,0.26337 0.11558,0.18948 0.11558,0.41876 0,0.29559 -0.19137,0.49833 -0.19138,0.20274 -0.59118,0.25769 0.1459,0.0701 0.22169,0.13832 0.16106,0.1478 0.30506,0.36949 l 0.48318,0.75603 h -0.46233 l -0.3676,-0.57792 q -0.16105,-0.25011 -0.26527,-0.38275 -0.10421,-0.13264 -0.18758,-0.18569 -0.0815,-0.053 -0.16675,-0.0739 -0.0625,-0.0133 -0.20464,-0.0133 h -0.42633 v 1.23352 z m 0.36759,-1.55185 h 0.79014 q 0.25201,0 0.39412,-0.0512 0.14211,-0.053 0.216,-0.16674 0.0739,-0.11558 0.0739,-0.25011 0,-0.19706 -0.144,-0.32402 -0.14211,-0.12695 -0.45097,-0.12695 h -0.87919 z"
         style="line-height:125%;font-family:sans-serif;-inkscape-font-specification:sans-serif"
         id="path60523" />
      <path
         d="m 111.28939,127.23746 h -0.34107 v -2.17334 q -0.12316,0.11747 -0.32401,0.23495 -0.19895,0.11748 -0.35812,0.17622 v -0.3297 q 0.28612,-0.13453 0.50023,-0.3259 0.21412,-0.19138 0.30317,-0.37139 h 0.2198 z"
         style="line-height:125%;font-family:sans-serif;-inkscape-font-specification:sans-serif"
         id="path60525" />
    </g>
    <g
       aria-label="10k"
       id="text17672"
       style="font-size:3.88056px;line-height:125%;font-family:Sans;-inkscape-font-specification:Sans;letter-spacing:0px;word-spacing:0px;stroke:#000000;stroke-width:0">
      <path
         d="m 107.00144,132.02661 h -0.34107 v -2.17334 q -0.12316,0.11748 -0.32401,0.23496 -0.19895,0.11747 -0.35812,0.17621 v -0.32969 q 0.28612,-0.13453 0.50023,-0.32591 0.21411,-0.19137 0.30317,-0.37138 h 0.2198 z"
         style="line-height:125%;font-family:sans-serif;-inkscape-font-specification:sans-serif"
         id="path60528" />
      <path
         d="m 107.87494,130.65667 q 0,-0.49265 0.10043,-0.79203 0.10232,-0.30127 0.30127,-0.46423 0.20085,-0.16295 0.50402,-0.16295 0.22359,0 0.39222,0.0909 0.16864,0.0891 0.27854,0.25959 0.1099,0.16864 0.17243,0.41307 0.0625,0.24253 0.0625,0.6556 0,0.48886 -0.10043,0.79013 -0.10042,0.29938 -0.30127,0.46423 -0.19896,0.16295 -0.50402,0.16295 -0.4017,0 -0.63097,-0.28801 -0.27475,-0.34675 -0.27475,-1.1293 z m 0.35054,0 q 0,0.68402 0.15917,0.9114 0.16105,0.22548 0.39601,0.22548 0.23496,0 0.39412,-0.22738 0.16106,-0.22737 0.16106,-0.9095 0,-0.68592 -0.16106,-0.9114 -0.15916,-0.22549 -0.39791,-0.22549 -0.23496,0 -0.37517,0.19896 -0.17622,0.2539 -0.17622,0.93793 z"
         style="line-height:125%;font-family:sans-serif;-inkscape-font-specification:sans-serif"
         id="path60530" />
      <path
         d="m 110.12976,132.02661 v -2.77778 h 0.34107 v 1.58405 l 0.80718,-0.81855 h 0.44149 l -0.76929,0.74655 0.84698,1.26573 h -0.42065 l -0.66507,-1.02888 -0.24064,0.23117 v 0.79771 z"
         style="line-height:125%;font-family:sans-serif;-inkscape-font-specification:sans-serif"
         id="path60532" />
    </g>
    <path
       id="path17674"
       style="fill:#000000;fill-opacity:1;stroke:none;stroke-width:0.264583px;stroke-linecap:butt;stroke-linejoin:miter;stroke-opacity:1"
       d="m 95.79719,89.237732 v 3.99976 l 2.99538,-3.3e-4 c 0.0799,0 0.1022,0.0294 0.11749,0.0917 0.28868,1.30983 1.08788,2.10935 1.88713,2.9086 0.79883,-0.79883 1.5976,-1.5979 1.88667,-2.9065 0.0206,-0.064 0.0525,-0.0938 0.11322,-0.0938 l 3.00011,3.3e-4 v -4 z" />
    <path
       style="fill:#000000;fill-opacity:0.25;stroke:none;stroke-width:0.264583px;stroke-linecap:butt;stroke-linejoin:miter;stroke-opacity:1"
       d="m 105.79719,89.237492 h -10 v 4 h 10 z"
       id="path17676" />
    <g
       aria-label="5V"
       id="text17680"
       style="font-size:3.175px;line-height:100%;font-family:Sans;-inkscape-font-specification:Sans;letter-spacing:0px;word-spacing:0px;fill:#ffffff;stroke:#000000;stroke-width:0">
      <path
         d="m 98.927522,91.770024 0.434082,-0.04496 q 0.0186,0.147277 0.110071,0.234094 0.09147,0.08527 0.21084,0.08527 0.136426,0 0.230994,-0.110071 0.09457,-0.111621 0.09457,-0.334863 0,-0.20929 -0.09457,-0.313159 -0.09302,-0.10542 -0.243396,-0.10542 -0.187586,0 -0.336414,0.165881 l -0.353467,-0.05116 0.223242,-1.182873 h 1.151866 v 0.407727 h -0.821653 l -0.06821,0.386023 q 0.145727,-0.07286 0.297656,-0.07286 0.2899,0 0.49144,0.21084 0.20154,0.21084 0.20154,0.547253 0,0.280603 -0.16278,0.500745 -0.22169,0.300757 -0.615466,0.300757 -0.314709,0 -0.513147,-0.168982 -0.198437,-0.168982 -0.237195,-0.454236 z"
         style="font-weight:bold;font-family:sans-serif;-inkscape-font-specification:'sans-serif Bold'"
         id="path60497" />
      <path
         d="m 101.36303,92.354485 -0.81235,-2.27273 h 0.49764 l 0.57516,1.682068 0.55656,-1.682068 h 0.48679 l -0.8139,2.27273 z"
         style="font-weight:bold;font-family:sans-serif;-inkscape-font-specification:'sans-serif Bold'"
         id="path60499" />
    </g>
    <path
       style="fill:none;stroke:#000000;stroke-width:0.4;stroke-linecap:butt;stroke-linejoin:miter;stroke-dasharray:none;stroke-opacity:1"
       d="m 115.79719,113.23746 v 5"
       id="path17682" />
    <path
       id="path17684"
       d="m 114.29719,113.23746 h 3 v -9 h -3 z"
       style="fill:none;fill-opacity:1;stroke:#000000;stroke-width:0.5;stroke-linecap:butt;stroke-linejoin:miter;stroke-miterlimit:4;stroke-dasharray:none;stroke-opacity:1" />
    <path
       style="fill:none;stroke:#000000;stroke-width:0.4;stroke-linecap:butt;stroke-linejoin:miter;stroke-dasharray:none;stroke-opacity:1"
       d="m 112.79719,106.23746 6,6"
       id="path17686" />
    <path
       style="fill:#000000;fill-opacity:1;stroke:none;stroke-width:0.264583px;stroke-linecap:butt;stroke-linejoin:miter;stroke-opacity:1"
       d="m 112.36307,107.21763 1.41426,-1.41417 -1.98014,-0.566 z"
       id="path17688" />
    <path
       style="fill:none;stroke:#000000;stroke-width:0.4;stroke-linecap:butt;stroke-linejoin:miter;stroke-dasharray:none;stroke-opacity:1"
       d="m 101.79719,99.237462 h 14 v 4.999998"
       id="path17690" />
    <path
       style="fill:none;stroke:#000000;stroke-width:0.4;stroke-linecap:butt;stroke-linejoin:miter;stroke-dasharray:none;stroke-opacity:1"
       d="m 159.79719,137.23746 h -29 v -19"
       id="path20133" />
    <path
       id="path20143"
       d="m 132.29719,132.23746 h -3 v -9 h 3 z"
       style="fill:#ffffff;fill-opacity:1;stroke:#000000;stroke-width:0.5;stroke-linecap:butt;stroke-linejoin:miter;stroke-miterlimit:4;stroke-dasharray:none;stroke-opacity:1" />
    <g
       aria-label="R2"
       id="text20147"
       style="font-size:3.88056px;line-height:125%;font-family:Sans;-inkscape-font-specification:Sans;letter-spacing:0px;word-spacing:0px;stroke:#000000;stroke-width:0">
      <path
         d="m 122.3463,127.23746 v -2.77779 h 1.23162 q 0.37139,0 0.56466,0.0758 0.19327,0.0739 0.30885,0.26337 0.11558,0.18948 0.11558,0.41876 0,0.29559 -0.19137,0.49833 -0.19138,0.20274 -0.59118,0.25769 0.1459,0.0701 0.22169,0.13832 0.16106,0.1478 0.30506,0.36949 l 0.48318,0.75603 h -0.46233 l -0.3676,-0.57792 q -0.16105,-0.25011 -0.26527,-0.38275 -0.10421,-0.13264 -0.18758,-0.18569 -0.0815,-0.053 -0.16675,-0.0739 -0.0625,-0.0133 -0.20464,-0.0133 h -0.42633 v 1.23352 z m 0.36759,-1.55185 h 0.79014 q 0.25201,0 0.39412,-0.0512 0.14211,-0.053 0.216,-0.16674 0.0739,-0.11558 0.0739,-0.25011 0,-0.19706 -0.144,-0.32402 -0.14211,-0.12695 -0.45097,-0.12695 h -0.87919 z"
         style="line-height:125%;font-family:sans-serif;-inkscape-font-specification:sans-serif"
         id="path60535" />
      <path
         d="m 126.7972,126.90966 v 0.3278 h -1.83607 q -0.004,-0.12317 0.0398,-0.23685 0.0701,-0.18759 0.22359,-0.36949 0.15537,-0.1819 0.44717,-0.42065 0.45286,-0.37138 0.61202,-0.58739 0.15917,-0.2179 0.15917,-0.41117 0,-0.20274 -0.1459,-0.34106 -0.14401,-0.14022 -0.37707,-0.14022 -0.24632,0 -0.39412,0.1478 -0.14779,0.14779 -0.14969,0.40927 l -0.35054,-0.036 q 0.036,-0.39222 0.27096,-0.59686 0.23496,-0.20654 0.63097,-0.20654 0.39981,0 0.63287,0.2217 0.23306,0.22169 0.23306,0.54949 0,0.16674 -0.0682,0.3278 -0.0682,0.16106 -0.22737,0.33917 -0.15727,0.17811 -0.52486,0.48886 -0.30696,0.25769 -0.39412,0.35054 -0.0872,0.091 -0.14401,0.1838 z"
         style="line-height:125%;font-family:sans-serif;-inkscape-font-specification:sans-serif"
         id="path60537" />
    </g>
    <g
       aria-label="10k"
       id="text20151"
       style="font-size:3.88056px;line-height:125%;font-family:Sans;-inkscape-font-specification:Sans;letter-spacing:0px;word-spacing:0px;stroke:#000000;stroke-width:0">
      <path
         d="m 122.00144,132.02661 h -0.34107 v -2.17334 q -0.12316,0.11748 -0.32401,0.23496 -0.19895,0.11747 -0.35812,0.17621 v -0.32969 q 0.28612,-0.13453 0.50023,-0.32591 0.21411,-0.19137 0.30317,-0.37138 h 0.2198 z"
         style="line-height:125%;font-family:sans-serif;-inkscape-font-specification:sans-serif"
         id="path60540" />
      <path
         d="m 122.87494,130.65667 q 0,-0.49265 0.10043,-0.79203 0.10232,-0.30127 0.30127,-0.46423 0.20085,-0.16295 0.50402,-0.16295 0.22359,0 0.39222,0.0909 0.16864,0.0891 0.27854,0.25959 0.1099,0.16864 0.17243,0.41307 0.0625,0.24253 0.0625,0.6556 0,0.48886 -0.10043,0.79013 -0.10042,0.29938 -0.30127,0.46423 -0.19896,0.16295 -0.50402,0.16295 -0.4017,0 -0.63097,-0.28801 -0.27475,-0.34675 -0.27475,-1.1293 z m 0.35054,0 q 0,0.68402 0.15917,0.9114 0.16105,0.22548 0.39601,0.22548 0.23496,0 0.39412,-0.22738 0.16106,-0.22737 0.16106,-0.9095 0,-0.68592 -0.16106,-0.9114 -0.15916,-0.22549 -0.39791,-0.22549 -0.23496,0 -0.37517,0.19896 -0.17622,0.2539 -0.17622,0.93793 z"
         style="line-height:125%;font-family:sans-serif;-inkscape-font-specification:sans-serif"
         id="path60542" />
      <path
         d="m 125.12976,132.02661 v -2.77778 h 0.34107 v 1.58405 l 0.80718,-0.81855 h 0.44149 l -0.76929,0.74655 0.84698,1.26573 h -0.42065 l -0.66507,-1.02888 -0.24064,0.23117 v 0.79771 z"
         style="line-height:125%;font-family:sans-serif;-inkscape-font-specification:sans-serif"
         id="path60544" />
    </g>
    <path
       id="path20153"
       style="fill:#000000;fill-opacity:1;stroke:none;stroke-width:1.04298;stroke-linecap:butt;stroke-linejoin:miter;stroke-miterlimit:4;stroke-dasharray:none;stroke-opacity:1"
       d="m 130.79719,118.23746 h 0.89999 m 0,0 c 0,-0.49703 -0.40293,-0.89996 -0.89999,-0.89996 -0.49702,0 -0.90001,0.40293 -0.90001,0.89996 0,0.49703 0.40293,0.89997 0.89995,0.89997 0.49706,0 0.90005,-0.40294 0.90005,-0.89997 z" />
    <g
       aria-label="R3"
       id="text20159"
       style="font-size:3.88056px;line-height:125%;font-family:Sans;-inkscape-font-specification:Sans;letter-spacing:0px;word-spacing:0px;stroke:#000000;stroke-width:0">
      <path
         d="m 122.3463,146.23746 v -2.77779 h 1.23162 q 0.37139,0 0.56466,0.0758 0.19327,0.0739 0.30885,0.26337 0.11558,0.18948 0.11558,0.41876 0,0.29559 -0.19137,0.49833 -0.19138,0.20274 -0.59118,0.25769 0.1459,0.0701 0.22169,0.13832 0.16106,0.1478 0.30506,0.36949 l 0.48318,0.75603 h -0.46233 l -0.3676,-0.57792 q -0.16105,-0.25011 -0.26527,-0.38275 -0.10421,-0.13264 -0.18758,-0.18569 -0.0815,-0.0531 -0.16675,-0.0739 -0.0625,-0.0133 -0.20464,-0.0133 h -0.42633 v 1.23352 z m 0.36759,-1.55185 h 0.79014 q 0.25201,0 0.39412,-0.0512 0.14211,-0.053 0.216,-0.16674 0.0739,-0.11558 0.0739,-0.25011 0,-0.19706 -0.144,-0.32402 -0.14211,-0.12695 -0.45097,-0.12695 h -0.87919 z"
         style="line-height:125%;font-family:sans-serif;-inkscape-font-specification:sans-serif"
         id="path60547" />
      <path
         d="m 125.00661,145.50417 0.34106,-0.0455 q 0.0587,0.28991 0.19896,0.41875 0.14211,0.12696 0.34485,0.12696 0.24064,0 0.40549,-0.16675 0.16674,-0.16674 0.16674,-0.41306 0,-0.23496 -0.15348,-0.38654 -0.15348,-0.15348 -0.39033,-0.15348 -0.0966,0 -0.24064,0.0379 l 0.0379,-0.29938 q 0.0341,0.004 0.0549,0.004 0.2179,0 0.39222,-0.11368 0.17432,-0.11369 0.17432,-0.35054 0,-0.18759 -0.12695,-0.31075 -0.12695,-0.12316 -0.3278,-0.12316 -0.19895,0 -0.33159,0.12505 -0.13264,0.12506 -0.17053,0.37517 l -0.34107,-0.0606 q 0.0625,-0.34296 0.28422,-0.53054 0.2217,-0.18949 0.55139,-0.18949 0.22738,0 0.41875,0.0985 0.19138,0.0966 0.2918,0.26528 0.10232,0.16863 0.10232,0.35812 0,0.18 -0.0966,0.3278 -0.0966,0.14779 -0.28612,0.23495 0.24633,0.0568 0.38275,0.23685 0.13643,0.17811 0.13643,0.44718 0,0.3638 -0.26527,0.6177 -0.26528,0.25201 -0.67076,0.25201 -0.3657,0 -0.60824,-0.2179 -0.24064,-0.2179 -0.27474,-0.56465 z"
         style="line-height:125%;font-family:sans-serif;-inkscape-font-specification:sans-serif"
         id="path60549" />
    </g>
    <g
       aria-label="10k"
       id="text20163"
       style="font-size:3.88056px;line-height:125%;font-family:Sans;-inkscape-font-specification:Sans;letter-spacing:0px;word-spacing:0px;stroke:#000000;stroke-width:0">
      <path
         d="m 122.00144,151.02661 h -0.34107 v -2.17334 q -0.12316,0.11748 -0.32401,0.23496 -0.19895,0.11747 -0.35812,0.17621 v -0.32969 q 0.28612,-0.13453 0.50023,-0.32591 0.21411,-0.19137 0.30317,-0.37138 h 0.2198 z"
         style="line-height:125%;font-family:sans-serif;-inkscape-font-specification:sans-serif"
         id="path60552" />
      <path
         d="m 122.87494,149.65667 q 0,-0.49265 0.10043,-0.79203 0.10232,-0.30127 0.30127,-0.46423 0.20085,-0.16295 0.50402,-0.16295 0.22359,0 0.39222,0.0909 0.16864,0.0891 0.27854,0.25959 0.1099,0.16864 0.17243,0.41307 0.0625,0.24253 0.0625,0.6556 0,0.48886 -0.10043,0.79013 -0.10042,0.29938 -0.30127,0.46423 -0.19896,0.16295 -0.50402,0.16295 -0.4017,0 -0.63097,-0.28801 -0.27475,-0.34675 -0.27475,-1.1293 z m 0.35054,0 q 0,0.68402 0.15917,0.9114 0.16105,0.22548 0.39601,0.22548 0.23496,0 0.39412,-0.22738 0.16106,-0.22737 0.16106,-0.9095 0,-0.68592 -0.16106,-0.9114 -0.15916,-0.22549 -0.39791,-0.22549 -0.23496,0 -0.37517,0.19896 -0.17622,0.2539 -0.17622,0.93793 z"
         style="line-height:125%;font-family:sans-serif;-inkscape-font-specification:sans-serif"
         id="path60554" />
      <path
         d="m 125.12976,151.02661 v -2.77778 h 0.34107 v 1.58405 l 0.80718,-0.81855 h 0.44149 l -0.76929,0.74655 0.84698,1.26573 h -0.42065 l -0.66507,-1.02888 -0.24064,0.23117 v 0.79771 z"
         style="line-height:125%;font-family:sans-serif;-inkscape-font-specification:sans-serif"
         id="path60556" />
    </g>
    <path
       style="fill:none;stroke:#000000;stroke-width:0.4;stroke-linecap:butt;stroke-linejoin:miter;stroke-dasharray:none;stroke-opacity:1"
       d="m 159.79719,175.23746 h -29 v -38"
       id="path20165" />
    <path
       id="path20155"
       d="m 132.29719,151.23746 h -3 v -9 h 3 z"
       style="fill:#ffffff;fill-opacity:1;stroke:#000000;stroke-width:0.5;stroke-linecap:butt;stroke-linejoin:miter;stroke-miterlimit:4;stroke-dasharray:none;stroke-opacity:1" />
    <path
       id="path21053"
       style="fill:#000000;fill-opacity:1;stroke:none;stroke-width:1.04298;stroke-linecap:butt;stroke-linejoin:miter;stroke-miterlimit:4;stroke-dasharray:none;stroke-opacity:1"
       d="m 130.79719,137.23746 h 0.89999 m 0,0 c 0,-0.49703 -0.40293,-0.89996 -0.89999,-0.89996 -0.49702,0 -0.90001,0.40293 -0.90001,0.89996 0,0.49703 0.40293,0.89997 0.89995,0.89997 0.49706,0 0.90005,-0.40294 0.90005,-0.89997 z" />
    <path
       style="fill:none;stroke:#000000;stroke-width:0.4;stroke-linecap:butt;stroke-linejoin:miter;stroke-dasharray:none;stroke-opacity:1"
       d="m 159.79719,156.23746 h -14.00001 v -19"
       id="path21882" />
    <path
       id="path21884"
       d="m 147.29718,151.23746 h -3 v -9 h 3 z"
       style="fill:#ffffff;fill-opacity:1;stroke:#000000;stroke-width:0.5;stroke-linecap:butt;stroke-linejoin:miter;stroke-miterlimit:4;stroke-dasharray:none;stroke-opacity:1" />
    <g
       aria-label="R4"
       id="text21888"
       style="font-size:3.88056px;line-height:125%;font-family:Sans;-inkscape-font-specification:Sans;letter-spacing:0px;word-spacing:0px;stroke:#000000;stroke-width:0">
      <path
         d="m 137.34631,146.23746 v -2.77779 h 1.23162 q 0.37138,0 0.56465,0.0758 0.19327,0.0739 0.30886,0.26337 0.11558,0.18948 0.11558,0.41876 0,0.29559 -0.19138,0.49833 -0.19137,0.20274 -0.59118,0.25769 0.1459,0.0701 0.2217,0.13832 0.16106,0.1478 0.30506,0.36949 l 0.48318,0.75603 h -0.46234 l -0.36759,-0.57792 q -0.16106,-0.25011 -0.26527,-0.38275 -0.10422,-0.13264 -0.18759,-0.18569 -0.0815,-0.0531 -0.16674,-0.0739 -0.0625,-0.0133 -0.20464,-0.0133 h -0.42633 v 1.23352 z m 0.36759,-1.55185 h 0.79013 q 0.25201,0 0.39412,-0.0512 0.14211,-0.053 0.21601,-0.16674 0.0739,-0.11558 0.0739,-0.25011 0,-0.19706 -0.14401,-0.32402 -0.14211,-0.12695 -0.45096,-0.12695 h -0.87919 z"
         style="line-height:125%;font-family:sans-serif;-inkscape-font-specification:sans-serif"
         id="path60559" />
      <path
         d="m 141.09802,146.23746 v -0.66508 h -1.20509 v -0.31264 l 1.26762,-1.80007 h 0.27854 v 1.80007 h 0.37517 v 0.31264 h -0.37517 v 0.66508 z m 0,-0.97772 v -1.25247 l -0.86971,1.25247 z"
         style="line-height:125%;font-family:sans-serif;-inkscape-font-specification:sans-serif"
         id="path60561" />
    </g>
    <g
       aria-label="10k"
       id="text21892"
       style="font-size:3.88056px;line-height:125%;font-family:Sans;-inkscape-font-specification:Sans;letter-spacing:0px;word-spacing:0px;stroke:#000000;stroke-width:0">
      <path
         d="m 137.00145,151.02661 h -0.34107 v -2.17334 q -0.12316,0.11748 -0.32401,0.23496 -0.19896,0.11747 -0.35812,0.17621 v -0.32969 q 0.28612,-0.13453 0.50023,-0.32591 0.21411,-0.19137 0.30317,-0.37138 h 0.2198 z"
         style="line-height:125%;font-family:sans-serif;-inkscape-font-specification:sans-serif"
         id="path60564" />
      <path
         d="m 137.87495,149.65667 q 0,-0.49265 0.10043,-0.79203 0.10231,-0.30127 0.30127,-0.46423 0.20085,-0.16295 0.50402,-0.16295 0.22358,0 0.39222,0.0909 0.16864,0.0891 0.27854,0.25959 0.1099,0.16864 0.17243,0.41307 0.0625,0.24253 0.0625,0.6556 0,0.48886 -0.10042,0.79013 -0.10043,0.29938 -0.30127,0.46423 -0.19896,0.16295 -0.50402,0.16295 -0.4017,0 -0.63097,-0.28801 -0.27475,-0.34675 -0.27475,-1.1293 z m 0.35054,0 q 0,0.68402 0.15916,0.9114 0.16106,0.22548 0.39602,0.22548 0.23495,0 0.39412,-0.22738 0.16106,-0.22737 0.16106,-0.9095 0,-0.68592 -0.16106,-0.9114 -0.15917,-0.22549 -0.39791,-0.22549 -0.23496,0 -0.37517,0.19896 -0.17622,0.2539 -0.17622,0.93793 z"
         style="line-height:125%;font-family:sans-serif;-inkscape-font-specification:sans-serif"
         id="path60566" />
      <path
         d="m 140.12977,151.02661 v -2.77778 h 0.34106 v 1.58405 l 0.80719,-0.81855 h 0.44149 l -0.76929,0.74655 0.84698,1.26573 h -0.42065 l -0.66508,-1.02888 -0.24064,0.23117 v 0.79771 z"
         style="line-height:125%;font-family:sans-serif;-inkscape-font-specification:sans-serif"
         id="path60568" />
    </g>
    <path
       id="path21894"
       style="fill:#000000;fill-opacity:1;stroke:none;stroke-width:1.04298;stroke-linecap:butt;stroke-linejoin:miter;stroke-miterlimit:4;stroke-dasharray:none;stroke-opacity:1"
       d="m 145.79718,137.23746 h 0.89999 m 0,0 c 0,-0.49703 -0.40293,-0.89996 -0.89999,-0.89996 -0.49702,0 -0.90001,0.40293 -0.90001,0.89996 0,0.49703 0.40293,0.89997 0.89995,0.89997 0.49706,0 0.90005,-0.40294 0.90005,-0.89997 z" />
    <g
       aria-label="R5"
       id="text21898"
       style="font-size:3.88056px;line-height:125%;font-family:Sans;-inkscape-font-specification:Sans;letter-spacing:0px;word-spacing:0px;stroke:#000000;stroke-width:0">
      <path
         d="m 137.34631,165.23746 v -2.77779 h 1.23162 q 0.37138,0 0.56465,0.0758 0.19327,0.0739 0.30886,0.26337 0.11558,0.18948 0.11558,0.41876 0,0.29559 -0.19138,0.49833 -0.19137,0.20274 -0.59118,0.25769 0.1459,0.0701 0.2217,0.13832 0.16106,0.1478 0.30506,0.36949 l 0.48318,0.75603 h -0.46234 l -0.36759,-0.57792 q -0.16106,-0.25011 -0.26527,-0.38275 -0.10422,-0.13264 -0.18759,-0.18569 -0.0815,-0.0531 -0.16674,-0.0739 -0.0625,-0.0133 -0.20464,-0.0133 h -0.42633 v 1.23352 z m 0.36759,-1.55185 h 0.79013 q 0.25201,0 0.39412,-0.0512 0.14211,-0.053 0.21601,-0.16674 0.0739,-0.11558 0.0739,-0.25011 0,-0.19706 -0.14401,-0.32402 -0.14211,-0.12695 -0.45096,-0.12695 h -0.87919 z"
         style="line-height:125%;font-family:sans-serif;-inkscape-font-specification:sans-serif"
         id="path60571" />
      <path
         d="m 140.00472,164.50985 0.35812,-0.0303 q 0.0398,0.26148 0.18379,0.39411 0.1459,0.13075 0.35054,0.13075 0.24633,0 0.41686,-0.18569 0.17053,-0.1857 0.17053,-0.49265 0,-0.2918 -0.16485,-0.46044 -0.16295,-0.16864 -0.42822,-0.16864 -0.16485,0 -0.29749,0.0758 -0.13263,0.0739 -0.20843,0.19327 l -0.32022,-0.0417 0.26906,-1.42679 h 1.38132 v 0.32591 h -1.10846 l -0.14969,0.74655 q 0.25011,-0.17432 0.52486,-0.17432 0.3638,0 0.61391,0.25201 0.25012,0.25201 0.25012,0.64802 0,0.37707 -0.2198,0.65181 -0.26717,0.33728 -0.7295,0.33728 -0.37896,0 -0.6196,-0.21222 -0.23874,-0.21222 -0.27285,-0.56276 z"
         style="line-height:125%;font-family:sans-serif;-inkscape-font-specification:sans-serif"
         id="path60573" />
    </g>
    <g
       aria-label="10k"
       id="text21902"
       style="font-size:3.88056px;line-height:125%;font-family:Sans;-inkscape-font-specification:Sans;letter-spacing:0px;word-spacing:0px;stroke:#000000;stroke-width:0">
      <path
         d="m 137.00145,170.02661 h -0.34107 v -2.17334 q -0.12316,0.11748 -0.32401,0.23496 -0.19896,0.11747 -0.35812,0.17621 v -0.32969 q 0.28612,-0.13453 0.50023,-0.32591 0.21411,-0.19137 0.30317,-0.37138 h 0.2198 z"
         style="line-height:125%;font-family:sans-serif;-inkscape-font-specification:sans-serif"
         id="path60576" />
      <path
         d="m 137.87495,168.65667 q 0,-0.49265 0.10043,-0.79203 0.10231,-0.30127 0.30127,-0.46423 0.20085,-0.16295 0.50402,-0.16295 0.22358,0 0.39222,0.0909 0.16864,0.0891 0.27854,0.25959 0.1099,0.16864 0.17243,0.41307 0.0625,0.24253 0.0625,0.6556 0,0.48886 -0.10042,0.79013 -0.10043,0.29938 -0.30127,0.46423 -0.19896,0.16295 -0.50402,0.16295 -0.4017,0 -0.63097,-0.28801 -0.27475,-0.34675 -0.27475,-1.1293 z m 0.35054,0 q 0,0.68402 0.15916,0.9114 0.16106,0.22548 0.39602,0.22548 0.23495,0 0.39412,-0.22738 0.16106,-0.22737 0.16106,-0.9095 0,-0.68592 -0.16106,-0.9114 -0.15917,-0.22549 -0.39791,-0.22549 -0.23496,0 -0.37517,0.19896 -0.17622,0.2539 -0.17622,0.93793 z"
         style="line-height:125%;font-family:sans-serif;-inkscape-font-specification:sans-serif"
         id="path60578" />
      <path
         d="m 140.12977,170.02661 v -2.77778 h 0.34106 v 1.58405 l 0.80719,-0.81855 h 0.44149 l -0.76929,0.74655 0.84698,1.26573 h -0.42065 l -0.66508,-1.02888 -0.24064,0.23117 v 0.79771 z"
         style="line-height:125%;font-family:sans-serif;-inkscape-font-specification:sans-serif"
         id="path60580" />
    </g>
    <path
       style="fill:none;stroke:#000000;stroke-width:0.4;stroke-linecap:butt;stroke-linejoin:miter;stroke-dasharray:none;stroke-opacity:1"
       d="m 145.79718,175.23746 v -19"
       id="path21904" />
    <path
       id="path21906"
       d="m 147.29718,170.23746 h -3 v -9 h 3 z"
       style="fill:#ffffff;fill-opacity:1;stroke:#000000;stroke-width:0.5;stroke-linecap:butt;stroke-linejoin:miter;stroke-miterlimit:4;stroke-dasharray:none;stroke-opacity:1" />
    <path
       id="path21908"
       style="fill:#000000;fill-opacity:1;stroke:none;stroke-width:1.04298;stroke-linecap:butt;stroke-linejoin:miter;stroke-miterlimit:4;stroke-dasharray:none;stroke-opacity:1"
       d="m 145.79718,156.23746 h 0.89999 m 0,0 c 0,-0.49703 -0.40293,-0.89996 -0.89999,-0.89996 -0.49702,0 -0.90001,0.40293 -0.90001,0.89996 0,0.49703 0.40293,0.89997 0.89995,0.89997 0.49706,0 0.90005,-0.40294 0.90005,-0.89997 z" />
    <path
       id="path22753"
       style="fill:none;fill-opacity:0.5;stroke:#000000;stroke-width:0.5;stroke-linecap:round;stroke-linejoin:round;stroke-dasharray:none"
       d="m 160.79719,138.23746 a 1,1 0 0 1 -1,-1 1,1 0 0 1 1,-1 1,1 0 0 1 1,1 1,1 0 0 1 -1,1 z" />
    <path
       id="path22755"
       style="fill:none;fill-opacity:0.5;stroke:#000000;stroke-width:0.5;stroke-linecap:round;stroke-linejoin:round;stroke-dasharray:none"
       d="m 160.79719,157.23746 a 1,1 0 0 1 -1,-1 1,1 0 0 1 1,-1 1,1 0 0 1 1,1 1,1 0 0 1 -1,1 z" />
    <path
       id="path22757"
       style="fill:#000000;fill-opacity:1;stroke:none;stroke-width:1.04298;stroke-linecap:butt;stroke-linejoin:miter;stroke-miterlimit:4;stroke-dasharray:none;stroke-opacity:1"
       d="m 130.79719,175.23746 h 0.89999 m 0,0 c 0,-0.49703 -0.40293,-0.89996 -0.89999,-0.89996 -0.49702,0 -0.90001,0.40293 -0.90001,0.89996 0,0.49703 0.40293,0.89997 0.89995,0.89997 0.49706,0 0.90005,-0.40294 0.90005,-0.89997 z" />
    <path
       id="path22759"
       style="fill:#000000;fill-opacity:1;stroke:none;stroke-width:1.04298;stroke-linecap:butt;stroke-linejoin:miter;stroke-miterlimit:4;stroke-dasharray:none;stroke-opacity:1"
       d="m 115.79719,175.23746 h 0.89999 m 0,0 c 0,-0.49703 -0.40293,-0.89996 -0.89999,-0.89996 -0.49702,0 -0.90001,0.40293 -0.90001,0.89996 0,0.49703 0.40293,0.89997 0.89995,0.89997 0.49706,0 0.90005,-0.40294 0.90005,-0.89997 z" />
    <path
       style="fill:#000000;fill-opacity:1;stroke:none;stroke-width:0.264583px;stroke-linecap:butt;stroke-linejoin:miter;stroke-opacity:1"
       d="m 167.79719,116.23746 c -2,0 -3,1 -4,2 1,1 2,2 4,2 h 20 v -4 z"
       id="path34615" />
    <path
       style="fill:#000000;fill-opacity:0.25;stroke:none;stroke-width:0.264583px;stroke-linecap:butt;stroke-linejoin:miter;stroke-opacity:1"
       d="m 166.79719,117.23746 1,-1 h 19 v 4 h -19 l -1,-1 z"
       id="path34617" />
    <g
       aria-label="1.979-4.910V"
       id="text34621"
       style="font-size:3.175px;line-height:100%;font-family:Sans;-inkscape-font-specification:Sans;letter-spacing:0px;word-spacing:0px;fill:#ffffff;stroke:#000000;stroke-width:0">
      <path
         d="m 168.38996,119.35833 h -0.43563 v -1.64176 q -0.23874,0.22324 -0.56276,0.33021 v -0.39532 q 0.17054,-0.0558 0.37052,-0.21084 0.19999,-0.15658 0.27441,-0.36432 h 0.35346 z"
         style="font-weight:bold;font-family:sans-serif;-inkscape-font-specification:'sans-serif Bold'"
         id="path60640" />
      <path
         d="m 169.1341,119.35833 v -0.43563 h 0.43564 v 0.43563 z"
         style="font-weight:bold;font-family:sans-serif;-inkscape-font-specification:'sans-serif Bold'"
         id="path60642" />
      <path
         d="m 169.9325,118.83278 0.42168,-0.0465 q 0.0155,0.12868 0.0806,0.19069 0.0651,0.062 0.17208,0.062 0.13488,0 0.22945,-0.12402 0.0946,-0.12403 0.12092,-0.5147 -0.16433,0.19068 -0.41083,0.19068 -0.2682,0 -0.46354,-0.20618 -0.19378,-0.20774 -0.19378,-0.53951 0,-0.34571 0.20463,-0.55655 0.20619,-0.21239 0.524,-0.21239 0.34572,0 0.56741,0.2682 0.22169,0.26665 0.22169,0.87902 0,0.62321 -0.23099,0.89917 -0.23099,0.27595 -0.60151,0.27595 -0.26665,0 -0.43099,-0.14108 -0.16433,-0.14263 -0.21084,-0.42478 z m 0.98599,-0.95188 q 0,-0.21084 -0.0977,-0.32711 -0.0961,-0.11627 -0.22324,-0.11627 -0.12092,0 -0.20154,0.0961 -0.0791,0.0946 -0.0791,0.31161 0,0.22015 0.0868,0.32402 0.0868,0.10231 0.21704,0.10231 0.12558,0 0.21084,-0.0992 0.0868,-0.0992 0.0868,-0.29146 z"
         style="font-weight:bold;font-family:sans-serif;-inkscape-font-specification:'sans-serif Bold'"
         id="path60644" />
      <path
         d="m 171.68899,117.52123 v -0.40462 h 1.48983 v 0.31626 q -0.18449,0.18138 -0.37517,0.52089 -0.19069,0.33952 -0.29146,0.72244 -0.0992,0.38137 -0.0977,0.68213 h -0.42013 q 0.0109,-0.47129 0.19379,-0.96118 0.18449,-0.48989 0.49144,-0.87592 z"
         style="font-weight:bold;font-family:sans-serif;-inkscape-font-specification:'sans-serif Bold'"
         id="path60646" />
      <path
         d="m 173.46407,118.83278 0.42168,-0.0465 q 0.0155,0.12868 0.0806,0.19069 0.0651,0.062 0.17208,0.062 0.13487,0 0.22944,-0.12402 0.0946,-0.12403 0.12093,-0.5147 -0.16434,0.19068 -0.41083,0.19068 -0.2682,0 -0.46354,-0.20618 -0.19379,-0.20774 -0.19379,-0.53951 0,-0.34571 0.20464,-0.55655 0.20619,-0.21239 0.524,-0.21239 0.34572,0 0.56741,0.2682 0.22169,0.26665 0.22169,0.87902 0,0.62321 -0.23099,0.89917 -0.231,0.27595 -0.60152,0.27595 -0.26665,0 -0.43098,-0.14108 -0.16433,-0.14263 -0.21084,-0.42478 z m 0.98599,-0.95188 q 0,-0.21084 -0.0977,-0.32711 -0.0961,-0.11627 -0.22324,-0.11627 -0.12093,0 -0.20154,0.0961 -0.0791,0.0946 -0.0791,0.31161 0,0.22015 0.0868,0.32402 0.0868,0.10231 0.21704,0.10231 0.12558,0 0.21084,-0.0992 0.0868,-0.0992 0.0868,-0.29146 z"
         style="font-weight:bold;font-family:sans-serif;-inkscape-font-specification:'sans-serif Bold'"
         id="path60648" />
      <path
         d="m 175.26396,118.75217 v -0.43564 h 0.85576 v 0.43564 z"
         style="font-weight:bold;font-family:sans-serif;-inkscape-font-specification:'sans-serif Bold'"
         id="path60650" />
      <path
         d="m 177.13206,119.35833 v -0.45734 h -0.93017 v -0.38137 l 0.98599,-1.44332 h 0.36586 v 1.44177 h 0.28216 v 0.38292 h -0.28216 v 0.45734 z m 0,-0.84026 v -0.7767 l -0.52244,0.7767 z"
         style="font-weight:bold;font-family:sans-serif;-inkscape-font-specification:'sans-serif Bold'"
         id="path60652" />
      <path
         d="m 178.13665,119.35833 v -0.43563 h 0.43564 v 0.43563 z"
         style="font-weight:bold;font-family:sans-serif;-inkscape-font-specification:'sans-serif Bold'"
         id="path60654" />
      <path
         d="m 178.93506,118.83278 0.42168,-0.0465 q 0.0155,0.12868 0.0806,0.19069 0.0651,0.062 0.17208,0.062 0.13488,0 0.22945,-0.12402 0.0946,-0.12403 0.12092,-0.5147 -0.16433,0.19068 -0.41083,0.19068 -0.2682,0 -0.46354,-0.20618 -0.19378,-0.20774 -0.19378,-0.53951 0,-0.34571 0.20464,-0.55655 0.20618,-0.21239 0.524,-0.21239 0.34571,0 0.5674,0.2682 0.22169,0.26665 0.22169,0.87902 0,0.62321 -0.23099,0.89917 -0.23099,0.27595 -0.60151,0.27595 -0.26665,0 -0.43098,-0.14108 -0.16434,-0.14263 -0.21084,-0.42478 z m 0.98598,-0.95188 q 0,-0.21084 -0.0977,-0.32711 -0.0961,-0.11627 -0.22324,-0.11627 -0.12092,0 -0.20154,0.0961 -0.0791,0.0946 -0.0791,0.31161 0,0.22015 0.0868,0.32402 0.0868,0.10231 0.21705,0.10231 0.12557,0 0.21084,-0.0992 0.0868,-0.0992 0.0868,-0.29146 z"
         style="font-weight:bold;font-family:sans-serif;-inkscape-font-specification:'sans-serif Bold'"
         id="path60656" />
      <path
         d="m 181.8062,119.35833 h -0.43563 v -1.64176 q -0.23875,0.22324 -0.56276,0.33021 v -0.39532 q 0.17053,-0.0558 0.37052,-0.21084 0.19999,-0.15658 0.2744,-0.36432 h 0.35347 z"
         style="font-weight:bold;font-family:sans-serif;-inkscape-font-specification:'sans-serif Bold'"
         id="path60658" />
      <path
         d="m 183.19371,117.0763 q 0.33021,0 0.51625,0.23564 0.22169,0.27906 0.22169,0.92553 0,0.64492 -0.22324,0.92707 -0.18449,0.23255 -0.5147,0.23255 -0.33176,0 -0.53485,-0.25425 -0.20309,-0.2558 -0.20309,-0.91002 0,-0.64182 0.22324,-0.92398 0.18449,-0.23254 0.5147,-0.23254 z m 0,0.36122 q -0.0791,0 -0.14108,0.0512 -0.062,0.0496 -0.0961,0.17983 -0.045,0.16898 -0.045,0.56896 0,0.39997 0.0403,0.55035 0.0403,0.14883 0.10077,0.19844 0.062,0.0496 0.14108,0.0496 0.0791,0 0.14108,-0.0496 0.062,-0.0512 0.0961,-0.18138 0.045,-0.16744 0.045,-0.56741 0,-0.39998 -0.0403,-0.54881 -0.0403,-0.15037 -0.10232,-0.19998 -0.0605,-0.0512 -0.13953,-0.0512 z"
         style="font-weight:bold;font-family:sans-serif;-inkscape-font-specification:'sans-serif Bold'"
         id="path60660" />
      <path
         d="m 184.89903,119.35833 -0.81235,-2.27273 h 0.49764 l 0.57516,1.68207 0.55656,-1.68207 h 0.48679 l -0.81391,2.27273 z"
         style="font-weight:bold;font-family:sans-serif;-inkscape-font-specification:'sans-serif Bold'"
         id="path60662" />
    </g>
    <path
       style="fill:#000000;fill-opacity:1;stroke:none;stroke-width:0.264583px;stroke-linecap:butt;stroke-linejoin:miter;stroke-opacity:1"
       d="m 167.79719,135.23746 c -2,0 -3,1 -4,2 1,1 2,2 4,2 h 20 v -4 z"
       id="path30850" />
    <path
       style="fill:#000000;fill-opacity:0.25;stroke:none;stroke-width:0.264583px;stroke-linecap:butt;stroke-linejoin:miter;stroke-opacity:1"
       d="m 166.79719,136.23746 1,-1 h 19 v 4 h -19 l -1,-1 z"
       id="path30852" />
    <g
       aria-label="0.790-1.959V"
       id="text30856"
       style="font-size:3.175px;line-height:100%;font-family:Sans;-inkscape-font-specification:Sans;letter-spacing:0px;word-spacing:0px;fill:#ffffff;stroke:#000000;stroke-width:0">
      <path
         d="m 168.07059,136.07707 q 0.33021,0 0.51625,0.23564 0.22169,0.27906 0.22169,0.92553 0,0.64492 -0.22324,0.92707 -0.18449,0.23255 -0.5147,0.23255 -0.33176,0 -0.53485,-0.25425 -0.20309,-0.2558 -0.20309,-0.91002 0,-0.64182 0.22324,-0.92398 0.18449,-0.23254 0.5147,-0.23254 z m 0,0.36122 q -0.0791,0 -0.14108,0.0512 -0.062,0.0496 -0.0961,0.17983 -0.045,0.16898 -0.045,0.56896 0,0.39997 0.0403,0.55035 0.0403,0.14883 0.10077,0.19844 0.062,0.0496 0.14108,0.0496 0.0791,0 0.14108,-0.0496 0.062,-0.0512 0.0961,-0.18138 0.045,-0.16744 0.045,-0.56741 0,-0.39998 -0.0403,-0.54881 -0.0403,-0.15037 -0.10232,-0.19998 -0.0605,-0.0512 -0.13953,-0.0512 z"
         style="font-weight:bold;font-family:sans-serif;-inkscape-font-specification:'sans-serif Bold'"
         id="path60615" />
      <path
         d="m 169.193,138.3591 v -0.43563 h 0.43563 v 0.43563 z"
         style="font-weight:bold;font-family:sans-serif;-inkscape-font-specification:'sans-serif Bold'"
         id="path60617" />
      <path
         d="m 169.9821,136.522 v -0.40462 h 1.48983 v 0.31626 q -0.18448,0.18138 -0.37517,0.52089 -0.19068,0.33952 -0.29145,0.72244 -0.0992,0.38137 -0.0977,0.68213 h -0.42013 q 0.0109,-0.47129 0.19379,-0.96118 0.18448,-0.48989 0.49144,-0.87592 z"
         style="font-weight:bold;font-family:sans-serif;-inkscape-font-specification:'sans-serif Bold'"
         id="path60619" />
      <path
         d="m 171.75719,137.83355 0.42168,-0.0465 q 0.0155,0.12868 0.0806,0.19069 0.0651,0.062 0.17208,0.062 0.13488,0 0.22945,-0.12402 0.0946,-0.12403 0.12092,-0.5147 -0.16433,0.19069 -0.41083,0.19069 -0.2682,0 -0.46353,-0.20619 -0.19379,-0.20774 -0.19379,-0.53951 0,-0.34571 0.20464,-0.55655 0.20619,-0.21239 0.524,-0.21239 0.34571,0 0.5674,0.2682 0.2217,0.26665 0.2217,0.87902 0,0.62321 -0.231,0.89917 -0.23099,0.27595 -0.60151,0.27595 -0.26665,0 -0.43098,-0.14108 -0.16433,-0.14263 -0.21084,-0.42478 z m 0.98598,-0.95188 q 0,-0.21084 -0.0977,-0.32711 -0.0961,-0.11627 -0.22324,-0.11627 -0.12092,0 -0.20154,0.0961 -0.0791,0.0946 -0.0791,0.3116 0,0.22015 0.0868,0.32402 0.0868,0.10231 0.21704,0.10231 0.12557,0 0.21084,-0.0992 0.0868,-0.0992 0.0868,-0.29146 z"
         style="font-weight:bold;font-family:sans-serif;-inkscape-font-specification:'sans-serif Bold'"
         id="path60621" />
      <path
         d="m 174.25006,136.07707 q 0.33021,0 0.51625,0.23564 0.22169,0.27906 0.22169,0.92553 0,0.64492 -0.22324,0.92707 -0.18449,0.23255 -0.5147,0.23255 -0.33176,0 -0.53485,-0.25425 -0.20309,-0.2558 -0.20309,-0.91002 0,-0.64182 0.22324,-0.92398 0.18449,-0.23254 0.5147,-0.23254 z m 0,0.36122 q -0.0791,0 -0.14108,0.0512 -0.062,0.0496 -0.0961,0.17983 -0.045,0.16898 -0.045,0.56896 0,0.39997 0.0403,0.55035 0.0403,0.14883 0.10077,0.19844 0.062,0.0496 0.14108,0.0496 0.0791,0 0.14107,-0.0496 0.062,-0.0512 0.0961,-0.18138 0.045,-0.16744 0.045,-0.56741 0,-0.39998 -0.0403,-0.54881 -0.0403,-0.15037 -0.10232,-0.19998 -0.0605,-0.0512 -0.13952,-0.0512 z"
         style="font-weight:bold;font-family:sans-serif;-inkscape-font-specification:'sans-serif Bold'"
         id="path60623" />
      <path
         d="m 175.32286,137.75294 v -0.43564 h 0.85576 v 0.43564 z"
         style="font-weight:bold;font-family:sans-serif;-inkscape-font-specification:'sans-serif Bold'"
         id="path60625" />
      <path
         d="m 177.45141,138.3591 h -0.43563 v -1.64176 q -0.23874,0.22324 -0.56276,0.33021 v -0.39532 q 0.17054,-0.0558 0.37052,-0.21084 0.19999,-0.15658 0.27441,-0.36432 h 0.35346 z"
         style="font-weight:bold;font-family:sans-serif;-inkscape-font-specification:'sans-serif Bold'"
         id="path60627" />
      <path
         d="m 178.19555,138.3591 v -0.43563 h 0.43564 v 0.43563 z"
         style="font-weight:bold;font-family:sans-serif;-inkscape-font-specification:'sans-serif Bold'"
         id="path60629" />
      <path
         d="m 178.99395,137.83355 0.42168,-0.0465 q 0.0155,0.12868 0.0806,0.19069 0.0651,0.062 0.17208,0.062 0.13488,0 0.22945,-0.12402 0.0946,-0.12403 0.12092,-0.5147 -0.16433,0.19069 -0.41083,0.19069 -0.2682,0 -0.46354,-0.20619 -0.19378,-0.20774 -0.19378,-0.53951 0,-0.34571 0.20463,-0.55655 0.20619,-0.21239 0.524,-0.21239 0.34572,0 0.56741,0.2682 0.22169,0.26665 0.22169,0.87902 0,0.62321 -0.23099,0.89917 -0.23099,0.27595 -0.60151,0.27595 -0.26665,0 -0.43099,-0.14108 -0.16433,-0.14263 -0.21084,-0.42478 z m 0.98599,-0.95188 q 0,-0.21084 -0.0977,-0.32711 -0.0961,-0.11627 -0.22324,-0.11627 -0.12092,0 -0.20154,0.0961 -0.0791,0.0946 -0.0791,0.3116 0,0.22015 0.0868,0.32402 0.0868,0.10231 0.21704,0.10231 0.12558,0 0.21084,-0.0992 0.0868,-0.0992 0.0868,-0.29146 z"
         style="font-weight:bold;font-family:sans-serif;-inkscape-font-specification:'sans-serif Bold'"
         id="path60631" />
      <path
         d="m 180.75664,137.77464 0.43408,-0.045 q 0.0186,0.14728 0.11007,0.2341 0.0915,0.0853 0.21084,0.0853 0.13643,0 0.23099,-0.11007 0.0946,-0.11162 0.0946,-0.33486 0,-0.20929 -0.0946,-0.31316 -0.093,-0.10542 -0.24339,-0.10542 -0.18759,0 -0.33642,0.16588 l -0.35346,-0.0512 0.22324,-1.18287 h 1.15187 v 0.40772 h -0.82166 l -0.0682,0.38603 q 0.14573,-0.0729 0.29766,-0.0729 0.2899,0 0.49144,0.21084 0.20154,0.21084 0.20154,0.54726 0,0.2806 -0.16278,0.50074 -0.2217,0.30076 -0.61547,0.30076 -0.31471,0 -0.51315,-0.16898 -0.19844,-0.16899 -0.23719,-0.45424 z"
         style="font-weight:bold;font-family:sans-serif;-inkscape-font-specification:'sans-serif Bold'"
         id="path60633" />
      <path
         d="m 182.52552,137.83355 0.42168,-0.0465 q 0.0155,0.12868 0.0806,0.19069 0.0651,0.062 0.17208,0.062 0.13487,0 0.22944,-0.12402 0.0946,-0.12403 0.12092,-0.5147 -0.16433,0.19069 -0.41082,0.19069 -0.2682,0 -0.46354,-0.20619 -0.19379,-0.20774 -0.19379,-0.53951 0,-0.34571 0.20464,-0.55655 0.20619,-0.21239 0.524,-0.21239 0.34572,0 0.56741,0.2682 0.22169,0.26665 0.22169,0.87902 0,0.62321 -0.23099,0.89917 -0.231,0.27595 -0.60152,0.27595 -0.26665,0 -0.43098,-0.14108 -0.16433,-0.14263 -0.21084,-0.42478 z m 0.98599,-0.95188 q 0,-0.21084 -0.0977,-0.32711 -0.0961,-0.11627 -0.22324,-0.11627 -0.12093,0 -0.20154,0.0961 -0.0791,0.0946 -0.0791,0.3116 0,0.22015 0.0868,0.32402 0.0868,0.10231 0.21704,0.10231 0.12557,0 0.21084,-0.0992 0.0868,-0.0992 0.0868,-0.29146 z"
         style="font-weight:bold;font-family:sans-serif;-inkscape-font-specification:'sans-serif Bold'"
         id="path60635" />
      <path
         d="m 184.95793,138.3591 -0.81235,-2.27273 h 0.49764 l 0.57516,1.68207 0.55655,-1.68207 h 0.4868 l -0.81391,2.27273 z"
         style="font-weight:bold;font-family:sans-serif;-inkscape-font-specification:'sans-serif Bold'"
         id="path60637" />
    </g>
    <path
       style="fill:#000000;fill-opacity:1;stroke:none;stroke-width:0.264583px;stroke-linecap:butt;stroke-linejoin:miter;stroke-opacity:1"
       d="m 167.79719,154.23746 c -2,0 -3,1 -4,2 1,1 2,2 4,2 h 20 v -4 z"
       id="path30858" />
    <path
       style="fill:#000000;fill-opacity:0.25;stroke:none;stroke-width:0.264583px;stroke-linecap:butt;stroke-linejoin:miter;stroke-opacity:1"
       d="m 166.79719,155.23746 1,-1 h 19 v 4 h -19 l -1,-1 z"
       id="path30860" />
    <g
       aria-label="0.395-0.978V"
       id="text30864"
       style="font-size:3.175px;line-height:100%;font-family:Sans;-inkscape-font-specification:Sans;letter-spacing:0px;word-spacing:0px;fill:#ffffff;stroke:#000000;stroke-width:0">
      <path
         d="m 168.07059,155.07707 q 0.33021,0 0.51625,0.23564 0.22169,0.27906 0.22169,0.92553 0,0.64492 -0.22324,0.92707 -0.18449,0.23255 -0.5147,0.23255 -0.33176,0 -0.53485,-0.25425 -0.20309,-0.2558 -0.20309,-0.91002 0,-0.64182 0.22324,-0.92398 0.18449,-0.23254 0.5147,-0.23254 z m 0,0.36122 q -0.0791,0 -0.14108,0.0512 -0.062,0.0496 -0.0961,0.17983 -0.045,0.16898 -0.045,0.56896 0,0.39997 0.0403,0.55035 0.0403,0.14883 0.10077,0.19844 0.062,0.0496 0.14108,0.0496 0.0791,0 0.14108,-0.0496 0.062,-0.0512 0.0961,-0.18138 0.045,-0.16744 0.045,-0.56741 0,-0.39998 -0.0403,-0.54881 -0.0403,-0.15037 -0.10232,-0.19998 -0.0605,-0.0512 -0.13953,-0.0512 z"
         style="font-weight:bold;font-family:sans-serif;-inkscape-font-specification:'sans-serif Bold'"
         id="path60590" />
      <path
         d="m 169.193,157.3591 v -0.43563 h 0.43563 v 0.43563 z"
         style="font-weight:bold;font-family:sans-serif;-inkscape-font-specification:'sans-serif Bold'"
         id="path60592" />
      <path
         d="m 169.9666,156.75604 0.42168,-0.0512 q 0.0202,0.16123 0.10852,0.24649 0.0884,0.0853 0.21394,0.0853 0.13487,0 0.22634,-0.10232 0.093,-0.10232 0.093,-0.27595 0,-0.16433 -0.0884,-0.26045 -0.0884,-0.0961 -0.21549,-0.0961 -0.0837,0 -0.19999,0.0326 l 0.0481,-0.35502 q 0.17674,0.005 0.26975,-0.076 0.093,-0.0822 0.093,-0.21705 0,-0.11472 -0.0682,-0.18293 -0.0682,-0.0682 -0.18139,-0.0682 -0.11162,0 -0.19068,0.0775 -0.0791,0.0775 -0.0961,0.22634 l -0.40153,-0.0682 q 0.0419,-0.20619 0.12558,-0.32866 0.0853,-0.12402 0.23564,-0.19379 0.15193,-0.0713 0.33952,-0.0713 0.32091,0 0.51469,0.20464 0.15968,0.16743 0.15968,0.37827 0,0.29921 -0.32711,0.47749 0.19534,0.0419 0.31161,0.18758 0.11782,0.14573 0.11782,0.35192 0,0.29921 -0.21859,0.51005 -0.21859,0.21084 -0.54415,0.21084 -0.30851,0 -0.5116,-0.17674 -0.20309,-0.17828 -0.23564,-0.46508 z"
         style="font-weight:bold;font-family:sans-serif;-inkscape-font-specification:'sans-serif Bold'"
         id="path60594" />
      <path
         d="m 171.75719,156.83355 0.42168,-0.0465 q 0.0155,0.12868 0.0806,0.19069 0.0651,0.062 0.17208,0.062 0.13488,0 0.22945,-0.12402 0.0946,-0.12403 0.12092,-0.5147 -0.16433,0.19069 -0.41083,0.19069 -0.2682,0 -0.46353,-0.20619 -0.19379,-0.20774 -0.19379,-0.53951 0,-0.34571 0.20464,-0.55655 0.20619,-0.21239 0.524,-0.21239 0.34571,0 0.5674,0.2682 0.2217,0.26665 0.2217,0.87902 0,0.62321 -0.231,0.89917 -0.23099,0.27595 -0.60151,0.27595 -0.26665,0 -0.43098,-0.14108 -0.16433,-0.14263 -0.21084,-0.42478 z m 0.98598,-0.95188 q 0,-0.21084 -0.0977,-0.32711 -0.0961,-0.11627 -0.22324,-0.11627 -0.12092,0 -0.20154,0.0961 -0.0791,0.0946 -0.0791,0.3116 0,0.22015 0.0868,0.32402 0.0868,0.10231 0.21704,0.10231 0.12557,0 0.21084,-0.0992 0.0868,-0.0992 0.0868,-0.29146 z"
         style="font-weight:bold;font-family:sans-serif;-inkscape-font-specification:'sans-serif Bold'"
         id="path60596" />
      <path
         d="m 173.51987,156.77464 0.43408,-0.045 q 0.0186,0.14728 0.11007,0.2341 0.0915,0.0853 0.21084,0.0853 0.13643,0 0.231,-0.11007 0.0946,-0.11162 0.0946,-0.33486 0,-0.20929 -0.0946,-0.31316 -0.093,-0.10542 -0.2434,-0.10542 -0.18759,0 -0.33641,0.16588 l -0.35347,-0.0512 0.22324,-1.18287 h 1.15187 v 0.40772 h -0.82166 l -0.0682,0.38603 q 0.14573,-0.0729 0.29766,-0.0729 0.2899,0 0.49144,0.21084 0.20154,0.21084 0.20154,0.54726 0,0.2806 -0.16278,0.50074 -0.22169,0.30076 -0.61547,0.30076 -0.31471,0 -0.51315,-0.16898 -0.19843,-0.16899 -0.23719,-0.45424 z"
         style="font-weight:bold;font-family:sans-serif;-inkscape-font-specification:'sans-serif Bold'"
         id="path60598" />
      <path
         d="m 175.32286,156.75294 v -0.43564 h 0.85576 v 0.43564 z"
         style="font-weight:bold;font-family:sans-serif;-inkscape-font-specification:'sans-serif Bold'"
         id="path60600" />
      <path
         d="m 177.07314,155.07707 q 0.33021,0 0.51625,0.23564 0.22169,0.27906 0.22169,0.92553 0,0.64492 -0.22324,0.92707 -0.18449,0.23255 -0.5147,0.23255 -0.33176,0 -0.53485,-0.25425 -0.20309,-0.2558 -0.20309,-0.91002 0,-0.64182 0.22324,-0.92398 0.18449,-0.23254 0.5147,-0.23254 z m 0,0.36122 q -0.0791,0 -0.14108,0.0512 -0.062,0.0496 -0.0961,0.17983 -0.045,0.16898 -0.045,0.56896 0,0.39997 0.0403,0.55035 0.0403,0.14883 0.10076,0.19844 0.062,0.0496 0.14108,0.0496 0.0791,0 0.14108,-0.0496 0.062,-0.0512 0.0961,-0.18138 0.045,-0.16744 0.045,-0.56741 0,-0.39998 -0.0403,-0.54881 -0.0403,-0.15037 -0.10232,-0.19998 -0.0605,-0.0512 -0.13953,-0.0512 z"
         style="font-weight:bold;font-family:sans-serif;-inkscape-font-specification:'sans-serif Bold'"
         id="path60602" />
      <path
         d="m 178.19555,157.3591 v -0.43563 h 0.43564 v 0.43563 z"
         style="font-weight:bold;font-family:sans-serif;-inkscape-font-specification:'sans-serif Bold'"
         id="path60604" />
      <path
         d="m 178.99395,156.83355 0.42168,-0.0465 q 0.0155,0.12868 0.0806,0.19069 0.0651,0.062 0.17208,0.062 0.13488,0 0.22945,-0.12402 0.0946,-0.12403 0.12092,-0.5147 -0.16433,0.19069 -0.41083,0.19069 -0.2682,0 -0.46354,-0.20619 -0.19378,-0.20774 -0.19378,-0.53951 0,-0.34571 0.20463,-0.55655 0.20619,-0.21239 0.524,-0.21239 0.34572,0 0.56741,0.2682 0.22169,0.26665 0.22169,0.87902 0,0.62321 -0.23099,0.89917 -0.23099,0.27595 -0.60151,0.27595 -0.26665,0 -0.43099,-0.14108 -0.16433,-0.14263 -0.21084,-0.42478 z m 0.98599,-0.95188 q 0,-0.21084 -0.0977,-0.32711 -0.0961,-0.11627 -0.22324,-0.11627 -0.12092,0 -0.20154,0.0961 -0.0791,0.0946 -0.0791,0.3116 0,0.22015 0.0868,0.32402 0.0868,0.10231 0.21704,0.10231 0.12558,0 0.21084,-0.0992 0.0868,-0.0992 0.0868,-0.29146 z"
         style="font-weight:bold;font-family:sans-serif;-inkscape-font-specification:'sans-serif Bold'"
         id="path60606" />
      <path
         d="m 180.75044,155.522 v -0.40462 h 1.48983 v 0.31626 q -0.18449,0.18138 -0.37517,0.52089 -0.19069,0.33952 -0.29146,0.72244 -0.0992,0.38137 -0.0977,0.68213 h -0.42013 q 0.0109,-0.47129 0.19379,-0.96118 0.18449,-0.48989 0.49144,-0.87592 z"
         style="font-weight:bold;font-family:sans-serif;-inkscape-font-specification:'sans-serif Bold'"
         id="path60608" />
      <path
         d="m 182.88984,156.13282 q -0.16898,-0.0713 -0.2465,-0.19534 -0.076,-0.12557 -0.076,-0.2744 0,-0.25425 0.17673,-0.42013 0.17829,-0.16588 0.5054,-0.16588 0.32401,0 0.50229,0.16588 0.17984,0.16588 0.17984,0.42013 0,0.15813 -0.0822,0.28215 -0.0822,0.12248 -0.23099,0.18759 0.18913,0.076 0.2868,0.22169 0.0992,0.14573 0.0992,0.33641 0,0.31471 -0.20154,0.5116 -0.19999,0.19689 -0.5333,0.19689 -0.31006,0 -0.51625,-0.16278 -0.24339,-0.19224 -0.24339,-0.5271 0,-0.18449 0.0915,-0.33797 0.0915,-0.15503 0.28835,-0.23874 z m 0.0899,-0.43873 q 0,0.13022 0.0729,0.20308 0.0744,0.0729 0.19689,0.0729 0.12402,0 0.19844,-0.0729 0.0744,-0.0744 0.0744,-0.20463 0,-0.12248 -0.0744,-0.19534 -0.0729,-0.0744 -0.19379,-0.0744 -0.12557,0 -0.19999,0.0744 -0.0744,0.0744 -0.0744,0.19689 z m -0.0403,0.97358 q 0,0.17983 0.0915,0.2806 0.093,0.10077 0.23099,0.10077 0.13488,0 0.22324,-0.0961 0.0884,-0.0977 0.0884,-0.2806 0,-0.15968 -0.0899,-0.2558 -0.0899,-0.0977 -0.22789,-0.0977 -0.15968,0 -0.23875,0.11007 -0.0775,0.11008 -0.0775,0.23875 z"
         style="font-weight:bold;font-family:sans-serif;-inkscape-font-specification:'sans-serif Bold'"
         id="path60610" />
      <path
         d="m 184.95793,157.3591 -0.81235,-2.27273 h 0.49764 l 0.57516,1.68207 0.55655,-1.68207 h 0.4868 l -0.81391,2.27273 z"
         style="font-weight:bold;font-family:sans-serif;-inkscape-font-specification:'sans-serif Bold'"
         id="path60612" />
    </g>
  </g>
</svg>
