<?xml version="1.0" encoding="UTF-8" standalone="no"?>
<!-- Created with Inkscape (http://www.inkscape.org/) -->

<svg
   width="79.63842mm"
   height="65.457237mm"
   viewBox="0 0 79.63842 65.457237"
   version="1.1"
   id="svg37530"
   xmlns="http://www.w3.org/2000/svg"
   xmlns:svg="http://www.w3.org/2000/svg">
  <defs
     id="defs37527" />
  <g
     id="layer1"
     transform="translate(41.109681,-99.706161)">
    <circle
       style="fill:none;stroke:#000000;stroke-width:0.5;stroke-linecap:round;stroke-linejoin:round;stroke-dasharray:none;stroke-opacity:1"
       id="circle18633"
       cx="17.865326"
       cy="145.29086"
       r="5.6246567" />
    <path
       style="fill:none;stroke:#000000;stroke-width:0.4;stroke-linecap:butt;stroke-linejoin:miter;stroke-dasharray:none;stroke-opacity:1"
       d="m 15.48999,141.29086 v 8"
       id="path18635" />
    <path
       style="fill:none;stroke:#000000;stroke-width:0.4;stroke-linecap:butt;stroke-linejoin:miter;stroke-dasharray:none;stroke-opacity:1"
       d="m 15.48999,143.29086 4,-3 v -5"
       id="path18639" />
    <path
       style="fill:none;stroke:#000000;stroke-width:0.4;stroke-linecap:butt;stroke-linejoin:miter;stroke-dasharray:none;stroke-opacity:1"
       d="m 15.48999,147.29086 4,3 v 10"
       id="path18641" />
    <path
       style="fill:#000000;fill-opacity:1;stroke:none;stroke-width:0.264583px;stroke-linecap:butt;stroke-linejoin:miter;stroke-opacity:1"
       d="m 17.5945,150.12027 1.19889,-1.60083 0.8416,1.87963 z"
       id="path18643" />
    <g
       aria-label="GND"
       id="text18651"
       style="font-size:3.88056px;line-height:100%;font-family:Sans;-inkscape-font-specification:Sans;letter-spacing:0px;word-spacing:0px;stroke:#000000;stroke-width:0">
      <path
         d="m 16.777575,164.02652 v -0.32591 l 1.176674,-0.002 v 1.03078 q -0.270957,0.21601 -0.558968,0.3259 -0.28801,0.10801 -0.591179,0.10801 -0.409277,0 -0.744658,-0.17432 -0.333485,-0.17622 -0.504018,-0.50781 -0.170532,-0.33159 -0.170532,-0.74087 0,-0.40549 0.168637,-0.75603 0.170533,-0.35243 0.48886,-0.52296 0.318327,-0.17054 0.733289,-0.17054 0.301274,0 0.543809,0.0985 0.24443,0.0966 0.382751,0.27096 0.138321,0.17432 0.210323,0.45475 l -0.331591,0.091 q -0.06253,-0.21221 -0.155374,-0.33348 -0.09285,-0.12127 -0.265272,-0.19327 -0.172428,-0.0739 -0.382751,-0.0739 -0.252009,0 -0.435805,0.0777 -0.183796,0.0758 -0.297484,0.20085 -0.111794,0.12506 -0.174322,0.27474 -0.106109,0.2577 -0.106109,0.55897 0,0.37138 0.126952,0.6215 0.128846,0.25011 0.373276,0.37138 0.24443,0.12127 0.519177,0.12127 0.238745,0 0.466121,-0.0909 0.227377,-0.0928 0.344855,-0.19706 v -0.51728 z"
         style="font-family:sans-serif;-inkscape-font-specification:sans-serif"
         id="path146118" />
      <path
         d="m 18.492373,165.11603 v -2.77779 h 0.377066 l 1.459,2.18092 v -2.18092 h 0.352434 v 2.77779 h -0.377066 l -1.459,-2.18282 v 2.18282 z"
         style="font-family:sans-serif;-inkscape-font-specification:sans-serif"
         id="path146120" />
      <path
         d="m 21.298579,165.11603 v -2.77779 h 0.956876 q 0.324012,0 0.494544,0.0398 0.238746,0.0549 0.407383,0.19895 0.219798,0.18569 0.327802,0.4756 0.109898,0.28801 0.109898,0.65939 0,0.31643 -0.0739,0.56086 -0.0739,0.24443 -0.189481,0.40549 -0.115583,0.15916 -0.253903,0.25201 -0.136426,0.0909 -0.331591,0.13832 -0.19327,0.0474 -0.445279,0.0474 z m 0.367592,-0.3278 h 0.593074 q 0.274747,0 0.430121,-0.0512 0.157268,-0.0512 0.250114,-0.14401 0.130741,-0.13074 0.202744,-0.35054 0.0739,-0.22169 0.0739,-0.53623 0,-0.4358 -0.144005,-0.66886 -0.14211,-0.23496 -0.346749,-0.31454 -0.147795,-0.0568 -0.475596,-0.0568 h -0.5836 z"
         style="font-family:sans-serif;-inkscape-font-specification:sans-serif"
         id="path146122" />
    </g>
    <path
       style="fill:none;stroke:#000000;stroke-width:0.7;stroke-linecap:butt;stroke-linejoin:miter;stroke-miterlimit:4;stroke-dasharray:none;stroke-opacity:1"
       d="m 16.48999,160.29086 h 6"
       id="path18653" />
    <path
       id="path18655"
       style="fill:#000000;fill-opacity:1;stroke:none;stroke-width:1.04298;stroke-linecap:butt;stroke-linejoin:miter;stroke-miterlimit:4;stroke-dasharray:none;stroke-opacity:1"
       d="m 19.48999,135.29086 h 0.89999 m 0,0 c 0,-0.49703 -0.40293,-0.89996 -0.89999,-0.89996 -0.49702,0 -0.90001,0.40293 -0.90001,0.89996 0,0.49703 0.40293,0.89997 0.89995,0.89997 0.49706,0 0.90005,-0.40294 0.90005,-0.89997 z" />
    <path
       id="path18661"
       style="fill:none;fill-opacity:0.5;stroke:#000000;stroke-width:0.5;stroke-linecap:round;stroke-linejoin:round;stroke-dasharray:none"
       d="m 29.48999,134.29086 a 1,1 0 0 1 1,1 1,1 0 0 1 -1,1 1,1 0 0 1 -1,-1 1,1 0 0 1 1,-1 z" />
    <path
       style="fill:none;stroke:#000000;stroke-width:0.4;stroke-linecap:butt;stroke-linejoin:miter;stroke-dasharray:none;stroke-opacity:1"
       d="m 19.48999,135.29086 h 9"
       id="path18663" />
    <g
       aria-label="Out"
       id="text18673"
       style="font-size:3.88056px;line-height:100%;font-family:Sans;-inkscape-font-specification:Sans;letter-spacing:0px;word-spacing:0px;stroke:#000000;stroke-width:0">
      <path
         d="m 32.49,135.32783 q 0,-0.6916 0.371381,-1.08193 0.371382,-0.39222 0.958771,-0.39222 0.384646,0 0.693499,0.18379 0.308853,0.1838 0.469912,0.51349 0.162953,0.32781 0.162953,0.74466 0,0.42254 -0.170533,0.75603 -0.170532,0.33349 -0.483175,0.50591 -0.312643,0.17054 -0.67455,0.17054 -0.392225,0 -0.701078,-0.18949 -0.308853,-0.18948 -0.468017,-0.51728 Q 32.49,135.69353 32.49,135.32783 Z m 0.378961,0.006 q 0,0.50212 0.269062,0.79203 0.270957,0.28801 0.67834,0.28801 0.414962,0 0.68213,-0.2918 0.269062,-0.2918 0.269062,-0.82803 0,-0.33917 -0.115583,-0.59118 -0.113689,-0.2539 -0.335381,-0.39223 -0.219797,-0.14021 -0.494544,-0.14021 -0.390329,0 -0.672655,0.26906 -0.280431,0.26717 -0.280431,0.89435 z"
         style="font-family:sans-serif;-inkscape-font-specification:sans-serif"
         id="path146106" />
      <path
         d="m 36.89542,136.68073 v -0.29559 q -0.234955,0.34106 -0.638549,0.34106 -0.178111,0 -0.333485,-0.0682 -0.15348,-0.0682 -0.229272,-0.17053 -0.0739,-0.10422 -0.104214,-0.25391 -0.02084,-0.10042 -0.02084,-0.31833 v -1.24678 h 0.341065 v 1.11604 q 0,0.26717 0.02084,0.36002 0.03221,0.13453 0.136426,0.21221 0.104214,0.0758 0.257693,0.0758 0.153479,0 0.288011,-0.0777 0.134531,-0.0796 0.18948,-0.21411 0.05684,-0.13643 0.05684,-0.39412 v -1.07815 h 0.341065 v 2.01229 z"
         style="font-family:sans-serif;-inkscape-font-specification:sans-serif"
         id="path146108" />
      <path
         d="m 38.479477,136.37566 0.04926,0.30128 q -0.144005,0.0303 -0.257694,0.0303 -0.18569,0 -0.28801,-0.0587 -0.102319,-0.0587 -0.144005,-0.15348 -0.04169,-0.0966 -0.04169,-0.40359 v -1.15772 h -0.250114 v -0.26528 h 0.250114 v -0.49833 l 0.33917,-0.20464 v 0.70297 h 0.34296 v 0.26528 h -0.34296 v 1.17667 q 0,0.1459 0.01705,0.18758 0.01895,0.0417 0.05874,0.0663 0.04169,0.0246 0.117477,0.0246 0.05684,0 0.14969,-0.0133 z"
         style="font-family:sans-serif;-inkscape-font-specification:sans-serif"
         id="path146110" />
    </g>
    <path
       style="fill:none;stroke:#000000;stroke-width:0.4;stroke-linecap:butt;stroke-linejoin:miter;stroke-dasharray:none;stroke-opacity:1"
       d="m 19.48999,106.29086 v 29"
       id="path18679" />
    <path
       id="path18681"
       d="m 20.98999,127.29086 h -3 v -9 h 3 z"
       style="fill:#ffffff;fill-opacity:1;stroke:#000000;stroke-width:0.5;stroke-linecap:butt;stroke-linejoin:miter;stroke-miterlimit:4;stroke-dasharray:none;stroke-opacity:1" />
    <g
       aria-label="T1"
       id="text18697"
       style="font-size:3.88056px;line-height:100%;font-family:Sans;-inkscape-font-specification:Sans;letter-spacing:0px;word-spacing:0px;stroke:#000000;stroke-width:0">
      <path
         d="m 26.405174,146.29086 v -2.44998 h -0.915191 v -0.3278 h 2.201763 v 0.3278 h -0.91898 v 2.44998 z"
         style="font-family:sans-serif;-inkscape-font-specification:sans-serif"
         id="path146113" />
      <path
         d="m 29.215169,146.29086 h -0.341065 v -2.17334 q -0.123162,0.11748 -0.324011,0.23496 -0.198955,0.11748 -0.358118,0.17621 V 144.199 q 0.286115,-0.13453 0.500228,-0.32591 0.214113,-0.19137 0.303169,-0.37138 h 0.219797 z"
         style="font-family:sans-serif;-inkscape-font-specification:sans-serif"
         id="path146115" />
    </g>
    <g
       aria-label="R2"
       id="text18701"
       style="font-size:3.88056px;line-height:100%;font-family:Sans;-inkscape-font-specification:Sans;letter-spacing:0px;word-spacing:0px;stroke:#000000;stroke-width:0">
      <path
         d="m 11.039088,122.29086 v -2.77778 h 1.231623 q 0.371381,0 0.564651,0.0758 0.19327,0.0739 0.308854,0.26338 0.115583,0.18948 0.115583,0.41875 0,0.29559 -0.191376,0.49833 -0.191375,0.20275 -0.591179,0.2577 0.1459,0.0701 0.221692,0.13832 0.161059,0.14779 0.305064,0.36949 l 0.483175,0.75602 h -0.462332 l -0.367592,-0.57791 q -0.161059,-0.25012 -0.265273,-0.38275 -0.104214,-0.13264 -0.187586,-0.18569 -0.08148,-0.0531 -0.166742,-0.0739 -0.06253,-0.0133 -0.204639,-0.0133 H 11.40668 v 1.23351 z m 0.367592,-1.55184 h 0.790133 q 0.252009,0 0.39412,-0.0512 0.14211,-0.0531 0.216007,-0.16674 0.0739,-0.11559 0.0739,-0.25012 0,-0.19706 -0.144005,-0.32401 -0.142111,-0.12695 -0.450964,-0.12695 H 11.40668 Z"
         style="font-family:sans-serif;-inkscape-font-specification:sans-serif"
         id="path146094" />
      <path
         d="m 15.489984,121.96306 v 0.3278 h -1.836066 q -0.0038,-0.12316 0.03979,-0.23685 0.07011,-0.18758 0.223587,-0.36948 0.155374,-0.18191 0.447174,-0.42065 0.452858,-0.37138 0.612022,-0.58739 0.159163,-0.2179 0.159163,-0.41117 0,-0.20275 -0.1459,-0.34107 -0.144005,-0.14021 -0.377066,-0.14021 -0.246324,0 -0.394119,0.14779 -0.147795,0.1478 -0.14969,0.40928 l -0.350539,-0.036 q 0.036,-0.39223 0.270957,-0.59687 0.234956,-0.20653 0.63097,-0.20653 0.399804,0 0.632865,0.22169 0.233061,0.22169 0.233061,0.5495 0,0.16674 -0.06821,0.3278 -0.06821,0.16106 -0.227376,0.33917 -0.157269,0.17811 -0.524861,0.48886 -0.306959,0.25769 -0.39412,0.35054 -0.08716,0.091 -0.144005,0.18379 z"
         style="font-family:sans-serif;-inkscape-font-specification:sans-serif"
         id="path146096" />
    </g>
    <g
       aria-label="10k"
       id="text18705"
       style="font-size:3.175px;line-height:100%;font-family:Sans;-inkscape-font-specification:Sans;letter-spacing:0px;word-spacing:0px;stroke:#000000;stroke-width:0">
      <path
         d="m 11.566205,126.57291 h -0.279053 v -1.77819 q -0.100769,0.0961 -0.2651,0.19224 -0.162781,0.0961 -0.293005,0.14417 v -0.26975 q 0.234094,-0.11007 0.409277,-0.26665 0.175183,-0.15658 0.248047,-0.30385 h 0.179834 z"
         style="font-family:sans-serif;-inkscape-font-specification:sans-serif"
         id="path146099" />
      <path
         d="m 12.28089,125.45204 q 0,-0.40307 0.08216,-0.64802 0.08372,-0.24649 0.246497,-0.37982 0.164331,-0.13332 0.412378,-0.13332 0.182934,0 0.320911,0.0744 0.137976,0.0729 0.227893,0.21239 0.08992,0.13798 0.141076,0.33796 0.05116,0.19844 0.05116,0.5364 0,0.39998 -0.08217,0.64648 -0.08216,0.24494 -0.246496,0.37982 -0.162781,0.13332 -0.412378,0.13332 -0.328662,0 -0.516248,-0.23564 -0.224792,-0.2837 -0.224792,-0.92398 z m 0.286804,0 q 0,0.55966 0.130225,0.7457 0.131775,0.18448 0.324011,0.18448 0.192236,0 0.322461,-0.18603 0.131775,-0.18604 0.131775,-0.74415 0,-0.5612 -0.131775,-0.74569 -0.130225,-0.18448 -0.325562,-0.18448 -0.192236,0 -0.306958,0.16278 -0.144177,0.20774 -0.144177,0.76739 z"
         style="font-family:sans-serif;-inkscape-font-specification:sans-serif"
         id="path146101" />
      <path
         d="m 14.125738,126.57291 v -2.27273 h 0.279053 v 1.29604 l 0.660425,-0.66972 h 0.361218 l -0.629419,0.61081 0.692981,1.0356 h -0.344165 l -0.544153,-0.84181 -0.196887,0.18913 v 0.65268 z"
         style="font-family:sans-serif;-inkscape-font-specification:sans-serif"
         id="path146103" />
    </g>
    <g
       aria-label="100k"
       id="text24016"
       style="font-size:3.175px;line-height:100%;font-family:Sans;-inkscape-font-specification:Sans;letter-spacing:0px;word-spacing:0px;stroke:#000000;stroke-width:0">
      <path
         d="m -20.199588,124.57291 h -0.279053 v -1.77819 q -0.100769,0.0961 -0.2651,0.19224 -0.162781,0.0961 -0.293005,0.14417 v -0.26975 q 0.234094,-0.11007 0.409277,-0.26665 0.175183,-0.15658 0.248047,-0.30385 h 0.179834 z"
         style="font-family:sans-serif;-inkscape-font-specification:sans-serif"
         id="path146135" />
      <path
         d="m -19.484903,123.45204 q 0,-0.40307 0.08217,-0.64802 0.08371,-0.24649 0.246496,-0.37982 0.164331,-0.13332 0.412378,-0.13332 0.182935,0 0.320911,0.0744 0.137976,0.0729 0.227893,0.21239 0.08992,0.13798 0.141076,0.33796 0.05116,0.19844 0.05116,0.5364 0,0.39998 -0.08216,0.64648 -0.08217,0.24494 -0.246497,0.37982 -0.162781,0.13332 -0.412378,0.13332 -0.328662,0 -0.516248,-0.23564 -0.224792,-0.2837 -0.224792,-0.92398 z m 0.286804,0 q 0,0.55966 0.130225,0.7457 0.131775,0.18448 0.324011,0.18448 0.192236,0 0.322461,-0.18603 0.131775,-0.18604 0.131775,-0.74415 0,-0.5612 -0.131775,-0.74569 -0.130225,-0.18448 -0.325562,-0.18448 -0.192236,0 -0.306958,0.16278 -0.144177,0.20774 -0.144177,0.76739 z"
         style="font-family:sans-serif;-inkscape-font-specification:sans-serif"
         id="path146137" />
      <path
         d="m -17.719119,123.45204 q 0,-0.40307 0.08216,-0.64802 0.08372,-0.24649 0.246497,-0.37982 0.164331,-0.13332 0.412378,-0.13332 0.182934,0 0.32091,0.0744 0.137976,0.0729 0.227893,0.21239 0.08992,0.13798 0.141077,0.33796 0.05116,0.19844 0.05116,0.5364 0,0.39998 -0.08217,0.64648 -0.08216,0.24494 -0.246496,0.37982 -0.162781,0.13332 -0.412378,0.13332 -0.328662,0 -0.516248,-0.23564 -0.224792,-0.2837 -0.224792,-0.92398 z m 0.286804,0 q 0,0.55966 0.130224,0.7457 0.131775,0.18448 0.324012,0.18448 0.192236,0 0.322461,-0.18603 0.131775,-0.18604 0.131775,-0.74415 0,-0.5612 -0.131775,-0.74569 -0.130225,-0.18448 -0.325562,-0.18448 -0.192236,0 -0.306958,0.16278 -0.144177,0.20774 -0.144177,0.76739 z"
         style="font-family:sans-serif;-inkscape-font-specification:sans-serif"
         id="path146139" />
      <path
         d="m -15.874271,124.57291 v -2.27273 h 0.279053 v 1.29604 l 0.660425,-0.66972 h 0.361218 l -0.629419,0.61081 0.692981,1.0356 h -0.344165 l -0.544153,-0.84181 -0.196887,0.18913 v 0.65268 z"
         style="font-family:sans-serif;-inkscape-font-specification:sans-serif"
         id="path146141" />
    </g>
    <g
       aria-label="D1"
       id="text24020"
       style="font-size:3.88056px;line-height:100%;font-family:Sans;-inkscape-font-specification:Sans;letter-spacing:0px;word-spacing:0px;stroke:#000000;stroke-width:0">
      <path
         d="m -25.510008,130.29089 v -2.77778 h 0.956876 q 0.324012,0 0.494544,0.0398 0.238746,0.055 0.407383,0.19896 0.219798,0.18569 0.327801,0.47559 0.109899,0.28801 0.109899,0.65939 0,0.31644 -0.0739,0.56087 -0.0739,0.24443 -0.189481,0.40548 -0.115583,0.15917 -0.253904,0.25201 -0.136425,0.0909 -0.33159,0.13832 -0.19327,0.0474 -0.445279,0.0474 z m 0.367592,-0.3278 h 0.593074 q 0.274747,0 0.430121,-0.0512 0.157268,-0.0512 0.250114,-0.144 0.130741,-0.13074 0.202744,-0.35054 0.0739,-0.22169 0.0739,-0.53623 0,-0.43581 -0.144005,-0.66887 -0.14211,-0.23495 -0.346749,-0.31453 -0.147795,-0.0569 -0.475596,-0.0569 h -0.5836 z"
         style="font-family:sans-serif;-inkscape-font-specification:sans-serif"
         id="path146144" />
      <path
         d="M -21.561235,130.29089 H -21.9023 v -2.17334 q -0.123162,0.11748 -0.324012,0.23496 -0.198954,0.11748 -0.358118,0.17622 v -0.3297 q 0.286116,-0.13453 0.500229,-0.32591 0.214113,-0.19137 0.303168,-0.37138 h 0.219798 z"
         style="font-family:sans-serif;-inkscape-font-specification:sans-serif"
         id="path146146" />
    </g>
    <path
       id="path24022"
       style="fill:none;fill-opacity:0.5;stroke:#000000;stroke-width:0.5;stroke-linecap:round;stroke-linejoin:round;stroke-dasharray:none"
       d="m -35.51001,134.29086 a 1,1 0 0 1 1,1 1,1 0 0 1 -1,1 1,1 0 0 1 -1,-1 1,1 0 0 1 1,-1 z" />
    <path
       style="fill:none;stroke:#000000;stroke-width:0.4;stroke-linecap:butt;stroke-linejoin:miter;stroke-dasharray:none;stroke-opacity:1"
       d="m -34.51001,135.29086 h 24"
       id="path24024" />
    <path
       id="path24026"
       d="m -19.51001,132.29086 v 6 l -6,-3 z"
       style="fill:none;stroke:#000000;stroke-width:0.5;stroke-linecap:butt;stroke-linejoin:miter;stroke-miterlimit:4;stroke-dasharray:none;stroke-opacity:1" />
    <path
       id="path24028"
       d="m -25.51001,138.29086 v -6"
       style="fill:none;stroke:#000000;stroke-width:0.5;stroke-linecap:butt;stroke-linejoin:miter;stroke-miterlimit:4;stroke-dasharray:none;stroke-opacity:1" />
    <path
       id="path24032"
       style="fill:none;fill-opacity:0.5;stroke:#000000;stroke-width:0.5;stroke-linecap:round;stroke-linejoin:round;stroke-dasharray:none"
       d="m -35.51001,144.29086 a 1,1 0 0 1 1,1 1,1 0 0 1 -1,1 1,1 0 0 1 -1,-1 1,1 0 0 1 1,-1 z" />
    <path
       style="fill:none;stroke:#000000;stroke-width:0.4;stroke-linecap:butt;stroke-linejoin:miter;stroke-dasharray:none;stroke-opacity:1"
       d="m -34.51001,145.29086 h 24"
       id="path24034" />
    <path
       id="path24036"
       d="m -19.51001,142.29086 v 6 l -6,-3 z"
       style="fill:none;stroke:#000000;stroke-width:0.5;stroke-linecap:butt;stroke-linejoin:miter;stroke-miterlimit:4;stroke-dasharray:none;stroke-opacity:1" />
    <path
       id="path24038"
       d="m -25.51001,148.29086 v -6"
       style="fill:none;stroke:#000000;stroke-width:0.5;stroke-linecap:butt;stroke-linejoin:miter;stroke-miterlimit:4;stroke-dasharray:none;stroke-opacity:1" />
    <path
       style="fill:none;stroke:#000000;stroke-width:0.4;stroke-linecap:butt;stroke-linejoin:miter;stroke-dasharray:none;stroke-opacity:1"
       d="m 19.48999,110.29086 h -30 v 35"
       id="path24042" />
    <path
       id="path24044"
       d="m -9.01001,127.29086 h -3 v -9 h 3 z"
       style="fill:#ffffff;fill-opacity:1;stroke:#000000;stroke-width:0.5;stroke-linecap:butt;stroke-linejoin:miter;stroke-miterlimit:4;stroke-dasharray:none;stroke-opacity:1" />
    <path
       id="path24048"
       style="fill:#000000;fill-opacity:1;stroke:none;stroke-width:1.04298;stroke-linecap:butt;stroke-linejoin:miter;stroke-miterlimit:4;stroke-dasharray:none;stroke-opacity:1"
       d="m -10.51001,135.29086 h 0.89999 m 0,0 c 0,-0.49703 -0.40293,-0.89996 -0.89999,-0.89996 -0.49702,0 -0.90001,0.40293 -0.90001,0.89996 0,0.49703 0.40293,0.89997 0.89995,0.89997 0.49706,0 0.90005,-0.40294 0.90005,-0.89997 z" />
    <g
       aria-label="R1"
       id="text24052"
       style="font-size:3.88056px;line-height:100%;font-family:Sans;-inkscape-font-specification:Sans;letter-spacing:0px;word-spacing:0px;stroke:#000000;stroke-width:0">
      <path
         d="m -18.4531,120.29086 v -2.77778 h 1.231623 q 0.371382,0 0.564652,0.0758 0.19327,0.0739 0.308853,0.26338 0.115583,0.18948 0.115583,0.41875 0,0.29559 -0.191375,0.49833 -0.191375,0.20275 -0.591179,0.2577 0.1459,0.0701 0.221692,0.13832 0.161058,0.14779 0.305064,0.36949 l 0.483175,0.75602 h -0.462333 l -0.367592,-0.57791 q -0.161058,-0.25012 -0.265272,-0.38275 -0.104215,-0.13264 -0.187586,-0.18569 -0.08148,-0.0531 -0.166743,-0.0739 -0.06253,-0.0133 -0.204639,-0.0133 h -0.426331 v 1.23351 z m 0.367592,-1.55184 h 0.790134 q 0.252009,0 0.394119,-0.0512 0.14211,-0.0531 0.216008,-0.16674 0.0739,-0.11559 0.0739,-0.25012 0,-0.19706 -0.144005,-0.32401 -0.14211,-0.12695 -0.450963,-0.12695 h -0.87919 z"
         style="font-family:sans-serif;-inkscape-font-specification:sans-serif"
         id="path146130" />
      <path
         d="m -14.510011,120.29086 h -0.341065 v -2.17334 q -0.123163,0.11748 -0.324012,0.23496 -0.198954,0.11748 -0.358118,0.17621 V 118.199 q 0.286116,-0.13453 0.500228,-0.32591 0.214113,-0.19137 0.303169,-0.37138 h 0.219798 z"
         style="font-family:sans-serif;-inkscape-font-specification:sans-serif"
         id="path146132" />
    </g>
    <g
       aria-label="D2"
       id="text24056"
       style="font-size:3.88056px;line-height:100%;font-family:Sans;-inkscape-font-specification:Sans;letter-spacing:0px;word-spacing:0px;stroke:#000000;stroke-width:0">
      <path
         d="m -25.510008,153.08002 v -2.77779 h 0.956876 q 0.324012,0 0.494544,0.0398 0.238746,0.055 0.407383,0.19896 0.219798,0.18569 0.327801,0.47559 0.109899,0.28802 0.109899,0.6594 0,0.31643 -0.0739,0.56086 -0.0739,0.24443 -0.189481,0.40549 -0.115583,0.15916 -0.253904,0.25201 -0.136425,0.0909 -0.33159,0.13832 -0.19327,0.0474 -0.445279,0.0474 z m 0.367592,-0.3278 h 0.593074 q 0.274747,0 0.430121,-0.0512 0.157268,-0.0512 0.250114,-0.14401 0.130741,-0.13074 0.202744,-0.35054 0.0739,-0.22169 0.0739,-0.53623 0,-0.4358 -0.144005,-0.66886 -0.14211,-0.23496 -0.346749,-0.31454 -0.147795,-0.0568 -0.475596,-0.0568 h -0.5836 z"
         style="font-family:sans-serif;-inkscape-font-specification:sans-serif"
         id="path146149" />
      <path
         d="m -21.053428,152.75222 v 0.3278 h -1.836065 q -0.0038,-0.12317 0.03979,-0.23685 0.07011,-0.18759 0.223587,-0.36949 0.155374,-0.1819 0.447174,-0.42065 0.452858,-0.37138 0.612021,-0.58739 0.159164,-0.2179 0.159164,-0.41117 0,-0.20274 -0.1459,-0.34106 -0.144005,-0.14022 -0.377066,-0.14022 -0.246325,0 -0.394119,0.1478 -0.147795,0.14779 -0.14969,0.40927 l -0.350539,-0.036 q 0.036,-0.39222 0.270957,-0.59686 0.234956,-0.20654 0.63097,-0.20654 0.399804,0 0.632865,0.2217 0.233061,0.22169 0.233061,0.54949 0,0.16674 -0.06821,0.3278 -0.06821,0.16106 -0.227377,0.33917 -0.157268,0.17811 -0.524861,0.48886 -0.306958,0.25769 -0.394119,0.35054 -0.08716,0.0909 -0.144005,0.1838 z"
         style="font-family:sans-serif;-inkscape-font-specification:sans-serif"
         id="path146151" />
    </g>
    <g
       aria-label="A"
       id="text24060"
       style="font-size:3.88056px;line-height:100%;font-family:Sans;-inkscape-font-specification:Sans;letter-spacing:0px;word-spacing:0px;stroke:#000000;stroke-width:0">
      <path
         d="m -41.109681,136.67978 1.066775,-2.77778 h 0.396014 l 1.136883,2.77778 h -0.418752 l -0.324011,-0.84129 h -1.161515 l -0.305064,0.84129 z m 0.801503,-1.14067 h 0.941718 l -0.289906,-0.76929 q -0.132636,-0.35054 -0.197059,-0.57602 -0.05306,0.26716 -0.14969,0.53054 z"
         style="font-family:sans-serif;-inkscape-font-specification:sans-serif"
         id="path146157" />
    </g>
    <g
       aria-label="B"
       id="text24064"
       style="font-size:3.88056px;line-height:100%;font-family:Sans;-inkscape-font-specification:Sans;letter-spacing:0px;word-spacing:0px;stroke:#000000;stroke-width:0">
      <path
         d="M -40.607556,146.67978 V 143.902 h 1.042142 q 0.318327,0 0.509703,0.0853 0.19327,0.0834 0.301274,0.25959 0.109898,0.17432 0.109898,0.3657 0,0.17811 -0.09663,0.33538 -0.09663,0.15727 -0.2918,0.2539 0.252009,0.0739 0.38654,0.25201 0.136426,0.17811 0.136426,0.42065 0,0.19516 -0.08337,0.3638 -0.08148,0.16674 -0.202744,0.25769 -0.121268,0.0909 -0.305064,0.13832 -0.181901,0.0455 -0.447174,0.0455 z m 0.367592,-1.61058 h 0.600653 q 0.24443,0 0.350539,-0.0322 0.140215,-0.0417 0.210323,-0.13832 0.072,-0.0966 0.072,-0.24253 0,-0.13832 -0.06632,-0.24254 -0.06632,-0.10611 -0.18948,-0.144 -0.123162,-0.0398 -0.422541,-0.0398 h -0.555178 z m 0,1.28278 h 0.691603 q 0.178112,0 0.250115,-0.0133 0.126952,-0.0227 0.212218,-0.0758 0.08527,-0.0531 0.140215,-0.15348 0.05495,-0.10232 0.05495,-0.23495 0,-0.15538 -0.07958,-0.26907 -0.07958,-0.11558 -0.221692,-0.16105 -0.140216,-0.0474 -0.405488,-0.0474 h -0.642339 z"
         style="font-family:sans-serif;-inkscape-font-specification:sans-serif"
         id="path146154" />
    </g>
    <path
       style="fill:none;stroke:#000000;stroke-width:0.4;stroke-linecap:butt;stroke-linejoin:miter;stroke-dasharray:none;stroke-opacity:1"
       d="m 15.48999,145.29086 h -26"
       id="path24070" />
    <path
       id="path24090"
       style="fill:none;fill-opacity:0.5;stroke:#000000;stroke-width:0.5;stroke-linecap:round;stroke-linejoin:round;stroke-dasharray:none"
       d="m 19.48999,104.29086 a 1,1 0 0 1 1,1 1,1 0 0 1 -1,1 1,1 0 0 1 -1,-1 1,1 0 0 1 1,-1 z" />
    <g
       aria-label="+VCC"
       id="text24100"
       style="font-size:3.88056px;line-height:100%;font-family:Sans;-inkscape-font-specification:Sans;letter-spacing:0px;word-spacing:0px;stroke:#000000;stroke-width:0">
      <path
         d="m 16.155079,102.03488 v -0.76171 h -0.756027 v -0.31833 h 0.756027 v -0.75603 h 0.322117 v 0.75603 h 0.756027 v 0.31833 h -0.756027 v 0.76171 z"
         style="font-family:sans-serif;-inkscape-font-specification:sans-serif"
         id="path146080" />
      <path
         d="m 18.542533,102.48395 -1.076249,-2.777786 h 0.397909 l 0.721921,2.017966 q 0.08716,0.24254 0.1459,0.45475 0.06442,-0.22737 0.149689,-0.45475 l 0.750343,-2.017966 h 0.375171 l -1.087618,2.777786 z"
         style="font-family:sans-serif;-inkscape-font-specification:sans-serif"
         id="path146082" />
      <path
         d="m 21.520408,102.62701 0.238935,0.0603 q -0.07513,0.29435 -0.270957,0.44954 -0.194597,0.15395 -0.476638,0.15395 -0.291895,0 -0.475407,-0.11824 -0.18228,-0.11946 -0.278347,-0.34485 -0.09483,-0.22539 -0.09483,-0.48403 0,-0.28204 0.107152,-0.49142 0.108382,-0.2106 0.306674,-0.31899 0.199523,-0.10961 0.438457,-0.10961 0.270957,0 0.455701,0.13794 0.184743,0.13794 0.257409,0.38796 l -0.23524,0.0554 q -0.06281,-0.19706 -0.18228,-0.28697 -0.119467,-0.0899 -0.300516,-0.0899 -0.208144,0 -0.348549,0.0998 -0.139174,0.0998 -0.195828,0.26849 -0.05665,0.16751 -0.05665,0.34609 0,0.23031 0.06651,0.40274 0.06774,0.1712 0.209375,0.25618 0.141637,0.085 0.306675,0.085 0.200754,0 0.339928,-0.11577 0.139173,-0.11577 0.188438,-0.34362 z"
         style="font-size:65%;baseline-shift:sub"
         id="path146084" />
      <path
         d="m 23.341978,102.62701 0.238935,0.0603 q -0.07513,0.29435 -0.270957,0.44954 -0.194596,0.15395 -0.476638,0.15395 -0.291895,0 -0.475407,-0.11824 -0.18228,-0.11946 -0.278346,-0.34485 -0.09483,-0.22539 -0.09483,-0.48403 0,-0.28204 0.107151,-0.49142 0.108383,-0.2106 0.306674,-0.31899 0.199523,-0.10961 0.438458,-0.10961 0.270957,0 0.4557,0.13794 0.184744,0.13794 0.25741,0.38796 l -0.23524,0.0554 q -0.06281,-0.19706 -0.182281,-0.28697 -0.119467,-0.0899 -0.300516,-0.0899 -0.208144,0 -0.348549,0.0998 -0.139173,0.0998 -0.195828,0.26849 -0.05665,0.16751 -0.05665,0.34609 0,0.23031 0.06651,0.40274 0.06774,0.1712 0.209376,0.25618 0.141636,0.085 0.306674,0.085 0.200755,0 0.339928,-0.11577 0.139173,-0.11577 0.188438,-0.34362 z"
         style="font-size:65%;baseline-shift:sub"
         id="path146086" />
    </g>
    <g
       aria-label="D3"
       id="text24114"
       style="font-size:3.88056px;line-height:100%;font-family:Sans;-inkscape-font-specification:Sans;letter-spacing:0px;word-spacing:0px;stroke:#000000;stroke-width:0">
      <path
         d="m 0.00499108,140.24161 v -2.77779 h 0.95687635 q 0.32401157,0 0.49454397,0.0398 0.2387454,0.0549 0.407383,0.19896 0.2197974,0.18569 0.3278012,0.4756 0.1098987,0.28801 0.1098987,0.65939 0,0.31643 -0.073897,0.56086 -0.073897,0.24443 -0.1894804,0.40549 -0.1155831,0.15916 -0.2539039,0.25201 -0.1364259,0.091 -0.3315908,0.13832 -0.19327,0.0474 -0.4452791,0.0474 z m 0.3675921,-0.3278 h 0.59307386 q 0.27474666,0 0.43012066,-0.0512 0.1572688,-0.0512 0.2501142,-0.14401 0.1307415,-0.13074 0.2027441,-0.35054 0.073897,-0.22169 0.073897,-0.53623 0,-0.4358 -0.1440052,-0.66886 -0.1421103,-0.23496 -0.3467492,-0.31454 -0.1477948,-0.0568 -0.47559599,-0.0568 H 0.37258318 Z"
         style="font-family:sans-serif;-inkscape-font-specification:sans-serif"
         id="path146125" />
      <path
         d="m 2.6709812,139.50832 0.3410649,-0.0455 q 0.058739,0.28991 0.1989545,0.41875 0.1421103,0.12696 0.3448544,0.12696 0.2406402,0 0.4054882,-0.16675 0.1667428,-0.16674 0.1667428,-0.41306 0,-0.23496 -0.1534792,-0.38654 -0.1534791,-0.15348 -0.3903297,-0.15348 -0.096635,0 -0.2406402,0.0379 l 0.037896,-0.29938 q 0.034107,0.004 0.054949,0.004 0.2179025,0 0.3922246,-0.11368 0.174322,-0.11369 0.174322,-0.35054 0,-0.18759 -0.1269519,-0.31075 -0.1269519,-0.12316 -0.3278012,-0.12316 -0.1989545,0 -0.3315908,0.12505 -0.1326364,0.12506 -0.1705324,0.37517 l -0.3410649,-0.0606 q 0.062529,-0.34296 0.2842207,-0.53054 0.2216922,-0.18948 0.5513882,-0.18948 0.2273765,0 0.4187518,0.0985 0.1913753,0.0966 0.2917999,0.26527 0.1023195,0.16864 0.1023195,0.35812 0,0.18 -0.096635,0.3278 -0.096635,0.14779 -0.2861155,0.23495 0.2463246,0.0568 0.3827506,0.23685 0.1364259,0.17811 0.1364259,0.44718 0,0.3638 -0.2652727,0.6177 -0.2652726,0.25201 -0.6707608,0.25201 -0.3656973,0 -0.6082323,-0.2179 -0.2406402,-0.2179 -0.2747467,-0.56465 z"
         style="font-family:sans-serif;-inkscape-font-specification:sans-serif"
         id="path146127" />
    </g>
    <path
       style="fill:#000000;fill-opacity:1;stroke:none;stroke-width:0.264583px;stroke-linecap:butt;stroke-linejoin:miter;stroke-opacity:1"
       d="m 26.48999,103.29086 c -2,0 -3,1 -4,2 1,1 2,2 4,2 h 7 v -4 z"
       id="path24132" />
    <path
       style="fill:#000000;fill-opacity:0.25;stroke:none;stroke-width:0.264583px;stroke-linecap:butt;stroke-linejoin:miter;stroke-opacity:1"
       d="m 25.48999,104.29086 1,-1 h 6 v 4 h -6 l -1,-1 z"
       id="path24134" />
    <g
       aria-label="5V"
       id="text24138"
       style="font-size:3.175px;line-height:100%;font-family:Sans;-inkscape-font-specification:Sans;letter-spacing:0px;word-spacing:0px;fill:#ffffff;stroke:#000000;stroke-width:0">
      <path
         d="m 27.12034,105.82341 0.434082,-0.045 q 0.0186,0.14728 0.110071,0.23409 0.09147,0.0853 0.21084,0.0853 0.136425,0 0.230993,-0.11007 0.09457,-0.11162 0.09457,-0.33487 0,-0.20928 -0.09457,-0.31315 -0.09302,-0.10542 -0.243396,-0.10542 -0.187585,0 -0.336413,0.16588 l -0.353467,-0.0512 0.223242,-1.18288 h 1.151868 v 0.40773 h -0.821655 l -0.06821,0.38602 q 0.145727,-0.0729 0.297656,-0.0729 0.289905,0 0.491443,0.21084 0.201538,0.21084 0.201538,0.54725 0,0.28061 -0.162781,0.50075 -0.221692,0.30075 -0.615466,0.30075 -0.31471,0 -0.513147,-0.16898 -0.198438,-0.16898 -0.237195,-0.45423 z"
         style="font-weight:bold;font-family:sans-serif;-inkscape-font-specification:'sans-serif Bold'"
         id="path146089" />
      <path
         d="m 29.55585,106.40787 -0.812353,-2.27273 h 0.497644 l 0.575158,1.68207 0.556556,-1.68207 h 0.486792 l -0.813904,2.27273 z"
         style="font-weight:bold;font-family:sans-serif;-inkscape-font-specification:'sans-serif Bold'"
         id="path146091" />
    </g>
    <path
       id="path24140"
       d="m -0.51001,142.29086 v 6 l 6,-3 z"
       style="fill:none;stroke:#000000;stroke-width:0.5;stroke-linecap:butt;stroke-linejoin:miter;stroke-miterlimit:4;stroke-dasharray:none;stroke-opacity:1" />
    <path
       id="path24142"
       d="m 5.48999,148.29086 v -6"
       style="fill:none;stroke:#000000;stroke-width:0.5;stroke-linecap:butt;stroke-linejoin:miter;stroke-miterlimit:4;stroke-dasharray:none;stroke-opacity:1" />
    <path
       id="path24146"
       style="fill:#000000;fill-opacity:1;stroke:none;stroke-width:1.04298;stroke-linecap:butt;stroke-linejoin:miter;stroke-miterlimit:4;stroke-dasharray:none;stroke-opacity:1"
       d="m 19.48999,110.29086 h 0.89999 m 0,0 c 0,-0.49703 -0.40293,-0.89996 -0.89999,-0.89996 -0.49702,0 -0.90001,0.40293 -0.90001,0.89996 0,0.49703 0.40293,0.89997 0.89995,0.89997 0.49706,0 0.90005,-0.40294 0.90005,-0.89997 z" />
    <path
       id="path25492"
       style="fill:#000000;fill-opacity:1;stroke:none;stroke-width:1.04298;stroke-linecap:butt;stroke-linejoin:miter;stroke-miterlimit:4;stroke-dasharray:none;stroke-opacity:1"
       d="m -10.51001,145.29086 h 0.89999 m 0,0 c 0,-0.49703 -0.40293,-0.89996 -0.89999,-0.89996 -0.49702,0 -0.90001,0.40293 -0.90001,0.89996 0,0.49703 0.40293,0.89997 0.89995,0.89997 0.49706,0 0.90005,-0.40294 0.90005,-0.89997 z" />
  </g>
</svg>
