<?xml version="1.0" encoding="UTF-8" standalone="no"?>
<!-- Created with Inkscape (http://www.inkscape.org/) -->

<svg
   width="62.536457mm"
   height="49.518459mm"
   viewBox="0 0 62.536457 49.518459"
   version="1.1"
   id="svg5240"
   xmlns="http://www.w3.org/2000/svg"
   xmlns:svg="http://www.w3.org/2000/svg">
  <defs
     id="defs5237" />
  <g
     id="layer1"
     transform="translate(-345.1921,-369.91583)">
    <path
       id="path4710"
       d="m 365.21033,384.9959 v -2.8125 h 5.625 v 2.8125 z"
       style="fill:none;stroke:#000000;stroke-width:0.396875;stroke-linecap:round;stroke-linejoin:round;stroke-miterlimit:4;stroke-dasharray:none;stroke-opacity:1" />
    <path
       style="fill:none;stroke:#000000;stroke-width:0.396875;stroke-linecap:round;stroke-linejoin:round;stroke-miterlimit:4;stroke-dasharray:none;stroke-opacity:1"
       d="m 356.77283,384.9959 v -2.8125 h 5.625 v 2.8125 z"
       id="path4712" />
    <path
       id="path4714"
       d="m 348.33533,384.9959 v -2.8125 h 5.625 v 2.8125 z"
       style="fill:none;stroke:#000000;stroke-width:0.396875;stroke-linecap:round;stroke-linejoin:round;stroke-miterlimit:4;stroke-dasharray:none;stroke-opacity:1" />
    <path
       style="fill:none;stroke:#000000;stroke-width:0.396875;stroke-linecap:round;stroke-linejoin:round;stroke-miterlimit:4;stroke-dasharray:none;stroke-opacity:1"
       d="m 390.52283,384.9959 v -2.8125 h 5.625 v 2.8125 z"
       id="path4716" />
    <path
       id="path4718"
       d="m 382.08533,384.9959 v -2.8125 h 5.625 v 2.8125 z"
       style="fill:none;stroke:#000000;stroke-width:0.396875;stroke-linecap:round;stroke-linejoin:round;stroke-miterlimit:4;stroke-dasharray:none;stroke-opacity:1" />
    <path
       style="fill:none;stroke:#000000;stroke-width:0.396875;stroke-linecap:round;stroke-linejoin:round;stroke-miterlimit:4;stroke-dasharray:none;stroke-opacity:1"
       d="m 373.64783,384.9959 v -2.8125 h 5.625 v 2.8125 z"
       id="path4720" />
    <path
       id="path4722"
       d="m 398.96033,384.9959 v -2.8125 h 5.625 v 2.8125 z"
       style="fill:none;stroke:#000000;stroke-width:0.396875;stroke-linecap:round;stroke-linejoin:round;stroke-miterlimit:4;stroke-dasharray:none;stroke-opacity:1" />
    <path
       id="path4724"
       d="m 345.52283,384.9959 h 61.875 v 28.125 h -61.875 z"
       style="fill:none;stroke:#000000;stroke-width:0.661458;stroke-linecap:round;stroke-linejoin:round;stroke-miterlimit:4;stroke-dasharray:none;stroke-opacity:1" />
    <path
       id="path4726"
       d="m 345.52283,396.71849 v 4.67982 c 1.29442,0 2.33991,-1.04549 2.33991,-2.33991 0,-1.29442 -1.04549,-2.33991 -2.33991,-2.33991 z"
       style="fill:none;stroke:#000000;stroke-width:0.661458;stroke-linecap:round;stroke-linejoin:round;stroke-miterlimit:4;stroke-dasharray:none;stroke-opacity:1" />
    <path
       id="path4750"
       d="m 356.77283,402.8084 h 6.5625 v -9.375 h -6.5625 z"
       style="fill:none;stroke:#000000;stroke-width:0.396875;stroke-linecap:round;stroke-linejoin:round;stroke-miterlimit:4;stroke-dasharray:none;stroke-opacity:1" />
    <path
       style="fill:none;stroke:#000000;stroke-width:0.396875;stroke-linecap:round;stroke-linejoin:round;stroke-miterlimit:4;stroke-dasharray:none;stroke-opacity:1"
       d="m 365.21033,415.9334 v -2.8125 h 5.625 v 2.8125 z"
       id="path4756" />
    <path
       id="path4758"
       d="m 356.77283,415.9334 v -2.8125 h 5.625 v 2.8125 z"
       style="fill:none;stroke:#000000;stroke-width:0.396875;stroke-linecap:round;stroke-linejoin:round;stroke-miterlimit:4;stroke-dasharray:none;stroke-opacity:1" />
    <path
       style="fill:none;stroke:#000000;stroke-width:0.396875;stroke-linecap:round;stroke-linejoin:round;stroke-miterlimit:4;stroke-dasharray:none;stroke-opacity:1"
       d="m 348.33533,415.9334 v -2.8125 h 5.625 v 2.8125 z"
       id="path4760" />
    <path
       id="path4762"
       d="m 390.52283,415.9334 v -2.8125 h 5.625 v 2.8125 z"
       style="fill:none;stroke:#000000;stroke-width:0.396875;stroke-linecap:round;stroke-linejoin:round;stroke-miterlimit:4;stroke-dasharray:none;stroke-opacity:1" />
    <path
       style="fill:none;stroke:#000000;stroke-width:0.396875;stroke-linecap:round;stroke-linejoin:round;stroke-miterlimit:4;stroke-dasharray:none;stroke-opacity:1"
       d="m 382.08533,415.9334 v -2.8125 h 5.625 v 2.8125 z"
       id="path4764" />
    <path
       id="path4766"
       d="m 373.64783,415.9334 v -2.8125 h 5.625 v 2.8125 z"
       style="fill:none;stroke:#000000;stroke-width:0.396875;stroke-linecap:round;stroke-linejoin:round;stroke-miterlimit:4;stroke-dasharray:none;stroke-opacity:1" />
    <path
       style="fill:none;stroke:#000000;stroke-width:0.396875;stroke-linecap:round;stroke-linejoin:round;stroke-miterlimit:4;stroke-dasharray:none;stroke-opacity:1"
       d="m 398.96033,415.9334 v -2.8125 h 5.625 v 2.8125 z"
       id="path4768" />
    <path
       style="fill:none;stroke:#000000;stroke-width:0.396875;stroke-linecap:round;stroke-linejoin:round;stroke-miterlimit:4;stroke-dasharray:none;stroke-opacity:1"
       d="m 386.77283,410.3084 v -6.5625 h -9.375 v 6.5625 z"
       id="path4770" />
    <text
       id="text4784"
       y="375.62091"
       x="367.73413"
       style="font-style:normal;font-variant:normal;font-weight:normal;font-stretch:normal;font-size:3.175px;line-height:0%;font-family:sans-serif;-inkscape-font-specification:Sans;text-align:start;letter-spacing:0px;word-spacing:0px;writing-mode:lr-tb;text-anchor:start;fill:#000000;fill-opacity:1;stroke:none;stroke-width:0.264583"
       xml:space="preserve"><tspan
         id="tspan4786"
         x="367.73413"
         y="375.62091"
         style="font-size:7.9375px;line-height:1.25;font-family:sans-serif;stroke-width:0.264583">4075</tspan></text>
    <path
       d="m 356.77283,400.9334 h -1.875 v 3.75 h 14.0625 v -4.6875 h 32.8125 v -15 m -38.4375,13.125 h 30 v -13.125 m -36.5625,13.125 h -3.75 v 8.4375 h 6.5625 v 6.5625 m -2.8125,-17.8125 h -5.625 v 17.8125"
       style="fill:none;stroke:#000000;stroke-width:0.396875;stroke-linecap:butt;stroke-linejoin:miter;stroke-miterlimit:4;stroke-dasharray:none;stroke-opacity:1"
       id="path4788" />
    <path
       d="m 368.02283,413.1209 v -1.875 h 11.25 v -0.9375 m 2.8125,-6.5625 v -1.875 h 11.25 v 11.25 m -11.25,-2.8125 v 1.875 h -5.625 v 0.9375 m 8.4375,-2.8125 v 2.8125"
       style="fill:none;stroke:#000000;stroke-width:0.396875;stroke-linecap:butt;stroke-linejoin:miter;stroke-miterlimit:4;stroke-dasharray:none;stroke-opacity:1"
       id="path4790" />
    <path
       id="path5627"
       d="m 378.33533,387.8084 v 6.5625 h -9.375 v -6.5625 z"
       style="fill:none;stroke:#000000;stroke-width:0.396875;stroke-linecap:round;stroke-linejoin:round;stroke-miterlimit:4;stroke-dasharray:none;stroke-opacity:1" />
    <path
       id="path5629"
       style="fill:none;stroke:#000000;stroke-width:0.396875;stroke-linecap:butt;stroke-linejoin:miter;stroke-miterlimit:4;stroke-dasharray:none;stroke-opacity:1"
       d="m 359.58533,384.9959 v 1.875 h 11.25 v 0.9375 m 2.8125,6.5625 v 1.875 h 11.25 v -11.25 m -11.25,2.8125 v -1.875 h -5.625 v -0.9375 m 8.4375,2.8125 v -2.8125" />
    <text
       id="text4728"
       y="412.15692"
       x="347.87524"
       style="font-style:normal;font-variant:normal;font-weight:normal;font-stretch:normal;font-size:3.175px;line-height:0%;font-family:sans-serif;-inkscape-font-specification:Sans;text-align:start;letter-spacing:0px;word-spacing:0px;writing-mode:lr-tb;text-anchor:start;fill:#000000;fill-opacity:1;stroke:#000000;stroke-width:0.0529167;stroke-miterlimit:4;stroke-dasharray:none;stroke-opacity:1"
       xml:space="preserve"><tspan
         y="412.15692"
         x="347.87524"
         id="tspan4730"
         style="font-size:2.64583px;line-height:1.25;font-family:sans-serif;stroke-width:0.0529167">1</tspan></text>
    <text
       xml:space="preserve"
       style="font-style:normal;font-variant:normal;font-weight:normal;font-stretch:normal;font-size:3.175px;line-height:0%;font-family:sans-serif;-inkscape-font-specification:Sans;text-align:start;letter-spacing:0px;word-spacing:0px;writing-mode:lr-tb;text-anchor:start;fill:#000000;fill-opacity:1;stroke:#000000;stroke-width:0.0529167;stroke-miterlimit:4;stroke-dasharray:none;stroke-opacity:1"
       x="401.03452"
       y="412.15692"
       id="text4732"><tspan
         y="412.15692"
         x="401.03452"
         id="tspan4734"
         style="font-size:2.64583px;line-height:1.25;font-family:sans-serif;stroke-width:0.0529167">7</tspan></text>
    <text
       id="text4736"
       y="387.91409"
       x="403.4021"
       style="font-style:normal;font-variant:normal;font-weight:normal;font-stretch:normal;font-size:3.175px;line-height:0%;font-family:sans-serif;-inkscape-font-specification:Sans;text-align:start;letter-spacing:0px;word-spacing:0px;writing-mode:lr-tb;text-anchor:start;fill:#000000;fill-opacity:1;stroke:#000000;stroke-width:0.0529167;stroke-miterlimit:4;stroke-dasharray:none;stroke-opacity:1"
       xml:space="preserve"><tspan
         y="387.91409"
         x="403.4021"
         id="tspan4738"
         style="font-size:2.64583px;line-height:1.25;font-family:sans-serif;stroke-width:0.0529167">8</tspan></text>
    <text
       xml:space="preserve"
       style="font-style:normal;font-variant:normal;font-weight:normal;font-stretch:normal;font-size:3.175px;line-height:0%;font-family:sans-serif;-inkscape-font-specification:Sans;text-align:start;letter-spacing:0px;word-spacing:0px;writing-mode:lr-tb;text-anchor:start;fill:#000000;fill-opacity:1;stroke:#000000;stroke-width:0.0529167;stroke-miterlimit:4;stroke-dasharray:none;stroke-opacity:1"
       x="349.59558"
       y="387.91412"
       id="text4740"><tspan
         y="387.91412"
         x="349.59558"
         id="tspan4742"
         style="font-size:2.64583px;line-height:1.25;font-family:sans-serif;stroke-width:0.0529167">14</tspan></text>
    <text
       id="text4776"
       y="381.1929"
       x="348.28766"
       style="font-style:normal;font-variant:normal;font-weight:normal;font-stretch:normal;font-size:3.175px;line-height:0%;font-family:sans-serif;-inkscape-font-specification:Sans;text-align:start;letter-spacing:0px;word-spacing:0px;writing-mode:lr-tb;text-anchor:start;fill:#000000;fill-opacity:1;stroke:#000000;stroke-width:0.0529167;stroke-miterlimit:4;stroke-dasharray:none;stroke-opacity:1"
       xml:space="preserve"><tspan
         y="381.1929"
         x="348.28766"
         id="tspan4778"
         style="font-size:3.43958px;line-height:1.25;font-family:sans-serif;stroke-width:0.0529167">Vcc</tspan></text>
    <text
       id="text4780"
       y="419.36584"
       x="397.95117"
       style="font-style:normal;font-variant:normal;font-weight:normal;font-stretch:normal;font-size:3.175px;line-height:0%;font-family:sans-serif;-inkscape-font-specification:Sans;text-align:start;letter-spacing:0px;word-spacing:0px;writing-mode:lr-tb;text-anchor:start;fill:#000000;fill-opacity:1;stroke:#000000;stroke-width:0.0529167;stroke-miterlimit:4;stroke-dasharray:none;stroke-opacity:1"
       xml:space="preserve"><tspan
         y="419.36584"
         x="397.95117"
         id="tspan4782"
         style="font-size:3.43958px;line-height:1.25;font-family:sans-serif;stroke-width:0.0529167">GND</tspan></text>
    <text
       id="text6483"
       y="399.83243"
       x="358.90765"
       style="font-style:normal;font-variant:normal;font-weight:normal;font-stretch:normal;font-size:3.175px;line-height:0%;font-family:sans-serif;-inkscape-font-specification:Sans;text-align:start;letter-spacing:0px;word-spacing:0px;writing-mode:lr-tb;text-anchor:start;fill:#000000;fill-opacity:1;stroke:none;stroke-width:0.264583"
       xml:space="preserve"><tspan
         y="399.83243"
         x="358.90765"
         id="tspan6485"
         style="font-size:4.7625px;line-height:1.25;font-family:sans-serif;stroke-width:0.264583">1</tspan></text>
    <text
       xml:space="preserve"
       style="font-style:normal;font-variant:normal;font-weight:normal;font-stretch:normal;font-size:3.175px;line-height:0%;font-family:sans-serif;-inkscape-font-specification:Sans;text-align:start;letter-spacing:0px;word-spacing:0px;writing-mode:lr-tb;text-anchor:start;fill:#000000;fill-opacity:1;stroke:none;stroke-width:0.264583"
       x="372.50137"
       y="392.80118"
       id="text6487"><tspan
         id="tspan6489"
         x="372.50137"
         y="392.80118"
         style="font-size:4.7625px;line-height:1.25;font-family:sans-serif;stroke-width:0.264583">1</tspan></text>
    <text
       id="text6491"
       y="408.73868"
       x="380.93887"
       style="font-style:normal;font-variant:normal;font-weight:normal;font-stretch:normal;font-size:3.175px;line-height:0%;font-family:sans-serif;-inkscape-font-specification:Sans;text-align:start;letter-spacing:0px;word-spacing:0px;writing-mode:lr-tb;text-anchor:start;fill:#000000;fill-opacity:1;stroke:none;stroke-width:0.264583"
       xml:space="preserve"><tspan
         y="408.73868"
         x="380.93887"
         id="tspan6493"
         style="font-size:4.7625px;line-height:1.25;font-family:sans-serif;stroke-width:0.264583">1</tspan></text>
  </g>
</svg>
