<?xml version="1.0" encoding="UTF-8" standalone="no"?>
<!-- Created with Inkscape (http://www.inkscape.org/) -->

<svg
   width="32.546234mm"
   height="21.762754mm"
   viewBox="0 0 32.546234 21.762756"
   version="1.1"
   id="svg24917"
   xmlns="http://www.w3.org/2000/svg"
   xmlns:svg="http://www.w3.org/2000/svg">
  <defs
     id="defs24914" />
  <g
     id="layer1"
     transform="translate(-134.21687,-16.891223)">
    <g
       id="g11561"
       transform="matrix(0.33,0,0,0.33,95.927224,12.006174)">
      <path
         style="fill:#666666;fill-opacity:1;stroke:#1a1a1a;stroke-width:0.454545;stroke-linecap:round;stroke-linejoin:bevel;stroke-dasharray:none;stroke-opacity:1"
         d="M 212.17622,27.5 190.52559,40 168.87495,27.5 190.52559,15.000002 Z"
         id="path2467" />
      <path
         style="fill:#333333;fill-opacity:1;stroke:#1a1a1a;stroke-width:0.454545;stroke-linecap:round;stroke-linejoin:round;stroke-dasharray:none;stroke-opacity:1"
         d="M 168.87495,27.5 190.52559,40 c 0,0 2.25059,5.970575 2.2548,10.698191 C 192.78563,57.789617 187.84982,63.47042 178.40123,58 169.73319,52.981491 166.83968,42.483849 166.81103,35.671273 166.80553,30.943656 168.87495,27.5 168.87495,27.5 Z"
         id="path2469" />
      <path
         id="path2465"
         style="fill:#4d4d4d;fill-opacity:1;stroke:#1a1a1a;stroke-width:0.454545;stroke-linecap:round;stroke-linejoin:round;stroke-dasharray:none;stroke-opacity:1"
         d="m 192.78246,50.602203 c 0.003,3.864342 -1.40909,7.290566 -4.17618,8.777451 l 21.8847,-12.639046 c 2.6032,-1.547948 3.93925,-4.817023 3.93592,-8.566564 C 214.4209,33.321698 212.17622,27.5 212.17622,27.5 L 190.52559,40 c 0,0 2.25256,5.749858 2.25687,10.602203 z" />
      <path
         style="fill:#b2b2b2;fill-opacity:1;stroke:#666666;stroke-width:0.454545;stroke-linecap:round;stroke-linejoin:round;stroke-dasharray:none;stroke-opacity:1"
         d="m 153.71949,74.250005 1.73205,1 v -2.000007 l -1.73205,-1 z"
         id="path6925" />
      <path
         style="fill:#b2b2b2;fill-opacity:1;stroke:#666666;stroke-width:0.454545;stroke-linecap:round;stroke-linejoin:round;stroke-dasharray:none;stroke-opacity:1"
         d="m 155.45154,75.250001 c 0,0 11.25833,-6.499996 13.85641,-8 2.49999,-1.443377 3.4641,-9.999999 6.06218,-11.499993 2.59808,-1.500002 8.0829,-4.666673 12.12435,-7.000005 v -1.999999 l -12.99038,7.5 C 171.90603,55.75 171.04,64.250005 168.44192,65.750006 l -12.99038,7.499995 z"
         id="path6927" />
      <path
         style="fill:#b2b2b2;fill-opacity:1;stroke:#666666;stroke-width:0.454545;stroke-linecap:round;stroke-linejoin:round;stroke-dasharray:none;stroke-opacity:1"
         d="m 155.45154,73.250001 12.99037,-7.499996 c 2.7538,-1.589906 3.46412,-10.000001 6.0622,-11.500003 2.59808,-1.499995 8.66025,-4.999997 12.99038,-7.5 l -1.73205,-1 c 0,0 -10.39231,6.000005 -12.99038,7.5 -2.59808,1.5 -3.56219,10.056621 -6.0622,11.500003 l -12.99037,7.499996 z"
         id="path6929" />
      <path
         style="fill:#b2b2b2;fill-opacity:1;stroke:#666666;stroke-width:0.454545;stroke-linecap:round;stroke-linejoin:round;stroke-dasharray:none;stroke-opacity:1"
         d="m 127.73874,57.250001 12.99037,-7.499997 c 2.75379,-1.589903 17.32051,-2.000001 19.91859,-3.500003 2.59808,-1.499995 8.66026,-4.999997 12.99039,-7.5 l -1.73205,-1 -12.99039,7.5 c -2.59808,1.500001 -17.41859,2.056626 -19.91859,3.500003 l -12.99037,7.499997 z"
         id="path7403" />
      <path
         style="fill:#b2b2b2;fill-opacity:1;stroke:#666666;stroke-width:0.454545;stroke-linecap:round;stroke-linejoin:round;stroke-dasharray:none;stroke-opacity:1"
         d="m 126.00669,58.250009 1.73205,1 v -2.000008 l -1.73205,-1 z"
         id="path7405" />
      <path
         style="fill:#b2b2b2;fill-opacity:1;stroke:#666666;stroke-width:0.454545;stroke-linecap:round;stroke-linejoin:round;stroke-dasharray:none;stroke-opacity:1"
         d="m 127.73874,59.250001 c 0,0 11.25833,-6.499996 13.85641,-8 2.49999,-1.443377 17.3205,-2.000002 19.91858,-3.499996 L 173.63809,40.75 v -1.999999 l -12.99039,7.5 c -2.59807,1.499996 -17.3205,2.000004 -19.91858,3.500005 l -12.99038,7.499995 z"
         id="path7407" />
      <path
         style="fill:#b2b2b2;fill-opacity:1;stroke:#666666;stroke-width:0.454545;stroke-linecap:round;stroke-linejoin:round;stroke-dasharray:none;stroke-opacity:1"
         d="m 141.59516,65.249998 38.97113,-22.499996 -1.73205,-1 -38.97113,22.499997 z"
         id="path7409" />
      <path
         style="fill:#b2b2b2;fill-opacity:1;stroke:#666666;stroke-width:0.454545;stroke-linecap:round;stroke-linejoin:round;stroke-dasharray:none;stroke-opacity:1"
         d="m 139.86309,66.250005 1.73205,1 v -2.000007 l -1.73205,-1 z"
         id="path7411" />
      <path
         style="fill:#b2b2b2;fill-opacity:1;stroke:#666666;stroke-width:0.454545;stroke-linecap:round;stroke-linejoin:round;stroke-dasharray:none;stroke-opacity:1"
         d="m 141.59514,67.250001 38.97115,-22.5 v -1.999999 l -38.97115,22.499999 z"
         id="path7413" />
    </g>
    <path
       d="m 136.71688,33.461594 -2.50001,-1.443381 0.74582,-0.430595 q 0.25254,-0.145807 0.42129,-0.201851 0.2355,-0.07892 0.49658,-0.07995 0.33844,-0.0025 0.68352,0.09962 0.34487,0.100203 0.67911,0.293179 0.28479,0.164424 0.44717,0.3247 0.16237,0.160266 0.21725,0.29596 0.0532,0.134715 0.0289,0.245204 -0.0245,0.108662 -0.13395,0.221092 -0.10797,0.111607 -0.3044,0.225012 z m -0.009,-0.335749 0.46225,-0.266879 q 0.21414,-0.123636 0.28921,-0.220136 0.0765,-0.09735 0.0653,-0.187378 -0.0157,-0.126769 -0.15748,-0.273383 -0.1419,-0.148451 -0.42499,-0.311895 -0.39222,-0.226447 -0.71421,-0.282754 -0.32222,-0.05813 -0.55336,-0.0074 -0.16638,0.03698 -0.42186,0.184467 l -0.45487,0.262617 z"
       id="path65692"
       style="font-size:3.52778px;line-height:1.25;stroke-width:0.523875" />
    <path
       d="m 140.21546,35.774354 0.24294,-0.171814 q 0.20679,0.09722 0.39729,0.127046 0.19027,0.02802 0.41296,-0.01396 0.22105,-0.04297 0.40567,-0.1495 0.16392,-0.09464 0.23322,-0.199584 0.0693,-0.10494 0.0326,-0.196049 -0.0368,-0.09296 -0.15279,-0.159895 -0.11768,-0.06791 -0.26371,-0.08405 -0.14778,-0.01713 -0.3433,0.02693 -0.12635,0.02762 -0.50655,0.152648 -0.38187,0.123988 -0.57484,0.150718 -0.24883,0.03544 -0.46379,-3e-5 -0.21519,-0.03722 -0.38743,-0.13667 -0.18929,-0.109286 -0.25997,-0.257528 -0.0724,-0.149213 0.0211,-0.301614 0.0935,-0.15239 0.31204,-0.278586 0.24072,-0.138976 0.51424,-0.192525 0.27332,-0.05534 0.54618,-0.01208 0.27288,0.04326 0.50026,0.166053 l -0.25084,0.172359 q -0.25915,-0.124077 -0.50875,-0.11978 -0.24809,0.004 -0.49767,0.147519 -0.25993,0.150075 -0.26872,0.283131 -0.009,0.131224 0.14618,0.220829 0.13472,0.07781 0.30589,0.0794 0.16976,0.002 0.61031,-0.145599 0.4404,-0.149896 0.63856,-0.185556 0.28965,-0.05108 0.53494,-0.01346 0.24355,0.03663 0.44478,0.152787 0.19952,0.115186 0.27794,0.274715 0.0767,0.158538 -0.0105,0.323076 -0.0874,0.162717 -0.31926,0.296585 -0.29389,0.169676 -0.59217,0.22768 -0.29679,0.05712 -0.60834,0.0089 -0.31176,-0.05039 -0.56835,-0.191714 z"
       id="path65694"
       style="font-size:3.52778px;line-height:1.25;stroke-width:0.523875" />
    <path
       d="m 145.45795,37.808586 -0.29331,-0.169339 0.91515,-0.53065 0.9277,0.535609 q -0.0168,0.234175 -0.14237,0.420884 -0.12725,0.185729 -0.36355,0.322156 -0.319,0.184175 -0.73729,0.24452 -0.41852,0.0585 -0.84986,-0.03708 -0.43136,-0.09556 -0.7997,-0.308231 -0.36495,-0.210697 -0.54899,-0.46873 -0.18427,-0.25987 -0.0897,-0.491724 0.0947,-0.231858 0.41808,-0.418591 0.23481,-0.135576 0.51255,-0.193501 0.27753,-0.05976 0.5422,-0.03143 0.26469,0.02831 0.5732,0.141649 l -0.17658,0.19649 q -0.23968,-0.08215 -0.42123,-0.103371 -0.1815,-0.02124 -0.38071,0.01896 -0.20092,0.0392 -0.36485,0.133829 -0.19643,0.113404 -0.26979,0.236461 -0.075,0.122092 -0.0511,0.238234 0.0254,0.11529 0.1114,0.22121 0.14918,0.181665 0.42033,0.338214 0.33424,0.192976 0.65828,0.265805 0.32553,0.07198 0.62518,0.025 0.29967,-0.04698 0.51381,-0.170612 0.18609,-0.107434 0.28144,-0.257023 0.0937,-0.15056 0.0914,-0.257584 l -0.46556,-0.268789 z"
       id="path65696"
       style="font-size:3.52778px;line-height:1.25;stroke-width:0.523875" />
  </g>
</svg>
