<?xml version="1.0" encoding="UTF-8" standalone="no"?>
<!-- Created with Inkscape (http://www.inkscape.org/) -->

<svg
   width="129.36047mm"
   height="90.151558mm"
   viewBox="0 0 129.36048 90.151561"
   version="1.1"
   id="svg1"
   xmlns="http://www.w3.org/2000/svg"
   xmlns:svg="http://www.w3.org/2000/svg">
  <defs
     id="defs1">
    <marker
       style="overflow:visible"
       id="Triangle"
       refX="0"
       refY="0"
       orient="auto-start-reverse"
       markerWidth="0.64999998"
       markerHeight="0.64999998"
       viewBox="0 0 1 1"
       preserveAspectRatio="xMidYMid"
       markerUnits="userSpaceOnUse">
      <path
         transform="scale(0.5)"
         style="fill:context-stroke;fill-rule:evenodd;stroke:context-stroke;stroke-width:1pt"
         d="M 5.77,0 -2.88,5 V -5 Z"
         id="path135" />
    </marker>
  </defs>
  <g
     id="layer1"
     transform="translate(-16.139596,-74.877063)">
    <path
       id="rect27"
       style="fill:#ffffff;stroke:#008c64;stroke-width:0.999999;stroke-linecap:round;stroke-linejoin:round"
       d="m 18.639594,76.377068 h 22.000002 c 1.108,0 1.999999,0.891998 1.999999,1.999997 v 4.000005 c 0,1.107999 -0.891999,1.999998 -1.999999,1.999998 H 18.639594 c -1.107999,0 -1.999999,-0.891999 -1.999999,-1.999998 v -4.000005 c 0,-1.107999 0.892,-1.999997 1.999999,-1.999997 z" />
    <g
       id="text215"
       style="font-size:6.08542px;line-height:1;stroke-width:0.264583"
       aria-label="i + ta/tä">
      <path
         style="font-weight:bold;font-family:Sans;-inkscape-font-specification:Sans;fill:#ff0000"
         d="m 19.391248,78.971595 v -0.772563 h 0.834962 v 0.772563 z m 0,3.583504 v -3.155623 h 0.834962 v 3.155623 z"
         id="path160" />
      <path
         style="font-weight:bold;font-family:Sans;-inkscape-font-specification:Sans"
         d="M 23.729487,81.928135 V 80.796033 H 22.58847 v -0.781478 h 1.141017 v -1.132102 h 0.760677 v 1.132102 h 1.143988 v 0.781478 h -1.143988 v 1.132102 z m 5.734795,-2.528659 v 0.665593 h -0.570508 v 1.271758 q 0,0.386281 0.01486,0.451652 0.01783,0.0624 0.07428,0.103999 0.05943,0.0416 0.142627,0.0416 0.115884,0 0.335768,-0.08023 l 0.07131,0.647764 q -0.291197,0.124799 -0.65965,0.124799 -0.225826,0 -0.407081,-0.07429 -0.181255,-0.07726 -0.267426,-0.196112 -0.0832,-0.121827 -0.115884,-0.326854 -0.02674,-0.145598 -0.02674,-0.588336 v -1.375757 h -0.38331 v -0.665593 h 0.38331 v -0.626964 l 0.837934,-0.487309 v 1.114273 z m 1.203415,0.962733 -0.757706,-0.136684 q 0.12777,-0.457595 0.439767,-0.677479 0.311997,-0.219883 0.927076,-0.219883 0.558622,0 0.831991,0.133713 0.273368,0.130741 0.38331,0.335767 0.112913,0.202055 0.112913,0.745821 l -0.0089,0.974618 q 0,0.415996 0.03863,0.615079 0.0416,0.196112 0.151541,0.421938 h -0.826048 q -0.03269,-0.0832 -0.08023,-0.246625 -0.0208,-0.07429 -0.02971,-0.09806 -0.21394,0.207998 -0.457595,0.311997 -0.243654,0.103999 -0.519994,0.103999 -0.487309,0 -0.769592,-0.264454 -0.279311,-0.264455 -0.279311,-0.668565 0,-0.267425 0.12777,-0.475423 0.12777,-0.210969 0.356567,-0.320911 0.231769,-0.112913 0.665593,-0.196112 0.585365,-0.109942 0.811191,-0.205026 v -0.0832 q 0,-0.240684 -0.118855,-0.341711 -0.118856,-0.103999 -0.448681,-0.103999 -0.222855,0 -0.347654,0.08914 -0.124798,0.08617 -0.202055,0.306054 z m 1.117245,0.677478 q -0.160455,0.05348 -0.508108,0.12777 -0.347654,0.07429 -0.454624,0.145599 -0.163427,0.115884 -0.163427,0.294168 0,0.175312 0.130742,0.303082 0.130741,0.12777 0.332796,0.12777 0.225826,0 0.430853,-0.148569 0.151541,-0.112913 0.199083,-0.27634 0.03269,-0.10697 0.03269,-0.407082 z m 1.197473,1.589697 1.078617,-4.504637 h 0.626965 l -1.090503,4.504637 z m 3.583505,-3.229908 v 0.665593 h -0.570508 v 1.271758 q 0,0.386281 0.01486,0.451652 0.01783,0.0624 0.07428,0.103999 0.05943,0.0416 0.142627,0.0416 0.115884,0 0.335768,-0.08023 l 0.07131,0.647764 q -0.291197,0.124799 -0.65965,0.124799 -0.225826,0 -0.407081,-0.07429 -0.181255,-0.07726 -0.267426,-0.196112 -0.0832,-0.121827 -0.115884,-0.326854 -0.02674,-0.145598 -0.02674,-0.588336 v -1.375757 h -0.38331 v -0.665593 h 0.38331 v -0.626964 l 0.837934,-0.487309 v 1.114273 z m 1.203414,0.962733 -0.757706,-0.136684 q 0.12777,-0.457595 0.439767,-0.677479 0.311996,-0.219883 0.927076,-0.219883 0.558622,0 0.831991,0.133713 0.273368,0.130741 0.38331,0.335767 0.112913,0.202055 0.112913,0.745821 l -0.0089,0.974618 q 0,0.415996 0.03863,0.615079 0.0416,0.196112 0.151541,0.421938 h -0.826048 q -0.03269,-0.0832 -0.08023,-0.246625 -0.0208,-0.07429 -0.02971,-0.09806 -0.21394,0.207998 -0.457595,0.311997 -0.243655,0.103999 -0.519994,0.103999 -0.487309,0 -0.769592,-0.264454 -0.279311,-0.264455 -0.279311,-0.668565 0,-0.267425 0.12777,-0.475423 0.12777,-0.210969 0.356567,-0.320911 0.231769,-0.112913 0.665593,-0.196112 0.585365,-0.109942 0.811191,-0.205026 v -0.0832 q 0,-0.240684 -0.118856,-0.341711 -0.118855,-0.103999 -0.44868,-0.103999 -0.222855,0 -0.347654,0.08914 -0.124798,0.08617 -0.202055,0.306054 z m 1.117245,0.677478 q -0.160455,0.05348 -0.508108,0.12777 -0.347654,0.07429 -0.454624,0.145599 -0.163427,0.115884 -0.163427,0.294168 0,0.175312 0.130742,0.303082 0.130741,0.12777 0.332796,0.12777 0.225826,0 0.430852,-0.148569 0.151542,-0.112913 0.199084,-0.27634 0.03269,-0.10697 0.03269,-0.407082 z m -1.476784,-2.198833 v -0.716107 h 0.716107 v 0.716107 z m 1.277701,0 v -0.716107 h 0.719078 v 0.716107 z"
         id="path161" />
    </g>
    <g
       id="text217"
       style="font-size:6.08542px;line-height:1.25;stroke-width:0.264583"
       aria-label="valita">
      <path
         style="font-weight:bold;font-family:Sans;-inkscape-font-specification:Sans"
         d="m 17.911354,96.51944 -1.271758,-3.155623 h 0.876562 l 0.594279,1.610496 0.172341,0.537823 q 0.06834,-0.205026 0.08617,-0.270397 0.0416,-0.133713 0.08914,-0.267426 l 0.600222,-1.610496 h 0.858733 l -1.253929,3.155623 z m 3.140766,-2.192891 -0.757706,-0.136684 q 0.12777,-0.457595 0.439766,-0.677479 0.311997,-0.219883 0.927076,-0.219883 0.558623,0 0.831991,0.133713 0.273369,0.130741 0.38331,0.335768 0.112913,0.202055 0.112913,0.74582 l -0.0089,0.974618 q 0,0.415996 0.03863,0.615079 0.0416,0.196113 0.151542,0.421939 h -0.826049 q -0.03269,-0.0832 -0.08023,-0.246626 -0.0208,-0.07429 -0.02971,-0.09806 -0.213941,0.207997 -0.457595,0.311996 -0.243655,0.103999 -0.519995,0.103999 -0.487309,0 -0.769591,-0.264454 -0.279312,-0.264454 -0.279312,-0.668564 0,-0.267426 0.12777,-0.475424 0.12777,-0.210969 0.356568,-0.320911 0.231769,-0.112913 0.665593,-0.196112 0.585365,-0.109941 0.811191,-0.205026 v -0.0832 q 0,-0.240683 -0.118856,-0.341711 -0.118856,-0.103999 -0.448681,-0.103999 -0.222854,0 -0.347653,0.08914 -0.124799,0.08617 -0.202055,0.306054 z m 1.117245,0.677478 q -0.160455,0.05349 -0.508109,0.127771 -0.347653,0.07428 -0.454623,0.145598 -0.163427,0.115884 -0.163427,0.294168 0,0.175313 0.130741,0.303083 0.130742,0.12777 0.332797,0.12777 0.225826,0 0.430852,-0.14857 0.151541,-0.112913 0.199084,-0.27634 0.03269,-0.10697 0.03269,-0.407081 z m 1.643182,1.515413 v -4.356068 h 0.834963 v 4.356068 z"
         id="path158" />
      <path
         style="font-weight:bold;font-family:Sans;-inkscape-font-specification:Sans;fill:#ff0000"
         d="m 25.503272,92.935935 v -0.772563 h 0.834963 v 0.772563 z m 0,3.583505 v -3.155623 h 0.834963 v 3.155623 z m 3.137795,-3.155623 v 0.665592 h -0.570509 v 1.271758 q 0,0.386282 0.01486,0.451652 0.01783,0.0624 0.07428,0.103999 0.05943,0.0416 0.142627,0.0416 0.115885,0 0.335768,-0.08023 l 0.07131,0.647765 q -0.291197,0.124798 -0.65965,0.124798 -0.225826,0 -0.407082,-0.07429 -0.181255,-0.07726 -0.267425,-0.196112 -0.0832,-0.121827 -0.115885,-0.326853 -0.02674,-0.145599 -0.02674,-0.588337 V 94.029402 H 26.84931 V 93.36381 h 0.383311 v -0.626965 l 0.837933,-0.487309 v 1.114274 z m 1.203415,0.962732 -0.757706,-0.136684 q 0.12777,-0.457595 0.439766,-0.677479 0.311997,-0.219883 0.927076,-0.219883 0.558623,0 0.831991,0.133713 0.273369,0.130741 0.38331,0.335768 0.112913,0.202055 0.112913,0.74582 l -0.0089,0.974618 q 0,0.415996 0.03863,0.615079 0.0416,0.196113 0.151542,0.421939 h -0.826049 q -0.03269,-0.0832 -0.08023,-0.246626 -0.0208,-0.07429 -0.02971,-0.09806 -0.213941,0.207997 -0.457595,0.311996 -0.243655,0.103999 -0.519995,0.103999 -0.487309,0 -0.769591,-0.264454 -0.279312,-0.264454 -0.279312,-0.668564 0,-0.267426 0.12777,-0.475424 0.12777,-0.210969 0.356568,-0.320911 0.231769,-0.112913 0.665593,-0.196112 0.585365,-0.109941 0.811191,-0.205026 v -0.0832 q 0,-0.240683 -0.118856,-0.341711 -0.118856,-0.103999 -0.448681,-0.103999 -0.222854,0 -0.347653,0.08914 -0.124799,0.08617 -0.202055,0.306054 z m 1.117245,0.677478 q -0.160455,0.05349 -0.508109,0.127771 -0.347653,0.07428 -0.454623,0.145598 -0.163427,0.115884 -0.163427,0.294168 0,0.175313 0.130741,0.303083 0.130742,0.12777 0.332797,0.12777 0.225826,0 0.430852,-0.14857 0.151541,-0.112913 0.199084,-0.27634 0.03269,-0.10697 0.03269,-0.407081 z"
         id="path159" />
    </g>
    <g
       id="text219"
       style="font-size:6.08542px;line-height:1;stroke-width:0.264583"
       aria-label="valitsen, valitset, valitsee (!),&#10;valitsemme, valitsette, valitsevat">
      <path
         style="font-family:Sans;-inkscape-font-specification:Sans"
         d="m 52.840036,118.11868 -1.200444,-3.15562 h 0.564566 l 0.677478,1.88981 q 0.109942,0.30605 0.202055,0.63588 0.07131,-0.2496 0.199084,-0.60023 l 0.701249,-1.92546 h 0.549709 l -1.194502,3.15562 z m 4.225326,-0.38925 q -0.297139,0.25257 -0.573479,0.35657 -0.273369,0.104 -0.588337,0.104 -0.519994,0 -0.799305,-0.25257 -0.279312,-0.25554 -0.279312,-0.65074 0,-0.23177 0.103999,-0.42194 0.106971,-0.19314 0.27634,-0.30902 0.172341,-0.11589 0.386282,-0.17531 0.157484,-0.0416 0.475423,-0.0802 0.647765,-0.0773 0.953818,-0.18423 0.003,-0.10994 0.003,-0.13965 0,-0.32686 -0.151541,-0.46057 -0.205027,-0.18126 -0.609137,-0.18126 -0.377367,0 -0.558622,0.13372 -0.178284,0.13074 -0.264455,0.46651 l -0.522965,-0.0713 q 0.07131,-0.33576 0.23474,-0.54079 0.163427,-0.208 0.472452,-0.31794 0.309025,-0.11291 0.716107,-0.11291 0.40411,0 0.656678,0.0951 0.252569,0.0951 0.371425,0.24068 0.118856,0.14263 0.166398,0.36251 0.02674,0.13669 0.02674,0.49326 v 0.71313 q 0,0.74582 0.03269,0.94491 0.03566,0.19611 0.136684,0.37736 h -0.558622 q -0.0832,-0.1664 -0.106971,-0.38925 z m -0.04457,-1.1945 q -0.291196,0.11885 -0.87359,0.20205 -0.329825,0.0476 -0.466509,0.10697 -0.136685,0.0594 -0.21097,0.17532 -0.07428,0.11291 -0.07428,0.25256 0,0.21395 0.160455,0.35657 0.163427,0.14263 0.475423,0.14263 0.309026,0 0.549709,-0.13371 0.240683,-0.13669 0.353596,-0.37143 0.08617,-0.18125 0.08617,-0.53485 z m 1.357929,1.58375 v -4.35606 h 0.534851 v 4.35606 z m 1.366842,-3.74099 v -0.61507 h 0.534851 v 0.61507 z m 0,3.74099 v -3.15562 h 0.534851 v 3.15562 z m 2.516773,-0.47839 0.07726,0.47245 q -0.225826,0.0475 -0.40411,0.0475 -0.291197,0 -0.451652,-0.0921 -0.160455,-0.0921 -0.225826,-0.24068 -0.06537,-0.15155 -0.06537,-0.63291 v -1.81552 h -0.392224 v -0.416 h 0.392224 v -0.78148 l 0.53188,-0.32091 v 1.10239 h 0.537823 v 0.416 h -0.537823 v 1.84523 q 0,0.2288 0.02674,0.29417 0.02971,0.0654 0.09211,0.104 0.06537,0.0386 0.184227,0.0386 0.08914,0 0.23474,-0.0208 z m 0.309025,-0.46354 0.528909,-0.0832 q 0.04457,0.31794 0.246625,0.48731 0.205027,0.16937 0.570509,0.16937 0.368453,0 0.546737,-0.14857 0.178283,-0.15154 0.178283,-0.3536 0,-0.18125 -0.157484,-0.28525 -0.109941,-0.0713 -0.546737,-0.18126 -0.588336,-0.14857 -0.817134,-0.25554 -0.225826,-0.10994 -0.344682,-0.30011 -0.115884,-0.19314 -0.115884,-0.42491 0,-0.21097 0.09508,-0.38925 0.09806,-0.18125 0.264454,-0.30011 0.124798,-0.0921 0.338739,-0.15451 0.216912,-0.0654 0.463538,-0.0654 0.371424,0 0.650736,0.10697 0.282282,0.10697 0.415995,0.29119 0.133713,0.18126 0.184227,0.48731 l -0.522966,0.0713 q -0.03566,-0.24366 -0.207998,-0.38034 -0.169369,-0.13669 -0.481366,-0.13669 -0.368453,0 -0.525937,0.12183 -0.157484,0.12183 -0.157484,0.28525 0,0.104 0.06537,0.1872 0.06537,0.0862 0.205026,0.14263 0.08023,0.0297 0.472452,0.13668 0.567537,0.15154 0.790391,0.2496 0.225827,0.0951 0.353597,0.27931 0.12777,0.18423 0.12777,0.4576 0,0.26742 -0.157484,0.50513 -0.154513,0.23474 -0.448681,0.36549 -0.294168,0.12777 -0.665593,0.12777 -0.615079,0 -0.938961,-0.25554 -0.320911,-0.25554 -0.410053,-0.75771 z m 5.416856,-0.0743 0.55268,0.0683 q -0.130742,0.48433 -0.484338,0.75176 -0.353596,0.26743 -0.903304,0.26743 -0.692336,0 -1.099417,-0.42491 -0.40411,-0.42788 -0.40411,-1.19748 0,-0.79633 0.410053,-1.2361 0.410052,-0.43976 1.06376,-0.43976 0.632907,0 1.034046,0.43085 0.401138,0.43085 0.401138,1.21233 0,0.0475 -0.003,0.14263 h -2.353346 q 0.02971,0.51999 0.294168,0.79633 0.264454,0.27634 0.65965,0.27634 0.294168,0 0.502166,-0.15451 0.207998,-0.15452 0.329825,-0.49325 z m -1.756095,-0.86468 h 1.762038 q -0.03566,-0.39817 -0.202055,-0.59725 -0.25554,-0.30903 -0.662622,-0.30903 -0.368453,0 -0.621021,0.24663 -0.249598,0.24662 -0.27634,0.65965 z m 2.98031,1.88089 v -3.15562 h 0.481366 v 0.44868 q 0.347654,-0.51999 1.004332,-0.51999 0.285255,0 0.522966,0.104 0.240683,0.10102 0.359539,0.26742 0.118856,0.1664 0.166398,0.3952 0.02971,0.14857 0.02971,0.51999 v 1.94032 h -0.534851 v -1.91952 q 0,-0.32685 -0.0624,-0.48731 -0.0624,-0.16343 -0.222855,-0.25851 -0.157484,-0.0981 -0.371425,-0.0981 -0.34171,0 -0.591308,0.21692 -0.246625,0.21691 -0.246625,0.82307 v 1.72341 z m 3.524076,0 v -0.60913 h 0.609137 v 0.60913 q 0,0.33577 -0.118856,0.5408 -0.118856,0.20799 -0.377368,0.32091 l -0.14857,-0.2288 q 0.16937,-0.0743 0.249598,-0.21988 0.08023,-0.14263 0.08914,-0.41303 z m 4.118357,0 -1.200444,-3.15562 h 0.564565 l 0.677479,1.88981 q 0.109941,0.30605 0.202055,0.63588 0.07131,-0.2496 0.199083,-0.60023 l 0.70125,-1.92546 h 0.549708 l -1.194501,3.15562 z m 4.225325,-0.38925 q -0.297139,0.25257 -0.573479,0.35657 -0.273369,0.104 -0.588337,0.104 -0.519994,0 -0.799305,-0.25257 -0.279312,-0.25554 -0.279312,-0.65074 0,-0.23177 0.103999,-0.42194 0.106971,-0.19314 0.27634,-0.30902 0.172341,-0.11589 0.386282,-0.17531 0.157484,-0.0416 0.475423,-0.0802 0.647765,-0.0773 0.953818,-0.18423 0.003,-0.10994 0.003,-0.13965 0,-0.32686 -0.151541,-0.46057 -0.205027,-0.18126 -0.609137,-0.18126 -0.377367,0 -0.558622,0.13372 -0.178284,0.13074 -0.264455,0.46651 l -0.522965,-0.0713 q 0.07131,-0.33576 0.23474,-0.54079 0.163427,-0.208 0.472452,-0.31794 0.309025,-0.11291 0.716107,-0.11291 0.40411,0 0.656678,0.0951 0.252569,0.0951 0.371425,0.24068 0.118856,0.14263 0.166398,0.36251 0.02674,0.13669 0.02674,0.49326 v 0.71313 q 0,0.74582 0.03269,0.94491 0.03566,0.19611 0.136684,0.37736 H 81.18716 q -0.0832,-0.1664 -0.106971,-0.38925 z m -0.04457,-1.1945 q -0.291196,0.11885 -0.87359,0.20205 -0.329825,0.0476 -0.466509,0.10697 -0.136685,0.0594 -0.21097,0.17532 -0.07428,0.11291 -0.07428,0.25256 0,0.21395 0.160455,0.35657 0.163427,0.14263 0.475423,0.14263 0.309026,0 0.549709,-0.13371 0.240683,-0.13669 0.353596,-0.37143 0.08617,-0.18125 0.08617,-0.53485 z m 1.357928,1.58375 V 113.7626 H 82.9284 v 4.35606 z m 1.366843,-3.74099 v -0.61507 h 0.534852 v 0.61507 z m 0,3.74099 v -3.15562 h 0.534852 v 3.15562 z m 2.516772,-0.47839 0.07726,0.47245 q -0.225826,0.0475 -0.40411,0.0475 -0.291197,0 -0.451652,-0.0921 -0.160456,-0.0921 -0.225826,-0.24068 -0.06537,-0.15155 -0.06537,-0.63291 v -1.81552 h -0.392224 v -0.416 h 0.392224 v -0.78148 l 0.53188,-0.32091 v 1.10239 h 0.537823 v 0.416 h -0.537823 v 1.84523 q 0,0.2288 0.02674,0.29417 0.02971,0.0654 0.09211,0.104 0.06537,0.0386 0.184226,0.0386 0.08914,0 0.234741,-0.0208 z m 0.309028,-0.46354 0.528908,-0.0832 q 0.04457,0.31794 0.246626,0.48731 0.205026,0.16937 0.570508,0.16937 0.368453,0 0.546737,-0.14857 0.178284,-0.15154 0.178284,-0.3536 0,-0.18125 -0.157484,-0.28525 -0.109942,-0.0713 -0.546737,-0.18126 -0.588336,-0.14857 -0.817134,-0.25554 -0.225826,-0.10994 -0.344682,-0.30011 -0.115884,-0.19314 -0.115884,-0.42491 0,-0.21097 0.09508,-0.38925 0.09806,-0.18125 0.264454,-0.30011 0.124799,-0.0921 0.33874,-0.15451 0.216912,-0.0654 0.463538,-0.0654 0.371424,0 0.650735,0.10697 0.282283,0.10697 0.415996,0.29119 0.133713,0.18126 0.184227,0.48731 l -0.522966,0.0713 q -0.03566,-0.24366 -0.207998,-0.38034 -0.16937,-0.13669 -0.481366,-0.13669 -0.368453,0 -0.525937,0.12183 -0.157484,0.12183 -0.157484,0.28525 0,0.104 0.06537,0.1872 0.06537,0.0862 0.205027,0.14263 0.08023,0.0297 0.472452,0.13668 0.567536,0.15154 0.790391,0.2496 0.225826,0.0951 0.353596,0.27931 0.12777,0.18423 0.12777,0.4576 0,0.26742 -0.157484,0.50513 -0.154512,0.23474 -0.448681,0.36549 -0.294168,0.12777 -0.665592,0.12777 -0.615079,0 -0.938962,-0.25554 -0.32091,-0.25554 -0.410052,-0.75771 z m 5.416855,-0.0743 0.55268,0.0683 q -0.130742,0.48433 -0.484338,0.75176 -0.353596,0.26743 -0.903305,0.26743 -0.692335,0 -1.099416,-0.42491 -0.40411,-0.42788 -0.40411,-1.19748 0,-0.79633 0.410052,-1.2361 0.410053,-0.43976 1.06376,-0.43976 0.632908,0 1.034046,0.43085 0.401139,0.43085 0.401139,1.21233 0,0.0475 -0.003,0.14263 h -2.353347 q 0.02971,0.51999 0.294169,0.79633 0.264454,0.27634 0.65965,0.27634 0.294168,0 0.502166,-0.15451 0.207998,-0.15452 0.329825,-0.49325 z m -1.756096,-0.86468 h 1.762039 q -0.03566,-0.39817 -0.202055,-0.59725 -0.25554,-0.30903 -0.662622,-0.30903 -0.368453,0 -0.621022,0.24663 -0.249597,0.24662 -0.27634,0.65965 z m 4.148068,1.4025 0.07726,0.47245 q -0.225826,0.0475 -0.40411,0.0475 -0.291197,0 -0.451652,-0.0921 -0.160455,-0.0921 -0.225826,-0.24068 -0.06537,-0.15155 -0.06537,-0.63291 v -1.81552 h -0.392224 v -0.416 h 0.392224 v -0.78148 l 0.53188,-0.32091 v 1.10239 h 0.537823 v 0.416 H 93.8572 v 1.84523 q 0,0.2288 0.02674,0.29417 0.02971,0.0654 0.09211,0.104 0.06537,0.0386 0.184227,0.0386 0.08914,0 0.23474,-0.0208 z m 0.662624,0.47839 v -0.60913 h 0.609136 v 0.60913 q 0,0.33577 -0.118856,0.5408 -0.118856,0.20799 -0.377367,0.32091 l -0.14857,-0.2288 q 0.16937,-0.0743 0.249597,-0.21988 0.08023,-0.14263 0.08914,-0.41303 z m 4.118353,0 -1.200444,-3.15562 h 0.564565 l 0.677479,1.88981 q 0.109941,0.30605 0.202055,0.63588 0.07131,-0.2496 0.199083,-0.60023 l 0.701247,-1.92546 h 0.54971 l -1.1945,3.15562 z m 4.225325,-0.38925 q -0.29714,0.25257 -0.57348,0.35657 -0.27337,0.104 -0.58834,0.104 -0.51999,0 -0.7993,-0.25257 -0.27931,-0.25554 -0.27931,-0.65074 0,-0.23177 0.10399,-0.42194 0.10697,-0.19314 0.27634,-0.30902 0.17234,-0.11589 0.38629,-0.17531 0.15748,-0.0416 0.47542,-0.0802 0.64776,-0.0773 0.95382,-0.18423 0.003,-0.10994 0.003,-0.13965 0,-0.32686 -0.15154,-0.46057 -0.20503,-0.18126 -0.60914,-0.18126 -0.37737,0 -0.55862,0.13372 -0.17829,0.13074 -0.26446,0.46651 l -0.52296,-0.0713 q 0.0713,-0.33576 0.23474,-0.54079 0.16343,-0.208 0.47245,-0.31794 0.30903,-0.11291 0.71611,-0.11291 0.40411,0 0.65668,0.0951 0.25256,0.0951 0.37142,0.24068 0.11886,0.14263 0.1664,0.36251 0.0267,0.13669 0.0267,0.49326 v 0.71313 q 0,0.74582 0.0327,0.94491 0.0357,0.19611 0.13668,0.37736 h -0.55862 q -0.0832,-0.1664 -0.10697,-0.38925 z m -0.0446,-1.1945 q -0.2912,0.11885 -0.87359,0.20205 -0.32983,0.0476 -0.46651,0.10697 -0.13669,0.0594 -0.21097,0.17532 -0.0743,0.11291 -0.0743,0.25256 0,0.21395 0.16046,0.35657 0.16343,0.14263 0.47542,0.14263 0.30903,0 0.54971,-0.13371 0.24068,-0.13669 0.3536,-0.37143 0.0862,-0.18125 0.0862,-0.53485 z m 1.35793,1.58375 v -4.35606 h 0.53485 v 4.35606 z m 1.36684,-3.74099 v -0.61507 h 0.53485 v 0.61507 z m 0,3.74099 v -3.15562 h 0.53485 v 3.15562 z m 2.51677,-0.47839 0.0773,0.47245 q -0.22583,0.0475 -0.40411,0.0475 -0.2912,0 -0.45165,-0.0921 -0.16046,-0.0921 -0.22583,-0.24068 -0.0654,-0.15155 -0.0654,-0.63291 v -1.81552 h -0.39222 v -0.416 h 0.39222 v -0.78148 l 0.53188,-0.32091 v 1.10239 h 0.53782 v 0.416 h -0.53782 v 1.84523 q 0,0.2288 0.0267,0.29417 0.0297,0.0654 0.0921,0.104 0.0654,0.0386 0.18422,0.0386 0.0891,0 0.23474,-0.0208 z m 0.30903,-0.46354 0.52891,-0.0832 q 0.0446,0.31794 0.24662,0.48731 0.20503,0.16937 0.57051,0.16937 0.36845,0 0.54674,-0.14857 0.17828,-0.15154 0.17828,-0.3536 0,-0.18125 -0.15748,-0.28525 -0.10994,-0.0713 -0.54674,-0.18126 -0.58834,-0.14857 -0.81713,-0.25554 -0.22583,-0.10994 -0.34469,-0.30011 -0.11588,-0.19314 -0.11588,-0.42491 0,-0.21097 0.0951,-0.38925 0.0981,-0.18125 0.26446,-0.30011 0.1248,-0.0921 0.33874,-0.15451 0.21691,-0.0654 0.46354,-0.0654 0.37142,0 0.65073,0.10697 0.28228,0.10697 0.416,0.29119 0.13371,0.18126 0.18422,0.48731 l -0.52296,0.0713 q -0.0357,-0.24366 -0.208,-0.38034 -0.16937,-0.13669 -0.48137,-0.13669 -0.36845,0 -0.52593,0.12183 -0.15749,0.12183 -0.15749,0.28525 0,0.104 0.0654,0.1872 0.0654,0.0862 0.20503,0.14263 0.0802,0.0297 0.47245,0.13668 0.56754,0.15154 0.79039,0.2496 0.22583,0.0951 0.3536,0.27931 0.12777,0.18423 0.12777,0.4576 0,0.26742 -0.15748,0.50513 -0.15452,0.23474 -0.44869,0.36549 -0.29416,0.12777 -0.66559,0.12777 -0.61508,0 -0.93896,-0.25554 -0.32091,-0.25554 -0.41005,-0.75771 z m 5.41685,-0.0743 0.55268,0.0683 q -0.13074,0.48433 -0.48434,0.75176 -0.35359,0.26743 -0.9033,0.26743 -0.69234,0 -1.09942,-0.42491 -0.40411,-0.42788 -0.40411,-1.19748 0,-0.79633 0.41006,-1.2361 0.41005,-0.43976 1.06376,-0.43976 0.6329,0 1.03404,0.43085 0.40114,0.43085 0.40114,1.21233 0,0.0475 -0.003,0.14263 h -2.35335 q 0.0297,0.51999 0.29417,0.79633 0.26446,0.27634 0.65965,0.27634 0.29417,0 0.50217,-0.15451 0.208,-0.15452 0.32982,-0.49325 z m -1.75609,-0.86468 h 1.76204 q -0.0357,-0.39817 -0.20206,-0.59725 -0.25554,-0.30903 -0.66262,-0.30903 -0.36845,0 -0.62102,0.24663 -0.2496,0.24662 -0.27634,0.65965 z m 5.14051,0.86468 0.55268,0.0683 q -0.13074,0.48433 -0.48433,0.75176 -0.3536,0.26743 -0.90331,0.26743 -0.69233,0 -1.09941,-0.42491 -0.40411,-0.42788 -0.40411,-1.19748 0,-0.79633 0.41005,-1.2361 0.41005,-0.43976 1.06376,-0.43976 0.63291,0 1.03404,0.43085 0.40114,0.43085 0.40114,1.21233 0,0.0475 -0.003,0.14263 h -2.35334 q 0.0297,0.51999 0.29416,0.79633 0.26446,0.27634 0.65965,0.27634 0.29417,0 0.50217,-0.15451 0.208,-0.15452 0.32982,-0.49325 z m -1.75609,-0.86468 h 1.76204 q -0.0357,-0.39817 -0.20206,-0.59725 -0.25554,-0.30903 -0.66262,-0.30903 -0.36845,0 -0.62102,0.24663 -0.2496,0.24662 -0.27634,0.65965 z m 5.69319,3.16156 q -0.44274,-0.55862 -0.74879,-1.30741 -0.30605,-0.74879 -0.30605,-1.55107 0,-0.70719 0.22879,-1.35496 0.26743,-0.75176 0.82605,-1.49758 h 0.38331 q -0.35954,0.61805 -0.47542,0.88251 -0.18126,0.41005 -0.28526,0.85576 -0.12777,0.55565 -0.12777,1.11724 0,1.42924 0.88845,2.85551 z m 1.28959,-2.36226 -0.16342,-2.30877 v -0.9657 h 0.66262 v 0.9657 l -0.15452,2.30877 z m -0.13965,1.08159 v -0.60913 h 0.61508 v 0.60913 z m 1.89574,1.28067 h -0.38331 q 0.88845,-1.42627 0.88845,-2.85551 0,-0.55862 -0.12777,-1.10833 -0.10103,-0.44571 -0.28228,-0.85576 -0.11589,-0.26743 -0.4784,-0.89142 h 0.38331 q 0.55863,0.74582 0.82605,1.49758 0.2288,0.64777 0.2288,1.35496 0,0.80228 -0.30903,1.55107 -0.30605,0.74879 -0.74582,1.30741 z m 1.81553,-1.28067 v -0.60913 h 0.60914 v 0.60913 q 0,0.33577 -0.11886,0.5408 -0.11885,0.20799 -0.37737,0.32091 l -0.14857,-0.2288 q 0.16937,-0.0743 0.2496,-0.21988 0.0802,-0.14263 0.0891,-0.41303 z"
         id="path156" />
      <path
         style="font-family:Sans;-inkscape-font-specification:Sans"
         d="m 52.840036,124.2041 -1.200444,-3.15562 h 0.564566 l 0.677478,1.88981 q 0.109942,0.30605 0.202055,0.63588 0.07131,-0.2496 0.199084,-0.60023 l 0.701249,-1.92546 h 0.549709 l -1.194502,3.15562 z m 4.225326,-0.38925 q -0.297139,0.25257 -0.573479,0.35657 -0.273369,0.104 -0.588337,0.104 -0.519994,0 -0.799305,-0.25257 -0.279312,-0.25554 -0.279312,-0.65074 0,-0.23177 0.103999,-0.42194 0.106971,-0.19314 0.27634,-0.30902 0.172341,-0.11589 0.386282,-0.17531 0.157484,-0.0416 0.475423,-0.0802 0.647765,-0.0773 0.953818,-0.18423 0.003,-0.10994 0.003,-0.13965 0,-0.32686 -0.151541,-0.46057 -0.205027,-0.18126 -0.609137,-0.18126 -0.377367,0 -0.558622,0.13372 -0.178284,0.13074 -0.264455,0.46651 l -0.522965,-0.0713 q 0.07131,-0.33576 0.23474,-0.54079 0.163427,-0.208 0.472452,-0.31794 0.309025,-0.11291 0.716107,-0.11291 0.40411,0 0.656678,0.0951 0.252569,0.0951 0.371425,0.24068 0.118856,0.14263 0.166398,0.36251 0.02674,0.13669 0.02674,0.49326 v 0.71313 q 0,0.74582 0.03269,0.94491 0.03566,0.19611 0.136684,0.37736 h -0.558622 q -0.0832,-0.1664 -0.106971,-0.38925 z m -0.04457,-1.1945 q -0.291196,0.11885 -0.87359,0.20205 -0.329825,0.0476 -0.466509,0.10697 -0.136685,0.0594 -0.21097,0.17532 -0.07428,0.11291 -0.07428,0.25256 0,0.21395 0.160455,0.35657 0.163427,0.14263 0.475423,0.14263 0.309026,0 0.549709,-0.13371 0.240683,-0.13669 0.353596,-0.37143 0.08617,-0.18125 0.08617,-0.53485 z m 1.357929,1.58375 v -4.35606 h 0.534851 v 4.35606 z m 1.366842,-3.74099 v -0.61507 h 0.534851 v 0.61507 z m 0,3.74099 v -3.15562 h 0.534851 v 3.15562 z m 2.516773,-0.47839 0.07726,0.47245 q -0.225826,0.0475 -0.40411,0.0475 -0.291197,0 -0.451652,-0.0921 -0.160455,-0.0921 -0.225826,-0.24068 -0.06537,-0.15155 -0.06537,-0.63291 v -1.81552 h -0.392224 v -0.416 h 0.392224 V 120.267 l 0.53188,-0.32091 v 1.10239 h 0.537823 v 0.416 h -0.537823 v 1.84523 q 0,0.2288 0.02674,0.29417 0.02971,0.0654 0.09211,0.104 0.06537,0.0386 0.184227,0.0386 0.08914,0 0.23474,-0.0208 z m 0.309025,-0.46354 0.528909,-0.0832 q 0.04457,0.31794 0.246625,0.48731 0.205027,0.16937 0.570509,0.16937 0.368453,0 0.546737,-0.14857 0.178283,-0.15154 0.178283,-0.3536 0,-0.18125 -0.157484,-0.28525 -0.109941,-0.0713 -0.546737,-0.18126 -0.588336,-0.14857 -0.817134,-0.25554 -0.225826,-0.10994 -0.344682,-0.30011 -0.115884,-0.19314 -0.115884,-0.42491 0,-0.21097 0.09508,-0.38925 0.09806,-0.18125 0.264454,-0.30011 0.124798,-0.0921 0.338739,-0.15451 0.216912,-0.0654 0.463538,-0.0654 0.371424,0 0.650736,0.10697 0.282282,0.10697 0.415995,0.29119 0.133713,0.18126 0.184227,0.48731 l -0.522966,0.0713 q -0.03566,-0.24366 -0.207998,-0.38034 -0.169369,-0.13669 -0.481366,-0.13669 -0.368453,0 -0.525937,0.12183 -0.157484,0.12183 -0.157484,0.28525 0,0.104 0.06537,0.1872 0.06537,0.0862 0.205026,0.14263 0.08023,0.0297 0.472452,0.13668 0.567537,0.15154 0.790391,0.2496 0.225827,0.0951 0.353597,0.27931 0.12777,0.18423 0.12777,0.4576 0,0.26742 -0.157484,0.50513 -0.154513,0.23475 -0.448681,0.36549 -0.294168,0.12777 -0.665593,0.12777 -0.615079,0 -0.938961,-0.25554 -0.320911,-0.25554 -0.410053,-0.75771 z m 5.416856,-0.0743 0.55268,0.0683 q -0.130742,0.48434 -0.484338,0.75176 -0.353596,0.26743 -0.903304,0.26743 -0.692336,0 -1.099417,-0.42491 -0.40411,-0.42788 -0.40411,-1.19748 0,-0.79633 0.410053,-1.2361 0.410052,-0.43976 1.06376,-0.43976 0.632907,0 1.034046,0.43085 0.401138,0.43085 0.401138,1.21233 0,0.0475 -0.003,0.14263 h -2.353346 q 0.02971,0.51999 0.294168,0.79633 0.264454,0.27634 0.65965,0.27634 0.294168,0 0.502166,-0.15451 0.207998,-0.15452 0.329825,-0.49325 z m -1.756095,-0.86468 h 1.762038 q -0.03566,-0.39817 -0.202055,-0.59725 -0.25554,-0.30903 -0.662622,-0.30903 -0.368453,0 -0.621021,0.24663 -0.249598,0.24662 -0.27634,0.65965 z m 2.98031,1.88089 v -3.15562 h 0.478395 v 0.44274 q 0.14857,-0.23177 0.395196,-0.37143 0.246626,-0.14262 0.561594,-0.14262 0.350625,0 0.573479,0.14559 0.225826,0.1456 0.31794,0.40709 0.374396,-0.55268 0.974618,-0.55268 0.46948,0 0.722049,0.26148 0.252569,0.25851 0.252569,0.7993 v 2.16615 h -0.53188 v -1.98786 q 0,-0.32091 -0.05348,-0.46057 -0.05051,-0.14262 -0.187198,-0.2288 -0.136685,-0.0862 -0.320911,-0.0862 -0.332797,0 -0.55268,0.22286 -0.219883,0.21988 -0.219883,0.70719 v 1.83335 h -0.534852 v -2.05026 q 0,-0.35657 -0.130741,-0.53485 -0.130741,-0.17829 -0.427881,-0.17829 -0.225826,0 -0.418967,0.11886 -0.190169,0.11886 -0.27634,0.34765 -0.08617,0.2288 -0.08617,0.65965 v 1.63724 z m 5.069203,0 v -3.15562 h 0.478394 v 0.44274 q 0.14857,-0.23177 0.395196,-0.37143 0.246626,-0.14262 0.561594,-0.14262 0.350625,0 0.57348,0.14559 0.225826,0.1456 0.317939,0.40709 0.374396,-0.55268 0.974618,-0.55268 0.469481,0 0.72205,0.26148 0.252568,0.25851 0.252568,0.7993 v 2.16615 h -0.53188 v -1.98786 q 0,-0.32091 -0.05348,-0.46057 -0.05051,-0.14262 -0.187198,-0.2288 -0.136684,-0.0862 -0.320911,-0.0862 -0.332796,0 -0.552679,0.22286 -0.219884,0.21988 -0.219884,0.70719 v 1.83335 h -0.534851 v -2.05026 q 0,-0.35657 -0.130742,-0.53485 -0.130741,-0.17829 -0.427881,-0.17829 -0.225826,0 -0.418967,0.11886 -0.190169,0.11886 -0.27634,0.34765 -0.08617,0.2288 -0.08617,0.65965 v 1.63724 z m 7.229407,-1.01621 0.55268,0.0683 q -0.130741,0.48434 -0.484338,0.75176 -0.353596,0.26743 -0.903304,0.26743 -0.692336,0 -1.099417,-0.42491 -0.40411,-0.42788 -0.40411,-1.19748 0,-0.79633 0.410053,-1.2361 0.410053,-0.43976 1.06376,-0.43976 0.632907,0 1.034046,0.43085 0.401138,0.43085 0.401138,1.21233 0,0.0475 -0.003,0.14263 h -2.353346 q 0.02971,0.51999 0.294168,0.79633 0.264455,0.27634 0.65965,0.27634 0.294169,0 0.502166,-0.15451 0.207998,-0.15452 0.329825,-0.49325 z m -1.756095,-0.86468 h 1.762038 q -0.03566,-0.39817 -0.202055,-0.59725 -0.25554,-0.30903 -0.662621,-0.30903 -0.368453,0 -0.621022,0.24663 -0.249597,0.24662 -0.27634,0.65965 z m 3.119966,1.88089 v -0.60913 h 0.609136 v 0.60913 q 0,0.33577 -0.118856,0.5408 -0.118855,0.20799 -0.377367,0.32091 l -0.14857,-0.2288 q 0.16937,-0.0743 0.249598,-0.21988 0.08023,-0.14263 0.08914,-0.41303 z m 4.118357,0 -1.200444,-3.15562 h 0.564565 l 0.677479,1.88981 q 0.109941,0.30605 0.202055,0.63588 0.07131,-0.2496 0.199083,-0.60023 l 0.70125,-1.92546 h 0.549708 l -1.194501,3.15562 z m 4.225325,-0.38925 q -0.297139,0.25257 -0.573479,0.35657 -0.273369,0.104 -0.588337,0.104 -0.519994,0 -0.799305,-0.25257 -0.279312,-0.25554 -0.279312,-0.65074 0,-0.23177 0.103999,-0.42194 0.10697,-0.19314 0.27634,-0.30902 0.172341,-0.11589 0.386282,-0.17531 0.157484,-0.0416 0.475423,-0.0802 0.647764,-0.0773 0.953818,-0.18423 0.003,-0.10994 0.003,-0.13965 0,-0.32686 -0.151542,-0.46057 -0.205026,-0.18126 -0.609136,-0.18126 -0.377367,0 -0.558622,0.13372 -0.178284,0.13074 -0.264455,0.46651 l -0.522965,-0.0713 q 0.07131,-0.33576 0.23474,-0.54079 0.163427,-0.208 0.472452,-0.31794 0.309025,-0.11291 0.716106,-0.11291 0.40411,0 0.656679,0.0951 0.252569,0.0951 0.371425,0.24068 0.118856,0.14263 0.166398,0.36251 0.02674,0.13669 0.02674,0.49326 v 0.71313 q 0,0.74582 0.03269,0.94491 0.03566,0.19611 0.136684,0.37736 h -0.558622 q -0.0832,-0.1664 -0.106971,-0.38925 z m -0.04457,-1.1945 q -0.291197,0.11885 -0.87359,0.20205 -0.329825,0.0476 -0.46651,0.10697 -0.136684,0.0594 -0.210969,0.17532 -0.07428,0.11291 -0.07428,0.25256 0,0.21395 0.160456,0.35657 0.163427,0.14263 0.475423,0.14263 0.309025,0 0.549709,-0.13371 0.240683,-0.13669 0.353596,-0.37143 0.08617,-0.18125 0.08617,-0.53485 z m 1.357926,1.58375 v -4.35606 h 0.534852 v 4.35606 z m 1.366843,-3.74099 v -0.61507 h 0.534852 v 0.61507 z m 0,3.74099 v -3.15562 h 0.534852 v 3.15562 z m 2.516774,-0.47839 0.07726,0.47245 q -0.225826,0.0475 -0.40411,0.0475 -0.291197,0 -0.451652,-0.0921 -0.160456,-0.0921 -0.225826,-0.24068 -0.06537,-0.15155 -0.06537,-0.63291 v -1.81552 h -0.392224 v -0.416 H 95.34587 V 120.267 l 0.53188,-0.32091 v 1.10239 h 0.537823 v 0.416 H 95.87775 v 1.84523 q 0,0.2288 0.02674,0.29417 0.02971,0.0654 0.09211,0.104 0.06537,0.0386 0.184226,0.0386 0.08914,0 0.234741,-0.0208 z m 0.309027,-0.46354 0.528909,-0.0832 q 0.04457,0.31794 0.246626,0.48731 0.205026,0.16937 0.570508,0.16937 0.368453,0 0.546737,-0.14857 0.178284,-0.15154 0.178284,-0.3536 0,-0.18125 -0.157484,-0.28525 -0.109942,-0.0713 -0.546737,-0.18126 -0.588337,-0.14857 -0.817134,-0.25554 -0.225826,-0.10994 -0.344682,-0.30011 -0.115885,-0.19314 -0.115885,-0.42491 0,-0.21097 0.09509,-0.38925 0.09806,-0.18125 0.264454,-0.30011 0.124799,-0.0921 0.33874,-0.15451 0.216911,-0.0654 0.463537,-0.0654 0.371425,0 0.650736,0.10697 0.282283,0.10697 0.415996,0.29119 0.133713,0.18126 0.184226,0.48731 l -0.522965,0.0713 q -0.03566,-0.24366 -0.207998,-0.38034 -0.16937,-0.13669 -0.481366,-0.13669 -0.368454,0 -0.525938,0.12183 -0.157484,0.12183 -0.157484,0.28525 0,0.104 0.06537,0.1872 0.06537,0.0862 0.205026,0.14263 0.08023,0.0297 0.472452,0.13668 0.567537,0.15154 0.790392,0.2496 0.225826,0.0951 0.353596,0.27931 0.12777,0.18423 0.12777,0.4576 0,0.26742 -0.157484,0.50513 -0.154512,0.23475 -0.448681,0.36549 -0.294168,0.12777 -0.665593,0.12777 -0.615079,0 -0.938961,-0.25554 -0.320911,-0.25554 -0.410053,-0.75771 z m 5.416855,-0.0743 0.55268,0.0683 q -0.13074,0.48434 -0.48434,0.75176 -0.3536,0.26743 -0.9033,0.26743 -0.69234,0 -1.09942,-0.42491 -0.404108,-0.42788 -0.404108,-1.19748 0,-0.79633 0.410048,-1.2361 0.41006,-0.43976 1.06376,-0.43976 0.63291,0 1.03405,0.43085 0.40114,0.43085 0.40114,1.21233 0,0.0475 -0.003,0.14263 h -2.35335 q 0.0297,0.51999 0.29417,0.79633 0.26445,0.27634 0.65965,0.27634 0.29417,0 0.50216,-0.15451 0.208,-0.15452 0.32983,-0.49325 z m -1.7561,-0.86468 h 1.76204 q -0.0357,-0.39817 -0.20205,-0.59725 -0.25554,-0.30903 -0.66262,-0.30903 -0.36846,0 -0.62103,0.24663 -0.24959,0.24662 -0.27634,0.65965 z m 4.14807,1.4025 0.0773,0.47245 q -0.22583,0.0475 -0.40411,0.0475 -0.2912,0 -0.45166,-0.0921 -0.16045,-0.0921 -0.22582,-0.24068 -0.0654,-0.15155 -0.0654,-0.63291 v -1.81552 h -0.39223 v -0.416 h 0.39223 V 120.267 l 0.53188,-0.32091 v 1.10239 h 0.53782 v 0.416 h -0.53782 v 1.84523 q 0,0.2288 0.0267,0.29417 0.0297,0.0654 0.0921,0.104 0.0654,0.0386 0.18423,0.0386 0.0891,0 0.23474,-0.0208 z m 1.69073,0 0.0773,0.47245 q -0.22582,0.0475 -0.40411,0.0475 -0.29119,0 -0.45165,-0.0921 -0.16045,-0.0921 -0.22582,-0.24068 -0.0654,-0.15155 -0.0654,-0.63291 v -1.81552 h -0.39223 v -0.416 h 0.39223 V 120.267 l 0.53188,-0.32091 v 1.10239 h 0.53782 v 0.416 h -0.53782 v 1.84523 q 0,0.2288 0.0267,0.29417 0.0297,0.0654 0.0921,0.104 0.0654,0.0386 0.18423,0.0386 0.0891,0 0.23474,-0.0208 z m 2.68317,-0.53782 0.55268,0.0683 q -0.13074,0.48434 -0.48434,0.75176 -0.3536,0.26743 -0.9033,0.26743 -0.69234,0 -1.09942,-0.42491 -0.40411,-0.42788 -0.40411,-1.19748 0,-0.79633 0.41005,-1.2361 0.41005,-0.43976 1.06376,-0.43976 0.63291,0 1.03405,0.43085 0.40114,0.43085 0.40114,1.21233 0,0.0475 -0.003,0.14263 h -2.35334 q 0.0297,0.51999 0.29417,0.79633 0.26445,0.27634 0.65965,0.27634 0.29417,0 0.50216,-0.15451 0.208,-0.15452 0.32983,-0.49325 z m -1.7561,-0.86468 h 1.76204 q -0.0357,-0.39817 -0.20205,-0.59725 -0.25554,-0.30903 -0.66263,-0.30903 -0.36845,0 -0.62102,0.24663 -0.24959,0.24662 -0.27634,0.65965 z m 3.11997,1.88089 v -0.60913 h 0.60914 v 0.60913 q 0,0.33577 -0.11886,0.5408 -0.11885,0.20799 -0.37737,0.32091 l -0.14857,-0.2288 q 0.16937,-0.0743 0.2496,-0.21988 0.0802,-0.14263 0.0891,-0.41303 z m 4.11835,0 -1.20044,-3.15562 h 0.56456 l 0.67748,1.88981 q 0.10994,0.30605 0.20206,0.63588 0.0713,-0.2496 0.19908,-0.60023 l 0.70125,-1.92546 h 0.54971 l -1.1945,3.15562 z m 4.22533,-0.38925 q -0.29714,0.25257 -0.57348,0.35657 -0.27337,0.104 -0.58834,0.104 -0.51999,0 -0.7993,-0.25257 -0.27931,-0.25554 -0.27931,-0.65074 0,-0.23177 0.10399,-0.42194 0.10697,-0.19314 0.27634,-0.30902 0.17235,-0.11589 0.38629,-0.17531 0.15748,-0.0416 0.47542,-0.0802 0.64776,-0.0773 0.95382,-0.18423 0.003,-0.10994 0.003,-0.13965 0,-0.32686 -0.15154,-0.46057 -0.20503,-0.18126 -0.60914,-0.18126 -0.37737,0 -0.55862,0.13372 -0.17828,0.13074 -0.26446,0.46651 l -0.52296,-0.0713 q 0.0713,-0.33576 0.23474,-0.54079 0.16343,-0.208 0.47245,-0.31794 0.30903,-0.11291 0.71611,-0.11291 0.40411,0 0.65668,0.0951 0.25257,0.0951 0.37142,0.24068 0.11886,0.14263 0.1664,0.36251 0.0267,0.13669 0.0267,0.49326 v 0.71313 q 0,0.74582 0.0327,0.94491 0.0356,0.19611 0.13668,0.37736 h -0.55862 q -0.0832,-0.1664 -0.10697,-0.38925 z m -0.0446,-1.1945 q -0.2912,0.11885 -0.87359,0.20205 -0.32983,0.0476 -0.46651,0.10697 -0.13669,0.0594 -0.21097,0.17532 -0.0743,0.11291 -0.0743,0.25256 0,0.21395 0.16046,0.35657 0.16343,0.14263 0.47542,0.14263 0.30903,0 0.54971,-0.13371 0.24068,-0.13669 0.3536,-0.37143 0.0862,-0.18125 0.0862,-0.53485 z m 1.35793,1.58375 V 119.848 h 0.53485 v 4.35606 z m 1.36684,-3.74099 V 119.848 h 0.53485 v 0.61507 z m 0,3.74099 v -3.15562 h 0.53485 v 3.15562 z m 2.51677,-0.47839 0.0773,0.47245 q -0.22583,0.0475 -0.40411,0.0475 -0.2912,0 -0.45165,-0.0921 -0.16046,-0.0921 -0.22583,-0.24068 -0.0654,-0.15155 -0.0654,-0.63291 v -1.81552 h -0.39222 v -0.416 h 0.39222 V 120.267 l 0.53188,-0.32091 v 1.10239 h 0.53782 v 0.416 H 123.274 v 1.84523 q 0,0.2288 0.0267,0.29417 0.0297,0.0654 0.0921,0.104 0.0654,0.0386 0.18422,0.0386 0.0892,0 0.23474,-0.0208 z m 0.30902,-0.46354 0.52891,-0.0832 q 0.0446,0.31794 0.24663,0.48731 0.20503,0.16937 0.57051,0.16937 0.36845,0 0.54673,-0.14857 0.17829,-0.15154 0.17829,-0.3536 0,-0.18125 -0.15749,-0.28525 -0.10994,-0.0713 -0.54673,-0.18126 -0.58834,-0.14857 -0.81714,-0.25554 -0.22582,-0.10994 -0.34468,-0.30011 -0.11588,-0.19314 -0.11588,-0.42491 0,-0.21097 0.0951,-0.38925 0.0981,-0.18125 0.26446,-0.30011 0.12479,-0.0921 0.33873,-0.15451 0.21692,-0.0654 0.46354,-0.0654 0.37143,0 0.65074,0.10697 0.28228,0.10697 0.41599,0.29119 0.13372,0.18126 0.18423,0.48731 l -0.52297,0.0713 q -0.0357,-0.24366 -0.20799,-0.38034 -0.16937,-0.13669 -0.48137,-0.13669 -0.36845,0 -0.52594,0.12183 -0.15748,0.12183 -0.15748,0.28525 0,0.104 0.0654,0.1872 0.0654,0.0862 0.20503,0.14263 0.0802,0.0297 0.47245,0.13668 0.56753,0.15154 0.79039,0.2496 0.22583,0.0951 0.3536,0.27931 0.12777,0.18423 0.12777,0.4576 0,0.26742 -0.15749,0.50513 -0.15451,0.23475 -0.44868,0.36549 -0.29417,0.12777 -0.66559,0.12777 -0.61508,0 -0.93896,-0.25554 -0.32091,-0.25554 -0.41006,-0.75771 z m 5.41687,-0.0743 0.55268,0.0683 q -0.13074,0.48434 -0.48434,0.75176 -0.3536,0.26743 -0.90331,0.26743 -0.69233,0 -1.09941,-0.42491 -0.40411,-0.42788 -0.40411,-1.19748 0,-0.79633 0.41005,-1.2361 0.41005,-0.43976 1.06376,-0.43976 0.63291,0 1.03405,0.43085 0.40114,0.43085 0.40114,1.21233 0,0.0475 -0.003,0.14263 h -2.35334 q 0.0297,0.51999 0.29417,0.79633 0.26445,0.27634 0.65965,0.27634 0.29416,0 0.50216,-0.15451 0.208,-0.15452 0.32983,-0.49325 z m -1.7561,-0.86468 h 1.76204 q -0.0357,-0.39817 -0.20206,-0.59725 -0.25554,-0.30903 -0.66262,-0.30903 -0.36845,0 -0.62102,0.24663 -0.2496,0.24662 -0.27634,0.65965 z m 3.85687,1.88089 -1.20045,-3.15562 h 0.56457 l 0.67748,1.88981 q 0.10994,0.30605 0.20205,0.63588 0.0713,-0.2496 0.19909,-0.60023 l 0.70125,-1.92546 h 0.5497 l -1.1945,3.15562 z m 4.22532,-0.38925 q -0.29714,0.25257 -0.57348,0.35657 -0.27336,0.104 -0.58833,0.104 -0.52,0 -0.79931,-0.25257 -0.27931,-0.25554 -0.27931,-0.65074 0,-0.23177 0.104,-0.42194 0.10697,-0.19314 0.27634,-0.30902 0.17234,-0.11589 0.38628,-0.17531 0.15748,-0.0416 0.47542,-0.0802 0.64777,-0.0773 0.95382,-0.18423 0.003,-0.10994 0.003,-0.13965 0,-0.32686 -0.15154,-0.46057 -0.20502,-0.18126 -0.60913,-0.18126 -0.37737,0 -0.55863,0.13372 -0.17828,0.13074 -0.26445,0.46651 l -0.52297,-0.0713 q 0.0713,-0.33576 0.23474,-0.54079 0.16343,-0.208 0.47246,-0.31794 0.30902,-0.11291 0.7161,-0.11291 0.40411,0 0.65668,0.0951 0.25257,0.0951 0.37143,0.24068 0.11885,0.14263 0.16639,0.36251 0.0267,0.13669 0.0267,0.49326 v 0.71313 q 0,0.74582 0.0327,0.94491 0.0357,0.19611 0.13669,0.37736 h -0.55863 q -0.0832,-0.1664 -0.10697,-0.38925 z m -0.0446,-1.1945 q -0.29119,0.11885 -0.87359,0.20205 -0.32982,0.0476 -0.46651,0.10697 -0.13668,0.0594 -0.21097,0.17532 -0.0743,0.11291 -0.0743,0.25256 0,0.21395 0.16045,0.35657 0.16343,0.14263 0.47543,0.14263 0.30902,0 0.54971,-0.13371 0.24068,-0.13669 0.35359,-0.37143 0.0862,-0.18125 0.0862,-0.53485 z m 2.53758,1.10536 0.0772,0.47245 q -0.22582,0.0475 -0.40411,0.0475 -0.29119,0 -0.45165,-0.0921 -0.16045,-0.0921 -0.22583,-0.24068 -0.0654,-0.15155 -0.0654,-0.63291 v -1.81552 h -0.39222 v -0.416 h 0.39222 V 120.267 l 0.53188,-0.32091 v 1.10239 h 0.53783 v 0.416 H 137.819 v 1.84523 q 0,0.2288 0.0268,0.29417 0.0297,0.0654 0.0921,0.104 0.0654,0.0386 0.18423,0.0386 0.0891,0 0.23474,-0.0208 z"
         id="path157" />
    </g>
    <g
       id="text220"
       style="font-size:6.08542px;line-height:1.25;stroke-width:0.264583"
       aria-label="valitse-">
      <path
         style="font-family:Sans;-inkscape-font-specification:Sans"
         d="m 32.840038,106.51944 -1.200444,-3.15562 h 0.564566 l 0.677478,1.8898 q 0.109942,0.30606 0.202055,0.63588 0.07131,-0.24959 0.199083,-0.60022 l 0.70125,-1.92546 h 0.549708 l -1.194501,3.15562 z m 4.225326,-0.38925 q -0.297139,0.25257 -0.573479,0.35656 -0.273369,0.104 -0.588337,0.104 -0.519994,0 -0.799305,-0.25257 -0.279312,-0.25554 -0.279312,-0.65073 0,-0.23177 0.103999,-0.42194 0.10697,-0.19314 0.27634,-0.30902 0.172341,-0.11589 0.386282,-0.17532 0.157484,-0.0416 0.475423,-0.0802 0.647764,-0.0773 0.953818,-0.18423 0.003,-0.10994 0.003,-0.13966 0,-0.32685 -0.151541,-0.46056 -0.205027,-0.18126 -0.609137,-0.18126 -0.377367,0 -0.558622,0.13371 -0.178284,0.13075 -0.264455,0.46651 l -0.522965,-0.0713 q 0.07131,-0.33577 0.23474,-0.54079 0.163427,-0.208 0.472452,-0.31794 0.309025,-0.11292 0.716107,-0.11292 0.404109,0 0.656678,0.0951 0.252569,0.0951 0.371425,0.24068 0.118856,0.14263 0.166398,0.36251 0.02674,0.13669 0.02674,0.49325 v 0.71314 q 0,0.74582 0.03269,0.9449 0.03566,0.19611 0.136684,0.37737 h -0.558622 q -0.0832,-0.1664 -0.106971,-0.38925 z m -0.04457,-1.1945 q -0.291197,0.11885 -0.87359,0.20205 -0.329825,0.0475 -0.46651,0.10697 -0.136684,0.0594 -0.210969,0.17531 -0.07428,0.11292 -0.07428,0.25257 0,0.21394 0.160456,0.35657 0.163427,0.14263 0.475423,0.14263 0.309026,0 0.549709,-0.13372 0.240683,-0.13668 0.353596,-0.37142 0.08617,-0.18126 0.08617,-0.53485 z m 1.357929,1.58375 v -4.35607 h 0.534851 v 4.35607 z m 1.366842,-3.74099 v -0.61508 h 0.534851 v 0.61508 z m 0,3.74099 v -3.15562 h 0.534851 v 3.15562 z"
         id="path153" />
      <path
         style="font-family:Sans;-inkscape-font-specification:Sans;fill:#ff0000"
         d="m 42.262337,106.04104 0.07726,0.47246 q -0.225826,0.0475 -0.40411,0.0475 -0.291197,0 -0.451652,-0.0921 -0.160455,-0.0921 -0.225826,-0.24069 -0.06537,-0.15154 -0.06537,-0.6329 v -1.81553 H 40.80041 v -0.41599 h 0.392224 v -0.78148 l 0.53188,-0.32091 v 1.10239 h 0.537823 v 0.41599 h -0.537823 v 1.84524 q 0,0.2288 0.02674,0.29417 0.02971,0.0654 0.09211,0.104 0.06537,0.0386 0.184227,0.0386 0.08914,0 0.23474,-0.0208 z m 0.309025,-0.46353 0.528908,-0.0832 q 0.04457,0.31794 0.246626,0.48731 0.205027,0.16937 0.570508,0.16937 0.368454,0 0.546737,-0.14857 0.178284,-0.15154 0.178284,-0.3536 0,-0.18125 -0.157484,-0.28525 -0.109941,-0.0713 -0.546737,-0.18126 -0.588336,-0.14857 -0.817134,-0.25554 -0.225826,-0.10994 -0.344682,-0.30011 -0.115884,-0.19314 -0.115884,-0.42491 0,-0.21097 0.09508,-0.38925 0.09806,-0.18126 0.264455,-0.30011 0.124798,-0.0921 0.338739,-0.15452 0.216912,-0.0654 0.463538,-0.0654 0.371424,0 0.650736,0.10697 0.282282,0.10697 0.415995,0.2912 0.133713,0.18126 0.184227,0.48731 l -0.522966,0.0713 q -0.03566,-0.24365 -0.207998,-0.38034 -0.169369,-0.13668 -0.481366,-0.13668 -0.368453,0 -0.525937,0.12183 -0.157484,0.12182 -0.157484,0.28525 0,0.104 0.06537,0.1872 0.06537,0.0862 0.205027,0.14263 0.08023,0.0297 0.472452,0.13668 0.567537,0.15154 0.790391,0.2496 0.225826,0.0951 0.353597,0.27931 0.12777,0.18423 0.12777,0.45759 0,0.26743 -0.157484,0.50514 -0.154513,0.23474 -0.448681,0.36548 -0.294169,0.12777 -0.665593,0.12777 -0.615079,0 -0.938961,-0.25554 -0.320911,-0.25554 -0.410053,-0.7577 z m 5.416856,-0.0743 0.55268,0.0683 q -0.130742,0.48434 -0.484338,0.75177 -0.353596,0.26742 -0.903304,0.26742 -0.692336,0 -1.099417,-0.42491 -0.40411,-0.42788 -0.40411,-1.19747 0,-0.79633 0.410053,-1.2361 0.410052,-0.43977 1.06376,-0.43977 0.632907,0 1.034046,0.43086 0.401138,0.43085 0.401138,1.21233 0,0.0475 -0.003,0.14262 H 46.20238 q 0.02971,0.52 0.294168,0.79634 0.264454,0.27634 0.65965,0.27634 0.294168,0 0.502166,-0.15452 0.207998,-0.15451 0.329825,-0.49325 z m -1.756095,-0.86467 h 1.762038 q -0.03566,-0.39817 -0.202055,-0.59726 -0.25554,-0.30902 -0.662622,-0.30902 -0.368453,0 -0.621021,0.24663 -0.249598,0.24662 -0.27634,0.65965 z"
         id="path154" />
      <path
         style="font-family:Sans;-inkscape-font-specification:Sans"
         d="m 49.004435,105.21203 v -0.53783 h 1.643183 v 0.53783 z"
         id="path155" />
    </g>
    <g
       id="text222"
       style="font-size:6.08542px;line-height:1.25;stroke-width:0.264583"
       aria-label="tarvita">
      <path
         style="font-weight:bold;font-family:Sans;-inkscape-font-specification:Sans"
         d="m 18.431347,133.36383 v 0.66559 h -0.570508 v 1.27176 q 0,0.38628 0.01486,0.45165 0.01783,0.0624 0.07428,0.104 0.05943,0.0416 0.142627,0.0416 0.115884,0 0.335768,-0.0802 l 0.07131,0.64776 q -0.291197,0.1248 -0.65965,0.1248 -0.225826,0 -0.407081,-0.0743 -0.181255,-0.0772 -0.267426,-0.19611 -0.0832,-0.12183 -0.115884,-0.32685 -0.02674,-0.1456 -0.02674,-0.58834 v -1.37576 h -0.38331 v -0.66559 h 0.38331 v -0.62696 l 0.837934,-0.48731 v 1.11427 z m 1.203415,0.96273 -0.757706,-0.13668 q 0.12777,-0.4576 0.439767,-0.67748 0.311997,-0.21988 0.927076,-0.21988 0.558622,0 0.831991,0.13371 0.273368,0.13074 0.38331,0.33577 0.112913,0.20205 0.112913,0.74582 l -0.0089,0.97462 q 0,0.41599 0.03863,0.61508 0.0416,0.19611 0.151541,0.42193 H 20.92732 q -0.03269,-0.0832 -0.08023,-0.24662 -0.0208,-0.0743 -0.02971,-0.0981 -0.21394,0.208 -0.457595,0.312 -0.243654,0.104 -0.519994,0.104 -0.487309,0 -0.769592,-0.26446 -0.279311,-0.26445 -0.279311,-0.66856 0,-0.26743 0.12777,-0.47542 0.12777,-0.21097 0.356567,-0.32091 0.231769,-0.11292 0.665593,-0.19612 0.585365,-0.10994 0.811192,-0.20502 v -0.0832 q 0,-0.24069 -0.118856,-0.34171 -0.118856,-0.104 -0.448681,-0.104 -0.222855,0 -0.347654,0.0891 -0.124798,0.0862 -0.202055,0.30605 z m 1.117246,0.67748 q -0.160456,0.0535 -0.508109,0.12777 -0.347654,0.0743 -0.454624,0.1456 -0.163427,0.11589 -0.163427,0.29417 0,0.17531 0.130742,0.30308 0.130741,0.12777 0.332796,0.12777 0.225826,0 0.430853,-0.14857 0.151541,-0.11291 0.199083,-0.27634 0.03269,-0.10697 0.03269,-0.40708 z m 2.442487,1.51541 h -0.834962 v -3.15562 h 0.775535 v 0.44868 q 0.199083,-0.31794 0.356567,-0.41896 0.160456,-0.10103 0.362511,-0.10103 0.285254,0 0.549708,0.15748 l -0.258512,0.72799 q -0.210969,-0.13668 -0.392224,-0.13668 -0.175312,0 -0.29714,0.0981 -0.121827,0.0951 -0.19314,0.34765 -0.06834,0.25257 -0.06834,1.05782 z m 2.436546,0 -1.271758,-3.15562 h 0.876562 l 0.594279,1.6105 0.172341,0.53782 q 0.06834,-0.20502 0.08617,-0.2704 0.0416,-0.13371 0.08914,-0.26742 l 0.600222,-1.6105 h 0.858733 l -1.253929,3.15562 z"
         id="path151" />
      <path
         style="font-weight:bold;font-family:Sans;-inkscape-font-specification:Sans;fill:#ff0000"
         d="m 28.147814,132.93595 v -0.77256 h 0.834962 v 0.77256 z m 0,3.5835 v -3.15562 h 0.834962 v 3.15562 z m 3.137794,-3.15562 v 0.66559 H 30.7151 v 1.27176 q 0,0.38628 0.01486,0.45165 0.01783,0.0624 0.07428,0.104 0.05943,0.0416 0.142627,0.0416 0.115885,0 0.335768,-0.0802 l 0.07131,0.64776 q -0.291196,0.1248 -0.65965,0.1248 -0.225826,0 -0.407081,-0.0743 -0.181255,-0.0772 -0.267426,-0.19611 -0.0832,-0.12183 -0.115884,-0.32685 -0.02674,-0.1456 -0.02674,-0.58834 v -1.37576 h -0.38331 v -0.66559 h 0.38331 v -0.62696 l 0.837934,-0.48731 v 1.11427 z m 1.203416,0.96273 -0.757706,-0.13668 q 0.12777,-0.4576 0.439766,-0.67748 0.311997,-0.21988 0.927076,-0.21988 0.558622,0 0.831991,0.13371 0.273368,0.13074 0.38331,0.33577 0.112913,0.20205 0.112913,0.74582 l -0.0089,0.97462 q 0,0.41599 0.03863,0.61508 0.0416,0.19611 0.151541,0.42193 h -0.826048 q -0.03269,-0.0832 -0.08023,-0.24662 -0.0208,-0.0743 -0.02971,-0.0981 -0.21394,0.208 -0.457595,0.312 -0.243654,0.104 -0.519994,0.104 -0.487309,0 -0.769592,-0.26446 -0.279311,-0.26445 -0.279311,-0.66856 0,-0.26743 0.12777,-0.47542 0.12777,-0.21097 0.356568,-0.32091 0.231769,-0.11292 0.665592,-0.19612 0.585366,-0.10994 0.811192,-0.20502 v -0.0832 q 0,-0.24069 -0.118856,-0.34171 -0.118856,-0.104 -0.448681,-0.104 -0.222855,0 -0.347653,0.0891 -0.124799,0.0862 -0.202055,0.30605 z m 1.117245,0.67748 q -0.160456,0.0535 -0.508109,0.12777 -0.347653,0.0743 -0.454624,0.1456 -0.163427,0.11589 -0.163427,0.29417 0,0.17531 0.130742,0.30308 0.130741,0.12777 0.332796,0.12777 0.225826,0 0.430853,-0.14857 0.151541,-0.11291 0.199083,-0.27634 0.03269,-0.10697 0.03269,-0.40708 z"
         id="path152" />
    </g>
    <g
       id="text224"
       style="font-size:6.08542px;line-height:1;stroke-width:0.264583"
       aria-label="tarvitsen, tarvitset, tarvitsee,&#10;tarvitsemme, tarvitsette, tarvitsevat">
      <path
         style="font-family:Sans;-inkscape-font-specification:Sans"
         d="m 53.101521,157.60316 0.07726,0.47246 q -0.225826,0.0475 -0.40411,0.0475 -0.291197,0 -0.451652,-0.0921 -0.160456,-0.0921 -0.225826,-0.24068 -0.06537,-0.15154 -0.06537,-0.63291 v -1.81552 h -0.392224 v -0.41599 h 0.392224 v -0.78148 l 0.53188,-0.32091 v 1.10239 h 0.537823 v 0.41599 h -0.537823 v 1.84524 q 0,0.2288 0.02674,0.29417 0.02971,0.0654 0.09211,0.104 0.06537,0.0386 0.184226,0.0386 0.08914,0 0.234741,-0.0208 z m 2.582143,0.0891 q -0.297139,0.25256 -0.573479,0.35656 -0.273369,0.104 -0.588337,0.104 -0.519994,0 -0.799305,-0.25257 -0.279312,-0.25554 -0.279312,-0.65073 0,-0.23177 0.103999,-0.42194 0.10697,-0.19314 0.27634,-0.30903 0.172341,-0.11588 0.386282,-0.17531 0.157484,-0.0416 0.475423,-0.0802 0.647764,-0.0772 0.953818,-0.18422 0.003,-0.10994 0.003,-0.13966 0,-0.32685 -0.151542,-0.46057 -0.205026,-0.18125 -0.609136,-0.18125 -0.377367,0 -0.558622,0.13371 -0.178284,0.13074 -0.264455,0.46651 l -0.522965,-0.0713 q 0.07131,-0.33577 0.23474,-0.5408 0.163427,-0.20799 0.472452,-0.31794 0.309025,-0.11291 0.716106,-0.11291 0.40411,0 0.656679,0.0951 0.252569,0.0951 0.371425,0.24068 0.118856,0.14263 0.166398,0.36251 0.02674,0.13668 0.02674,0.49325 v 0.71314 q 0,0.74582 0.03269,0.9449 0.03566,0.19611 0.136684,0.37737 h -0.558622 q -0.0832,-0.1664 -0.106971,-0.38925 z m -0.04457,-1.19451 q -0.291197,0.11886 -0.87359,0.20206 -0.329825,0.0475 -0.46651,0.10697 -0.136684,0.0594 -0.210969,0.17531 -0.07428,0.11291 -0.07428,0.25257 0,0.21394 0.160456,0.35657 0.163427,0.14262 0.475423,0.14262 0.309025,0 0.549709,-0.13371 0.240683,-0.13668 0.353596,-0.37142 0.08617,-0.18126 0.08617,-0.53485 z m 1.363871,1.58376 v -3.15562 h 0.481367 v 0.47839 q 0.184226,-0.33577 0.338739,-0.44274 0.157484,-0.10697 0.344682,-0.10697 0.270397,0 0.549708,0.17234 l -0.184227,0.49623 q -0.196112,-0.11589 -0.392224,-0.11589 -0.175312,0 -0.314968,0.10697 -0.139656,0.104 -0.199083,0.2912 -0.08914,0.28525 -0.08914,0.62399 v 1.6521 z m 2.908998,0 -1.200445,-3.15562 h 0.564566 l 0.677478,1.8898 q 0.109942,0.30606 0.202055,0.63588 0.07131,-0.2496 0.199084,-0.60022 l 0.701249,-1.92546 h 0.549709 l -1.194502,3.15562 z m 2.169119,-3.74099 v -0.61508 h 0.534852 v 0.61508 z m 0,3.74099 v -3.15562 h 0.534852 v 3.15562 z m 2.516773,-0.4784 0.07726,0.47246 q -0.225826,0.0475 -0.40411,0.0475 -0.291197,0 -0.451652,-0.0921 -0.160456,-0.0921 -0.225826,-0.24068 -0.06537,-0.15154 -0.06537,-0.63291 v -1.81552 h -0.392224 v -0.41599 h 0.392224 v -0.78148 l 0.53188,-0.32091 v 1.10239 h 0.537823 v 0.41599 h -0.537823 v 1.84524 q 0,0.2288 0.02674,0.29417 0.02971,0.0654 0.09211,0.104 0.06537,0.0386 0.184226,0.0386 0.08914,0 0.234741,-0.0208 z m 0.309025,-0.46353 0.528908,-0.0832 q 0.04457,0.31794 0.246626,0.48731 0.205027,0.16937 0.570508,0.16937 0.368454,0 0.546737,-0.14857 0.178284,-0.15155 0.178284,-0.3536 0,-0.18126 -0.157484,-0.28526 -0.109942,-0.0713 -0.546737,-0.18125 -0.588336,-0.14857 -0.817134,-0.25554 -0.225826,-0.10994 -0.344682,-0.30011 -0.115884,-0.19314 -0.115884,-0.42491 0,-0.21097 0.09508,-0.38925 0.09806,-0.18126 0.264455,-0.30012 0.124798,-0.0921 0.338739,-0.15451 0.216912,-0.0654 0.463538,-0.0654 0.371424,0 0.650736,0.10697 0.282282,0.10697 0.415995,0.2912 0.133713,0.18125 0.184227,0.48731 l -0.522966,0.0713 q -0.03566,-0.24365 -0.207998,-0.38034 -0.169369,-0.13668 -0.481366,-0.13668 -0.368453,0 -0.525937,0.12183 -0.157484,0.12182 -0.157484,0.28525 0,0.104 0.06537,0.1872 0.06537,0.0862 0.205027,0.14262 0.08023,0.0297 0.472452,0.13669 0.567537,0.15154 0.790391,0.2496 0.225826,0.0951 0.353596,0.27931 0.127771,0.18422 0.127771,0.45759 0,0.26743 -0.157484,0.50514 -0.154513,0.23474 -0.448681,0.36548 -0.294169,0.12777 -0.665593,0.12777 -0.615079,0 -0.938962,-0.25554 -0.32091,-0.25554 -0.410052,-0.7577 z m 5.416855,-0.0743 0.55268,0.0683 q -0.130742,0.48434 -0.484338,0.75177 -0.353596,0.26742 -0.903304,0.26742 -0.692336,0 -1.099417,-0.42491 -0.40411,-0.42788 -0.40411,-1.19747 0,-0.79634 0.410053,-1.2361 0.410052,-0.43977 1.06376,-0.43977 0.632907,0 1.034046,0.43085 0.401138,0.43086 0.401138,1.21233 0,0.0476 -0.003,0.14263 h -2.353346 q 0.02971,0.52 0.294168,0.79634 0.264454,0.27634 0.65965,0.27634 0.294168,0 0.502166,-0.15452 0.207998,-0.15451 0.329825,-0.49325 z M 68.56764,156.2006 h 1.762038 q -0.03566,-0.39816 -0.202055,-0.59725 -0.25554,-0.30902 -0.662622,-0.30902 -0.368453,0 -0.621022,0.24662 -0.249597,0.24663 -0.276339,0.65965 z m 2.980312,1.8809 v -3.15562 h 0.481366 v 0.44868 q 0.347654,-0.52 1.004332,-0.52 0.285254,0 0.522966,0.104 0.240683,0.10103 0.359539,0.26743 0.118856,0.16639 0.166398,0.39519 0.02971,0.14857 0.02971,0.52 v 1.94032 h -0.534851 v -1.91952 q 0,-0.32686 -0.0624,-0.48731 -0.0624,-0.16343 -0.222854,-0.25851 -0.157484,-0.0981 -0.371425,-0.0981 -0.34171,0 -0.591308,0.21691 -0.246626,0.21691 -0.246626,0.82308 v 1.72341 z m 3.524076,0 v -0.60914 h 0.609136 v 0.60914 q 0,0.33577 -0.118856,0.54079 -0.118855,0.208 -0.377367,0.32091 l -0.14857,-0.22879 q 0.16937,-0.0743 0.249598,-0.21989 0.08023,-0.14262 0.08914,-0.41302 z m 4.409552,-0.4784 0.07726,0.47246 q -0.225826,0.0475 -0.40411,0.0475 -0.291197,0 -0.451652,-0.0921 -0.160455,-0.0921 -0.225826,-0.24068 -0.06537,-0.15154 -0.06537,-0.63291 v -1.81552 h -0.392224 v -0.41599 h 0.392224 v -0.78148 l 0.53188,-0.32091 v 1.10239 h 0.537823 v 0.41599 h -0.537823 v 1.84524 q 0,0.2288 0.02674,0.29417 0.02971,0.0654 0.09211,0.104 0.06537,0.0386 0.184227,0.0386 0.08914,0 0.23474,-0.0208 z m 2.582144,0.0891 q -0.297139,0.25256 -0.573479,0.35656 -0.273369,0.104 -0.588337,0.104 -0.519994,0 -0.799305,-0.25257 -0.279312,-0.25554 -0.279312,-0.65073 0,-0.23177 0.103999,-0.42194 0.10697,-0.19314 0.27634,-0.30903 0.172341,-0.11588 0.386282,-0.17531 0.157484,-0.0416 0.475423,-0.0802 0.647764,-0.0772 0.953818,-0.18422 0.003,-0.10994 0.003,-0.13966 0,-0.32685 -0.151542,-0.46057 -0.205026,-0.18125 -0.609136,-0.18125 -0.377367,0 -0.558622,0.13371 -0.178284,0.13074 -0.264455,0.46651 l -0.522965,-0.0713 q 0.07131,-0.33577 0.23474,-0.5408 0.163427,-0.20799 0.472452,-0.31794 0.309025,-0.11291 0.716106,-0.11291 0.40411,0 0.656679,0.0951 0.252569,0.0951 0.371425,0.24068 0.118856,0.14263 0.166398,0.36251 0.02674,0.13668 0.02674,0.49325 v 0.71314 q 0,0.74582 0.03269,0.9449 0.03566,0.19611 0.136684,0.37737 h -0.558622 q -0.0832,-0.1664 -0.106971,-0.38925 z m -0.04457,-1.19451 q -0.291197,0.11886 -0.87359,0.20206 -0.329825,0.0475 -0.46651,0.10697 -0.136684,0.0594 -0.210969,0.17531 -0.07428,0.11291 -0.07428,0.25257 0,0.21394 0.160456,0.35657 0.163427,0.14262 0.475423,0.14262 0.309025,0 0.549709,-0.13371 0.240683,-0.13668 0.353596,-0.37142 0.08617,-0.18126 0.08617,-0.53485 z m 1.363871,1.58376 v -3.15562 h 0.481366 v 0.47839 q 0.184227,-0.33577 0.338739,-0.44274 0.157485,-0.10697 0.344682,-0.10697 0.270398,0 0.549709,0.17234 l -0.184227,0.49623 q -0.196112,-0.11589 -0.392224,-0.11589 -0.175312,0 -0.314968,0.10697 -0.139656,0.104 -0.199084,0.2912 -0.08914,0.28525 -0.08914,0.62399 v 1.6521 z m 2.908998,0 -1.200444,-3.15562 h 0.564565 l 0.677478,1.8898 q 0.109942,0.30606 0.202055,0.63588 0.07131,-0.2496 0.199084,-0.60022 l 0.70125,-1.92546 h 0.549708 l -1.194501,3.15562 z m 2.169119,-3.74099 v -0.61508 h 0.534851 v 0.61508 z m 0,3.74099 v -3.15562 h 0.534851 v 3.15562 z m 2.516773,-0.4784 0.07726,0.47246 q -0.225826,0.0475 -0.40411,0.0475 -0.291196,0 -0.451652,-0.0921 -0.160455,-0.0921 -0.225826,-0.24068 -0.06537,-0.15154 -0.06537,-0.63291 v -1.81552 h -0.392224 v -0.41599 h 0.392224 v -0.78148 l 0.53188,-0.32091 v 1.10239 h 0.537823 v 0.41599 h -0.53783 v 1.84524 q 0,0.2288 0.02674,0.29417 0.02971,0.0654 0.09211,0.104 0.06537,0.0386 0.184227,0.0386 0.08914,0 0.23474,-0.0208 z m 0.309024,-0.46353 0.528909,-0.0832 q 0.04457,0.31794 0.246626,0.48731 0.205026,0.16937 0.570508,0.16937 0.368453,0 0.546737,-0.14857 0.178283,-0.15155 0.178283,-0.3536 0,-0.18126 -0.157484,-0.28526 -0.109941,-0.0713 -0.546737,-0.18125 -0.588336,-0.14857 -0.817134,-0.25554 -0.225826,-0.10994 -0.344682,-0.30011 -0.115884,-0.19314 -0.115884,-0.42491 0,-0.21097 0.09508,-0.38925 0.09806,-0.18126 0.264454,-0.30012 0.124799,-0.0921 0.338739,-0.15451 0.216912,-0.0654 0.463538,-0.0654 0.371425,0 0.650736,0.10697 0.282283,0.10697 0.415995,0.2912 0.133713,0.18125 0.184227,0.48731 l -0.522966,0.0713 q -0.03566,-0.24365 -0.207998,-0.38034 -0.169369,-0.13668 -0.481366,-0.13668 -0.368453,0 -0.525937,0.12183 -0.157484,0.12182 -0.157484,0.28525 0,0.104 0.06537,0.1872 0.06537,0.0862 0.205026,0.14262 0.08023,0.0297 0.472452,0.13669 0.567537,0.15154 0.790392,0.2496 0.225826,0.0951 0.353596,0.27931 0.12777,0.18422 0.12777,0.45759 0,0.26743 -0.157484,0.50514 -0.154513,0.23474 -0.448681,0.36548 -0.294168,0.12777 -0.665593,0.12777 -0.615079,0 -0.938961,-0.25554 -0.320911,-0.25554 -0.410053,-0.7577 z m 5.416855,-0.0743 0.55268,0.0683 q -0.130741,0.48434 -0.484338,0.75177 -0.353596,0.26742 -0.903304,0.26742 -0.692336,0 -1.099417,-0.42491 -0.40411,-0.42788 -0.40411,-1.19747 0,-0.79634 0.410053,-1.2361 0.410053,-0.43977 1.06376,-0.43977 0.632907,0 1.034046,0.43085 0.401138,0.43086 0.401138,1.21233 0,0.0476 -0.003,0.14263 h -2.353346 q 0.02971,0.52 0.294168,0.79634 0.264454,0.27634 0.65965,0.27634 0.294168,0 0.502166,-0.15452 0.207998,-0.15451 0.329825,-0.49325 z m -1.756095,-0.86468 h 1.762038 q -0.03566,-0.39816 -0.202055,-0.59725 -0.25554,-0.30902 -0.662621,-0.30902 -0.368454,0 -0.621022,0.24662 -0.249598,0.24663 -0.27634,0.65965 z m 4.148071,1.4025 0.07726,0.47246 q -0.225826,0.0475 -0.40411,0.0475 -0.291196,0 -0.451652,-0.0921 -0.160455,-0.0921 -0.225826,-0.24068 -0.06537,-0.15154 -0.06537,-0.63291 v -1.81552 h -0.392224 v -0.41599 h 0.392224 v -0.78148 l 0.53188,-0.32091 v 1.10239 h 0.537823 v 0.41599 h -0.537823 v 1.84524 q 0,0.2288 0.02674,0.29417 0.02971,0.0654 0.09211,0.104 0.06537,0.0386 0.184227,0.0386 0.08914,0 0.23474,-0.0208 z m 0.66262,0.4784 v -0.60914 h 0.60913 v 0.60914 q 0,0.33577 -0.11885,0.54079 -0.11886,0.208 -0.377367,0.32091 l -0.148569,-0.22879 q 0.169369,-0.0743 0.249597,-0.21989 0.08023,-0.14262 0.08914,-0.41302 z m 4.40955,-0.4784 0.0773,0.47246 q -0.22583,0.0475 -0.40411,0.0475 -0.2912,0 -0.45165,-0.0921 -0.16046,-0.0921 -0.22583,-0.24068 -0.0654,-0.15154 -0.0654,-0.63291 v -1.81552 h -0.39222 v -0.41599 h 0.39222 v -0.78148 l 0.53188,-0.32091 v 1.10239 h 0.53782 v 0.41599 h -0.53782 v 1.84524 q 0,0.2288 0.0267,0.29417 0.0297,0.0654 0.0921,0.104 0.0654,0.0386 0.18422,0.0386 0.0891,0 0.23474,-0.0208 z m 2.58214,0.0891 q -0.29714,0.25256 -0.57347,0.35656 -0.27337,0.104 -0.58834,0.104 -0.52,0 -0.79931,-0.25257 -0.27931,-0.25554 -0.27931,-0.65073 0,-0.23177 0.104,-0.42194 0.10697,-0.19314 0.27634,-0.30903 0.17234,-0.11588 0.38628,-0.17531 0.15749,-0.0416 0.47543,-0.0802 0.64776,-0.0772 0.95381,-0.18422 0.003,-0.10994 0.003,-0.13966 0,-0.32685 -0.15155,-0.46057 -0.20502,-0.18125 -0.60913,-0.18125 -0.37737,0 -0.55863,0.13371 -0.17828,0.13074 -0.26445,0.46651 l -0.52297,-0.0713 q 0.0713,-0.33577 0.23475,-0.5408 0.16342,-0.20799 0.47245,-0.31794 0.30902,-0.11291 0.7161,-0.11291 0.40411,0 0.65668,0.0951 0.25257,0.0951 0.37143,0.24068 0.11885,0.14263 0.1664,0.36251 0.0267,0.13668 0.0267,0.49325 v 0.71314 q 0,0.74582 0.0327,0.9449 0.0357,0.19611 0.13669,0.37737 h -0.55863 q -0.0832,-0.1664 -0.10697,-0.38925 z m -0.0446,-1.19451 q -0.29119,0.11886 -0.87359,0.20206 -0.32982,0.0475 -0.46651,0.10697 -0.13668,0.0594 -0.21097,0.17531 -0.0743,0.11291 -0.0743,0.25257 0,0.21394 0.16046,0.35657 0.16342,0.14262 0.47542,0.14262 0.30902,0 0.54971,-0.13371 0.24068,-0.13668 0.35359,-0.37142 0.0862,-0.18126 0.0862,-0.53485 z m 1.36388,1.58376 v -3.15562 h 0.48136 v 0.47839 q 0.18423,-0.33577 0.33874,-0.44274 0.15749,-0.10697 0.34468,-0.10697 0.2704,0 0.54971,0.17234 l -0.18422,0.49623 q -0.19612,-0.11589 -0.39223,-0.11589 -0.17531,0 -0.31497,0.10697 -0.13965,0.104 -0.19908,0.2912 -0.0891,0.28525 -0.0891,0.62399 v 1.6521 z m 2.90899,0 -1.20044,-3.15562 h 0.56456 l 0.67748,1.8898 q 0.10994,0.30606 0.20205,0.63588 0.0713,-0.2496 0.19909,-0.60022 l 0.70125,-1.92546 h 0.54971 l -1.19451,3.15562 z m 2.16912,-3.74099 v -0.61508 h 0.53485 v 0.61508 z m 0,3.74099 v -3.15562 h 0.53485 v 3.15562 z m 2.51677,-0.4784 0.0773,0.47246 q -0.22583,0.0475 -0.40411,0.0475 -0.2912,0 -0.45165,-0.0921 -0.16046,-0.0921 -0.22583,-0.24068 -0.0654,-0.15154 -0.0654,-0.63291 v -1.81552 h -0.39222 v -0.41599 h 0.39222 v -0.78148 l 0.53188,-0.32091 v 1.10239 h 0.53782 v 0.41599 h -0.53782 v 1.84524 q 0,0.2288 0.0267,0.29417 0.0297,0.0654 0.0921,0.104 0.0654,0.0386 0.18422,0.0386 0.0891,0 0.23474,-0.0208 z m 0.30903,-0.46353 0.52891,-0.0832 q 0.0446,0.31794 0.24662,0.48731 0.20503,0.16937 0.57051,0.16937 0.36846,0 0.54674,-0.14857 0.17828,-0.15155 0.17828,-0.3536 0,-0.18126 -0.15748,-0.28526 -0.10994,-0.0713 -0.54674,-0.18125 -0.58833,-0.14857 -0.81713,-0.25554 -0.22583,-0.10994 -0.34468,-0.30011 -0.11589,-0.19314 -0.11589,-0.42491 0,-0.21097 0.0951,-0.38925 0.0981,-0.18126 0.26445,-0.30012 0.1248,-0.0921 0.33874,-0.15451 0.21691,-0.0654 0.46354,-0.0654 0.37142,0 0.65073,0.10697 0.28229,0.10697 0.416,0.2912 0.13371,0.18125 0.18423,0.48731 l -0.52297,0.0713 q -0.0357,-0.24365 -0.208,-0.38034 -0.16937,-0.13668 -0.48136,-0.13668 -0.36846,0 -0.52594,0.12183 -0.15748,0.12182 -0.15748,0.28525 0,0.104 0.0654,0.1872 0.0654,0.0862 0.20502,0.14262 0.0802,0.0297 0.47245,0.13669 0.56754,0.15154 0.7904,0.2496 0.22582,0.0951 0.35359,0.27931 0.12777,0.18422 0.12777,0.45759 0,0.26743 -0.15748,0.50514 -0.15451,0.23474 -0.44868,0.36548 -0.29417,0.12777 -0.6656,0.12777 -0.61507,0 -0.93896,-0.25554 -0.32091,-0.25554 -0.41005,-0.7577 z m 5.41686,-0.0743 0.55268,0.0683 q -0.13075,0.48434 -0.48434,0.75177 -0.3536,0.26742 -0.90331,0.26742 -0.69233,0 -1.09941,-0.42491 -0.40411,-0.42788 -0.40411,-1.19747 0,-0.79634 0.41005,-1.2361 0.41005,-0.43977 1.06376,-0.43977 0.63291,0 1.03405,0.43085 0.40113,0.43086 0.40113,1.21233 0,0.0476 -0.003,0.14263 h -2.35334 q 0.0297,0.52 0.29416,0.79634 0.26446,0.27634 0.65965,0.27634 0.29417,0 0.50217,-0.15452 0.208,-0.15451 0.32983,-0.49325 z m -1.7561,-0.86468 h 1.76204 q -0.0357,-0.39816 -0.20206,-0.59725 -0.25554,-0.30902 -0.66262,-0.30902 -0.36845,0 -0.62102,0.24662 -0.2496,0.24663 -0.27634,0.65965 z m 5.14052,0.86468 0.55268,0.0683 q -0.13074,0.48434 -0.48434,0.75177 -0.3536,0.26742 -0.9033,0.26742 -0.69234,0 -1.09942,-0.42491 -0.40411,-0.42788 -0.40411,-1.19747 0,-0.79634 0.41005,-1.2361 0.41005,-0.43977 1.06376,-0.43977 0.63291,0 1.03405,0.43085 0.40114,0.43086 0.40114,1.21233 0,0.0476 -0.003,0.14263 h -2.35334 q 0.0297,0.52 0.29417,0.79634 0.26445,0.27634 0.65965,0.27634 0.29416,0 0.50216,-0.15452 0.208,-0.15451 0.32983,-0.49325 z m -1.7561,-0.86468 h 1.76204 q -0.0357,-0.39816 -0.20205,-0.59725 -0.25554,-0.30902 -0.66263,-0.30902 -0.36845,0 -0.62102,0.24662 -0.2496,0.24663 -0.27634,0.65965 z m 3.11997,1.8809 v -0.60914 h 0.60914 v 0.60914 q 0,0.33577 -0.11886,0.54079 -0.11886,0.208 -0.37737,0.32091 l -0.14857,-0.22879 q 0.16937,-0.0743 0.2496,-0.21989 0.0802,-0.14262 0.0891,-0.41302 z"
         id="path149" />
      <path
         style="font-family:Sans;-inkscape-font-specification:Sans"
         d="m 53.101521,163.68858 0.07726,0.47246 q -0.225826,0.0475 -0.40411,0.0475 -0.291197,0 -0.451652,-0.0921 -0.160456,-0.0921 -0.225826,-0.24068 -0.06537,-0.15154 -0.06537,-0.63291 v -1.81552 h -0.392224 v -0.41599 h 0.392224 v -0.78148 l 0.53188,-0.32091 v 1.10239 h 0.537823 v 0.41599 h -0.537823 v 1.84524 q 0,0.2288 0.02674,0.29417 0.02971,0.0654 0.09211,0.104 0.06537,0.0386 0.184226,0.0386 0.08914,0 0.234741,-0.0208 z m 2.582143,0.0891 q -0.297139,0.25256 -0.573479,0.35656 -0.273369,0.104 -0.588337,0.104 -0.519994,0 -0.799305,-0.25257 -0.279312,-0.25554 -0.279312,-0.65073 0,-0.23177 0.103999,-0.42194 0.10697,-0.19314 0.27634,-0.30903 0.172341,-0.11588 0.386282,-0.17531 0.157484,-0.0416 0.475423,-0.0802 0.647764,-0.0772 0.953818,-0.18422 0.003,-0.10994 0.003,-0.13966 0,-0.32685 -0.151542,-0.46057 -0.205026,-0.18125 -0.609136,-0.18125 -0.377367,0 -0.558622,0.13371 -0.178284,0.13074 -0.264455,0.46651 l -0.522965,-0.0713 q 0.07131,-0.33577 0.23474,-0.5408 0.163427,-0.20799 0.472452,-0.31794 0.309025,-0.11291 0.716106,-0.11291 0.40411,0 0.656679,0.0951 0.252569,0.0951 0.371425,0.24068 0.118856,0.14263 0.166398,0.36251 0.02674,0.13668 0.02674,0.49325 v 0.71314 q 0,0.74582 0.03269,0.9449 0.03566,0.19611 0.136684,0.37737 h -0.558622 q -0.0832,-0.1664 -0.106971,-0.38925 z m -0.04457,-1.19451 q -0.291197,0.11886 -0.87359,0.20206 -0.329825,0.0475 -0.46651,0.10697 -0.136684,0.0594 -0.210969,0.17531 -0.07428,0.11291 -0.07428,0.25257 0,0.21394 0.160456,0.35657 0.163427,0.14262 0.475423,0.14262 0.309025,0 0.549709,-0.13371 0.240683,-0.13668 0.353596,-0.37142 0.08617,-0.18126 0.08617,-0.53485 z m 1.363871,1.58376 v -3.15562 h 0.481367 v 0.47839 q 0.184226,-0.33577 0.338739,-0.44274 0.157484,-0.10697 0.344682,-0.10697 0.270397,0 0.549708,0.17234 l -0.184227,0.49623 q -0.196112,-0.11589 -0.392224,-0.11589 -0.175312,0 -0.314968,0.10697 -0.139656,0.104 -0.199083,0.2912 -0.08914,0.28525 -0.08914,0.62399 v 1.6521 z m 2.908998,0 -1.200445,-3.15562 h 0.564566 l 0.677478,1.8898 q 0.109942,0.30606 0.202055,0.63588 0.07131,-0.2496 0.199084,-0.60022 l 0.701249,-1.92546 h 0.549709 l -1.194502,3.15562 z m 2.169119,-3.74099 v -0.61508 h 0.534852 v 0.61508 z m 0,3.74099 v -3.15562 h 0.534852 v 3.15562 z m 2.516773,-0.4784 0.07726,0.47246 q -0.225826,0.0475 -0.40411,0.0475 -0.291197,0 -0.451652,-0.0921 -0.160456,-0.0921 -0.225826,-0.24068 -0.06537,-0.15154 -0.06537,-0.63291 v -1.81552 h -0.392224 v -0.41599 h 0.392224 v -0.78148 l 0.53188,-0.32091 v 1.10239 h 0.537823 v 0.41599 h -0.537823 v 1.84524 q 0,0.2288 0.02674,0.29417 0.02971,0.0654 0.09211,0.104 0.06537,0.0386 0.184226,0.0386 0.08914,0 0.234741,-0.0208 z m 0.309025,-0.46353 0.528908,-0.0832 q 0.04457,0.31794 0.246626,0.48731 0.205027,0.16937 0.570508,0.16937 0.368454,0 0.546737,-0.14857 0.178284,-0.15155 0.178284,-0.3536 0,-0.18126 -0.157484,-0.28525 -0.109942,-0.0713 -0.546737,-0.18126 -0.588336,-0.14857 -0.817134,-0.25554 -0.225826,-0.10994 -0.344682,-0.30011 -0.115884,-0.19314 -0.115884,-0.42491 0,-0.21097 0.09508,-0.38925 0.09806,-0.18126 0.264455,-0.30011 0.124798,-0.0921 0.338739,-0.15452 0.216912,-0.0654 0.463538,-0.0654 0.371424,0 0.650736,0.10697 0.282282,0.10697 0.415995,0.2912 0.133713,0.18125 0.184227,0.48731 l -0.522966,0.0713 q -0.03566,-0.24365 -0.207998,-0.38034 -0.169369,-0.13668 -0.481366,-0.13668 -0.368453,0 -0.525937,0.12183 -0.157484,0.12182 -0.157484,0.28525 0,0.104 0.06537,0.1872 0.06537,0.0862 0.205027,0.14262 0.08023,0.0297 0.472452,0.13669 0.567537,0.15154 0.790391,0.2496 0.225826,0.0951 0.353596,0.27931 0.127771,0.18422 0.127771,0.45759 0,0.26743 -0.157484,0.50514 -0.154513,0.23474 -0.448681,0.36548 -0.294169,0.12777 -0.665593,0.12777 -0.615079,0 -0.938962,-0.25554 -0.32091,-0.25554 -0.410052,-0.7577 z m 5.416855,-0.0743 0.55268,0.0683 q -0.130742,0.48434 -0.484338,0.75177 -0.353596,0.26742 -0.903304,0.26742 -0.692336,0 -1.099417,-0.42491 -0.40411,-0.42788 -0.40411,-1.19747 0,-0.79633 0.410053,-1.2361 0.410052,-0.43977 1.06376,-0.43977 0.632907,0 1.034046,0.43085 0.401138,0.43086 0.401138,1.21233 0,0.0476 -0.003,0.14263 h -2.353346 q 0.02971,0.52 0.294168,0.79634 0.264454,0.27634 0.65965,0.27634 0.294168,0 0.502166,-0.15452 0.207998,-0.15451 0.329825,-0.49325 z m -1.756095,-0.86468 h 1.762038 q -0.03566,-0.39816 -0.202055,-0.59725 -0.25554,-0.30902 -0.662622,-0.30902 -0.368453,0 -0.621022,0.24662 -0.249597,0.24663 -0.276339,0.65965 z m 2.980312,1.8809 v -3.15562 h 0.478395 v 0.44273 q 0.14857,-0.23177 0.395196,-0.37142 0.246625,-0.14263 0.561594,-0.14263 0.350624,0 0.573479,0.1456 0.225826,0.1456 0.317939,0.40708 0.374396,-0.55268 0.974619,-0.55268 0.46948,0 0.722049,0.26148 0.252569,0.25852 0.252569,0.79931 v 2.16615 h -0.53188 v -1.98787 q 0,-0.32091 -0.05349,-0.46056 -0.05051,-0.14263 -0.187197,-0.2288 -0.136685,-0.0862 -0.320911,-0.0862 -0.332797,0 -0.55268,0.22285 -0.219883,0.21989 -0.219883,0.7072 v 1.83335 h -0.534852 v -2.05027 q 0,-0.35656 -0.130741,-0.53485 -0.130742,-0.17828 -0.427881,-0.17828 -0.225826,0 -0.418967,0.11886 -0.19017,0.11885 -0.27634,0.34765 -0.08617,0.2288 -0.08617,0.65965 v 1.63724 z m 5.069202,0 v -3.15562 h 0.478395 v 0.44273 q 0.14857,-0.23177 0.395196,-0.37142 0.246626,-0.14263 0.561594,-0.14263 0.350625,0 0.573479,0.1456 0.225827,0.1456 0.31794,0.40708 0.374396,-0.55268 0.974618,-0.55268 0.469481,0 0.722049,0.26148 0.252569,0.25852 0.252569,0.79931 v 2.16615 h -0.53188 v -1.98787 q 0,-0.32091 -0.05349,-0.46056 -0.05051,-0.14263 -0.187198,-0.2288 -0.136684,-0.0862 -0.320911,-0.0862 -0.332796,0 -0.55268,0.22285 -0.219883,0.21989 -0.219883,0.7072 v 1.83335 h -0.534851 v -2.05027 q 0,-0.35656 -0.130742,-0.53485 -0.130741,-0.17828 -0.427881,-0.17828 -0.225826,0 -0.418967,0.11886 -0.190169,0.11885 -0.27634,0.34765 -0.08617,0.2288 -0.08617,0.65965 v 1.63724 z m 7.229408,-1.01622 0.55268,0.0683 q -0.130742,0.48434 -0.484338,0.75177 -0.353596,0.26742 -0.903304,0.26742 -0.692336,0 -1.099417,-0.42491 -0.40411,-0.42788 -0.40411,-1.19747 0,-0.79633 0.410053,-1.2361 0.410052,-0.43977 1.06376,-0.43977 0.632907,0 1.034046,0.43085 0.401138,0.43086 0.401138,1.21233 0,0.0476 -0.003,0.14263 h -2.353346 q 0.02971,0.52 0.294168,0.79634 0.264454,0.27634 0.65965,0.27634 0.294168,0 0.502166,-0.15452 0.207998,-0.15451 0.329825,-0.49325 z m -1.756095,-0.86468 h 1.762038 q -0.03566,-0.39816 -0.202055,-0.59725 -0.25554,-0.30902 -0.662621,-0.30902 -0.368454,0 -0.621022,0.24662 -0.249598,0.24663 -0.27634,0.65965 z m 3.119964,1.8809 v -0.60914 h 0.609136 v 0.60914 q 0,0.33577 -0.118856,0.54079 -0.118855,0.208 -0.377367,0.32091 l -0.14857,-0.22879 q 0.16937,-0.0743 0.249597,-0.21989 0.08023,-0.14262 0.08914,-0.41302 z m 4.409554,-0.4784 0.07726,0.47246 q -0.225826,0.0475 -0.40411,0.0475 -0.291197,0 -0.451652,-0.0921 -0.160456,-0.0921 -0.225826,-0.24068 -0.06537,-0.15154 -0.06537,-0.63291 v -1.81552 h -0.392224 v -0.41599 h 0.392224 v -0.78148 l 0.53188,-0.32091 v 1.10239 h 0.537823 v 0.41599 h -0.537823 v 1.84524 q 0,0.2288 0.02674,0.29417 0.02971,0.0654 0.09211,0.104 0.06537,0.0386 0.184226,0.0386 0.08914,0 0.234741,-0.0208 z m 2.582142,0.0891 q -0.297139,0.25256 -0.573479,0.35656 -0.273369,0.104 -0.588337,0.104 -0.519994,0 -0.799306,-0.25257 -0.279311,-0.25554 -0.279311,-0.65073 0,-0.23177 0.103999,-0.42194 0.10697,-0.19314 0.27634,-0.30903 0.172341,-0.11588 0.386281,-0.17531 0.157485,-0.0416 0.475424,-0.0802 0.647764,-0.0772 0.953818,-0.18422 0.003,-0.10994 0.003,-0.13966 0,-0.32685 -0.151542,-0.46057 -0.205026,-0.18125 -0.609136,-0.18125 -0.377367,0 -0.558622,0.13371 -0.178284,0.13074 -0.264455,0.46651 l -0.522966,-0.0713 q 0.07131,-0.33577 0.234741,-0.5408 0.163427,-0.20799 0.472452,-0.31794 0.309025,-0.11291 0.716106,-0.11291 0.40411,0 0.656679,0.0951 0.252569,0.0951 0.371425,0.24068 0.118855,0.14263 0.166398,0.36251 0.02674,0.13668 0.02674,0.49325 v 0.71314 q 0,0.74582 0.03269,0.9449 0.03566,0.19611 0.136684,0.37737 h -0.558623 q -0.0832,-0.1664 -0.10697,-0.38925 z m -0.04457,-1.19451 q -0.291197,0.11886 -0.87359,0.20206 -0.329825,0.0475 -0.46651,0.10697 -0.136684,0.0594 -0.210969,0.17531 -0.07429,0.11291 -0.07429,0.25257 0,0.21394 0.160456,0.35657 0.163427,0.14262 0.475423,0.14262 0.309025,0 0.549709,-0.13371 0.240683,-0.13668 0.353596,-0.37142 0.08617,-0.18126 0.08617,-0.53485 z m 1.363873,1.58376 v -3.15562 h 0.481366 v 0.47839 q 0.184227,-0.33577 0.338739,-0.44274 0.157484,-0.10697 0.344682,-0.10697 0.270397,0 0.549709,0.17234 l -0.184227,0.49623 q -0.196112,-0.11589 -0.392224,-0.11589 -0.175313,0 -0.314968,0.10697 -0.139656,0.104 -0.199084,0.2912 -0.08914,0.28525 -0.08914,0.62399 v 1.6521 z m 2.908998,0 -1.200444,-3.15562 h 0.564565 l 0.677478,1.8898 q 0.109942,0.30606 0.202055,0.63588 0.07131,-0.2496 0.199084,-0.60022 l 0.701249,-1.92546 h 0.549709 l -1.194502,3.15562 z m 2.169119,-3.74099 v -0.61508 h 0.534851 v 0.61508 z m 0,3.74099 v -3.15562 h 0.534851 v 3.15562 z m 2.516773,-0.4784 0.0772,0.47246 q -0.22582,0.0475 -0.40411,0.0475 -0.29119,0 -0.45165,-0.0921 -0.16045,-0.0921 -0.22582,-0.24068 -0.0654,-0.15154 -0.0654,-0.63291 v -1.81552 h -0.392227 v -0.41599 h 0.392227 v -0.78148 l 0.53188,-0.32091 v 1.10239 h 0.53782 v 0.41599 h -0.53782 v 1.84524 q 0,0.2288 0.0267,0.29417 0.0297,0.0654 0.0921,0.104 0.0654,0.0386 0.18423,0.0386 0.0891,0 0.23474,-0.0208 z m 0.30902,-0.46353 0.52891,-0.0832 q 0.0446,0.31794 0.24663,0.48731 0.20502,0.16937 0.5705,0.16937 0.36846,0 0.54674,-0.14857 0.17829,-0.15155 0.17829,-0.3536 0,-0.18126 -0.15749,-0.28525 -0.10994,-0.0713 -0.54674,-0.18126 -0.58833,-0.14857 -0.81713,-0.25554 -0.22583,-0.10994 -0.34468,-0.30011 -0.11589,-0.19314 -0.11589,-0.42491 0,-0.21097 0.0951,-0.38925 0.0981,-0.18126 0.26445,-0.30011 0.1248,-0.0921 0.33874,-0.15452 0.21691,-0.0654 0.46354,-0.0654 0.37142,0 0.65074,0.10697 0.28228,0.10697 0.41599,0.2912 0.13371,0.18125 0.18423,0.48731 l -0.52297,0.0713 q -0.0357,-0.24365 -0.208,-0.38034 -0.16937,-0.13668 -0.48136,-0.13668 -0.36846,0 -0.52594,0.12183 -0.15748,0.12182 -0.15748,0.28525 0,0.104 0.0654,0.1872 0.0654,0.0862 0.20502,0.14262 0.0802,0.0297 0.47246,0.13669 0.56753,0.15154 0.79039,0.2496 0.22582,0.0951 0.35359,0.27931 0.12777,0.18422 0.12777,0.45759 0,0.26743 -0.15748,0.50514 -0.15451,0.23474 -0.44868,0.36548 -0.29417,0.12777 -0.66559,0.12777 -0.61508,0 -0.93897,-0.25554 -0.32091,-0.25554 -0.41005,-0.7577 z m 5.41686,-0.0743 0.55268,0.0683 q -0.13074,0.48434 -0.48434,0.75177 -0.3536,0.26742 -0.90331,0.26742 -0.69233,0 -1.09941,-0.42491 -0.40411,-0.42788 -0.40411,-1.19747 0,-0.79633 0.41005,-1.2361 0.41005,-0.43977 1.06376,-0.43977 0.63291,0 1.03405,0.43085 0.40114,0.43086 0.40114,1.21233 0,0.0476 -0.003,0.14263 h -2.35334 q 0.0297,0.52 0.29417,0.79634 0.26445,0.27634 0.65965,0.27634 0.29416,0 0.50216,-0.15452 0.208,-0.15451 0.32983,-0.49325 z m -1.7561,-0.86468 h 1.76204 q -0.0357,-0.39816 -0.20206,-0.59725 -0.25554,-0.30902 -0.66262,-0.30902 -0.36845,0 -0.62102,0.24662 -0.2496,0.24663 -0.27634,0.65965 z m 4.14807,1.4025 0.0773,0.47246 q -0.22583,0.0475 -0.40411,0.0475 -0.2912,0 -0.45165,-0.0921 -0.16046,-0.0921 -0.22583,-0.24068 -0.0654,-0.15154 -0.0654,-0.63291 v -1.81552 h -0.39222 v -0.41599 h 0.39222 v -0.78148 l 0.53188,-0.32091 v 1.10239 h 0.53782 v 0.41599 h -0.53782 v 1.84524 q 0,0.2288 0.0267,0.29417 0.0297,0.0654 0.0921,0.104 0.0654,0.0386 0.18422,0.0386 0.0891,0 0.23474,-0.0208 z m 1.69073,0 0.0773,0.47246 q -0.22582,0.0475 -0.40411,0.0475 -0.29119,0 -0.45165,-0.0921 -0.16045,-0.0921 -0.22583,-0.24068 -0.0654,-0.15154 -0.0654,-0.63291 v -1.81552 h -0.39222 v -0.41599 h 0.39222 v -0.78148 l 0.53188,-0.32091 v 1.10239 h 0.53783 v 0.41599 h -0.53783 v 1.84524 q 0,0.2288 0.0268,0.29417 0.0297,0.0654 0.0921,0.104 0.0654,0.0386 0.18423,0.0386 0.0891,0 0.23474,-0.0208 z m 2.68317,-0.53782 0.55268,0.0683 q -0.13075,0.48434 -0.48434,0.75177 -0.3536,0.26742 -0.90331,0.26742 -0.69233,0 -1.09941,-0.42491 -0.40411,-0.42788 -0.40411,-1.19747 0,-0.79633 0.41005,-1.2361 0.41005,-0.43977 1.06376,-0.43977 0.63291,0 1.03405,0.43085 0.40113,0.43086 0.40113,1.21233 0,0.0476 -0.003,0.14263 h -2.35334 q 0.0297,0.52 0.29417,0.79634 0.26445,0.27634 0.65965,0.27634 0.29416,0 0.50216,-0.15452 0.208,-0.15451 0.32983,-0.49325 z m -1.7561,-0.86468 h 1.76204 q -0.0357,-0.39816 -0.20206,-0.59725 -0.25554,-0.30902 -0.66262,-0.30902 -0.36845,0 -0.62102,0.24662 -0.2496,0.24663 -0.27634,0.65965 z m 3.11997,1.8809 v -0.60914 h 0.60914 v 0.60914 q 0,0.33577 -0.11886,0.54079 -0.11886,0.208 -0.37737,0.32091 l -0.14857,-0.22879 q 0.16937,-0.0743 0.2496,-0.21989 0.0802,-0.14262 0.0891,-0.41302 z m 4.40955,-0.4784 0.0773,0.47246 q -0.22583,0.0475 -0.40411,0.0475 -0.2912,0 -0.45166,-0.0921 -0.16045,-0.0921 -0.22582,-0.24068 -0.0654,-0.15154 -0.0654,-0.63291 v -1.81552 h -0.39223 v -0.41599 h 0.39223 v -0.78148 l 0.53188,-0.32091 v 1.10239 h 0.53782 v 0.41599 h -0.53782 v 1.84524 q 0,0.2288 0.0267,0.29417 0.0297,0.0654 0.0921,0.104 0.0654,0.0386 0.18423,0.0386 0.0891,0 0.23474,-0.0208 z m 2.58215,0.0891 q -0.29714,0.25256 -0.57348,0.35656 -0.27337,0.104 -0.58834,0.104 -0.52,0 -0.79931,-0.25257 -0.27931,-0.25554 -0.27931,-0.65073 0,-0.23177 0.104,-0.42194 0.10697,-0.19314 0.27634,-0.30903 0.17234,-0.11588 0.38628,-0.17531 0.15749,-0.0416 0.47543,-0.0802 0.64776,-0.0772 0.95381,-0.18422 0.003,-0.10994 0.003,-0.13966 0,-0.32685 -0.15155,-0.46057 -0.20502,-0.18125 -0.60913,-0.18125 -0.37737,0 -0.55862,0.13371 -0.17829,0.13074 -0.26446,0.46651 l -0.52296,-0.0713 q 0.0713,-0.33577 0.23474,-0.5408 0.16342,-0.20799 0.47245,-0.31794 0.30902,-0.11291 0.7161,-0.11291 0.40411,0 0.65668,0.0951 0.25257,0.0951 0.37143,0.24068 0.11885,0.14263 0.1664,0.36251 0.0267,0.13668 0.0267,0.49325 v 0.71314 q 0,0.74582 0.0327,0.9449 0.0357,0.19611 0.13669,0.37737 h -0.55862 q -0.0832,-0.1664 -0.10697,-0.38925 z m -0.0446,-1.19451 q -0.29119,0.11886 -0.87359,0.20206 -0.32982,0.0475 -0.46651,0.10697 -0.13668,0.0594 -0.21096,0.17531 -0.0743,0.11291 -0.0743,0.25257 0,0.21394 0.16046,0.35657 0.16342,0.14262 0.47542,0.14262 0.30902,0 0.54971,-0.13371 0.24068,-0.13668 0.35359,-0.37142 0.0862,-0.18126 0.0862,-0.53485 z m 1.36388,1.58376 v -3.15562 h 0.48136 v 0.47839 q 0.18423,-0.33577 0.33874,-0.44274 0.15749,-0.10697 0.34468,-0.10697 0.2704,0 0.54971,0.17234 l -0.18422,0.49623 q -0.19612,-0.11589 -0.39223,-0.11589 -0.17531,0 -0.31497,0.10697 -0.13965,0.104 -0.19908,0.2912 -0.0891,0.28525 -0.0891,0.62399 v 1.6521 z m 2.90899,0 -1.20044,-3.15562 h 0.56456 l 0.67748,1.8898 q 0.10994,0.30606 0.20206,0.63588 0.0713,-0.2496 0.19908,-0.60022 l 0.70125,-1.92546 h 0.54971 l -1.1945,3.15562 z m 2.16912,-3.74099 v -0.61508 h 0.53485 v 0.61508 z m 0,3.74099 v -3.15562 h 0.53485 v 3.15562 z m 2.51678,-0.4784 0.0773,0.47246 q -0.22582,0.0475 -0.40411,0.0475 -0.29119,0 -0.45165,-0.0921 -0.16045,-0.0921 -0.22583,-0.24068 -0.0654,-0.15154 -0.0654,-0.63291 v -1.81552 h -0.39222 v -0.41599 h 0.39222 v -0.78148 l 0.53188,-0.32091 v 1.10239 h 0.53783 v 0.41599 H 130.34 v 1.84524 q 0,0.2288 0.0267,0.29417 0.0297,0.0654 0.0921,0.104 0.0654,0.0386 0.18423,0.0386 0.0891,0 0.23474,-0.0208 z m 0.30902,-0.46353 0.52891,-0.0832 q 0.0446,0.31794 0.24662,0.48731 0.20503,0.16937 0.57051,0.16937 0.36845,0 0.54674,-0.14857 0.17828,-0.15155 0.17828,-0.3536 0,-0.18126 -0.15748,-0.28525 -0.10995,-0.0713 -0.54674,-0.18126 -0.58834,-0.14857 -0.81713,-0.25554 -0.22583,-0.10994 -0.34469,-0.30011 -0.11588,-0.19314 -0.11588,-0.42491 0,-0.21097 0.0951,-0.38925 0.0981,-0.18126 0.26446,-0.30011 0.1248,-0.0921 0.33874,-0.15452 0.21691,-0.0654 0.46353,-0.0654 0.37143,0 0.65074,0.10697 0.28228,0.10697 0.416,0.2912 0.13371,0.18125 0.18422,0.48731 l -0.52296,0.0713 q -0.0357,-0.24365 -0.208,-0.38034 -0.16937,-0.13668 -0.48137,-0.13668 -0.36845,0 -0.52593,0.12183 -0.15749,0.12182 -0.15749,0.28525 0,0.104 0.0654,0.1872 0.0654,0.0862 0.20503,0.14262 0.0802,0.0297 0.47245,0.13669 0.56754,0.15154 0.79039,0.2496 0.22583,0.0951 0.3536,0.27931 0.12777,0.18422 0.12777,0.45759 0,0.26743 -0.15749,0.50514 -0.15451,0.23474 -0.44868,0.36548 -0.29416,0.12777 -0.66559,0.12777 -0.61508,0 -0.93896,-0.25554 -0.32091,-0.25554 -0.41005,-0.7577 z m 5.41685,-0.0743 0.55268,0.0683 q -0.13074,0.48434 -0.48434,0.75177 -0.35359,0.26742 -0.9033,0.26742 -0.69234,0 -1.09942,-0.42491 -0.40411,-0.42788 -0.40411,-1.19747 0,-0.79633 0.41006,-1.2361 0.41005,-0.43977 1.06376,-0.43977 0.6329,0 1.03404,0.43085 0.40114,0.43086 0.40114,1.21233 0,0.0476 -0.003,0.14263 h -2.35335 q 0.0297,0.52 0.29417,0.79634 0.26446,0.27634 0.65965,0.27634 0.29417,0 0.50217,-0.15452 0.20799,-0.15451 0.32982,-0.49325 z m -1.75609,-0.86468 h 1.76204 q -0.0357,-0.39816 -0.20206,-0.59725 -0.25554,-0.30902 -0.66262,-0.30902 -0.36845,0 -0.62102,0.24662 -0.2496,0.24663 -0.27634,0.65965 z m 3.85687,1.8809 -1.20044,-3.15562 h 0.56456 l 0.67748,1.8898 q 0.10994,0.30606 0.20206,0.63588 0.0713,-0.2496 0.19908,-0.60022 l 0.70125,-1.92546 h 0.54971 l -1.1945,3.15562 z m 4.22533,-0.38925 q -0.29714,0.25256 -0.57348,0.35656 -0.27337,0.104 -0.58834,0.104 -0.51999,0 -0.79931,-0.25257 -0.27931,-0.25554 -0.27931,-0.65073 0,-0.23177 0.104,-0.42194 0.10697,-0.19314 0.27634,-0.30903 0.17234,-0.11588 0.38628,-0.17531 0.15749,-0.0416 0.47543,-0.0802 0.64776,-0.0772 0.95382,-0.18422 0.003,-0.10994 0.003,-0.13966 0,-0.32685 -0.15154,-0.46057 -0.20503,-0.18125 -0.60914,-0.18125 -0.37737,0 -0.55862,0.13371 -0.17829,0.13074 -0.26446,0.46651 l -0.52296,-0.0713 q 0.0713,-0.33577 0.23474,-0.5408 0.16342,-0.20799 0.47245,-0.31794 0.30902,-0.11291 0.71611,-0.11291 0.40411,0 0.65667,0.0951 0.25257,0.0951 0.37143,0.24068 0.11885,0.14263 0.1664,0.36251 0.0267,0.13668 0.0267,0.49325 v 0.71314 q 0,0.74582 0.0327,0.9449 0.0357,0.19611 0.13669,0.37737 h -0.55862 q -0.0832,-0.1664 -0.10697,-0.38925 z m -0.0446,-1.19451 q -0.2912,0.11886 -0.8736,0.20206 -0.32982,0.0475 -0.4665,0.10697 -0.13669,0.0594 -0.21097,0.17531 -0.0743,0.11291 -0.0743,0.25257 0,0.21394 0.16046,0.35657 0.16342,0.14262 0.47542,0.14262 0.30903,0 0.54971,-0.13371 0.24068,-0.13668 0.35359,-0.37142 0.0862,-0.18126 0.0862,-0.53485 z m 2.53757,1.10536 0.0773,0.47246 q -0.22583,0.0475 -0.40411,0.0475 -0.2912,0 -0.45166,-0.0921 -0.16045,-0.0921 -0.22582,-0.24068 -0.0654,-0.15154 -0.0654,-0.63291 v -1.81552 h -0.39223 v -0.41599 h 0.39223 v -0.78148 l 0.53188,-0.32091 v 1.10239 h 0.53782 v 0.41599 h -0.53782 v 1.84524 q 0,0.2288 0.0267,0.29417 0.0297,0.0654 0.0921,0.104 0.0654,0.0386 0.18423,0.0386 0.0891,0 0.23474,-0.0208 z"
         id="path150" />
    </g>
    <g
       id="text227"
       style="font-size:6.08542px;line-height:1.25;stroke-width:0.264583"
       aria-label="tarvitse-">
      <path
         style="font-family:Sans;-inkscape-font-specification:Sans"
         d="m 33.101523,146.04106 0.07726,0.47245 q -0.225826,0.0475 -0.40411,0.0475 -0.291197,0 -0.451652,-0.0921 -0.160456,-0.0921 -0.225826,-0.24068 -0.06537,-0.15154 -0.06537,-0.63291 V 143.7798 H 31.6396 v -0.416 h 0.392225 v -0.78148 l 0.53188,-0.32091 v 1.10239 h 0.537823 v 0.416 H 32.5637 v 1.84523 q 0,0.2288 0.02674,0.29417 0.02971,0.0654 0.09211,0.104 0.06537,0.0386 0.184226,0.0386 0.08914,0 0.234741,-0.0208 z m 2.582143,0.0891 q -0.29714,0.25257 -0.573479,0.35657 -0.273369,0.104 -0.588337,0.104 -0.519994,0 -0.799306,-0.25257 -0.279311,-0.25554 -0.279311,-0.65074 0,-0.23177 0.103999,-0.42193 0.10697,-0.19315 0.27634,-0.30903 0.172341,-0.11588 0.386281,-0.17531 0.157484,-0.0416 0.475424,-0.0802 0.647764,-0.0773 0.953818,-0.18423 0.003,-0.10994 0.003,-0.13965 0,-0.32686 -0.151542,-0.46057 -0.205026,-0.18125 -0.609136,-0.18125 -0.377367,0 -0.558622,0.13371 -0.178284,0.13074 -0.264455,0.46651 l -0.522966,-0.0713 q 0.07131,-0.33576 0.234741,-0.54079 0.163427,-0.208 0.472452,-0.31794 0.309025,-0.11291 0.716106,-0.11291 0.40411,0 0.656679,0.0951 0.252569,0.0951 0.371425,0.24069 0.118855,0.14262 0.166398,0.36251 0.02674,0.13668 0.02674,0.49325 v 0.71313 q 0,0.74582 0.03269,0.94491 0.03566,0.19611 0.136684,0.37736 h -0.558623 q -0.0832,-0.16639 -0.10697,-0.38925 z m -0.04457,-1.1945 q -0.291197,0.11886 -0.87359,0.20206 -0.329825,0.0475 -0.46651,0.10697 -0.136684,0.0594 -0.210969,0.17531 -0.07428,0.11291 -0.07428,0.25257 0,0.21394 0.160456,0.35656 0.163427,0.14263 0.475423,0.14263 0.309025,0 0.549709,-0.13371 0.240683,-0.13669 0.353596,-0.37143 0.08617,-0.18125 0.08617,-0.53485 z m 1.363871,1.58375 v -3.15562 h 0.481366 v 0.4784 q 0.184227,-0.33577 0.33874,-0.44274 0.157484,-0.10697 0.344682,-0.10697 0.270397,0 0.549708,0.17234 l -0.184227,0.49622 q -0.196112,-0.11588 -0.392224,-0.11588 -0.175312,0 -0.314968,0.10697 -0.139656,0.104 -0.199084,0.2912 -0.08914,0.28525 -0.08914,0.62399 v 1.65209 z m 2.908998,0 -1.200445,-3.15562 h 0.564566 l 0.677478,1.88981 q 0.109942,0.30605 0.202055,0.63588 0.07131,-0.2496 0.199084,-0.60022 l 0.701249,-1.92547 h 0.549709 l -1.194502,3.15562 z m 2.169119,-3.74098 v -0.61508 h 0.534852 v 0.61508 z m 0,3.74098 v -3.15562 h 0.534852 v 3.15562 z"
         id="path146" />
      <path
         style="font-family:Sans;-inkscape-font-specification:Sans;fill:#ff0000"
         d="m 44.597856,146.04106 0.07726,0.47245 q -0.225826,0.0475 -0.40411,0.0475 -0.291197,0 -0.451652,-0.0921 -0.160456,-0.0921 -0.225826,-0.24068 -0.06537,-0.15154 -0.06537,-0.63291 v -1.81552 h -0.392224 v -0.416 h 0.392224 v -0.78148 l 0.53188,-0.32091 v 1.10239 h 0.537823 v 0.416 h -0.537823 v 1.84523 q 0,0.2288 0.02674,0.29417 0.02971,0.0654 0.09211,0.104 0.06537,0.0386 0.184226,0.0386 0.08914,0 0.234741,-0.0208 z m 0.309025,-0.46354 0.528908,-0.0832 q 0.04457,0.31794 0.246626,0.48731 0.205027,0.16937 0.570508,0.16937 0.368453,0 0.546737,-0.14857 0.178284,-0.15154 0.178284,-0.35359 0,-0.18126 -0.157484,-0.28526 -0.109942,-0.0713 -0.546737,-0.18125 -0.588336,-0.14857 -0.817134,-0.25554 -0.225826,-0.10995 -0.344682,-0.30011 -0.115884,-0.19315 -0.115884,-0.42491 0,-0.21097 0.09508,-0.38926 0.09806,-0.18125 0.264455,-0.30011 0.124798,-0.0921 0.338739,-0.15451 0.216912,-0.0654 0.463538,-0.0654 0.371424,0 0.650735,0.10697 0.282283,0.10697 0.415996,0.2912 0.133713,0.18125 0.184227,0.4873 l -0.522966,0.0713 q -0.03566,-0.24366 -0.207998,-0.38034 -0.16937,-0.13669 -0.481366,-0.13669 -0.368453,0 -0.525937,0.12183 -0.157484,0.12183 -0.157484,0.28526 0,0.104 0.06537,0.18719 0.06537,0.0862 0.205027,0.14263 0.08023,0.0297 0.472452,0.13669 0.567536,0.15154 0.790391,0.24959 0.225826,0.0951 0.353596,0.27931 0.12777,0.18423 0.12777,0.4576 0,0.26742 -0.157484,0.50514 -0.154512,0.23474 -0.44868,0.36548 -0.294169,0.12777 -0.665593,0.12777 -0.615079,0 -0.938962,-0.25554 -0.32091,-0.25554 -0.410052,-0.75771 z m 5.416855,-0.0743 0.55268,0.0683 q -0.130742,0.48434 -0.484338,0.75176 -0.353596,0.26743 -0.903305,0.26743 -0.692335,0 -1.099416,-0.42491 -0.40411,-0.42788 -0.40411,-1.19747 0,-0.79634 0.410053,-1.23611 0.410052,-0.43976 1.063759,-0.43976 0.632908,0 1.034046,0.43085 0.401139,0.43085 0.401139,1.21233 0,0.0475 -0.003,0.14263 h -2.353346 q 0.02971,0.51999 0.294168,0.79633 0.264454,0.27634 0.65965,0.27634 0.294168,0 0.502166,-0.15451 0.207998,-0.15451 0.329825,-0.49325 z m -1.756095,-0.86468 h 1.762038 q -0.03566,-0.39817 -0.202055,-0.59725 -0.25554,-0.30903 -0.662622,-0.30903 -0.368453,0 -0.621022,0.24663 -0.249597,0.24663 -0.276339,0.65965 z"
         id="path147" />
      <path
         style="font-family:Sans;-inkscape-font-specification:Sans"
         d="m 51.339955,145.21204 v -0.53782 h 1.643182 v 0.53782 z"
         id="path148" />
    </g>
    <g
       id="g27"
       transform="translate(29.147927,104.91084)">
      <path
         id="rect205"
         style="fill:#008c64;stroke:#008c64;stroke-linecap:round;stroke-linejoin:round"
         d="m 22.491666,-29.533777 h 11.000003 c 1.107999,0 1.999999,0.891999 1.999999,1.999999 v 6.000003 c 0,1.107999 -0.892,1.999999 -1.999999,1.999999 H 22.491666 c -1.108,0 -1.999999,-0.892 -1.999999,-1.999999 v -6.000003 c 0,-1.108 0.891999,-1.999999 1.999999,-1.999999 z" />
      <path
         style="font-weight:bold;font-size:6.08542px;line-height:1.25;font-family:Sans;-inkscape-font-specification:Sans;fill:#ffffff;stroke-width:0.264583"
         d="m 25.544722,-25.590108 v 0.665593 h -0.570508 v 1.271758 q 0,0.386281 0.01486,0.451652 0.01783,0.0624 0.07428,0.103999 0.05943,0.0416 0.142627,0.0416 0.115885,0 0.335768,-0.08023 l 0.07131,0.647764 q -0.291197,0.124799 -0.65965,0.124799 -0.225826,0 -0.407082,-0.07428 -0.181255,-0.07726 -0.267425,-0.196112 -0.0832,-0.121827 -0.115885,-0.326854 -0.02674,-0.145598 -0.02674,-0.588336 v -1.375757 h -0.38331 v -0.665593 h 0.38331 v -0.626964 l 0.837934,-0.487309 v 1.114273 z m 0.285254,2.25529 0.837933,-0.12777 q 0.05349,0.243655 0.216912,0.371425 0.163427,0.124799 0.457595,0.124799 0.323883,0 0.48731,-0.118856 0.109941,-0.0832 0.109941,-0.222855 0,-0.09509 -0.05943,-0.157484 -0.0624,-0.05943 -0.279311,-0.109942 -1.010275,-0.222854 -1.280672,-0.407081 -0.374396,-0.25554 -0.374396,-0.710164 0,-0.410053 0.323882,-0.689364 0.323883,-0.279311 1.004332,-0.279311 0.647765,0 0.962733,0.210969 0.314968,0.210969 0.433824,0.623993 l -0.78742,0.145599 q -0.05051,-0.184227 -0.193141,-0.282283 -0.139656,-0.09806 -0.401139,-0.09806 -0.329825,0 -0.472452,0.09211 -0.09508,0.06537 -0.09508,0.16937 0,0.08914 0.0832,0.151541 0.112913,0.0832 0.778506,0.23474 0.668564,0.151542 0.933018,0.371425 0.261483,0.222855 0.261483,0.621022 0,0.433824 -0.36251,0.74582 -0.362511,0.311997 -1.072675,0.311997 -0.644793,0 -1.02216,-0.261483 -0.374396,-0.261483 -0.49028,-0.710164 z m 5.505997,-0.103999 0.831991,0.139656 q -0.160455,0.457595 -0.508108,0.698278 -0.344682,0.237712 -0.864677,0.237712 -0.823077,0 -1.218272,-0.537823 -0.311997,-0.430852 -0.311997,-1.087531 0,-0.784449 0.410053,-1.227187 0.410052,-0.445709 1.037017,-0.445709 0.704221,0 1.111302,0.466509 0.407082,0.463538 0.389253,1.423299 h -2.091863 q 0.0089,0.371425 0.202055,0.579422 0.193141,0.205027 0.481366,0.205027 0.196113,0 0.329825,-0.106971 0.133713,-0.10697 0.202055,-0.344682 z m 0.04754,-0.843876 q -0.0089,-0.362511 -0.187198,-0.549708 -0.178284,-0.19017 -0.433824,-0.19017 -0.273369,0 -0.451652,0.199084 -0.178284,0.199083 -0.175313,0.540794 z"
         id="text228"
         aria-label="tse" />
    </g>
    <path
       style="fill:none;stroke:#000000;stroke-width:0.75;stroke-linecap:round;stroke-linejoin:round;stroke-dasharray:none;stroke-opacity:1;marker-end:url(#Triangle)"
       d="m 21.639594,99.377064 c 0,3.999986 3,5.999986 7,5.999986"
       id="path28" />
    <path
       style="fill:none;stroke:#000000;stroke-width:0.75;stroke-linecap:round;stroke-linejoin:round;stroke-dasharray:none;stroke-opacity:1;marker-end:url(#Triangle)"
       d="m 36.639594,109.37705 c 0,5.00001 7,10.00001 12,10.00001"
       id="path29" />
    <path
       style="fill:none;stroke:#000000;stroke-width:0.75;stroke-linecap:round;stroke-linejoin:round;stroke-dasharray:none;stroke-opacity:1;marker-end:url(#Triangle)"
       d="m 21.639594,139.37706 c 0,4 3,6 7,6"
       id="path30" />
    <path
       style="fill:none;stroke:#000000;stroke-width:0.75;stroke-linecap:round;stroke-linejoin:round;stroke-dasharray:none;stroke-opacity:1;marker-end:url(#Triangle)"
       d="m 36.639594,149.37706 c 0,4.99999 7,9.99999 12,9.99999"
       id="path31" />
  </g>
</svg>
