<?xml version="1.0" encoding="UTF-8" standalone="no"?>
<!-- Created with Inkscape (http://www.inkscape.org/) -->

<svg
   width="66.038742mm"
   height="28.328667mm"
   viewBox="0 0 66.038742 28.328667"
   version="1.1"
   id="svg37530"
   xmlns="http://www.w3.org/2000/svg"
   xmlns:svg="http://www.w3.org/2000/svg">
  <defs
     id="defs37527" />
  <g
     id="layer1"
     transform="translate(-48.781475,-83.996683)">
    <g
       aria-label="AND Gate"
       id="text3611"
       style="font-size:3.88056px;line-height:100%;font-family:Sans;-inkscape-font-specification:Sans;letter-spacing:0px;word-spacing:0px;stroke:#000000;stroke-width:0">
      <path
         d="M 70.896113,103.12535 H 70.33904 l -0.174322,-0.62528 h -0.864031 l -0.174322,0.62528 h -0.558967 l 0.839399,-2.55609 h 0.651812 z m -1.16341,-2.21124 q -0.01516,0.0796 -0.05684,0.23875 -0.03979,0.15727 -0.257694,0.92656 h 0.629076 q -0.221693,-0.78066 -0.261484,-0.93414 -0.0379,-0.15348 -0.05305,-0.23117 z"
         style="font-weight:bold;font-family:'Liberation Mono';-inkscape-font-specification:'Liberation Mono'"
         id="path38203" />
      <path
         d="m 72.313427,103.12535 -0.727605,-1.91375 q 0.05305,0.47749 0.05305,0.67076 v 1.24299 h -0.486964 v -2.55609 h 0.638549 l 0.744658,1.96491 q -0.05306,-0.44528 -0.05306,-0.6916 v -1.27331 h 0.486965 v 2.55609 z"
         style="font-weight:bold;font-family:'Liberation Mono';-inkscape-font-specification:'Liberation Mono'"
         id="path38205" />
      <path
         d="m 75.401958,101.82741 q 0,0.62529 -0.2918,0.96256 -0.2918,0.33538 -0.831819,0.33538 h -0.797713 v -2.55609 h 0.684025 q 0.621496,0 0.928454,0.31264 0.308853,0.31075 0.308853,0.94551 z m -0.562757,0 q 0,-0.43012 -0.162953,-0.62718 -0.161058,-0.19896 -0.521071,-0.19896 h -0.115583 v 1.69207 h 0.19327 q 0.606337,0 0.606337,-0.86593 z"
         style="font-weight:bold;font-family:'Liberation Mono';-inkscape-font-specification:'Liberation Mono'"
         id="path38207" />
      <path
         d="m 80.019597,102.77481 q -0.460437,0.38844 -0.934139,0.38844 -0.494544,0 -0.77308,-0.34675 -0.278536,-0.34865 -0.278536,-0.98151 0,-1.30552 1.057301,-1.30552 0.341065,0 0.557072,0.17622 0.216008,0.17621 0.318328,0.53433 l -0.519177,0.10232 q -0.100425,-0.37328 -0.350539,-0.37328 -0.255798,0 -0.377066,0.20464 -0.119373,0.20464 -0.119373,0.66129 0,0.42254 0.126952,0.65181 0.126952,0.22927 0.38654,0.22927 0.100425,0 0.206534,-0.0379 0.108004,-0.0379 0.187586,-0.10232 v -0.44528 h -0.519177 v -0.41307 h 1.030774 z"
         style="font-weight:bold;font-family:'Liberation Mono';-inkscape-font-specification:'Liberation Mono'"
         id="path38209" />
      <path
         d="m 81.042791,103.16325 q -0.297484,0 -0.464227,-0.16106 -0.166743,-0.16295 -0.166743,-0.45665 0,-0.31833 0.19706,-0.48317 0.198954,-0.16675 0.593074,-0.17243 l 0.422541,-0.008 v -0.10422 q 0,-0.19516 -0.06632,-0.29558 -0.06632,-0.10043 -0.214113,-0.10043 -0.138321,0 -0.204639,0.0701 -0.06442,0.0682 -0.07958,0.2198 l -0.555177,-0.0265 q 0.102319,-0.60823 0.862136,-0.60823 0.38275,0 0.585494,0.18758 0.204639,0.18759 0.204639,0.55139 v 0.74276 q 0,0.17243 0.0379,0.23875 0.03979,0.0644 0.130742,0.0644 0.06063,0 0.117478,-0.0114 v 0.28801 q -0.04737,0.0114 -0.08527,0.0208 -0.0379,0.009 -0.07579,0.0152 -0.0379,0.006 -0.08148,0.009 -0.04169,0.004 -0.09853,0.004 -0.200849,0 -0.297484,-0.0985 -0.09474,-0.0985 -0.113689,-0.28991 h -0.01137 q -0.119372,0.21412 -0.272851,0.30886 -0.151585,0.0947 -0.363803,0.0947 z m 0.581705,-0.9872 -0.253904,0.004 q -0.170532,0.004 -0.248219,0.036 -0.07579,0.0303 -0.115583,0.10043 -0.03979,0.0682 -0.03979,0.18759 0,0.28801 0.227376,0.28801 0.183796,0 0.306959,-0.14401 0.123162,-0.1459 0.123162,-0.36759 z"
         style="font-weight:bold;font-family:'Liberation Mono';-inkscape-font-specification:'Liberation Mono'"
         id="path38211" />
      <path
         d="m 83.161183,101.43519 h -0.316432 v -0.36002 h 0.342959 l 0.166743,-0.53433 h 0.333486 v 0.53433 h 0.7295 v 0.36002 h -0.7295 v 1.00424 q 0,0.16674 0.03032,0.22548 0.03221,0.0568 0.102319,0.0909 0.07011,0.0322 0.19706,0.0322 0.234956,0 0.483175,-0.0512 v 0.35243 q -0.269062,0.0436 -0.380856,0.0512 -0.111793,0.009 -0.233061,0.009 -0.24064,0 -0.403593,-0.0644 -0.161059,-0.0663 -0.24443,-0.20464 -0.08148,-0.14021 -0.08148,-0.39222 z"
         style="font-weight:bold;font-family:'Liberation Mono';-inkscape-font-specification:'Liberation Mono'"
         id="path38213" />
      <path
         d="m 86.05455,103.16325 q -0.477491,0 -0.737079,-0.28043 -0.259588,-0.28233 -0.259588,-0.79203 0,-0.34107 0.121267,-0.57602 0.123163,-0.23496 0.348644,-0.35623 0.225482,-0.12126 0.534335,-0.12126 0.449069,0 0.697289,0.29938 0.248219,0.29937 0.248219,0.85076 v 0.0152 H 85.61685 q 0,0.27854 0.123163,0.44149 0.125057,0.16295 0.341064,0.16295 0.140216,0 0.24822,-0.0587 0.108004,-0.0606 0.1459,-0.18569 l 0.502123,0.0436 q -0.104214,0.26717 -0.346749,0.41307 -0.242535,0.14401 -0.576021,0.14401 z m 0,-1.79059 q -0.195165,0 -0.310748,0.13263 -0.115583,0.13074 -0.123162,0.36381 h 0.87161 q -0.01326,-0.22738 -0.130741,-0.36191 -0.115584,-0.13453 -0.306959,-0.13453 z"
         style="font-weight:bold;font-family:'Liberation Mono';-inkscape-font-specification:'Liberation Mono'"
         id="path38215" />
    </g>
    <path
       id="path7544"
       style="fill:none;fill-opacity:0.5;stroke:#000000;stroke-width:0.5;stroke-linecap:round;stroke-linejoin:round;stroke-dasharray:none"
       d="m 63.781475,92.12535 a 1,1 0 0 1 -1,1 1,1 0 0 1 -1,-1 1,1 0 0 1 1,-1 1,1 0 0 1 1,1 z" />
    <path
       id="path7548"
       style="fill:none;fill-opacity:0.5;stroke:#000000;stroke-width:0.5;stroke-linecap:round;stroke-linejoin:round;stroke-dasharray:none"
       d="m 71.781475,92.12535 a 1,1 0 0 1 -1,1 1,1 0 0 1 -1,-1 1,1 0 0 1 1,-1 1,1 0 0 1 1,1 z" />
    <path
       style="fill:none;stroke:#000000;stroke-width:0.4;stroke-linecap:butt;stroke-linejoin:miter;stroke-dasharray:none;stroke-opacity:1"
       d="m 71.781475,92.12535 h 10"
       id="path7550" />
    <path
       style="fill:none;stroke:#000000;stroke-width:0.7;stroke-linecap:butt;stroke-linejoin:miter;stroke-dasharray:none;stroke-opacity:1"
       d="m 62.781475,89.774467 h 8"
       id="path7552" />
    <path
       style="fill:none;stroke:#000000;stroke-width:0.4;stroke-linecap:butt;stroke-linejoin:miter;stroke-dasharray:none;stroke-opacity:1"
       d="m 66.781475,89.774467 v -2"
       id="path7554" />
    <path
       id="path7803"
       style="fill:none;fill-opacity:0.5;stroke:#000000;stroke-width:0.5;stroke-linecap:round;stroke-linejoin:round;stroke-dasharray:none"
       d="m 83.781475,92.12535 a 1,1 0 0 1 -1,1 1,1 0 0 1 -1,-1 1,1 0 0 1 1,-1 1,1 0 0 1 1,1 z" />
    <path
       id="path7807"
       style="fill:none;fill-opacity:0.5;stroke:#000000;stroke-width:0.5;stroke-linecap:round;stroke-linejoin:round;stroke-dasharray:none"
       d="m 91.781475,92.12535 a 1,1 0 0 1 -1,1 1,1 0 0 1 -1,-1 1,1 0 0 1 1,-1 1,1 0 0 1 1,1 z" />
    <path
       style="fill:none;stroke:#000000;stroke-width:0.4;stroke-linecap:butt;stroke-linejoin:miter;stroke-dasharray:none;stroke-opacity:1"
       d="m 91.781475,92.12535 h 11.030565 l -0.0306,6.508031"
       id="path7809" />
    <path
       style="fill:none;stroke:#000000;stroke-width:0.7;stroke-linecap:butt;stroke-linejoin:miter;stroke-dasharray:none;stroke-opacity:1"
       d="m 82.781475,89.774467 h 8"
       id="path7811" />
    <path
       style="fill:none;stroke:#000000;stroke-width:0.4;stroke-linecap:butt;stroke-linejoin:miter;stroke-dasharray:none;stroke-opacity:1"
       d="m 86.781475,89.774467 v -2"
       id="path7813" />
    <path
       style="fill:none;stroke:#000000;stroke-width:0.4;stroke-linecap:butt;stroke-linejoin:miter;stroke-dasharray:none;stroke-opacity:1"
       d="m 102.78148,105.63735 0.0119,6.488 H 52.781475 v -7.76424"
       id="path8068" />
    <path
       style="fill:none;stroke:#000000;stroke-width:0.4;stroke-linecap:butt;stroke-linejoin:miter;stroke-dasharray:none;stroke-opacity:1"
       d="M 52.781475,99.864933 V 92.12535 h 9"
       id="path8070" />
    <path
       style="fill:none;stroke:#000000;stroke-width:0.5;stroke-linecap:butt;stroke-linejoin:miter;stroke-dasharray:none;stroke-opacity:1"
       d="m 54.781475,104.37592 h -4"
       id="path8072" />
    <path
       style="fill:none;stroke:#000000;stroke-width:0.5;stroke-linecap:butt;stroke-linejoin:miter;stroke-dasharray:none;stroke-opacity:1"
       d="m 54.781475,101.37592 h -4"
       id="path8074" />
    <path
       style="fill:none;stroke:#000000;stroke-width:0.5;stroke-linecap:butt;stroke-linejoin:miter;stroke-dasharray:none;stroke-opacity:1"
       d="m 56.781475,102.87592 h -8"
       id="path8076" />
    <path
       style="fill:none;stroke:#000000;stroke-width:0.5;stroke-linecap:butt;stroke-linejoin:miter;stroke-dasharray:none;stroke-opacity:1"
       d="m 56.781475,99.875917 h -8"
       id="path8078" />
    <path
       id="path8080"
       style="fill:none;stroke:#000000;stroke-width:0.405334;stroke-linecap:butt;stroke-linejoin:miter;stroke-miterlimit:4;stroke-dasharray:none;stroke-opacity:1"
       d="m 51.931132,98.025636 h -1.9 m 0.949999,-0.95 v 1.900001" />
    <g
       aria-label="A"
       id="text10359"
       style="font-size:3.88056px;line-height:100%;font-family:Sans;-inkscape-font-specification:Sans;letter-spacing:0px;word-spacing:0px;stroke:#000000;stroke-width:0">
      <path
         d="m 65.481636,86.774467 1.066775,-2.777783 h 0.396014 l 1.136883,2.777783 h -0.418752 l -0.324012,-0.841293 h -1.161515 l -0.305064,0.841293 z m 0.801502,-1.140672 h 0.941718 l -0.289905,-0.769291 q -0.132637,-0.350538 -0.19706,-0.57602 -0.05306,0.267167 -0.14969,0.530545 z"
         style="font-family:sans-serif;-inkscape-font-specification:sans-serif"
         id="path38197" />
    </g>
    <g
       aria-label="B"
       id="text10363"
       style="font-size:3.88056px;line-height:100%;font-family:Sans;-inkscape-font-specification:Sans;letter-spacing:0px;word-spacing:0px;stroke:#000000;stroke-width:0">
      <path
         d="m 85.732699,86.774467 v -2.777783 h 1.042143 q 0.318327,0 0.509702,0.08527 0.19327,0.08337 0.301274,0.259588 0.109899,0.174322 0.109899,0.365698 0,0.178111 -0.09664,0.33538 -0.09663,0.157269 -0.2918,0.253904 0.252009,0.0739 0.38654,0.252009 0.136426,0.178111 0.136426,0.420646 0,0.195165 -0.08337,0.363803 -0.08148,0.166743 -0.202744,0.257693 -0.121268,0.09095 -0.305064,0.138321 -0.181901,0.04547 -0.447174,0.04547 z m 0.367592,-1.610583 h 0.600654 q 0.244429,0 0.350538,-0.03221 0.140216,-0.04169 0.210324,-0.138321 0.072,-0.09664 0.072,-0.242535 0,-0.138321 -0.06632,-0.242535 -0.06632,-0.106109 -0.18948,-0.144005 -0.123163,-0.03979 -0.422542,-0.03979 h -0.555178 z m 0,1.282782 h 0.691604 q 0.178112,0 0.250114,-0.01326 0.126952,-0.02274 0.212219,-0.07579 0.08527,-0.05305 0.140215,-0.153479 0.05495,-0.102319 0.05495,-0.234956 0,-0.155373 -0.07958,-0.269062 -0.07958,-0.115583 -0.221693,-0.161058 -0.140215,-0.04737 -0.405488,-0.04737 h -0.642339 z"
         style="font-family:sans-serif;-inkscape-font-specification:sans-serif"
         id="path38200" />
    </g>
    <g
       aria-label="Out"
       id="text10367"
       style="font-size:3.88056px;line-height:100%;font-family:Sans;-inkscape-font-specification:Sans;letter-spacing:0px;word-spacing:0px;stroke:#000000;stroke-width:0">
      <path
         d="m 108.78147,102.1623 q 0,-0.6916 0.37138,-1.08193 0.37139,-0.39223 0.95878,-0.39223 0.38464,0 0.69349,0.1838 0.30886,0.18379 0.46992,0.51349 0.16295,0.3278 0.16295,0.74466 0,0.42254 -0.17053,0.75602 -0.17054,0.33349 -0.48318,0.50592 -0.31264,0.17053 -0.67455,0.17053 -0.39222,0 -0.70108,-0.18948 -0.30885,-0.18948 -0.46801,-0.51728 -0.15917,-0.3278 -0.15917,-0.6935 z m 0.37896,0.006 q 0,0.50213 0.26907,0.79203 0.27095,0.28801 0.67834,0.28801 0.41496,0 0.68213,-0.2918 0.26906,-0.2918 0.26906,-0.82803 0,-0.33917 -0.11558,-0.59118 -0.11369,-0.2539 -0.33539,-0.39222 -0.21979,-0.14022 -0.49454,-0.14022 -0.39033,0 -0.67265,0.26907 -0.28044,0.26716 -0.28044,0.89434 z"
         style="font-family:sans-serif;-inkscape-font-specification:sans-serif"
         id="path38218" />
      <path
         d="m 113.18689,103.51519 v -0.29559 q -0.23495,0.34107 -0.63855,0.34107 -0.17811,0 -0.33348,-0.0682 -0.15348,-0.0682 -0.22927,-0.17053 -0.0739,-0.10421 -0.10422,-0.2539 -0.0208,-0.10043 -0.0208,-0.31833 v -1.24678 h 0.34107 v 1.11604 q 0,0.26716 0.0208,0.36001 0.0322,0.13453 0.13642,0.21222 0.10422,0.0758 0.2577,0.0758 0.15348,0 0.28801,-0.0777 0.13453,-0.0796 0.18948,-0.21411 0.0568,-0.13643 0.0568,-0.39412 v -1.07814 h 0.34107 v 2.01228 z"
         style="font-family:sans-serif;-inkscape-font-specification:sans-serif"
         id="path38220" />
      <path
         d="m 114.77095,103.21013 0.0493,0.30127 q -0.14401,0.0303 -0.2577,0.0303 -0.18569,0 -0.28801,-0.0587 -0.10232,-0.0587 -0.144,-0.15348 -0.0417,-0.0966 -0.0417,-0.40359 v -1.15773 h -0.25011 v -0.26527 h 0.25011 v -0.49834 l 0.33917,-0.20463 v 0.70297 h 0.34296 v 0.26527 h -0.34296 v 1.17667 q 0,0.1459 0.0171,0.18759 0.0189,0.0417 0.0587,0.0663 0.0417,0.0246 0.11748,0.0246 0.0568,0 0.14969,-0.0133 z"
         style="font-family:sans-serif;-inkscape-font-specification:sans-serif"
         id="path38222" />
    </g>
    <circle
       style="fill:none;stroke:#000000;stroke-width:0.5;stroke-dasharray:none"
       id="path3593"
       cx="102.78147"
       cy="102.12535"
       r="3.5" />
    <path
       style="fill:none;stroke:#000000;stroke-width:0.5;stroke-linecap:butt;stroke-linejoin:miter;stroke-dasharray:none;stroke-opacity:1"
       d="m 105.25635,99.650476 -4.94975,4.949744"
       id="path4242" />
    <path
       style="fill:none;stroke:#000000;stroke-width:0.5;stroke-linecap:butt;stroke-linejoin:miter;stroke-dasharray:none;stroke-opacity:1"
       d="M 105.25635,104.60022 100.3066,99.650476"
       id="path4244" />
  </g>
</svg>
