<?xml version="1.0" encoding="UTF-8" standalone="no"?>
<svg
   width="32.740707"
   height="38"
   viewBox="0 0 8.6626452 10.054166"
   version="1.1"
   id="svg8"
   xmlns:xlink="http://www.w3.org/1999/xlink"
   xmlns="http://www.w3.org/2000/svg"
   xmlns:svg="http://www.w3.org/2000/svg"
   xmlns:rdf="http://www.w3.org/1999/02/22-rdf-syntax-ns#"
   xmlns:cc="http://creativecommons.org/ns#"
   xmlns:dc="http://purl.org/dc/elements/1.1/">
  <defs
     id="defs2">
    <linearGradient
       id="linearGradient24264">
      <stop
         style="stop-color:#e87f7f;stop-opacity:1"
         offset="0"
         id="stop24260" />
      <stop
         style="stop-color:#f38821;stop-opacity:1"
         offset="1"
         id="stop24262" />
    </linearGradient>
    <linearGradient
       id="linearGradient19289-6">
      <stop
         style="stop-color:#f7b97e;stop-opacity:1"
         offset="0"
         id="stop19285" />
      <stop
         style="stop-color:#d71f20;stop-opacity:1"
         offset="1"
         id="stop19287" />
    </linearGradient>
    <linearGradient
       id="linearGradient3468">
      <stop
         id="stop3470"
         offset="0"
         style="stop-color:#fdfdfc;stop-opacity:0.78431374" />
      <stop
         id="stop3472"
         offset="1"
         style="stop-color:#ffffff;stop-opacity:0.05172414" />
    </linearGradient>
    <linearGradient
       xlink:href="#linearGradient3468"
       id="linearGradient929"
       gradientUnits="userSpaceOnUse"
       gradientTransform="matrix(0.01786075,0,0,0.01786075,-7.7935535,4.6237863)"
       x1="604.547"
       y1="-104.44051"
       x2="604.547"
       y2="-0.038252577" />
    <linearGradient
       xlink:href="#linearGradient3468"
       id="linearGradient9268"
       gradientUnits="userSpaceOnUse"
       gradientTransform="matrix(0.01786075,0,0,0.01786075,-5.140077,4.6237863)"
       x1="604.547"
       y1="-104.44051"
       x2="604.547"
       y2="-0.038252577" />
    <linearGradient
       xlink:href="#linearGradient19289-6"
       id="linearGradient19291"
       x1="209.81006"
       y1="45.947952"
       x2="236.95779"
       y2="45.947952"
       gradientUnits="userSpaceOnUse"
       gradientTransform="matrix(0.10969094,0,0,0.10969094,-20.17187,-2.571861)" />
    <linearGradient
       xlink:href="#linearGradient24264"
       id="linearGradient22897"
       gradientUnits="userSpaceOnUse"
       x1="209.81006"
       y1="45.947952"
       x2="236.95779"
       y2="45.947952"
       gradientTransform="matrix(-0.10969094,0,0,-0.10969094,28.834517,11.120989)" />
    <linearGradient
       xlink:href="#linearGradient3468"
       id="linearGradient6084"
       x1="604.547"
       y1="-104.44051"
       x2="604.547"
       y2="-0.038252577"
       gradientUnits="userSpaceOnUse"
       gradientTransform="matrix(0.16282797,0,0,0.16282797,50.29215,51.56831)" />
    <linearGradient
       xlink:href="#linearGradient3468"
       id="linearGradient929-5"
       gradientUnits="userSpaceOnUse"
       gradientTransform="matrix(0.16282797,0,0,0.16282797,65.411198,63.285572)"
       x1="604.547"
       y1="-104.44051"
       x2="604.547"
       y2="-0.038252577" />
    <linearGradient
       xlink:href="#linearGradient3468"
       id="linearGradient937"
       gradientUnits="userSpaceOnUse"
       gradientTransform="matrix(0.16282797,0,0,0.16282797,30.259412,56.859977)"
       x1="604.547"
       y1="-104.44051"
       x2="604.547"
       y2="-0.038252577" />
  </defs>
  <metadata
     id="metadata5">
    <rdf:RDF>
      <cc:Work
         rdf:about="">
        <dc:format>image/svg+xml</dc:format>
        <dc:type
           rdf:resource="http://purl.org/dc/dcmitype/StillImage" />
      </cc:Work>
    </rdf:RDF>
  </metadata>
  <rect
     style="fill:#2d2926;fill-opacity:1;stroke:#f38821;stroke-width:0.329073;stroke-linecap:round;stroke-linejoin:round;stroke-miterlimit:4;stroke-dasharray:none;stroke-opacity:1"
     id="rect943"
     width="8.3335733"
     height="9.7250938"
     x="0.1645367"
     y="0.16453616"
     rx="0.81425208"
     ry="0.81425208" />
  <circle
     r="1.6901189"
     cy="4.2741618"
     cx="5.6580615"
     id="circle9262"
     style="fill:#d71f20;fill-opacity:1;fill-rule:nonzero;stroke:none;stroke-width:0.154786;stroke-linecap:round;stroke-linejoin:round;stroke-miterlimit:4;stroke-dasharray:none;stroke-opacity:1" />
  <ellipse
     ry="0.96927029"
     rx="1.2931367"
     style="fill:url(#linearGradient9268);fill-opacity:1;fill-rule:nonzero;stroke:none;stroke-width:0.154786;stroke-linecap:round;stroke-linejoin:round;stroke-miterlimit:4;stroke-dasharray:none;stroke-opacity:1"
     id="ellipse9264"
     cx="5.6580615"
     cy="3.6647491" />
  <circle
     r="1.6901189"
     cy="4.2741618"
     cx="3.0045857"
     id="circle923"
     style="fill:#f38821;fill-opacity:1;fill-rule:nonzero;stroke:none;stroke-width:0.154786;stroke-linecap:round;stroke-linejoin:round;stroke-miterlimit:4;stroke-dasharray:none;stroke-opacity:1" />
  <ellipse
     ry="0.96927029"
     rx="1.2931367"
     style="fill:url(#linearGradient929);fill-opacity:1;fill-rule:nonzero;stroke:none;stroke-width:0.154786;stroke-linecap:round;stroke-linejoin:round;stroke-miterlimit:4;stroke-dasharray:none;stroke-opacity:1"
     id="ellipse925"
     cx="3.0045857"
     cy="3.6647491" />
  <text
     xml:space="preserve"
     style="font-style:normal;font-weight:normal;font-size:1.49753px;line-height:1.25;font-family:sans-serif;fill:#000000;fill-opacity:1;stroke:none;stroke-width:0.0290222"
     x="1.1635847"
     y="8.7959385"
     id="text947"
     transform="scale(0.98776894,1.0123825)"><tspan
       id="tspan945"
       x="1.1635847"
       y="8.7959385"
       style="fill:#ffffff;fill-opacity:1;stroke-width:0.0290222">PowerHA</tspan></text>
  <path
     style="fill:url(#linearGradient19291);fill-opacity:1;stroke:none;stroke-width:0.0399147px;stroke-linecap:butt;stroke-linejoin:miter;stroke-opacity:1"
     d="M 5.8202461,2.542705 C 5.1090989,1.6924205 3.8633828,1.6134033 3.0852726,2.3341691 L 2.8423927,2.096847 2.8567392,3.0920641 3.8333681,3.0649676 3.5817063,2.8191249 C 4.3156693,2.0350622 5.2154981,2.0892138 5.8202538,2.542705 Z"
     id="path18102" />
  <path
     style="fill:url(#linearGradient22897);fill-opacity:1;stroke:none;stroke-width:0.0399147px;stroke-linecap:butt;stroke-linejoin:miter;stroke-opacity:1"
     d="m 2.8424004,6.0064233 c 0.7111472,0.8502846 1.9568633,0.9293018 2.7349735,0.208536 L 5.8202538,6.4522813 5.8059073,5.4570642 4.8292784,5.4841607 5.0809402,5.7300035 C 4.3469773,6.5140662 3.4471485,6.4599145 2.8423927,6.0064233 Z"
     id="path22895" />
</svg>
