<?xml version="1.0" encoding="UTF-8" standalone="no"?>
<!-- Created with Inkscape (http://www.inkscape.org/) -->

<svg
   width="54.638416mm"
   height="70.457222mm"
   viewBox="0 0 54.638416 70.457222"
   version="1.1"
   id="svg37530"
   xmlns="http://www.w3.org/2000/svg"
   xmlns:svg="http://www.w3.org/2000/svg">
  <defs
     id="defs37527" />
  <g
     id="layer1"
     transform="translate(-23.799219,-66.166066)">
    <circle
       style="fill:none;stroke:#000000;stroke-width:0.5;stroke-linecap:round;stroke-linejoin:round;stroke-dasharray:none;stroke-opacity:1"
       id="circle5654"
       cx="57.774227"
       cy="86.750748"
       r="5.6246567" />
    <path
       style="fill:none;stroke:#000000;stroke-width:0.4;stroke-linecap:butt;stroke-linejoin:miter;stroke-dasharray:none;stroke-opacity:1"
       d="m 55.398891,82.75075 v 8"
       id="path5656" />
    <path
       style="fill:none;stroke:#000000;stroke-width:0.4;stroke-linecap:butt;stroke-linejoin:miter;stroke-dasharray:none;stroke-opacity:1"
       d="m 55.398891,86.75075 h -25"
       id="path5658" />
    <path
       style="fill:none;stroke:#000000;stroke-width:0.4;stroke-linecap:butt;stroke-linejoin:miter;stroke-dasharray:none;stroke-opacity:1"
       d="m 55.398891,84.75075 4,-3 v -9"
       id="path5660" />
    <path
       style="fill:none;stroke:#000000;stroke-width:0.4;stroke-linecap:butt;stroke-linejoin:miter;stroke-dasharray:none;stroke-opacity:1"
       d="m 55.398891,88.75075 4,3 v 3"
       id="path5662" />
    <path
       style="fill:#000000;fill-opacity:1;stroke:none;stroke-width:0.264583px;stroke-linecap:butt;stroke-linejoin:miter;stroke-opacity:1"
       d="m 57.503406,91.58016 1.198886,-1.60083 0.841597,1.87963 z"
       id="path5664" />
    <path
       id="path5668"
       d="m 45.398891,85.25075 v 3 h -9 v -3 z"
       style="fill:#ffffff;fill-opacity:1;stroke:#000000;stroke-width:0.5;stroke-linecap:butt;stroke-linejoin:miter;stroke-miterlimit:4;stroke-dasharray:none;stroke-opacity:1" />
    <g
       aria-label="GND"
       id="text5672"
       style="font-size:3.88056px;line-height:100%;font-family:Sans;-inkscape-font-specification:Sans;letter-spacing:0px;word-spacing:0px;stroke:#000000;stroke-width:0">
      <path
         d="m 56.68648,135.4864 v -0.32591 l 1.176674,-0.002 v 1.03077 q -0.270957,0.21601 -0.558968,0.32591 -0.28801,0.108 -0.591179,0.108 -0.409277,0 -0.744658,-0.17432 -0.333485,-0.17622 -0.504018,-0.50781 -0.170532,-0.33159 -0.170532,-0.74087 0,-0.40548 0.168637,-0.75602 0.170533,-0.35244 0.48886,-0.52297 0.318327,-0.17053 0.733289,-0.17053 0.301274,0 0.543809,0.0985 0.24443,0.0966 0.382751,0.27096 0.138321,0.17432 0.210323,0.45475 l -0.331591,0.091 q -0.06253,-0.21222 -0.155374,-0.33349 -0.09284,-0.12126 -0.265272,-0.19327 -0.172428,-0.0739 -0.382751,-0.0739 -0.252009,0 -0.435805,0.0777 -0.183796,0.0758 -0.297484,0.20085 -0.111794,0.12506 -0.174322,0.27475 -0.106109,0.25769 -0.106109,0.55897 0,0.37138 0.126952,0.62149 0.128846,0.25012 0.373276,0.37138 0.24443,0.12127 0.519177,0.12127 0.238745,0 0.466121,-0.0909 0.227377,-0.0928 0.344855,-0.19706 v -0.51728 z"
         style="font-family:sans-serif;-inkscape-font-specification:sans-serif"
         id="path98747" />
      <path
         d="m 58.401278,136.57591 v -2.77778 h 0.377066 l 1.459,2.18092 v -2.18092 h 0.352434 v 2.77778 h -0.377066 l -1.459,-2.18281 v 2.18281 z"
         style="font-family:sans-serif;-inkscape-font-specification:sans-serif"
         id="path98749" />
      <path
         d="m 61.207484,136.57591 v -2.77778 h 0.956876 q 0.324012,0 0.494544,0.0398 0.238746,0.0549 0.407383,0.19895 0.219798,0.1857 0.327802,0.4756 0.109898,0.28801 0.109898,0.65939 0,0.31643 -0.0739,0.56086 -0.0739,0.24443 -0.189481,0.40549 -0.115583,0.15917 -0.253903,0.25201 -0.136426,0.0909 -0.331591,0.13832 -0.19327,0.0474 -0.445279,0.0474 z m 0.367592,-0.3278 h 0.593074 q 0.274747,0 0.430121,-0.0512 0.157268,-0.0512 0.250114,-0.144 0.130741,-0.13075 0.202744,-0.35054 0.0739,-0.22169 0.0739,-0.53623 0,-0.43581 -0.144005,-0.66887 -0.14211,-0.23495 -0.346749,-0.31454 -0.147795,-0.0568 -0.475596,-0.0568 h -0.5836 z"
         style="font-family:sans-serif;-inkscape-font-specification:sans-serif"
         id="path98751" />
    </g>
    <path
       style="fill:none;stroke:#000000;stroke-width:0.7;stroke-linecap:butt;stroke-linejoin:miter;stroke-miterlimit:4;stroke-dasharray:none;stroke-opacity:1"
       d="m 56.398891,131.75075 h 6"
       id="path5674" />
    <path
       id="path5676"
       style="fill:#000000;fill-opacity:1;stroke:none;stroke-width:1.04298;stroke-linecap:butt;stroke-linejoin:miter;stroke-miterlimit:4;stroke-dasharray:none;stroke-opacity:1"
       d="m 59.398891,111.75075 h 0.89999 m 0,0 c 0,-0.49703 -0.40293,-0.89996 -0.89999,-0.89996 -0.49702,0 -0.90001,0.40293 -0.90001,0.89996 0,0.49703 0.40293,0.89997 0.89995,0.89997 0.49706,0 0.90005,-0.40294 0.90005,-0.89997 z" />
    <path
       id="path5680"
       style="fill:none;fill-opacity:0.5;stroke:#000000;stroke-width:0.5;stroke-linecap:round;stroke-linejoin:round;stroke-dasharray:none"
       d="m 59.398891,70.75075 a 1,1 0 0 1 1,1 1,1 0 0 1 -1,1 1,1 0 0 1 -1,-1 1,1 0 0 1 1,-1 z" />
    <path
       id="path5682"
       style="fill:none;fill-opacity:0.5;stroke:#000000;stroke-width:0.5;stroke-linecap:round;stroke-linejoin:round;stroke-dasharray:none"
       d="m 69.398891,110.75075 a 1,1 0 0 1 1,1 1,1 0 0 1 -1,1 1,1 0 0 1 -1,-1 1,1 0 0 1 1,-1 z" />
    <path
       style="fill:none;stroke:#000000;stroke-width:0.4;stroke-linecap:butt;stroke-linejoin:miter;stroke-dasharray:none;stroke-opacity:1"
       d="m 59.398891,111.75075 h 9"
       id="path5684" />
    <g
       aria-label="+VCC"
       id="text5690"
       style="font-size:3.88056px;line-height:100%;font-family:Sans;-inkscape-font-specification:Sans;letter-spacing:0px;word-spacing:0px;stroke:#000000;stroke-width:0">
      <path
         d="M 56.063988,68.494779 V 67.733067 H 55.307961 V 67.41474 h 0.756027 v -0.756027 h 0.322117 v 0.756027 h 0.756027 v 0.318327 h -0.756027 v 0.761712 z"
         style="font-family:sans-serif;-inkscape-font-specification:sans-serif"
         id="path98716" />
      <path
         d="m 58.451442,68.943848 -1.076249,-2.777784 h 0.397909 l 0.721921,2.017967 q 0.08716,0.242535 0.1459,0.454753 0.06442,-0.227376 0.149689,-0.454753 l 0.750343,-2.017967 h 0.375171 l -1.087618,2.777784 z"
         style="font-family:sans-serif;-inkscape-font-specification:sans-serif"
         id="path98718" />
      <path
         d="m 61.429317,69.086905 0.238935,0.06035 q -0.07513,0.294358 -0.270958,0.449542 -0.194596,0.153953 -0.476638,0.153953 -0.291894,0 -0.475406,-0.118236 -0.18228,-0.119467 -0.278347,-0.344854 -0.09483,-0.225387 -0.09483,-0.484028 0,-0.282042 0.107151,-0.491417 0.108383,-0.210608 0.306674,-0.318991 0.199523,-0.109614 0.438458,-0.109614 0.270957,0 0.455701,0.137942 0.184743,0.137941 0.257409,0.387961 l -0.23524,0.05542 q -0.06281,-0.19706 -0.18228,-0.286968 -0.119468,-0.08991 -0.300516,-0.08991 -0.208145,0 -0.34855,0.09976 -0.139173,0.09976 -0.195828,0.268493 -0.05665,0.167501 -0.05665,0.346086 0,0.230314 0.06651,0.402741 0.06774,0.171196 0.209376,0.256178 0.141637,0.08498 0.306674,0.08498 0.200755,0 0.339928,-0.115773 0.139174,-0.115772 0.188439,-0.343623 z"
         style="font-size:65%;baseline-shift:sub"
         id="path98720" />
      <path
         d="m 63.250887,69.086905 0.238935,0.06035 q -0.07513,0.294358 -0.270957,0.449542 -0.194597,0.153953 -0.476638,0.153953 -0.291895,0 -0.475407,-0.118236 -0.18228,-0.119467 -0.278346,-0.344854 -0.09483,-0.225387 -0.09483,-0.484028 0,-0.282042 0.107151,-0.491417 0.108383,-0.210608 0.306674,-0.318991 0.199523,-0.109614 0.438458,-0.109614 0.270957,0 0.4557,0.137942 0.184744,0.137941 0.257409,0.387961 l -0.23524,0.05542 q -0.06281,-0.19706 -0.18228,-0.286968 -0.119467,-0.08991 -0.300516,-0.08991 -0.208144,0 -0.348549,0.09976 -0.139174,0.09976 -0.195828,0.268493 -0.05665,0.167501 -0.05665,0.346086 0,0.230314 0.06651,0.402741 0.06774,0.171196 0.209376,0.256178 0.141636,0.08498 0.306674,0.08498 0.200754,0 0.339928,-0.115773 0.139173,-0.115772 0.188438,-0.343623 z"
         style="font-size:65%;baseline-shift:sub"
         id="path98722" />
    </g>
    <g
       aria-label="Out"
       id="text5694"
       style="font-size:3.88056px;line-height:100%;font-family:Sans;-inkscape-font-specification:Sans;letter-spacing:0px;word-spacing:0px;stroke:#000000;stroke-width:0">
      <path
         d="m 72.398889,111.78769 q 0,-0.6916 0.371382,-1.08193 0.371382,-0.39223 0.958771,-0.39223 0.384646,0 0.693499,0.1838 0.308853,0.18379 0.469911,0.51349 0.162953,0.3278 0.162953,0.74466 0,0.42254 -0.170532,0.75602 -0.170532,0.33349 -0.483175,0.50592 -0.312643,0.17053 -0.674551,0.17053 -0.392224,0 -0.701077,-0.18948 -0.308853,-0.18948 -0.468017,-0.51728 -0.159164,-0.3278 -0.159164,-0.6935 z m 0.378961,0.006 q 0,0.50213 0.269063,0.79203 0.270957,0.28801 0.67834,0.28801 0.414962,0 0.682129,-0.2918 0.269063,-0.2918 0.269063,-0.82803 0,-0.33917 -0.115584,-0.59118 -0.113688,-0.2539 -0.33538,-0.39222 -0.219797,-0.14022 -0.494544,-0.14022 -0.39033,0 -0.672656,0.26907 -0.280431,0.26716 -0.280431,0.89434 z"
         style="font-family:sans-serif;-inkscape-font-specification:sans-serif"
         id="path98740" />
      <path
         d="m 76.80431,113.14058 v -0.29559 q -0.234956,0.34106 -0.638549,0.34106 -0.178112,0 -0.333486,-0.0682 -0.153479,-0.0682 -0.229271,-0.17053 -0.0739,-0.10422 -0.104214,-0.2539 -0.02084,-0.10043 -0.02084,-0.31833 v -1.24678 h 0.341065 v 1.11604 q 0,0.26716 0.02084,0.36001 0.03221,0.13453 0.136426,0.21222 0.104214,0.0758 0.257693,0.0758 0.153479,0 0.28801,-0.0777 0.134531,-0.0796 0.189481,-0.21411 0.05684,-0.13643 0.05684,-0.39412 v -1.07814 h 0.341065 v 2.01228 z"
         style="font-family:sans-serif;-inkscape-font-specification:sans-serif"
         id="path98742" />
      <path
         d="m 78.388367,112.83552 0.04926,0.30127 q -0.144005,0.0303 -0.257694,0.0303 -0.185691,0 -0.28801,-0.0587 -0.10232,-0.0587 -0.144005,-0.15348 -0.04169,-0.0966 -0.04169,-0.4036 v -1.15772 h -0.250114 v -0.26527 h 0.250114 v -0.49834 l 0.33917,-0.20464 v 0.70298 h 0.34296 v 0.26527 h -0.34296 v 1.17667 q 0,0.1459 0.01705,0.18759 0.01895,0.0417 0.05874,0.0663 0.04169,0.0246 0.117478,0.0246 0.05684,0 0.14969,-0.0133 z"
         style="font-family:sans-serif;-inkscape-font-specification:sans-serif"
         id="path98744" />
    </g>
    <g
       aria-label="A"
       id="text5698"
       style="font-size:3.88056px;line-height:100%;font-family:Sans;-inkscape-font-specification:Sans;letter-spacing:0px;word-spacing:0px;stroke:#000000;stroke-width:0">
      <path
         d="m 23.799219,88.139633 1.066775,-2.777783 h 0.396014 l 1.136883,2.777783 H 25.980139 L 25.656127,87.29834 h -1.161515 l -0.305064,0.841293 z m 0.801502,-1.140672 h 0.941718 L 25.252534,86.22967 q -0.132637,-0.350539 -0.19706,-0.576021 -0.05305,0.267168 -0.149689,0.530546 z"
         style="font-family:sans-serif;-inkscape-font-specification:sans-serif"
         id="path98779" />
    </g>
    <path
       style="fill:none;stroke:#000000;stroke-width:0.4;stroke-linecap:butt;stroke-linejoin:miter;stroke-dasharray:none;stroke-opacity:1"
       d="m 59.398891,111.75075 v 20"
       id="path5700" />
    <path
       id="path5702"
       d="m 60.898891,125.75075 h -3 v -9 h 2.999997 z"
       style="fill:#ffffff;fill-opacity:1;stroke:#000000;stroke-width:0.5;stroke-linecap:butt;stroke-linejoin:miter;stroke-miterlimit:4;stroke-dasharray:none;stroke-opacity:1" />
    <path
       id="path5706"
       style="fill:none;fill-opacity:0.5;stroke:#000000;stroke-width:0.5;stroke-linecap:round;stroke-linejoin:round;stroke-dasharray:none"
       d="m 29.398891,85.75075 a 1,1 0 0 1 1,1 1,1 0 0 1 -1,1 1,1 0 0 1 -1,-1 1,1 0 0 1 1,-1 z" />
    <g
       aria-label="10k"
       id="text5710"
       style="font-size:3.175px;line-height:100%;font-family:Sans;-inkscape-font-specification:Sans;letter-spacing:0px;word-spacing:0px;stroke:#000000;stroke-width:0">
      <path
         d="m 43.236054,82.71199 h -0.279053 v -1.778186 q -0.100769,0.09612 -0.2651,0.192237 -0.16278,0.09612 -0.293005,0.144177 v -0.269751 q 0.234094,-0.110071 0.409277,-0.26665 0.175183,-0.15658 0.248047,-0.303858 h 0.179834 z"
         style="font-family:sans-serif;-inkscape-font-specification:sans-serif"
         id="path98787" />
      <path
         d="m 43.950739,81.591129 q 0,-0.403077 0.08217,-0.648023 0.08372,-0.246496 0.246496,-0.379822 0.164331,-0.133325 0.412378,-0.133325 0.182935,0 0.320911,0.07441 0.137976,0.07286 0.227893,0.21239 0.08992,0.137976 0.141077,0.337964 0.05116,0.198438 0.05116,0.536402 0,0.399975 -0.08217,0.646472 -0.08217,0.244946 -0.246497,0.379821 -0.162781,0.133326 -0.412378,0.133326 -0.328662,0 -0.516247,-0.235645 -0.224793,-0.283703 -0.224793,-0.923974 z m 0.286804,0 q 0,0.559655 0.130225,0.74569 0.131775,0.184485 0.324011,0.184485 0.192237,0 0.322461,-0.186035 0.131775,-0.186035 0.131775,-0.74414 0,-0.561206 -0.131775,-0.745691 -0.130224,-0.184485 -0.325561,-0.184485 -0.192237,0 -0.306958,0.162781 -0.144178,0.207739 -0.144178,0.767395 z"
         style="font-family:sans-serif;-inkscape-font-specification:sans-serif"
         id="path98789" />
      <path
         d="m 45.795588,82.71199 v -2.272729 h 0.279053 v 1.296045 l 0.660424,-0.669727 h 0.361219 l -0.629419,0.610816 0.692981,1.035595 h -0.344165 l -0.544153,-0.841809 -0.196887,0.189136 v 0.652673 z"
         style="font-family:sans-serif;-inkscape-font-specification:sans-serif"
         id="path98791" />
    </g>
    <g
       aria-label="R1"
       id="text5714"
       style="font-size:3.88056px;line-height:100%;font-family:Sans;-inkscape-font-specification:Sans;letter-spacing:0px;word-spacing:0px;stroke:#000000;stroke-width:0">
      <path
         d="m 36.39889,82.750748 v -2.777784 h 1.231623 q 0.371382,0 0.564652,0.07579 0.19327,0.0739 0.308853,0.263378 0.115583,0.189481 0.115583,0.418752 0,0.295589 -0.191375,0.498334 -0.191376,0.202744 -0.591179,0.257693 0.1459,0.07011 0.221692,0.138321 0.161058,0.147794 0.305063,0.369487 l 0.483175,0.756027 h -0.462332 l -0.367592,-0.577916 q -0.161058,-0.250114 -0.265273,-0.38275 -0.104214,-0.132637 -0.187585,-0.185691 -0.08148,-0.05306 -0.166743,-0.0739 -0.06253,-0.01326 -0.204639,-0.01326 h -0.426331 v 1.233518 z m 0.367592,-1.551845 h 0.790133 q 0.25201,0 0.39412,-0.05116 0.14211,-0.05306 0.216008,-0.166743 0.0739,-0.115583 0.0739,-0.250114 0,-0.19706 -0.144005,-0.324012 -0.142111,-0.126952 -0.450964,-0.126952 h -0.879189 z"
         style="font-family:sans-serif;-inkscape-font-specification:sans-serif"
         id="path98782" />
      <path
         d="m 40.341978,82.750748 h -0.341065 v -2.173341 q -0.123162,0.117478 -0.324011,0.234956 -0.198955,0.117477 -0.358118,0.176216 v -0.329696 q 0.286115,-0.134531 0.500228,-0.325906 0.214113,-0.191375 0.303169,-0.371382 h 0.219797 z"
         style="font-family:sans-serif;-inkscape-font-specification:sans-serif"
         id="path98784" />
    </g>
    <g
       aria-label="T1"
       id="text5718"
       style="font-size:3.88056px;line-height:100%;font-family:Sans;-inkscape-font-specification:Sans;letter-spacing:0px;word-spacing:0px;stroke:#000000;stroke-width:0">
      <path
         d="m 66.314079,87.750748 v -2.449983 h -0.915191 v -0.327801 h 2.201763 v 0.327801 h -0.91898 v 2.449983 z"
         style="font-family:sans-serif;-inkscape-font-specification:sans-serif"
         id="path98730" />
      <path
         d="m 69.124074,87.750748 h -0.341065 v -2.173341 q -0.123162,0.117478 -0.324011,0.234956 -0.198955,0.117477 -0.358118,0.176216 v -0.329696 q 0.286115,-0.134531 0.500228,-0.325906 0.214113,-0.191375 0.303169,-0.371382 h 0.219797 z"
         style="font-family:sans-serif;-inkscape-font-specification:sans-serif"
         id="path98732" />
    </g>
    <g
       aria-label="R3"
       id="text5722"
       style="font-size:3.88056px;line-height:100%;font-family:Sans;-inkscape-font-specification:Sans;letter-spacing:0px;word-spacing:0px;stroke:#000000;stroke-width:0">
      <path
         d="m 50.919573,120.70148 v -2.77779 h 1.231623 q 0.371382,0 0.564652,0.0758 0.19327,0.0739 0.308853,0.26337 0.115583,0.18948 0.115583,0.41876 0,0.29558 -0.191375,0.49833 -0.191375,0.20274 -0.591179,0.25769 0.1459,0.0701 0.221692,0.13832 0.161058,0.1478 0.305064,0.36949 l 0.483175,0.75603 h -0.462333 l -0.367592,-0.57792 q -0.161058,-0.25011 -0.265272,-0.38275 -0.104215,-0.13264 -0.187586,-0.18569 -0.08148,-0.053 -0.166743,-0.0739 -0.06253,-0.0133 -0.204639,-0.0133 h -0.426331 v 1.23352 z m 0.367592,-1.55185 h 0.790134 q 0.252009,0 0.394119,-0.0512 0.14211,-0.0531 0.216008,-0.16674 0.0739,-0.11558 0.0739,-0.25011 0,-0.19706 -0.144005,-0.32402 -0.14211,-0.12695 -0.450963,-0.12695 h -0.87919 z"
         style="font-family:sans-serif;-inkscape-font-specification:sans-serif"
         id="path98759" />
      <path
         d="m 53.579879,119.96819 0.341065,-0.0455 q 0.05874,0.28991 0.198954,0.41875 0.142111,0.12696 0.344855,0.12696 0.24064,0 0.405488,-0.16675 0.166743,-0.16674 0.166743,-0.41306 0,-0.23496 -0.15348,-0.38654 -0.153479,-0.15348 -0.390329,-0.15348 -0.09663,0 -0.24064,0.0379 l 0.0379,-0.29938 q 0.03411,0.004 0.05495,0.004 0.217902,0 0.392225,-0.11369 0.174322,-0.11368 0.174322,-0.35053 0,-0.18759 -0.126952,-0.31075 -0.126952,-0.12316 -0.327802,-0.12316 -0.198954,0 -0.33159,0.12505 -0.132637,0.12506 -0.170533,0.37517 l -0.341065,-0.0606 q 0.06253,-0.34296 0.284221,-0.53054 0.221692,-0.18949 0.551388,-0.18949 0.227377,0 0.418752,0.0985 0.191375,0.0966 0.2918,0.26528 0.102319,0.16863 0.102319,0.35812 0,0.18 -0.09663,0.3278 -0.09663,0.14779 -0.286115,0.23495 0.246324,0.0568 0.38275,0.23685 0.136426,0.17811 0.136426,0.44718 0,0.3638 -0.265272,0.6177 -0.265273,0.25201 -0.670761,0.25201 -0.365697,0 -0.608232,-0.2179 -0.240641,-0.2179 -0.274747,-0.56465 z"
         style="font-family:sans-serif;-inkscape-font-specification:sans-serif"
         id="path98761" />
    </g>
    <g
       aria-label="1k"
       id="text5726"
       style="font-size:3.175px;line-height:100%;font-family:Sans;-inkscape-font-specification:Sans;letter-spacing:0px;word-spacing:0px;stroke:#000000;stroke-width:0">
      <path
         d="m 53.240884,125.03279 h -0.279053 v -1.77818 q -0.100769,0.0961 -0.2651,0.19223 -0.162781,0.0961 -0.293006,0.14418 v -0.26975 q 0.234095,-0.11007 0.409278,-0.26665 0.175183,-0.15658 0.248047,-0.30386 h 0.179834 z"
         style="font-family:sans-serif;-inkscape-font-specification:sans-serif"
         id="path98754" />
      <path
         d="m 54.034634,125.03279 v -2.27273 h 0.279052 v 1.29605 l 0.660425,-0.66973 h 0.361218 l -0.629419,0.61082 0.692981,1.03559 h -0.344165 l -0.544152,-0.84181 -0.196888,0.18914 v 0.65267 z"
         style="font-family:sans-serif;-inkscape-font-specification:sans-serif"
         id="path98756" />
    </g>
    <path
       style="fill:#000000;fill-opacity:1;stroke:none;stroke-width:0.264583px;stroke-linecap:butt;stroke-linejoin:miter;stroke-opacity:1"
       d="m 66.398891,69.75075 c -2,0 -3,1 -4,2 1,1 2,2 4,2 h 7 v -4 z"
       id="path5732" />
    <path
       style="fill:#000000;fill-opacity:0.25;stroke:none;stroke-width:0.264583px;stroke-linecap:butt;stroke-linejoin:miter;stroke-opacity:1"
       d="m 65.398891,70.75075 1,-1 h 6 v 4 h -6 l -1,-1 z"
       id="path5734" />
    <g
       aria-label="5V"
       id="text5738"
       style="font-size:3.175px;line-height:100%;font-family:Sans;-inkscape-font-specification:Sans;letter-spacing:0px;word-spacing:0px;fill:#ffffff;stroke:#000000;stroke-width:0">
      <path
         d="m 67.029237,72.283261 0.434082,-0.04496 q 0.0186,0.147277 0.110071,0.234094 0.09147,0.08527 0.21084,0.08527 0.136426,0 0.230994,-0.110071 0.09457,-0.111621 0.09457,-0.334863 0,-0.20929 -0.09457,-0.313159 -0.09302,-0.10542 -0.243396,-0.10542 -0.187586,0 -0.336414,0.165881 l -0.353467,-0.05116 0.223243,-1.182873 h 1.151867 v 0.407727 h -0.821655 l -0.06821,0.386023 q 0.145728,-0.07286 0.297656,-0.07286 0.289905,0 0.491443,0.21084 0.201538,0.21084 0.201538,0.547253 0,0.280603 -0.162781,0.500745 -0.221691,0.300757 -0.615466,0.300757 -0.314709,0 -0.513147,-0.168982 -0.198437,-0.168982 -0.237195,-0.454236 z"
         style="font-weight:bold;font-family:sans-serif;-inkscape-font-specification:'sans-serif Bold'"
         id="path98725" />
      <path
         d="m 69.464748,72.867722 -0.812354,-2.27273 h 0.497644 l 0.575159,1.682068 0.556555,-1.682068 h 0.486792 l -0.813904,2.27273 z"
         style="font-weight:bold;font-family:sans-serif;-inkscape-font-specification:'sans-serif Bold'"
         id="path98727" />
    </g>
    <circle
       style="fill:none;stroke:#000000;stroke-width:0.5;stroke-linecap:round;stroke-linejoin:round;stroke-dasharray:none;stroke-opacity:1"
       id="circle6370"
       cx="57.774227"
       cy="101.75075"
       r="5.6246567" />
    <path
       style="fill:none;stroke:#000000;stroke-width:0.4;stroke-linecap:butt;stroke-linejoin:miter;stroke-dasharray:none;stroke-opacity:1"
       d="m 55.398891,97.75075 v 8"
       id="path6372" />
    <path
       style="fill:none;stroke:#000000;stroke-width:0.4;stroke-linecap:butt;stroke-linejoin:miter;stroke-dasharray:none;stroke-opacity:1"
       d="m 55.398891,101.75075 h -25"
       id="path6374" />
    <path
       style="fill:none;stroke:#000000;stroke-width:0.4;stroke-linecap:butt;stroke-linejoin:miter;stroke-dasharray:none;stroke-opacity:1"
       d="m 55.398891,99.75075 4,-3 v -3"
       id="path6376" />
    <path
       style="fill:none;stroke:#000000;stroke-width:0.4;stroke-linecap:butt;stroke-linejoin:miter;stroke-dasharray:none;stroke-opacity:1"
       d="m 55.398891,103.75075 4,3 v 5"
       id="path6378" />
    <path
       style="fill:#000000;fill-opacity:1;stroke:none;stroke-width:0.264583px;stroke-linecap:butt;stroke-linejoin:miter;stroke-opacity:1"
       d="m 57.503406,106.58016 1.198886,-1.60083 0.841597,1.87963 z"
       id="path6380" />
    <path
       id="path6384"
       d="m 45.398891,100.25075 v 3 h -9 v -3 z"
       style="fill:#ffffff;fill-opacity:1;stroke:#000000;stroke-width:0.5;stroke-linecap:butt;stroke-linejoin:miter;stroke-miterlimit:4;stroke-dasharray:none;stroke-opacity:1" />
    <g
       aria-label="B"
       id="text6388"
       style="font-size:3.88056px;line-height:100%;font-family:Sans;-inkscape-font-specification:Sans;letter-spacing:0px;word-spacing:0px;stroke:#000000;stroke-width:0">
      <path
         d="m 24.301343,103.13963 v -2.77778 h 1.042143 q 0.318327,0 0.509702,0.0853 0.19327,0.0834 0.301274,0.25958 0.109899,0.17433 0.109899,0.3657 0,0.17811 -0.09664,0.33538 -0.09663,0.15727 -0.2918,0.25391 0.252009,0.0739 0.38654,0.252 0.136426,0.17812 0.136426,0.42065 0,0.19517 -0.08337,0.3638 -0.08148,0.16675 -0.202744,0.2577 -0.121267,0.091 -0.305063,0.13832 -0.181902,0.0455 -0.447174,0.0455 z m 0.367592,-1.61058 h 0.600653 q 0.24443,0 0.350539,-0.0322 0.140216,-0.0417 0.210323,-0.13832 0.072,-0.0966 0.072,-0.24254 0,-0.13832 -0.06632,-0.24253 -0.06632,-0.10611 -0.189481,-0.14401 -0.123162,-0.0398 -0.422541,-0.0398 h -0.555178 z m 0,1.28278 h 0.691604 q 0.178111,0 0.250114,-0.0133 0.126952,-0.0227 0.212218,-0.0758 0.08527,-0.0531 0.140216,-0.15348 0.05495,-0.10232 0.05495,-0.23496 0,-0.15537 -0.07958,-0.26906 -0.07958,-0.11558 -0.221692,-0.16106 -0.140216,-0.0474 -0.405488,-0.0474 h -0.642339 z"
         style="font-family:sans-serif;-inkscape-font-specification:sans-serif"
         id="path98776" />
    </g>
    <path
       id="path6390"
       style="fill:none;fill-opacity:0.5;stroke:#000000;stroke-width:0.5;stroke-linecap:round;stroke-linejoin:round;stroke-dasharray:none"
       d="m 29.398891,100.75075 a 1,1 0 0 1 1,1 1,1 0 0 1 -1,1 1,1 0 0 1 -1,-1 1,1 0 0 1 1,-1 z" />
    <g
       aria-label="10k"
       id="text6394"
       style="font-size:3.175px;line-height:100%;font-family:Sans;-inkscape-font-specification:Sans;letter-spacing:0px;word-spacing:0px;stroke:#000000;stroke-width:0">
      <path
         d="m 43.236054,97.71199 h -0.279053 v -1.778186 q -0.100769,0.09612 -0.2651,0.192237 -0.16278,0.09612 -0.293005,0.144177 v -0.269751 q 0.234094,-0.110071 0.409277,-0.26665 0.175183,-0.15658 0.248047,-0.303858 h 0.179834 z"
         style="font-family:sans-serif;-inkscape-font-specification:sans-serif"
         id="path98764" />
      <path
         d="m 43.950739,96.591129 q 0,-0.403077 0.08217,-0.648023 0.08372,-0.246496 0.246496,-0.379822 0.164331,-0.133325 0.412378,-0.133325 0.182935,0 0.320911,0.07441 0.137976,0.07286 0.227893,0.21239 0.08992,0.137976 0.141077,0.337964 0.05116,0.198438 0.05116,0.536402 0,0.399975 -0.08217,0.646472 -0.08217,0.244946 -0.246497,0.379821 -0.162781,0.133326 -0.412378,0.133326 -0.328662,0 -0.516247,-0.235645 -0.224793,-0.283703 -0.224793,-0.923974 z m 0.286804,0 q 0,0.559655 0.130225,0.74569 0.131775,0.184485 0.324011,0.184485 0.192237,0 0.322461,-0.186035 0.131775,-0.186035 0.131775,-0.74414 0,-0.561206 -0.131775,-0.745691 -0.130224,-0.184485 -0.325561,-0.184485 -0.192237,0 -0.306958,0.162781 -0.144178,0.207739 -0.144178,0.767395 z"
         style="font-family:sans-serif;-inkscape-font-specification:sans-serif"
         id="path98766" />
      <path
         d="m 45.795588,97.71199 v -2.272729 h 0.279053 v 1.296045 l 0.660424,-0.669727 h 0.361219 l -0.629419,0.610816 0.692981,1.035595 h -0.344165 l -0.544153,-0.841809 -0.196887,0.189136 v 0.652673 z"
         style="font-family:sans-serif;-inkscape-font-specification:sans-serif"
         id="path98768" />
    </g>
    <g
       aria-label="R2"
       id="text6398"
       style="font-size:3.88056px;line-height:100%;font-family:Sans;-inkscape-font-specification:Sans;letter-spacing:0px;word-spacing:0px;stroke:#000000;stroke-width:0">
      <path
         d="m 36.39889,97.750748 v -2.777784 h 1.231623 q 0.371382,0 0.564652,0.07579 0.19327,0.0739 0.308853,0.263378 0.115583,0.189481 0.115583,0.418752 0,0.295589 -0.191375,0.498334 -0.191376,0.202744 -0.591179,0.257693 0.1459,0.07011 0.221692,0.138321 0.161058,0.147794 0.305063,0.369487 l 0.483175,0.756027 h -0.462332 l -0.367592,-0.577916 q -0.161058,-0.250114 -0.265273,-0.38275 -0.104214,-0.132637 -0.187585,-0.185691 -0.08148,-0.05306 -0.166743,-0.0739 -0.06253,-0.01326 -0.204639,-0.01326 h -0.426331 v 1.233518 z m 0.367592,-1.551845 h 0.790133 q 0.25201,0 0.39412,-0.05116 0.14211,-0.05306 0.216008,-0.166743 0.0739,-0.115583 0.0739,-0.250114 0,-0.19706 -0.144005,-0.324012 -0.142111,-0.126952 -0.450964,-0.126952 h -0.879189 z"
         style="font-family:sans-serif;-inkscape-font-specification:sans-serif"
         id="path98771" />
      <path
         d="m 40.849786,97.422946 v 0.327802 H 39.01372 q -0.0038,-0.123163 0.03979,-0.236851 0.07011,-0.187586 0.223587,-0.369487 0.155374,-0.181901 0.447174,-0.420646 0.452858,-0.371382 0.612022,-0.58739 0.159164,-0.217902 0.159164,-0.411172 0,-0.202745 -0.1459,-0.341065 -0.144006,-0.140216 -0.377067,-0.140216 -0.246324,0 -0.394119,0.147795 -0.147795,0.147795 -0.14969,0.409278 l -0.350538,-0.036 q 0.036,-0.392224 0.270957,-0.596863 0.234955,-0.206534 0.63097,-0.206534 0.399803,0 0.632864,0.221692 0.233061,0.221693 0.233061,0.549494 0,0.166743 -0.06821,0.327801 -0.06821,0.161058 -0.227376,0.33917 -0.157269,0.178112 -0.524861,0.48886 -0.306958,0.257693 -0.394119,0.350538 -0.08716,0.09095 -0.144006,0.183796 z"
         style="font-family:sans-serif;-inkscape-font-specification:sans-serif"
         id="path98773" />
    </g>
    <g
       aria-label="T2"
       id="text6402"
       style="font-size:3.88056px;line-height:100%;font-family:Sans;-inkscape-font-specification:Sans;letter-spacing:0px;word-spacing:0px;stroke:#000000;stroke-width:0">
      <path
         d="m 66.314079,102.75075 v -2.44998 h -0.915191 v -0.327806 h 2.201763 v 0.327806 h -0.91898 v 2.44998 z"
         style="font-family:sans-serif;-inkscape-font-specification:sans-serif"
         id="path98735" />
      <path
         d="m 69.631882,102.42295 v 0.3278 h -1.836066 q -0.0038,-0.12316 0.03979,-0.23685 0.07011,-0.18759 0.223587,-0.36949 0.155374,-0.1819 0.447174,-0.42065 0.452858,-0.37138 0.612022,-0.58739 0.159163,-0.2179 0.159163,-0.41117 0,-0.20274 -0.1459,-0.34106 -0.144005,-0.14022 -0.377066,-0.14022 -0.246324,0 -0.394119,0.1478 -0.147795,0.14779 -0.14969,0.40927 l -0.350538,-0.036 q 0.036,-0.39222 0.270957,-0.59686 0.234955,-0.206535 0.63097,-0.206535 0.399803,0 0.632864,0.221695 0.233061,0.22169 0.233061,0.54949 0,0.16674 -0.06821,0.3278 -0.06821,0.16106 -0.227376,0.33917 -0.157269,0.17811 -0.524861,0.48886 -0.306958,0.25769 -0.39412,0.35054 -0.08716,0.091 -0.144005,0.1838 z"
         style="font-family:sans-serif;-inkscape-font-specification:sans-serif"
         id="path98737" />
    </g>
  </g>
</svg>
