<?xml version="1.0" encoding="UTF-8" standalone="no"?>
<svg
   xmlns:dc="http://purl.org/dc/elements/1.1/"
   xmlns:cc="http://creativecommons.org/ns#"
   xmlns:rdf="http://www.w3.org/1999/02/22-rdf-syntax-ns#"
   xmlns:svg="http://www.w3.org/2000/svg"
   xmlns="http://www.w3.org/2000/svg"
   version="1.1"
   height="38"
   width="37.882912"
   id="svg4">
  <metadata
     id="metadata10">
    <rdf:RDF>
      <cc:Work
         rdf:about="">
        <dc:format>image/svg+xml</dc:format>
        <dc:type
           rdf:resource="http://purl.org/dc/dcmitype/StillImage" />
        <dc:title></dc:title>
      </cc:Work>
    </rdf:RDF>
  </metadata>
  <defs
     id="defs8" />
  <path
     style="fill:#00adef;stroke-width:0.999998"
     d="M 0,5.3801699 15.481546,3.2717437 15.488284,18.204948 0.01411323,18.29307 Z M 15.474171,19.925544 15.486179,34.871761 0.01201666,32.744291 0.01114905,19.825289 Z M 17.350897,2.9959245 37.878141,0 v 18.015024 l -20.527244,0.162962 z m 20.532014,17.0701745 -0.0048,17.9339 -20.527245,-2.897188 -0.02876,-15.070288 z"
     id="path2" />
</svg>
