<?xml version="1.0" encoding="UTF-8" standalone="no"?>
<!-- Created with Inkscape (http://www.inkscape.org/) -->

<svg
   width="770"
   height="337.20905"
   viewBox="0 0 203.72915 89.219884"
   version="1.1"
   id="svg385"
   inkscape:version="1.2.1 (9c6d41e410, 2022-07-14)"
   sodipodi:docname="python_-_control_flows.svg"
   xml:space="preserve"
   xmlns:inkscape="http://www.inkscape.org/namespaces/inkscape"
   xmlns:sodipodi="http://sodipodi.sourceforge.net/DTD/sodipodi-0.dtd"
   xmlns:xlink="http://www.w3.org/1999/xlink"
   xmlns="http://www.w3.org/2000/svg"
   xmlns:svg="http://www.w3.org/2000/svg"><sodipodi:namedview
     id="namedview387"
     pagecolor="#ffffff"
     bordercolor="#666666"
     borderopacity="1.0"
     inkscape:showpageshadow="2"
     inkscape:pageopacity="0.0"
     inkscape:pagecheckerboard="0"
     inkscape:deskcolor="#d1d1d1"
     inkscape:document-units="mm"
     showgrid="true"
     inkscape:zoom="1.6819304"
     inkscape:cx="555.31429"
     inkscape:cy="248.52396"
     inkscape:window-width="3440"
     inkscape:window-height="1321"
     inkscape:window-x="0"
     inkscape:window-y="0"
     inkscape:window-maximized="1"
     inkscape:current-layer="layer1"><inkscape:grid
       type="xygrid"
       id="grid652"
       units="mm"
       spacingx="1"
       spacingy="1"
       originx="-4.9999987"
       originy="-159.99995" /></sodipodi:namedview><defs
     id="defs382"><linearGradient
       id="linearGradient4689"><stop
         style="stop-color:#5a9fd4;stop-opacity:1;"
         offset="0"
         id="stop4691" /><stop
         style="stop-color:#306998;stop-opacity:1;"
         offset="1"
         id="stop4693" /></linearGradient><linearGradient
       id="linearGradient4671"><stop
         style="stop-color:#ffd43b;stop-opacity:1;"
         offset="0"
         id="stop4673" /><stop
         style="stop-color:#ffe873;stop-opacity:1"
         offset="1"
         id="stop4675" /></linearGradient><linearGradient
       inkscape:collect="always"
       xlink:href="#linearGradient4671"
       id="linearGradient3396"
       x1="35"
       y1="175"
       x2="25"
       y2="160"
       gradientUnits="userSpaceOnUse"
       gradientTransform="translate(-5.0000003)" /><linearGradient
       inkscape:collect="always"
       xlink:href="#linearGradient4671"
       id="linearGradient4804"
       x1="30"
       y1="272"
       x2="20"
       y2="257"
       gradientUnits="userSpaceOnUse" /><linearGradient
       inkscape:collect="always"
       xlink:href="#linearGradient4671"
       id="linearGradient4808"
       x1="120"
       y1="205"
       x2="110"
       y2="185"
       gradientUnits="userSpaceOnUse" /><linearGradient
       inkscape:collect="always"
       xlink:href="#linearGradient4671"
       id="linearGradient4814"
       x1="265"
       y1="212"
       x2="255"
       y2="192"
       gradientUnits="userSpaceOnUse" /><linearGradient
       inkscape:collect="always"
       xlink:href="#linearGradient4671"
       id="linearGradient4820"
       gradientUnits="userSpaceOnUse"
       gradientTransform="translate(85)"
       x1="35"
       y1="175"
       x2="25"
       y2="160" /><linearGradient
       inkscape:collect="always"
       xlink:href="#linearGradient4671"
       id="linearGradient4824"
       gradientUnits="userSpaceOnUse"
       gradientTransform="translate(230)"
       x1="35"
       y1="175"
       x2="25"
       y2="160" /><linearGradient
       inkscape:collect="always"
       xlink:href="#linearGradient4671"
       id="linearGradient4828"
       gradientUnits="userSpaceOnUse"
       gradientTransform="translate(230,96.99999)"
       x1="35"
       y1="175"
       x2="25"
       y2="160" /><linearGradient
       inkscape:collect="always"
       xlink:href="#linearGradient4671"
       id="linearGradient4832"
       gradientUnits="userSpaceOnUse"
       gradientTransform="translate(85,96.99999)"
       x1="35"
       y1="175"
       x2="25"
       y2="160" /><linearGradient
       inkscape:collect="always"
       xlink:href="#linearGradient4689"
       id="linearGradient4840"
       x1="10"
       y1="183"
       x2="40"
       y2="201"
       gradientUnits="userSpaceOnUse" /><linearGradient
       inkscape:collect="always"
       xlink:href="#linearGradient4689"
       id="linearGradient4900"
       gradientUnits="userSpaceOnUse"
       x1="10"
       y1="183"
       x2="40"
       y2="201"
       gradientTransform="translate(2e-7,24)" /><linearGradient
       inkscape:collect="always"
       xlink:href="#linearGradient4689"
       id="linearGradient4904"
       gradientUnits="userSpaceOnUse"
       gradientTransform="translate(4.9999997e-8,48)"
       x1="10"
       y1="183"
       x2="40"
       y2="201" /><linearGradient
       inkscape:collect="always"
       xlink:href="#linearGradient4689"
       id="linearGradient4908"
       gradientUnits="userSpaceOnUse"
       gradientTransform="translate(55,25)"
       x1="10"
       y1="183"
       x2="40"
       y2="201" /><linearGradient
       inkscape:collect="always"
       xlink:href="#linearGradient4689"
       id="linearGradient4912"
       gradientUnits="userSpaceOnUse"
       gradientTransform="translate(125,25)"
       x1="10"
       y1="183"
       x2="40"
       y2="201" /><linearGradient
       inkscape:collect="always"
       xlink:href="#linearGradient4689"
       id="linearGradient4916"
       gradientUnits="userSpaceOnUse"
       gradientTransform="translate(180,10)"
       x1="10"
       y1="183"
       x2="40"
       y2="201" /></defs><g
     inkscape:label="Layer 1"
     inkscape:groupmode="layer"
     id="layer1"
     transform="translate(-4.999999,-159.99999)"><g
       id="g7635"
       transform="matrix(0.72760416,0,0,0.72760416,1.3619789,43.583331)"
       style="stroke-width:1.37437"><g
         aria-label="Sequential"
         id="text6972"
         style="font-size:7.05556px;line-height:1.25;fill:#3874a4;stroke-width:0.363636"><path
           d="m 7.5316311,279.49332 0.9921881,-0.0965 q 0.089572,0.49954 0.3617353,0.73381 0.2756078,0.23427 0.740696,0.23427 0.4926485,0 0.7406955,-0.20671 0.251493,-0.21015 0.251493,-0.4892 0,-0.17915 -0.106798,-0.30317 -0.103353,-0.12747 -0.365181,-0.22049 -0.1791449,-0.062 -0.8164879,-0.22049 -0.8199333,-0.20326 -1.1506627,-0.49953 -0.4650882,-0.41686 -0.4650882,-1.01631 0,-0.38585 0.2170412,-0.72002 0.2204862,-0.33762 0.6304529,-0.51332 0.4134117,-0.1757 0.9956332,-0.1757 0.9508465,0 1.4297155,0.41685 0.482314,0.41686 0.506429,1.11277 l -1.019749,0.0448 q -0.06546,-0.3893 -0.282498,-0.55811 -0.2135956,-0.17225 -0.6442328,-0.17225 -0.4444176,0 -0.6959097,0.18259 -0.1619196,0.11713 -0.1619196,0.3135 0,0.17914 0.1515843,0.30661 0.1929255,0.16192 0.9370666,0.33762 0.7441412,0.1757 1.0989862,0.36518 0.35829,0.18604 0.558106,0.51332 0.203261,0.32384 0.203261,0.80271 0,0.43408 -0.241157,0.81304 -0.241157,0.37896 -0.68213,0.565 -0.440972,0.18259 -1.0989858,0.18259 -0.9577372,0 -1.4710568,-0.44097 -0.5133195,-0.44442 -0.6132273,-1.29191 z"
           style="font-weight:bold;-inkscape-font-specification:'sans-serif Bold';stroke-width:0.363636"
           id="path7557" /><path
           d="m 14.607862,279.97218 0.964627,0.16192 q -0.186035,0.53055 -0.589111,0.8096 -0.399632,0.27561 -1.002524,0.27561 -0.954292,0 -1.41249,-0.62356 -0.361735,-0.49954 -0.361735,-1.26091 0,-0.9095 0.475423,-1.42282 0.475424,-0.51677 1.202339,-0.51677 0.816489,0 1.288467,0.54088 0.471978,0.53744 0.451308,1.6502 h -2.425349 q 0.01033,0.43064 0.234267,0.6718 0.223931,0.23771 0.558105,0.23771 0.227377,0 0.382406,-0.12402 0.15503,-0.12403 0.234267,-0.39964 z m 0.05512,-0.9784 q -0.01034,-0.42031 -0.217042,-0.63735 -0.206706,-0.22048 -0.502984,-0.22048 -0.316949,0 -0.523655,0.23082 -0.206706,0.23082 -0.203261,0.62701 z"
           style="font-weight:bold;-inkscape-font-specification:'sans-serif Bold';stroke-width:0.363636"
           id="path7559" /><path
           d="m 18.803992,282.52845 v -1.83969 q -0.189481,0.24461 -0.471979,0.3893 -0.282498,0.14125 -0.609782,0.14125 -0.623563,0 -1.026639,-0.46853 -0.475424,-0.54777 -0.475424,-1.48484 0,-0.88195 0.444418,-1.37459 0.447863,-0.4961 1.109321,-0.4961 0.365181,0 0.630453,0.15503 0.268718,0.15503 0.475424,0.46853 v -0.54088 h 0.89228 v 5.05052 z m 0.03101,-3.26596 q 0,-0.56155 -0.230821,-0.83371 -0.227377,-0.27561 -0.571886,-0.27561 -0.3514,0 -0.589112,0.27906 -0.234267,0.27905 -0.234267,0.88539 0,0.60289 0.227377,0.87161 0.227376,0.26527 0.561551,0.26527 0.334174,0 0.585666,-0.29973 0.251492,-0.29972 0.251492,-0.89228 z"
           style="font-weight:bold;-inkscape-font-specification:'sans-serif Bold';stroke-width:0.363636"
           id="path7561" /><path
           d="m 23.131033,281.13663 v -0.54777 q -0.199815,0.29283 -0.5271,0.46164 -0.323839,0.16881 -0.685574,0.16881 -0.368625,0 -0.661459,-0.16192 -0.292833,-0.16192 -0.423747,-0.45475 -0.130913,-0.29284 -0.130913,-0.8096 v -2.31511 h 0.968072 v 1.68121 q 0,0.7717 0.05168,0.9474 0.05512,0.17226 0.196371,0.27561 0.141249,0.0999 0.35829,0.0999 0.248047,0 0.444418,-0.13436 0.19637,-0.1378 0.268717,-0.33762 0.07235,-0.20326 0.07235,-0.98874 v -1.54341 h 0.968073 v 3.6587 z"
           style="font-weight:bold;-inkscape-font-specification:'sans-serif Bold';stroke-width:0.363636"
           id="path7563" /><path
           d="m 27.151463,279.97218 0.964628,0.16192 q -0.186035,0.53055 -0.589112,0.8096 -0.399631,0.27561 -1.002523,0.27561 -0.954292,0 -1.41249,-0.62356 -0.361736,-0.49954 -0.361736,-1.26091 0,-0.9095 0.475424,-1.42282 0.475423,-0.51677 1.202339,-0.51677 0.816488,0 1.288466,0.54088 0.471979,0.53744 0.451308,1.6502 h -2.425349 q 0.01034,0.43064 0.234267,0.6718 0.223931,0.23771 0.558106,0.23771 0.227376,0 0.382406,-0.12402 0.155029,-0.12403 0.234266,-0.39964 z m 0.05512,-0.9784 q -0.01034,-0.42031 -0.217041,-0.63735 -0.206706,-0.22048 -0.502984,-0.22048 -0.316949,0 -0.523655,0.23082 -0.206706,0.23082 -0.203261,0.62701 z"
           style="font-weight:bold;-inkscape-font-specification:'sans-serif Bold';stroke-width:0.363636"
           id="path7565" /><path
           d="m 32.284658,281.13663 h -0.968072 v -1.86725 q 0,-0.59255 -0.06201,-0.76481 -0.06201,-0.1757 -0.203261,-0.27216 -0.137804,-0.0965 -0.334174,-0.0965 -0.251492,0 -0.451308,0.1378 -0.199816,0.1378 -0.275608,0.36518 -0.07235,0.22738 -0.07235,0.84061 v 1.65709 h -0.968072 v -3.6587 h 0.89917 v 0.53744 q 0.478869,-0.62012 1.205784,-0.62012 0.320394,0 0.585667,0.11713 0.265272,0.11369 0.399631,0.29284 0.137804,0.17914 0.189481,0.40652 0.05512,0.22738 0.05512,0.65112 z"
           style="font-weight:bold;-inkscape-font-specification:'sans-serif Bold';stroke-width:0.363636"
           id="path7567" /><path
           d="m 34.944275,277.47793 v 0.77171 h -0.661459 v 1.4745 q 0,0.44786 0.01723,0.52365 0.02067,0.0723 0.08613,0.12058 0.0689,0.0482 0.165365,0.0482 0.134358,0 0.389296,-0.093 l 0.08268,0.75104 q -0.33762,0.14469 -0.764812,0.14469 -0.261827,0 -0.471978,-0.0861 -0.210151,-0.0896 -0.310059,-0.22737 -0.09646,-0.14125 -0.134359,-0.37897 -0.03101,-0.1688 -0.03101,-0.68212 v -1.59508 h -0.444417 v -0.77171 h 0.444417 v -0.72691 l 0.971518,-0.565 v 1.29191 z"
           style="font-weight:bold;-inkscape-font-specification:'sans-serif Bold';stroke-width:0.363636"
           id="path7569" /><path
           d="m 35.616068,276.98184 v -0.89573 h 0.968073 v 0.89573 z m 0,4.15479 v -3.6587 h 0.968073 v 3.6587 z"
           style="font-weight:bold;-inkscape-font-specification:'sans-serif Bold';stroke-width:0.363636"
           id="path7571" /><path
           d="m 38.299799,278.59415 -0.8785,-0.15848 q 0.148139,-0.53054 0.509875,-0.78548 0.361735,-0.25494 1.07487,-0.25494 0.647678,0 0.964627,0.15503 0.316949,0.15158 0.444418,0.3893 0.130914,0.23426 0.130914,0.86472 l -0.01034,1.12999 q 0,0.48231 0.04479,0.71313 0.04823,0.22738 0.1757,0.48921 h -0.957738 q -0.0379,-0.0965 -0.09302,-0.28595 -0.02412,-0.0861 -0.03445,-0.11368 -0.248047,0.24115 -0.530545,0.36173 -0.282498,0.12058 -0.602892,0.12058 -0.564996,0 -0.892281,-0.30661 -0.323839,-0.30662 -0.323839,-0.77515 0,-0.31006 0.148139,-0.55122 0.14814,-0.2446 0.413412,-0.37207 0.268718,-0.13091 0.771702,-0.22737 0.678684,-0.12747 0.940512,-0.23772 v -0.0965 q 0,-0.27905 -0.137804,-0.39618 -0.137804,-0.12058 -0.52021,-0.12058 -0.258382,0 -0.403076,0.10335 -0.144694,0.0999 -0.234267,0.35485 z m 1.295357,0.78548 q -0.186036,0.062 -0.589112,0.14814 -0.403076,0.0861 -0.5271,0.16881 -0.18948,0.13436 -0.18948,0.34106 0,0.20326 0.151584,0.3514 0.151584,0.14814 0.385851,0.14814 0.261827,0 0.499539,-0.17225 0.1757,-0.13092 0.230822,-0.3204 0.0379,-0.12402 0.0379,-0.47198 z"
           style="font-weight:bold;-inkscape-font-specification:'sans-serif Bold';stroke-width:0.363636"
           id="path7573" /><path
           d="m 41.500294,281.13663 v -5.05052 h 0.968072 v 5.05052 z"
           style="font-weight:bold;-inkscape-font-specification:'sans-serif Bold';stroke-width:0.363636"
           id="path7575" /></g><path
         id="rect20061"
         style="fill:url(#linearGradient4840);fill-opacity:1;stroke-width:3.57337;stroke-linecap:round;stroke-linejoin:round"
         d="m 45,184.99999 c 4e-6,0 0,14 0,14 H 4.9999994 v -14 z"
         sodipodi:nodetypes="ccccc" /><path
         id="path20862"
         style="fill:url(#linearGradient3396);fill-opacity:1;stroke-width:3.57337;stroke-linecap:round;stroke-linejoin:round"
         d="m 40,167.49999 a 15,7.5 0 0 1 -15,7.5 15,7.5 0 0 1 -15.0000003,-7.5 15,7.5 0 0 1 15.0000003,-7.5 15,7.5 0 0 1 15,7.5 z" /><path
         style="fill:#9baab4;fill-opacity:1;stroke:none;stroke-width:0.687187;stroke-linecap:round;stroke-linejoin:round;stroke-dasharray:none;stroke-opacity:1"
         d="m 24,175.99999 h 1.999998 v 5 h 2.000001 l -2.999999,3 -3.000002,-3 H 24 Z"
         id="path20931" /><path
         style="fill:#9baab4;fill-opacity:1;stroke:none;stroke-width:0.687187;stroke-linecap:round;stroke-linejoin:round;stroke-dasharray:none;stroke-opacity:1"
         d="M 24.000002,199.99999 H 26 v 5 h 2.000001 l -2.999999,3 -3.000002,-3 h 2.000002 z"
         id="path22469" /><path
         style="fill:#9baab4;fill-opacity:1;stroke:none;stroke-width:0.687187;stroke-linecap:round;stroke-linejoin:round;stroke-dasharray:none;stroke-opacity:1"
         d="m 24.000001,223.99999 h 1.999998 v 5 H 28 l -2.999999,3 -3.000002,-3 h 2.000002 z"
         id="path22473" /><path
         id="path23201"
         style="fill:url(#linearGradient4804);fill-opacity:1;stroke-width:3.57337;stroke-linecap:round;stroke-linejoin:round"
         d="m 39.999999,264.49999 a 15,7.5 0 0 1 -15,7.5 15,7.5 0 0 1 -15.0000003,-7.5 15,7.5 0 0 1 15.0000003,-7.5 15,7.5 0 0 1 15,7.5 z" /><path
         style="fill:#9baab4;fill-opacity:1;stroke:none;stroke-width:0.687187;stroke-linecap:round;stroke-linejoin:round;stroke-dasharray:none;stroke-opacity:1"
         d="m 24,247.99999 h 1.999998 v 5 h 2.000001 l -2.999999,3 -3.000002,-3 H 24 Z"
         id="path23203" /><path
         id="path4898"
         style="fill:url(#linearGradient4900);fill-opacity:1;stroke-width:3.57337;stroke-linecap:round;stroke-linejoin:round"
         d="m 45,208.99999 c 4e-6,0 0,14 0,14 H 4.9999992 v -14 z"
         sodipodi:nodetypes="ccccc" /><path
         id="path4902"
         style="fill:url(#linearGradient4904);fill-opacity:1;stroke-width:3.57337;stroke-linecap:round;stroke-linejoin:round"
         d="m 45,232.99999 c 4e-6,0 0,14 0,14 H 4.999999 v -14 z"
         sodipodi:nodetypes="ccccc" /><path
         id="path23264"
         style="fill:#9baab4;fill-opacity:1;stroke:none;stroke-width:0.687187;stroke-linecap:round;stroke-linejoin:round;stroke-dasharray:none;stroke-opacity:1"
         d="m 79.000148,224.99999 v 12 h 34.999932 v 15.99967 h -1.99988 l 2.99982,3.00033 2.99981,-3.00033 h -1.99987 v -15.99967 h 34.99993 v -12 h -1.99988 v 10.00012 H 81.000026 v -10.00012 z"
         sodipodi:nodetypes="cccccccccccccccc" /><path
         style="fill:url(#linearGradient4808);fill-opacity:1;stroke:none;stroke-width:0.363636px;stroke-linecap:butt;stroke-linejoin:miter;stroke-opacity:1"
         d="m 90,194.99999 25,-10 25,10 -25,10 z"
         id="path23242"
         sodipodi:nodetypes="ccccc" /><path
         id="path4818"
         style="fill:url(#linearGradient4820);fill-opacity:1;stroke-width:3.57337;stroke-linecap:round;stroke-linejoin:round"
         d="m 130,167.49999 a 15,7.5 0 0 1 -15,7.5 15,7.5 0 0 1 -15,-7.5 15,7.5 0 0 1 15,-7.5 15,7.5 0 0 1 15,7.5 z" /><path
         style="fill:#9baab4;fill-opacity:1;stroke:none;stroke-width:0.687187;stroke-linecap:round;stroke-linejoin:round;stroke-dasharray:none;stroke-opacity:1"
         d="m 114,175.99999 h 2 v 5 h 2 l -3,3 -3,-3 h 2 z"
         id="path23248" /><path
         id="path4830"
         style="fill:url(#linearGradient4832);fill-opacity:1;stroke-width:3.57337;stroke-linecap:round;stroke-linejoin:round"
         d="m 130,264.49999 a 15,7.5 0 0 1 -15,7.5 15,7.5 0 0 1 -15,-7.5 15,7.5 0 0 1 15,-7.5 15,7.5 0 0 1 15,7.5 z" /><path
         style="fill:#9baab4;fill-opacity:1;stroke:none;stroke-width:0.687187;stroke-linecap:round;stroke-linejoin:round;stroke-dasharray:none;stroke-opacity:1"
         d="m 141,195.99999 v -2 h 10 v 12 h 2 l -3,3 -3,-3 h 2 v -10 z"
         id="path23260"
         sodipodi:nodetypes="cccccccccc" /><path
         style="fill:#9baab4;fill-opacity:1;stroke:none;stroke-width:0.687187;stroke-linecap:round;stroke-linejoin:round;stroke-dasharray:none;stroke-opacity:1"
         d="m 89,195.99999 v -2 H 79 v 12 h -2 l 3,3 3,-3 h -2 v -10 z"
         id="path23262"
         sodipodi:nodetypes="cccccccccc" /><path
         id="path4906"
         style="fill:url(#linearGradient4908);fill-opacity:1;stroke-width:3.57337;stroke-linecap:round;stroke-linejoin:round"
         d="m 100,209.99999 c 0,0 0,14 0,14 H 59.999999 v -14 z"
         sodipodi:nodetypes="ccccc" /><path
         id="path4910"
         style="fill:url(#linearGradient4912);fill-opacity:1;stroke-width:3.57337;stroke-linecap:round;stroke-linejoin:round"
         d="m 170,209.99999 c 0,0 0,14 0,14 h -40 v -14 z"
         sodipodi:nodetypes="ccccc" /><g
         aria-label="Conditional"
         id="text24863"
         style="font-size:7.05556px;line-height:1.25;fill:#3874a4;stroke-width:0.363636"><path
           d="m 99.421266,279.27972 0.988744,0.3135 q -0.22738,0.82683 -0.757922,1.2299 -0.5271,0.39963 -1.340143,0.39963 -1.005969,0 -1.653647,-0.68557 -0.647679,-0.68902 -0.647679,-1.88102 0,-1.26091 0.651124,-1.95682 0.651123,-0.69935 1.712214,-0.69935 0.926731,0 1.505507,0.54777 0.344506,0.32384 0.516766,0.93017 l -1.009415,0.24116 q -0.08957,-0.39274 -0.375515,-0.62012 -0.282498,-0.22737 -0.68902,-0.22737 -0.561551,0 -0.912951,0.40307 -0.347955,0.40308 -0.347955,1.30569 0,0.95774 0.34451,1.36426 0.34451,0.40652 0.895725,0.40652 0.406522,0 0.699355,-0.25838 0.292834,-0.25838 0.420302,-0.81304 z"
           style="font-weight:bold;-inkscape-font-specification:'sans-serif Bold';stroke-width:0.363636"
           id="path7534" /><path
           d="m 101.05424,279.2556 q 0,-0.48231 0.23771,-0.93362 0.23772,-0.45131 0.6718,-0.68902 0.43753,-0.23771 0.97496,-0.23771 0.83027,0 1.36081,0.54088 0.53055,0.53744 0.53055,1.36082 0,0.83026 -0.53744,1.37803 -0.53399,0.54433 -1.34703,0.54433 -0.50298,0 -0.96118,-0.22738 -0.45475,-0.22737 -0.69247,-0.6649 -0.23771,-0.44097 -0.23771,-1.07143 z m 0.99219,0.0517 q 0,0.54433 0.25838,0.83371 0.25839,0.28939 0.63735,0.28939 0.37896,0 0.63389,-0.28939 0.25839,-0.28938 0.25839,-0.8406 0,-0.53744 -0.25839,-0.82682 -0.25493,-0.28939 -0.63389,-0.28939 -0.37896,0 -0.63735,0.28939 -0.25838,0.28938 -0.25838,0.83371 z"
           style="font-weight:bold;-inkscape-font-specification:'sans-serif Bold';stroke-width:0.363636"
           id="path7536" /><path
           d="m 108.91596,281.13663 h -0.96808 v -1.86725 q 0,-0.59255 -0.062,-0.76481 -0.062,-0.1757 -0.20326,-0.27216 -0.1378,-0.0965 -0.33417,-0.0965 -0.2515,0 -0.45131,0.1378 -0.19982,0.1378 -0.27561,0.36518 -0.0724,0.22738 -0.0724,0.84061 v 1.65709 h -0.96807 v -3.6587 h 0.89917 v 0.53744 q 0.47887,-0.62012 1.20579,-0.62012 0.32039,0 0.58566,0.11713 0.26528,0.11369 0.39963,0.29284 0.13781,0.17914 0.18948,0.40652 0.0551,0.22738 0.0551,0.65112 z"
           style="font-weight:bold;-inkscape-font-specification:'sans-serif Bold';stroke-width:0.363636"
           id="path7538" /><path
           d="m 113.25333,281.13663 h -0.89917 v -0.53744 q -0.22393,0.31351 -0.53054,0.46854 -0.30317,0.15158 -0.61323,0.15158 -0.63045,0 -1.08176,-0.50643 -0.44786,-0.50987 -0.44786,-1.41938 0,-0.93018 0.43752,-1.41249 0.43753,-0.48576 1.10588,-0.48576 0.61323,0 1.06109,0.50988 v -1.81902 h 0.96807 z m -2.58382,-1.90859 q 0,0.58567 0.16192,0.8475 0.23427,0.37896 0.65457,0.37896 0.33417,0 0.56844,-0.2825 0.23427,-0.28594 0.23427,-0.85094 0,-0.63045 -0.22738,-0.90606 -0.22738,-0.27905 -0.58222,-0.27905 -0.34451,0 -0.57878,0.2756 -0.23082,0.27217 -0.23082,0.81649 z"
           style="font-weight:bold;-inkscape-font-specification:'sans-serif Bold';stroke-width:0.363636"
           id="path7540" /><path
           d="m 114.20763,276.98184 v -0.89573 h 0.96807 v 0.89573 z m 0,4.15479 v -3.6587 h 0.96807 v 3.6587 z"
           style="font-weight:bold;-inkscape-font-specification:'sans-serif Bold';stroke-width:0.363636"
           id="path7542" /><path
           d="m 117.84565,277.47793 v 0.77171 h -0.66146 v 1.4745 q 0,0.44786 0.0172,0.52365 0.0207,0.0723 0.0861,0.12058 0.0689,0.0482 0.16537,0.0482 0.13436,0 0.38929,-0.093 l 0.0827,0.75104 q -0.33762,0.14469 -0.76482,0.14469 -0.26182,0 -0.47197,-0.0861 -0.21015,-0.0896 -0.31006,-0.22737 -0.0965,-0.14125 -0.13436,-0.37897 -0.031,-0.1688 -0.031,-0.68212 v -1.59508 h -0.44441 v -0.77171 h 0.44441 v -0.72691 l 0.97152,-0.565 v 1.29191 z"
           style="font-weight:bold;-inkscape-font-specification:'sans-serif Bold';stroke-width:0.363636"
           id="path7544" /><path
           d="m 118.51744,276.98184 v -0.89573 h 0.96807 v 0.89573 z m 0,4.15479 v -3.6587 h 0.96807 v 3.6587 z"
           style="font-weight:bold;-inkscape-font-specification:'sans-serif Bold';stroke-width:0.363636"
           id="path7546" /><path
           d="m 120.25377,279.2556 q 0,-0.48231 0.23772,-0.93362 0.23771,-0.45131 0.67179,-0.68902 0.43753,-0.23771 0.97496,-0.23771 0.83027,0 1.36082,0.54088 0.53054,0.53744 0.53054,1.36082 0,0.83026 -0.53743,1.37803 -0.53399,0.54433 -1.34704,0.54433 -0.50298,0 -0.96118,-0.22738 -0.45475,-0.22737 -0.69246,-0.6649 -0.23772,-0.44097 -0.23772,-1.07143 z m 0.99219,0.0517 q 0,0.54433 0.25838,0.83371 0.25839,0.28939 0.63735,0.28939 0.37896,0 0.63389,-0.28939 0.25839,-0.28938 0.25839,-0.8406 0,-0.53744 -0.25839,-0.82682 -0.25493,-0.28939 -0.63389,-0.28939 -0.37896,0 -0.63735,0.28939 -0.25838,0.28938 -0.25838,0.83371 z"
           style="font-weight:bold;-inkscape-font-specification:'sans-serif Bold';stroke-width:0.363636"
           id="path7548" /><path
           d="m 128.11549,281.13663 h -0.96808 v -1.86725 q 0,-0.59255 -0.062,-0.76481 -0.062,-0.1757 -0.20326,-0.27216 -0.1378,-0.0965 -0.33417,-0.0965 -0.2515,0 -0.45131,0.1378 -0.19982,0.1378 -0.27561,0.36518 -0.0724,0.22738 -0.0724,0.84061 v 1.65709 h -0.96807 v -3.6587 h 0.89917 v 0.53744 q 0.47887,-0.62012 1.20579,-0.62012 0.32039,0 0.58566,0.11713 0.26527,0.11369 0.39963,0.29284 0.13781,0.17914 0.18948,0.40652 0.0551,0.22738 0.0551,0.65112 z"
           style="font-weight:bold;-inkscape-font-specification:'sans-serif Bold';stroke-width:0.363636"
           id="path7550" /><path
           d="m 129.82081,278.59415 -0.8785,-0.15848 q 0.14814,-0.53054 0.50987,-0.78548 0.36174,-0.25494 1.07487,-0.25494 0.64768,0 0.96463,0.15503 0.31695,0.15158 0.44442,0.3893 0.13091,0.23426 0.13091,0.86472 l -0.0103,1.12999 q 0,0.48231 0.0448,0.71313 0.0482,0.22738 0.1757,0.48921 h -0.95773 q -0.0379,-0.0965 -0.093,-0.28595 -0.0241,-0.0861 -0.0344,-0.11368 -0.24805,0.24115 -0.53055,0.36173 -0.2825,0.12058 -0.60289,0.12058 -0.565,0 -0.89228,-0.30661 -0.32384,-0.30662 -0.32384,-0.77515 0,-0.31006 0.14814,-0.55122 0.14814,-0.2446 0.41341,-0.37207 0.26872,-0.13091 0.7717,-0.22737 0.67869,-0.12747 0.94051,-0.23772 v -0.0965 q 0,-0.27905 -0.1378,-0.39618 -0.1378,-0.12058 -0.52021,-0.12058 -0.25838,0 -0.40308,0.10335 -0.14469,0.0999 -0.23426,0.35485 z m 1.29535,0.78548 q -0.18603,0.062 -0.58911,0.14814 -0.40307,0.0861 -0.5271,0.16881 -0.18948,0.13436 -0.18948,0.34106 0,0.20326 0.15159,0.3514 0.15158,0.14814 0.38585,0.14814 0.26183,0 0.49954,-0.17225 0.1757,-0.13092 0.23082,-0.3204 0.0379,-0.12402 0.0379,-0.47198 z"
           style="font-weight:bold;-inkscape-font-specification:'sans-serif Bold';stroke-width:0.363636"
           id="path7552" /><path
           d="m 133.02131,281.13663 v -5.05052 h 0.96807 v 5.05052 z"
           style="font-weight:bold;-inkscape-font-specification:'sans-serif Bold';stroke-width:0.363636"
           id="path7554" /></g><path
         style="fill:url(#linearGradient4814);fill-opacity:1;stroke:none;stroke-width:0.363636px;stroke-linecap:butt;stroke-linejoin:miter;stroke-opacity:1"
         d="m 235,201.99999 25,-10 25,10 -25,10 z"
         id="path24770"
         sodipodi:nodetypes="ccccc" /><path
         id="path4822"
         style="fill:url(#linearGradient4824);fill-opacity:1;stroke-width:3.57337;stroke-linecap:round;stroke-linejoin:round"
         d="m 275,167.49999 a 15,7.5 0 0 1 -15,7.5 15,7.5 0 0 1 -15,-7.5 15,7.5 0 0 1 15,-7.5 15,7.5 0 0 1 15,7.5 z" /><path
         style="fill:#9baab4;fill-opacity:1;stroke:none;stroke-width:0.687187;stroke-linecap:round;stroke-linejoin:round;stroke-dasharray:none;stroke-opacity:1"
         d="m 259,175.99999 h 2 v 12 h 2 l -3,3 -3,-3 h 2 z"
         id="path24774"
         sodipodi:nodetypes="cccccccc" /><path
         id="path4826"
         style="fill:url(#linearGradient4828);fill-opacity:1;stroke-width:3.57337;stroke-linecap:round;stroke-linejoin:round"
         d="m 275,264.49999 a 15,7.5 0 0 1 -15,7.5 15,7.5 0 0 1 -15,-7.5 15,7.5 0 0 1 15,-7.5 15,7.5 0 0 1 15,7.5 z" /><path
         style="fill:#9baab4;fill-opacity:1;stroke:none;stroke-width:0.687187;stroke-linecap:round;stroke-linejoin:round;stroke-dasharray:none;stroke-opacity:1"
         d="m 234,200.99999 v 2 h -5 v 2 l -3,-3 3,-3 v 2 z"
         id="path24786" /><path
         style="fill:#9baab4;fill-opacity:1;stroke:none;stroke-width:0.687187;stroke-linecap:round;stroke-linejoin:round;stroke-dasharray:none;stroke-opacity:1"
         d="m 206,193.99999 h -2 v -12 h 52 v -2 l 3,3 -3,3 v -2 h -50 z"
         id="path24788"
         sodipodi:nodetypes="cccccccccc" /><path
         id="path4914"
         style="fill:url(#linearGradient4916);fill-opacity:1;stroke-width:3.57337;stroke-linecap:round;stroke-linejoin:round"
         d="m 225,194.99999 c 0,0 0,14 0,14 h -40 v -14 z"
         sodipodi:nodetypes="ccccc" /><path
         style="fill:#9baab4;fill-opacity:1;stroke:none;stroke-width:0.687187;stroke-linecap:round;stroke-linejoin:round;stroke-dasharray:none;stroke-opacity:1"
         d="m 259,212.99999 h 2 v 40 h 2 l -3,3 -3,-3 h 2 z"
         id="path24802"
         sodipodi:nodetypes="cccccccc" /><g
         aria-label="Looping"
         id="text24867"
         style="font-size:7.05556px;line-height:1.25;fill:#3874a4;stroke-width:0.363636"><path
           d="m 246.5865,281.13663 v -5.00917 h 1.01975 v 4.15823 h 2.53559 v 0.85094 z"
           style="font-weight:bold;-inkscape-font-specification:'sans-serif Bold';stroke-width:0.363636"
           id="path7519" /><path
           d="m 250.63794,279.2556 q 0,-0.48231 0.23771,-0.93362 0.23771,-0.45131 0.67179,-0.68902 0.43753,-0.23771 0.97497,-0.23771 0.83027,0 1.36081,0.54088 0.53055,0.53744 0.53055,1.36082 0,0.83026 -0.53744,1.37803 -0.53399,0.54433 -1.34703,0.54433 -0.50299,0 -0.96118,-0.22738 -0.45476,-0.22737 -0.69247,-0.6649 -0.23771,-0.44097 -0.23771,-1.07143 z m 0.99219,0.0517 q 0,0.54433 0.25838,0.83371 0.25838,0.28939 0.63734,0.28939 0.37896,0 0.6339,-0.28939 0.25838,-0.28938 0.25838,-0.8406 0,-0.53744 -0.25838,-0.82682 -0.25494,-0.28939 -0.6339,-0.28939 -0.37896,0 -0.63734,0.28939 -0.25838,0.28938 -0.25838,0.83371 z"
           style="font-weight:bold;-inkscape-font-specification:'sans-serif Bold';stroke-width:0.363636"
           id="path7521" /><path
           d="m 254.94776,279.2556 q 0,-0.48231 0.23771,-0.93362 0.23771,-0.45131 0.67179,-0.68902 0.43753,-0.23771 0.97496,-0.23771 0.83027,0 1.36082,0.54088 0.53054,0.53744 0.53054,1.36082 0,0.83026 -0.53743,1.37803 -0.53399,0.54433 -1.34703,0.54433 -0.50299,0 -0.96119,-0.22738 -0.45475,-0.22737 -0.69246,-0.6649 -0.23771,-0.44097 -0.23771,-1.07143 z m 0.99218,0.0517 q 0,0.54433 0.25839,0.83371 0.25838,0.28939 0.63734,0.28939 0.37896,0 0.6339,-0.28939 0.25838,-0.28938 0.25838,-0.8406 0,-0.53744 -0.25838,-0.82682 -0.25494,-0.28939 -0.6339,-0.28939 -0.37896,0 -0.63734,0.28939 -0.25839,0.28938 -0.25839,0.83371 z"
           style="font-weight:bold;-inkscape-font-specification:'sans-serif Bold';stroke-width:0.363636"
           id="path7523" /><path
           d="m 259.45394,277.47793 h 0.90262 v 0.53744 q 0.1757,-0.27561 0.47542,-0.44786 0.29973,-0.17226 0.66491,-0.17226 0.63734,0 1.08176,0.49954 0.44442,0.49954 0.44442,1.39182 0,0.9164 -0.44787,1.42627 -0.44786,0.50643 -1.0852,0.50643 -0.30317,0 -0.55122,-0.12058 -0.2446,-0.12058 -0.51676,-0.41341 v 1.84313 h -0.96808 z m 0.95774,1.76734 q 0,0.61667 0.2446,0.91295 0.24461,0.29283 0.59601,0.29283 0.33761,0 0.56155,-0.26871 0.22393,-0.27217 0.22393,-0.88884 0,-0.57533 -0.23082,-0.85438 -0.23083,-0.27906 -0.57189,-0.27906 -0.35485,0 -0.58911,0.27561 -0.23427,0.27216 -0.23427,0.8096 z"
           style="font-weight:bold;-inkscape-font-specification:'sans-serif Bold';stroke-width:0.363636"
           id="path7525" /><path
           d="m 263.79132,276.98184 v -0.89573 h 0.96807 v 0.89573 z m 0,4.15479 v -3.6587 h 0.96807 v 3.6587 z"
           style="font-weight:bold;-inkscape-font-specification:'sans-serif Bold';stroke-width:0.363636"
           id="path7527" /><path
           d="m 269.07955,281.13663 h -0.96808 v -1.86725 q 0,-0.59255 -0.062,-0.76481 -0.062,-0.1757 -0.20326,-0.27216 -0.1378,-0.0965 -0.33417,-0.0965 -0.25149,0 -0.45131,0.1378 -0.19982,0.1378 -0.27561,0.36518 -0.0723,0.22738 -0.0723,0.84061 v 1.65709 h -0.96808 v -3.6587 h 0.89917 v 0.53744 q 0.47887,-0.62012 1.20579,-0.62012 0.32039,0 0.58566,0.11713 0.26528,0.11369 0.39964,0.29284 0.1378,0.17914 0.18948,0.40652 0.0551,0.22738 0.0551,0.65112 z"
           style="font-weight:bold;-inkscape-font-specification:'sans-serif Bold';stroke-width:0.363636"
           id="path7529" /><path
           d="m 269.97183,281.37778 1.10587,0.13436 q 0.0276,0.19293 0.12747,0.26528 0.13781,0.10335 0.43409,0.10335 0.37896,0 0.56844,-0.11369 0.12747,-0.0758 0.19292,-0.2446 0.0448,-0.12058 0.0448,-0.44442 v -0.53399 q -0.43408,0.59256 -1.09554,0.59256 -0.73725,0 -1.16789,-0.62357 -0.33762,-0.49264 -0.33762,-1.22645 0,-0.91984 0.44097,-1.4056 0.44442,-0.48576 1.10243,-0.48576 0.67869,0 1.11966,0.596 v -0.51332 h 0.90606 v 3.28318 q 0,0.64768 -0.1068,0.96807 -0.10679,0.3204 -0.29972,0.50299 -0.19293,0.18259 -0.51677,0.28594 -0.32039,0.10335 -0.81304,0.10335 -0.93017,0 -1.31947,-0.32039 -0.3893,-0.31695 -0.3893,-0.80615 0,-0.0482 0.003,-0.11714 z m 0.86472,-2.14629 q 0,0.58222 0.22393,0.85438 0.22738,0.26872 0.55811,0.26872 0.35484,0 0.59944,-0.27561 0.2446,-0.27905 0.2446,-0.82338 0,-0.56844 -0.23426,-0.84405 -0.23427,-0.2756 -0.59256,-0.2756 -0.34795,0 -0.57533,0.27216 -0.22393,0.26872 -0.22393,0.82338 z"
           style="font-weight:bold;-inkscape-font-specification:'sans-serif Bold';stroke-width:0.363636"
           id="path7531" /></g></g></g></svg>
