<?xml version="1.0" encoding="UTF-8" standalone="no"?>
<!-- Created with Inkscape (http://www.inkscape.org/) -->

<svg
   width="119.63844mm"
   height="109.45724mm"
   viewBox="0 0 119.63844 109.45724"
   version="1.1"
   id="svg37530"
   xmlns="http://www.w3.org/2000/svg"
   xmlns:svg="http://www.w3.org/2000/svg">
  <defs
     id="defs37527" />
  <g
     id="layer1"
     transform="translate(67.538259,-128.31984)">
    <g
       aria-label="D2"
       id="text1937"
       style="font-size:3.88056px;line-height:100%;font-family:Sans;-inkscape-font-specification:Sans;letter-spacing:0px;word-spacing:0px;stroke:#000000;stroke-width:0">
      <path
         d="m -31.938578,214.6937 v -2.77779 h 0.956876 q 0.324012,0 0.494544,0.0398 0.238746,0.0549 0.407383,0.19896 0.219798,0.18569 0.327802,0.47559 0.109898,0.28801 0.109898,0.65939 0,0.31644 -0.0739,0.56087 -0.0739,0.24443 -0.18948,0.40549 -0.115584,0.15916 -0.253904,0.252 -0.136426,0.0909 -0.331591,0.13832 -0.19327,0.0474 -0.445279,0.0474 z m 0.367592,-0.32781 h 0.593074 q 0.274747,0 0.430121,-0.0512 0.157269,-0.0512 0.250114,-0.144 0.130741,-0.13074 0.202744,-0.35054 0.0739,-0.22169 0.0739,-0.53623 0,-0.4358 -0.144005,-0.66887 -0.14211,-0.23495 -0.346749,-0.31453 -0.147795,-0.0568 -0.475596,-0.0568 h -0.5836 z"
         style="font-family:sans-serif;-inkscape-font-specification:sans-serif"
         id="path167318" />
      <path
         d="m -27.481997,214.36589 v 0.32781 h -1.836066 q -0.0038,-0.12317 0.03979,-0.23686 0.07011,-0.18758 0.223587,-0.36948 0.155374,-0.1819 0.447174,-0.42065 0.452858,-0.37138 0.612022,-0.58739 0.159163,-0.2179 0.159163,-0.41117 0,-0.20275 -0.1459,-0.34107 -0.144005,-0.14021 -0.377066,-0.14021 -0.246324,0 -0.394119,0.14779 -0.147795,0.1478 -0.14969,0.40928 l -0.350539,-0.036 q 0.036,-0.39222 0.270957,-0.59686 0.234956,-0.20654 0.63097,-0.20654 0.399804,0 0.632865,0.22169 0.233061,0.2217 0.233061,0.5495 0,0.16674 -0.06821,0.3278 -0.06821,0.16106 -0.227376,0.33917 -0.157269,0.17811 -0.524861,0.48886 -0.306959,0.25769 -0.39412,0.35054 -0.08716,0.091 -0.144005,0.18379 z"
         style="font-family:sans-serif;-inkscape-font-specification:sans-serif"
         id="path167320" />
    </g>
    <path
       style="fill:none;stroke:#000000;stroke-width:0.4;stroke-linecap:butt;stroke-linejoin:miter;stroke-dasharray:none;stroke-opacity:1"
       d="m -0.93857,161.90454 4,-3 h 24.99999"
       id="path1949" />
    <path
       style="fill:none;stroke:#000000;stroke-width:0.4;stroke-linecap:butt;stroke-linejoin:miter;stroke-dasharray:none;stroke-opacity:1"
       d="m -0.93857,165.90454 4,3 -1e-5,5 h 10"
       id="path1951" />
    <path
       style="fill:#000000;fill-opacity:1;stroke:none;stroke-width:0.264583px;stroke-linecap:butt;stroke-linejoin:miter;stroke-opacity:1"
       d="m 1.16594,168.73395 1.19889,-1.60083 0.8416,1.87963 z"
       id="path1953" />
    <g
       aria-label="GND"
       id="text1957"
       style="font-size:3.88056px;line-height:100%;font-family:Sans;-inkscape-font-specification:Sans;letter-spacing:0px;word-spacing:0px;stroke:#000000;stroke-width:0">
      <path
         d="m 25.34896,236.64019 v -0.3259 l 1.176673,-0.002 v 1.03078 q -0.270957,0.216 -0.558967,0.3259 -0.28801,0.10801 -0.591179,0.10801 -0.409278,0 -0.744658,-0.17433 -0.333486,-0.17621 -0.504018,-0.5078 -0.170533,-0.33159 -0.170533,-0.74087 0,-0.40549 0.168638,-0.75603 0.170532,-0.35243 0.488859,-0.52297 0.318328,-0.17053 0.73329,-0.17053 0.301274,0 0.543809,0.0985 0.244429,0.0966 0.38275,0.27096 0.138321,0.17432 0.210324,0.45475 l -0.331591,0.0909 q -0.06253,-0.21222 -0.155374,-0.33348 -0.09285,-0.12127 -0.265273,-0.19327 -0.172427,-0.0739 -0.38275,-0.0739 -0.252009,0 -0.435806,0.0777 -0.183796,0.0758 -0.297484,0.20085 -0.111793,0.12505 -0.174322,0.27474 -0.106109,0.2577 -0.106109,0.55897 0,0.37138 0.126952,0.6215 0.128847,0.25011 0.373276,0.37138 0.24443,0.12127 0.519177,0.12127 0.238745,0 0.466122,-0.091 0.227376,-0.0928 0.344854,-0.19706 v -0.51728 z"
         style="font-family:sans-serif;-inkscape-font-specification:sans-serif"
         id="path167376" />
      <path
         d="m 27.063758,237.72971 v -2.77779 h 0.377066 l 1.458999,2.18092 v -2.18092 h 0.352434 v 2.77779 h -0.377066 l -1.459,-2.18282 v 2.18282 z"
         style="font-family:sans-serif;-inkscape-font-specification:sans-serif"
         id="path167378" />
      <path
         d="m 29.869963,237.72971 v -2.77779 h 0.956877 q 0.324011,0 0.494544,0.0398 0.238745,0.0549 0.407383,0.19896 0.219797,0.18569 0.327801,0.47559 0.109899,0.28801 0.109899,0.6594 0,0.31643 -0.0739,0.56086 -0.0739,0.24443 -0.18948,0.40549 -0.115583,0.15916 -0.253904,0.252 -0.136426,0.091 -0.331591,0.13833 -0.19327,0.0474 -0.445279,0.0474 z m 0.367593,-0.32781 h 0.593073 q 0.274747,0 0.430121,-0.0512 0.157269,-0.0512 0.250114,-0.144 0.130742,-0.13074 0.202744,-0.35054 0.0739,-0.22169 0.0739,-0.53623 0,-0.4358 -0.144005,-0.66886 -0.142111,-0.23496 -0.34675,-0.31454 -0.147794,-0.0568 -0.475596,-0.0568 h -0.583599 z"
         style="font-family:sans-serif;-inkscape-font-specification:sans-serif"
         id="path167380" />
    </g>
    <path
       style="fill:none;stroke:#000000;stroke-width:0.7;stroke-linecap:butt;stroke-linejoin:miter;stroke-miterlimit:4;stroke-dasharray:none;stroke-opacity:1"
       d="m 25.06142,232.90454 h 6"
       id="path1959" />
    <path
       id="path1961"
       style="fill:#000000;fill-opacity:1;stroke:none;stroke-width:1.04298;stroke-linecap:butt;stroke-linejoin:miter;stroke-miterlimit:4;stroke-dasharray:none;stroke-opacity:1"
       d="m 13.06144,173.90454 h 0.89999 m 0,0 c 0,-0.49703 -0.40293,-0.89996 -0.89999,-0.89996 -0.49702,0 -0.90001,0.40293 -0.90001,0.89996 0,0.49703 0.40293,0.89997 0.89995,0.89997 0.49706,0 0.90005,-0.40294 0.90005,-0.89997 z" />
    <path
       id="path1963"
       style="fill:none;fill-opacity:0.5;stroke:#000000;stroke-width:0.5;stroke-linecap:round;stroke-linejoin:round;stroke-dasharray:none"
       d="m 43.06141,182.90454 c 0.55228,0 1,0.44772 1,1 0,0.55228 -0.44772,1 -1,1 -0.55228,0 -1,-0.44772 -1,-1 0,-0.55228 0.44772,-1 1,-1 z" />
    <path
       style="fill:none;stroke:#000000;stroke-width:0.4;stroke-linecap:butt;stroke-linejoin:miter;stroke-dasharray:none;stroke-opacity:1"
       d="m 13.06142,173.90454 h 11"
       id="path1965" />
    <g
       aria-label="Out"
       id="text1969"
       style="font-size:3.88056px;line-height:100%;font-family:Sans;-inkscape-font-specification:Sans;letter-spacing:0px;word-spacing:0px;stroke:#000000;stroke-width:0">
      <path
         d="m 46.061445,183.94151 q 0,-0.6916 0.371382,-1.08193 0.371381,-0.39223 0.958771,-0.39223 0.384645,0 0.693498,0.1838 0.308854,0.1838 0.469912,0.51349 0.162953,0.3278 0.162953,0.74466 0,0.42254 -0.170532,0.75603 -0.170533,0.33348 -0.483175,0.50591 -0.312643,0.17053 -0.674551,0.17053 -0.392224,0 -0.701078,-0.18948 -0.308853,-0.18948 -0.468016,-0.51728 -0.159164,-0.3278 -0.159164,-0.6935 z m 0.378961,0.006 q 0,0.50212 0.269062,0.79203 0.270957,0.28801 0.67834,0.28801 0.414963,0 0.68213,-0.2918 0.269062,-0.2918 0.269062,-0.82803 0,-0.33917 -0.115583,-0.59118 -0.113688,-0.25391 -0.33538,-0.39223 -0.219798,-0.14021 -0.494544,-0.14021 -0.39033,0 -0.672656,0.26906 -0.280431,0.26717 -0.280431,0.89435 z"
         style="font-family:sans-serif;-inkscape-font-specification:sans-serif"
         id="path167393" />
      <path
         d="m 50.466866,185.2944 v -0.29559 q -0.234956,0.34107 -0.638549,0.34107 -0.178112,0 -0.333486,-0.0682 -0.153479,-0.0682 -0.229271,-0.17054 -0.0739,-0.10421 -0.104215,-0.2539 -0.02084,-0.10043 -0.02084,-0.31833 v -1.24678 h 0.341064 v 1.11604 q 0,0.26717 0.02084,0.36001 0.03221,0.13453 0.136426,0.21222 0.104214,0.0758 0.257694,0.0758 0.153479,0 0.28801,-0.0777 0.134531,-0.0796 0.18948,-0.21412 0.05684,-0.13642 0.05684,-0.39412 v -1.07814 h 0.341064 v 2.01228 z"
         style="font-family:sans-serif;-inkscape-font-specification:sans-serif"
         id="path167395" />
      <path
         d="m 52.050922,184.98934 0.04926,0.30127 q -0.144005,0.0303 -0.257693,0.0303 -0.185691,0 -0.28801,-0.0587 -0.10232,-0.0587 -0.144006,-0.15348 -0.04169,-0.0966 -0.04169,-0.40359 v -1.15773 h -0.250114 v -0.26527 h 0.250114 v -0.49833 l 0.33917,-0.20464 v 0.70297 h 0.342959 v 0.26527 h -0.342959 v 1.17668 q 0,0.1459 0.01705,0.18758 0.01895,0.0417 0.05874,0.0663 0.04169,0.0246 0.117478,0.0246 0.05684,0 0.149689,-0.0133 z"
         style="font-family:sans-serif;-inkscape-font-specification:sans-serif"
         id="path167397" />
    </g>
    <path
       style="fill:none;stroke:#000000;stroke-width:0.4;stroke-linecap:butt;stroke-linejoin:miter;stroke-dasharray:none;stroke-opacity:1"
       d="m 13.06143,173.90454 -10e-6,54"
       id="path1971" />
    <path
       id="path1973"
       d="m 14.56143,187.90454 h -3 v -9 h 3 z"
       style="fill:#ffffff;fill-opacity:1;stroke:#000000;stroke-width:0.4;stroke-linecap:butt;stroke-linejoin:miter;stroke-miterlimit:4;stroke-dasharray:none;stroke-opacity:1" />
    <g
       aria-label="R2"
       id="text1981"
       style="font-size:3.88056px;line-height:100%;font-family:Sans;-inkscape-font-specification:Sans;letter-spacing:0px;word-spacing:0px;stroke:#000000;stroke-width:0">
      <path
         d="m -20.389467,147.90454 v -2.77778 h 1.231623 q 0.371382,0 0.564652,0.0758 0.19327,0.0739 0.308853,0.26338 0.115583,0.18948 0.115583,0.41875 0,0.29559 -0.191375,0.49833 -0.191375,0.20275 -0.591179,0.2577 0.1459,0.0701 0.221692,0.13832 0.161058,0.14779 0.305063,0.36948 l 0.483176,0.75603 h -0.462333 l -0.367592,-0.57791 q -0.161058,-0.25012 -0.265272,-0.38275 -0.104215,-0.13264 -0.187586,-0.1857 -0.08148,-0.0531 -0.166743,-0.0739 -0.06253,-0.0133 -0.204639,-0.0133 h -0.426331 v 1.23352 z m 0.367592,-1.55184 h 0.790134 q 0.252009,0 0.394119,-0.0512 0.14211,-0.0531 0.216008,-0.16675 0.0739,-0.11558 0.0739,-0.25011 0,-0.19706 -0.144005,-0.32401 -0.14211,-0.12695 -0.450963,-0.12695 h -0.87919 z"
         style="font-family:sans-serif;-inkscape-font-specification:sans-serif"
         id="path167276" />
      <path
         d="m -15.938571,147.57674 v 0.3278 h -1.836066 q -0.0038,-0.12316 0.03979,-0.23685 0.07011,-0.18759 0.223587,-0.36949 0.155374,-0.1819 0.447174,-0.42064 0.452859,-0.37138 0.612022,-0.58739 0.159164,-0.21791 0.159164,-0.41118 0,-0.20274 -0.1459,-0.34106 -0.144005,-0.14022 -0.377066,-0.14022 -0.246325,0 -0.39412,0.1478 -0.147794,0.14779 -0.149689,0.40928 l -0.350539,-0.036 q 0.036,-0.39223 0.270957,-0.59687 0.234956,-0.20653 0.63097,-0.20653 0.399804,0 0.632865,0.22169 0.233061,0.22169 0.233061,0.54949 0,0.16675 -0.06821,0.32781 -0.06821,0.16105 -0.227377,0.33917 -0.157269,0.17811 -0.524861,0.48885 -0.306958,0.2577 -0.394119,0.35054 -0.08716,0.0909 -0.144005,0.1838 z"
         style="font-family:sans-serif;-inkscape-font-specification:sans-serif"
         id="path167278" />
    </g>
    <path
       style="fill:none;stroke:#000000;stroke-width:0.4;stroke-linecap:butt;stroke-linejoin:miter;stroke-dasharray:none;stroke-opacity:1"
       d="M -0.93857,163.90454 H -11.93858"
       id="path1983" />
    <path
       id="path1985"
       style="fill:none;fill-opacity:0.5;stroke:#000000;stroke-width:0.5;stroke-linecap:round;stroke-linejoin:round;stroke-dasharray:none"
       d="m 28.06142,132.90454 c 0.55228,0 1,0.44772 1,1 0,0.55228 -0.44772,1 -1,1 -0.55228,0 -1,-0.44772 -1,-1 0,-0.55228 0.44772,-1 1,-1 z" />
    <g
       aria-label="+VCC"
       id="text1991"
       style="font-size:3.88056px;line-height:100%;font-family:Sans;-inkscape-font-specification:Sans;letter-spacing:0px;word-spacing:0px;stroke:#000000;stroke-width:0">
      <path
         d="m 24.726509,130.64856 v -0.76171 h -0.756027 v -0.31833 h 0.756027 v -0.75603 h 0.322117 v 0.75603 h 0.756027 v 0.31833 h -0.756027 v 0.76171 z"
         style="font-family:sans-serif;-inkscape-font-specification:sans-serif"
         id="path167257" />
      <path
         d="m 27.113963,131.09763 -1.076249,-2.77779 h 0.397909 l 0.721921,2.01797 q 0.08716,0.24253 0.1459,0.45475 0.06442,-0.22737 0.149689,-0.45475 l 0.750343,-2.01797 h 0.375171 l -1.087617,2.77779 z"
         style="font-family:sans-serif;-inkscape-font-specification:sans-serif"
         id="path167259" />
      <path
         d="m 30.091838,131.24068 0.238935,0.0603 q -0.07513,0.29436 -0.270957,0.44955 -0.194597,0.15395 -0.476638,0.15395 -0.291895,0 -0.475407,-0.11824 -0.18228,-0.11946 -0.278347,-0.34485 -0.09483,-0.22539 -0.09483,-0.48403 0,-0.28204 0.107151,-0.49142 0.108383,-0.2106 0.306674,-0.31899 0.199523,-0.10961 0.438458,-0.10961 0.270957,0 0.4557,0.13794 0.184744,0.13794 0.257409,0.38796 l -0.23524,0.0554 q -0.06281,-0.19706 -0.18228,-0.28696 -0.119467,-0.0899 -0.300516,-0.0899 -0.208144,0 -0.348549,0.0998 -0.139174,0.0998 -0.195828,0.26849 -0.05666,0.1675 -0.05666,0.34609 0,0.23031 0.06651,0.40274 0.06774,0.17119 0.209376,0.25618 0.141636,0.085 0.306674,0.085 0.200754,0 0.339928,-0.11577 0.139173,-0.11578 0.188438,-0.34363 z"
         style="font-size:65%;baseline-shift:sub"
         id="path167261" />
      <path
         d="m 31.913408,131.24068 0.238935,0.0603 q -0.07513,0.29436 -0.270957,0.44955 -0.194596,0.15395 -0.476638,0.15395 -0.291894,0 -0.475406,-0.11824 -0.182281,-0.11946 -0.278347,-0.34485 -0.09484,-0.22539 -0.09484,-0.48403 0,-0.28204 0.107151,-0.49142 0.108383,-0.2106 0.306674,-0.31899 0.199523,-0.10961 0.438458,-0.10961 0.270957,0 0.455701,0.13794 0.184743,0.13794 0.257409,0.38796 l -0.23524,0.0554 q -0.06281,-0.19706 -0.18228,-0.28696 -0.119468,-0.0899 -0.300516,-0.0899 -0.208145,0 -0.34855,0.0998 -0.139173,0.0998 -0.195828,0.26849 -0.05665,0.1675 -0.05665,0.34609 0,0.23031 0.06651,0.40274 0.06774,0.17119 0.209376,0.25618 0.141637,0.085 0.306674,0.085 0.200755,0 0.339928,-0.11577 0.139174,-0.11578 0.188438,-0.34363 z"
         style="font-size:65%;baseline-shift:sub"
         id="path167263" />
    </g>
    <path
       style="fill:none;stroke:#000000;stroke-width:0.4;stroke-linecap:butt;stroke-linejoin:miter;stroke-dasharray:none;stroke-opacity:1"
       d="m 24.06141,191.90454 4,-3 v -5"
       id="path2008" />
    <path
       style="fill:none;stroke:#000000;stroke-width:0.4;stroke-linecap:butt;stroke-linejoin:miter;stroke-dasharray:none;stroke-opacity:1"
       d="m 24.06141,195.90454 4,3 10e-6,34"
       id="path2010" />
    <path
       style="fill:#000000;fill-opacity:1;stroke:none;stroke-width:0.264583px;stroke-linecap:butt;stroke-linejoin:miter;stroke-opacity:1"
       d="m 26.16592,198.73395 1.19889,-1.60083 0.8416,1.87963 z"
       id="path2012" />
    <path
       style="fill:none;stroke:#000000;stroke-width:0.4;stroke-linecap:butt;stroke-linejoin:miter;stroke-dasharray:none;stroke-opacity:1"
       d="m 24.06141,193.90454 h -36"
       id="path2014" />
    <path
       style="fill:none;stroke:#000000;stroke-width:0.4;stroke-linecap:butt;stroke-linejoin:miter;stroke-dasharray:none;stroke-opacity:1"
       d="m 24.06142,169.90454 v 8"
       id="path2018" />
    <path
       style="fill:none;stroke:#000000;stroke-width:0.4;stroke-linecap:butt;stroke-linejoin:miter;stroke-dasharray:none;stroke-opacity:1"
       d="m 24.06142,171.90454 4,-3 v -34"
       id="path2020" />
    <path
       style="fill:none;stroke:#000000;stroke-width:0.4;stroke-linecap:butt;stroke-linejoin:miter;stroke-dasharray:none;stroke-opacity:1"
       d="m 24.06142,175.90454 4,3 -10e-6,5"
       id="path2022" />
    <path
       style="fill:#000000;fill-opacity:1;stroke:none;stroke-width:0.264583px;stroke-linecap:butt;stroke-linejoin:miter;stroke-opacity:1"
       d="m 26.16593,178.73395 1.19889,-1.60083 0.8416,1.87963 z"
       id="path2024" />
    <path
       id="path2026"
       d="m 29.56142,152.90454 h -3 v -9 h 3 z"
       style="fill:#ffffff;fill-opacity:1;stroke:#000000;stroke-width:0.5;stroke-linecap:butt;stroke-linejoin:miter;stroke-miterlimit:4;stroke-dasharray:none;stroke-opacity:1" />
    <g
       aria-label="R4"
       id="text2030"
       style="font-size:3.88056px;line-height:100%;font-family:Sans;-inkscape-font-specification:Sans;letter-spacing:0px;word-spacing:0px;stroke:#000000;stroke-width:0">
      <path
         d="m 2.0614298,202.90454 v -2.77778 h 1.231623 q 0.3713817,0 0.5646518,0.0758 0.1932701,0.0739 0.3088532,0.26338 0.1155831,0.18948 0.1155831,0.41875 0,0.29559 -0.1913753,0.49833 -0.1913753,0.20275 -0.5911791,0.2577 0.1459,0.0701 0.2216922,0.13832 0.1610584,0.14779 0.3050635,0.36948 l 0.4831752,0.75603 H 4.0471851 L 3.679593,202.32663 q -0.1610584,-0.25012 -0.2652727,-0.38275 -0.1042142,-0.13264 -0.1875856,-0.1857 -0.081477,-0.0531 -0.1667428,-0.0739 -0.062529,-0.0133 -0.204639,-0.0133 h -0.426331 v 1.23352 z m 0.3675921,-1.55184 h 0.7901335 q 0.2520091,0 0.3941194,-0.0512 0.1421104,-0.0531 0.2160077,-0.16675 0.073897,-0.11558 0.073897,-0.25011 0,-0.19706 -0.1440051,-0.32401 -0.1421104,-0.12695 -0.4509635,-0.12695 H 2.4290219 Z"
         style="font-family:sans-serif;-inkscape-font-specification:sans-serif"
         id="path167359" />
      <path
         d="m 5.813143,202.90454 v -0.66508 H 4.6080473 v -0.31264 l 1.2676243,-1.80006 h 0.2785363 v 1.80006 h 0.3751713 v 0.31264 H 6.1542079 v 0.66508 z m 0,-0.97772 v -1.25246 l -0.8697153,1.25246 z"
         style="font-family:sans-serif;-inkscape-font-specification:sans-serif"
         id="path167361" />
    </g>
    <g
       aria-label="250"
       id="text2034"
       style="font-size:3.175px;line-height:100%;font-family:Sans;-inkscape-font-specification:Sans;letter-spacing:0px;word-spacing:0px;stroke:#000000;stroke-width:0">
      <path
         d="m 3.5639163,206.91838 v 0.2682 H 2.0616824 q -0.0031,-0.10076 0.032556,-0.19378 0.057361,-0.15348 0.1829345,-0.30231 0.1271241,-0.14883 0.3658692,-0.34416 0.37052,-0.30386 0.5007446,-0.4806 0.1302246,-0.17828 0.1302246,-0.33641 0,-0.16588 -0.1193726,-0.27905 -0.1178222,-0.11472 -0.3085083,-0.11472 -0.201538,0 -0.3224609,0.12092 -0.1209228,0.12092 -0.1224731,0.33486 l -0.2868042,-0.0294 q 0.029456,-0.32091 0.2216919,-0.48834 0.1922363,-0.16899 0.5162475,-0.16899 0.3271118,0 0.5177979,0.18139 0.190686,0.18138 0.190686,0.44958 0,0.13643 -0.055811,0.2682 -0.05581,0.13178 -0.1860351,0.27751 -0.1286743,0.14572 -0.4294312,0.39997 -0.2511474,0.21084 -0.3224609,0.28681 -0.071314,0.0744 -0.1178223,0.15037 z"
         style="font-family:sans-serif;-inkscape-font-specification:sans-serif"
         id="path167364" />
      <path
         d="m 3.8631228,206.59127 0.2930054,-0.0248 q 0.032556,0.21394 0.1503784,0.32246 0.1193726,0.10697 0.2868042,0.10697 0.2015381,0 0.3410644,-0.15193 0.1395264,-0.15193 0.1395264,-0.40308 0,-0.23874 -0.1348755,-0.37672 -0.1333252,-0.13797 -0.3503662,-0.13797 -0.1348755,0 -0.243396,0.062 -0.1085205,0.0605 -0.1705322,0.15813 l -0.2619995,-0.0341 0.2201416,-1.16737 h 1.1301635 v 0.26665 H 4.356116 l -0.1224732,0.61082 q 0.2046387,-0.14263 0.4294312,-0.14263 0.2976562,0 0.5022949,0.20619 0.2046387,0.20619 0.2046387,0.5302 0,0.30851 -0.179834,0.5333 -0.2185913,0.27595 -0.5968628,0.27595 -0.3100586,0 -0.5069458,-0.17363 -0.1953369,-0.17363 -0.2232422,-0.46044 z"
         style="font-family:sans-serif;-inkscape-font-specification:sans-serif"
         id="path167366" />
      <path
         d="m 5.6289065,206.06572 q 0,-0.40307 0.082165,-0.64802 0.083716,-0.2465 0.2464966,-0.37982 0.164331,-0.13333 0.4123779,-0.13333 0.1829346,0 0.3209107,0.0744 0.137976,0.0729 0.227893,0.21239 0.089917,0.13797 0.1410767,0.33796 0.05116,0.19844 0.05116,0.5364 0,0.39998 -0.082166,0.64647 -0.082165,0.24495 -0.2464966,0.37983 -0.1627807,0.13332 -0.4123779,0.13332 -0.3286621,0 -0.5162475,-0.23564 -0.2247925,-0.28371 -0.2247925,-0.92398 z m 0.2868042,0 q 0,0.55966 0.1302246,0.74569 0.1317749,0.18449 0.3240112,0.18449 0.1922363,0 0.3224609,-0.18604 0.1317749,-0.18603 0.1317749,-0.74414 0,-0.5612 -0.1317749,-0.74569 -0.1302246,-0.18448 -0.3255615,-0.18448 -0.1922363,0 -0.306958,0.16278 -0.1441772,0.20774 -0.1441772,0.76739 z"
         style="font-family:sans-serif;-inkscape-font-specification:sans-serif"
         id="path167368" />
    </g>
    <path
       id="path2036"
       style="fill:#000000;fill-opacity:1;stroke:none;stroke-width:1.04298;stroke-linecap:butt;stroke-linejoin:miter;stroke-miterlimit:4;stroke-dasharray:none;stroke-opacity:1"
       d="m 28.06142,138.90454 h 0.89999 m 0,0 c 0,-0.49703 -0.40293,-0.89996 -0.89999,-0.89996 -0.49702,0 -0.90001,0.40293 -0.90001,0.89996 0,0.49703 0.40293,0.89997 0.89995,0.89997 0.49706,0 0.90005,-0.40294 0.90005,-0.89997 z" />
    <g
       aria-label="R3"
       id="text2042"
       style="font-size:3.88056px;line-height:100%;font-family:Sans;-inkscape-font-specification:Sans;letter-spacing:0px;word-spacing:0px;stroke:#000000;stroke-width:0">
      <path
         d="m -20.417909,202.85529 v -2.77779 h 1.231623 q 0.371381,0 0.564651,0.0758 0.193271,0.0739 0.308854,0.26338 0.115583,0.18948 0.115583,0.41875 0,0.29559 -0.191376,0.49834 -0.191375,0.20274 -0.591179,0.25769 0.1459,0.0701 0.221693,0.13832 0.161058,0.1478 0.305063,0.36949 l 0.483175,0.75603 h -0.462332 l -0.367592,-0.57792 q -0.161059,-0.25011 -0.265273,-0.38275 -0.104214,-0.13264 -0.187585,-0.18569 -0.08148,-0.0531 -0.166743,-0.0739 -0.06253,-0.0133 -0.204639,-0.0133 h -0.426331 v 1.23352 z m 0.367592,-1.55185 h 0.790133 q 0.252009,0 0.39412,-0.0512 0.14211,-0.0531 0.216007,-0.16674 0.0739,-0.11558 0.0739,-0.25012 0,-0.19706 -0.144005,-0.32401 -0.142111,-0.12695 -0.450964,-0.12695 h -0.879189 z"
         style="font-family:sans-serif;-inkscape-font-specification:sans-serif"
         id="path167323" />
      <path
         d="m -17.757604,202.122 0.341065,-0.0455 q 0.05874,0.28991 0.198955,0.41875 0.14211,0.12695 0.344854,0.12695 0.24064,0 0.405488,-0.16674 0.166743,-0.16674 0.166743,-0.41307 0,-0.23495 -0.153479,-0.38654 -0.153479,-0.15347 -0.39033,-0.15347 -0.09663,0 -0.24064,0.0379 l 0.0379,-0.29938 q 0.03411,0.004 0.05495,0.004 0.217903,0 0.392225,-0.11369 0.174322,-0.11368 0.174322,-0.35054 0,-0.18758 -0.126952,-0.31074 -0.126952,-0.12317 -0.327801,-0.12317 -0.198955,0 -0.331591,0.12506 -0.132636,0.12506 -0.170532,0.37517 l -0.341065,-0.0606 q 0.06253,-0.34296 0.284221,-0.53055 0.221692,-0.18948 0.551388,-0.18948 0.227376,0 0.418752,0.0985 0.191375,0.0966 0.291799,0.26528 0.10232,0.16863 0.10232,0.35811 0,0.18001 -0.09664,0.3278 -0.09663,0.1478 -0.286116,0.23496 0.246325,0.0568 0.382751,0.23685 0.136426,0.17811 0.136426,0.44718 0,0.3638 -0.265273,0.6177 -0.265272,0.25201 -0.670761,0.25201 -0.365697,0 -0.608232,-0.2179 -0.24064,-0.2179 -0.274747,-0.56465 z"
         style="font-family:sans-serif;-inkscape-font-specification:sans-serif"
         id="path167325" />
    </g>
    <g
       aria-label="500"
       id="text2046"
       style="font-size:3.175px;line-height:100%;font-family:Sans;-inkscape-font-specification:Sans;letter-spacing:0px;word-spacing:0px;stroke:#000000;stroke-width:0">
      <path
         d="m -20.952221,206.59127 0.293005,-0.0248 q 0.03256,0.21394 0.150379,0.32246 0.119372,0.10697 0.286804,0.10697 0.201538,0 0.341065,-0.15193 0.139526,-0.15193 0.139526,-0.40308 0,-0.23874 -0.134876,-0.37672 -0.133325,-0.13797 -0.350366,-0.13797 -0.134875,0 -0.243396,0.062 -0.10852,0.0605 -0.170532,0.15813 l -0.262,-0.0341 0.220142,-1.16737 h 1.130164 v 0.26665 h -0.906922 l -0.122473,0.61082 q 0.204639,-0.14263 0.429431,-0.14263 0.297656,0 0.502295,0.20619 0.204639,0.20619 0.204639,0.5302 0,0.30851 -0.179834,0.5333 -0.218591,0.27595 -0.596863,0.27595 -0.310059,0 -0.506946,-0.17363 -0.195337,-0.17363 -0.223242,-0.46044 z"
         style="font-family:sans-serif;-inkscape-font-specification:sans-serif"
         id="path167328" />
      <path
         d="m -19.186437,206.06572 q 0,-0.40307 0.08216,-0.64802 0.08372,-0.2465 0.246497,-0.37982 0.164331,-0.13333 0.412378,-0.13333 0.182934,0 0.32091,0.0744 0.137976,0.0729 0.227893,0.21239 0.08992,0.13797 0.141077,0.33796 0.05116,0.19844 0.05116,0.5364 0,0.39998 -0.08217,0.64647 -0.08216,0.24495 -0.246496,0.37983 -0.162781,0.13332 -0.412378,0.13332 -0.328662,0 -0.516248,-0.23564 -0.224792,-0.28371 -0.224792,-0.92398 z m 0.286804,0 q 0,0.55966 0.130225,0.74569 0.131774,0.18449 0.324011,0.18449 0.192236,0 0.322461,-0.18604 0.131775,-0.18603 0.131775,-0.74414 0,-0.5612 -0.131775,-0.74569 -0.130225,-0.18448 -0.325562,-0.18448 -0.192236,0 -0.306958,0.16278 -0.144177,0.20774 -0.144177,0.76739 z"
         style="font-family:sans-serif;-inkscape-font-specification:sans-serif"
         id="path167330" />
      <path
         d="m -17.420654,206.06572 q 0,-0.40307 0.08217,-0.64802 0.08372,-0.2465 0.246497,-0.37982 0.164331,-0.13333 0.412377,-0.13333 0.182935,0 0.320911,0.0744 0.137976,0.0729 0.227893,0.21239 0.08992,0.13797 0.141077,0.33796 0.05116,0.19844 0.05116,0.5364 0,0.39998 -0.08216,0.64647 -0.08217,0.24495 -0.246497,0.37983 -0.16278,0.13332 -0.412378,0.13332 -0.328662,0 -0.516247,-0.23564 -0.224793,-0.28371 -0.224793,-0.92398 z m 0.286805,0 q 0,0.55966 0.130224,0.74569 0.131775,0.18449 0.324011,0.18449 0.192237,0 0.322461,-0.18604 0.131775,-0.18603 0.131775,-0.74414 0,-0.5612 -0.131775,-0.74569 -0.130224,-0.18448 -0.325561,-0.18448 -0.192236,0 -0.306958,0.16278 -0.144177,0.20774 -0.144177,0.76739 z"
         style="font-family:sans-serif;-inkscape-font-specification:sans-serif"
         id="path167332" />
    </g>
    <path
       id="path2048"
       style="fill:#000000;fill-opacity:1;stroke:none;stroke-width:1.04298;stroke-linecap:butt;stroke-linejoin:miter;stroke-miterlimit:4;stroke-dasharray:none;stroke-opacity:1"
       d="m -11.93859,193.90454 h 0.89999 m 0,0 c 0,-0.49703 -0.40293,-0.89996 -0.89999,-0.89996 -0.49702,0 -0.90001,0.40293 -0.90001,0.89996 0,0.49703 0.40293,0.89997 0.89995,0.89997 0.49706,0 0.90005,-0.40294 0.90005,-0.89997 z" />
    <path
       id="path2050"
       style="fill:#000000;fill-opacity:1;stroke:none;stroke-width:1.04298;stroke-linecap:butt;stroke-linejoin:miter;stroke-miterlimit:4;stroke-dasharray:none;stroke-opacity:1"
       d="m 28.06141,183.90454 h 0.89999 m 0,0 c 0,-0.49703 -0.40293,-0.89996 -0.89999,-0.89996 -0.49702,0 -0.90001,0.40293 -0.90001,0.89996 0,0.49703 0.40293,0.89997 0.89995,0.89997 0.49706,0 0.90005,-0.40294 0.90005,-0.89997 z" />
    <path
       id="path2052"
       style="fill:#000000;fill-opacity:1;stroke:none;stroke-width:1.04298;stroke-linecap:butt;stroke-linejoin:miter;stroke-miterlimit:4;stroke-dasharray:none;stroke-opacity:1"
       d="m 28.06142,227.90454 h 0.89999 m 0,0 c 0,-0.49703 -0.40293,-0.89996 -0.89999,-0.89996 -0.49702,0 -0.90001,0.40293 -0.90001,0.89996 0,0.49703 0.40293,0.89997 0.89995,0.89997 0.49706,0 0.90005,-0.40294 0.90005,-0.89997 z" />
    <path
       style="fill:none;stroke:#000000;stroke-width:0.4;stroke-linecap:butt;stroke-linejoin:miter;stroke-dasharray:none;stroke-opacity:1"
       d="m 42.06141,183.90454 h -14"
       id="path2054" />
    <g
       aria-label="T4"
       id="text2058"
       style="font-size:3.88056px;line-height:100%;font-family:Sans;-inkscape-font-specification:Sans;letter-spacing:0px;word-spacing:0px;stroke:#000000;stroke-width:0">
      <path
         d="m 5.9766188,164.68231 v -2.44998 H 5.0614282 v -0.3278 h 2.201763 v 0.3278 H 6.344211 v 2.44998 z"
         style="font-family:sans-serif;-inkscape-font-specification:sans-serif"
         id="path167340" />
      <path
         d="m 8.5952389,164.68231 v -0.66507 H 7.3901432 v -0.31265 l 1.2676243,-1.80006 h 0.2785363 v 1.80006 h 0.3751713 v 0.31265 H 8.9363038 v 0.66507 z m 0,-0.97772 v -1.25246 l -0.8697153,1.25246 z"
         style="font-family:sans-serif;-inkscape-font-specification:sans-serif"
         id="path167342" />
    </g>
    <g
       aria-label="T5"
       id="text2062"
       style="font-size:3.88056px;line-height:100%;font-family:Sans;-inkscape-font-specification:Sans;letter-spacing:0px;word-spacing:0px;stroke:#000000;stroke-width:0">
      <path
         d="m 30.976619,174.68231 v -2.44998 h -0.91519 v -0.3278 h 2.201763 v 0.3278 h -0.918981 v 2.44998 z"
         style="font-family:sans-serif;-inkscape-font-specification:sans-serif"
         id="path167388" />
      <path
         d="m 32.501937,173.95471 0.358118,-0.0303 q 0.03979,0.26148 0.183796,0.39412 0.1459,0.13074 0.350539,0.13074 0.246325,0 0.416857,-0.18569 0.170533,-0.18569 0.170533,-0.49265 0,-0.2918 -0.164848,-0.46044 -0.162954,-0.16863 -0.428226,-0.16863 -0.164848,0 -0.297485,0.0758 -0.132636,0.0739 -0.208428,0.19327 l -0.320222,-0.0417 0.269062,-1.42679 h 1.381313 v 0.32591 h -1.108461 l -0.14969,0.74655 q 0.250115,-0.17432 0.524861,-0.17432 0.363803,0 0.613917,0.25201 0.250114,0.25201 0.250114,0.64802 0,0.37707 -0.219797,0.65182 -0.267168,0.33727 -0.7295,0.33727 -0.378961,0 -0.619601,-0.21222 -0.238745,-0.21221 -0.272852,-0.56275 z"
         style="font-family:sans-serif;-inkscape-font-specification:sans-serif"
         id="path167390" />
    </g>
    <g
       aria-label="2.8k"
       id="text2066"
       style="font-size:3.175px;line-height:100%;font-family:Sans;-inkscape-font-specification:Sans;letter-spacing:0px;word-spacing:0px;stroke:#000000;stroke-width:0">
      <path
         d="m -40.328997,151.91838 v 0.2682 h -1.502234 q -0.0031,-0.10076 0.03256,-0.19378 0.05736,-0.15348 0.182935,-0.30231 0.127124,-0.14883 0.365869,-0.34416 0.37052,-0.30386 0.500745,-0.4806 0.130224,-0.17828 0.130224,-0.33641 0,-0.16588 -0.119372,-0.27905 -0.117823,-0.11472 -0.308509,-0.11472 -0.201538,0 -0.322461,0.12092 -0.120922,0.12092 -0.122473,0.33486 l -0.286804,-0.0294 q 0.02946,-0.32091 0.221692,-0.48834 0.192236,-0.16899 0.516247,-0.16899 0.327112,0 0.517798,0.18139 0.190686,0.18138 0.190686,0.44958 0,0.13643 -0.05581,0.2682 -0.05581,0.13178 -0.186035,0.27751 -0.128675,0.14572 -0.429431,0.39997 -0.251148,0.21084 -0.322461,0.28681 -0.07131,0.0744 -0.117823,0.15037 z"
         style="font-family:sans-serif;-inkscape-font-specification:sans-serif"
         id="path167293" />
      <path
         d="m -39.873211,152.18658 v -0.31781 h 0.31781 v 0.31781 z"
         style="font-family:sans-serif;-inkscape-font-specification:sans-serif"
         id="path167295" />
      <path
         d="m -38.718243,150.9541 q -0.173633,-0.0636 -0.257348,-0.18138 -0.08372,-0.11782 -0.08372,-0.28216 0,-0.24804 0.178284,-0.41702 0.178283,-0.16899 0.474389,-0.16899 0.297656,0 0.479041,0.17364 0.181384,0.17208 0.181384,0.42013 0,0.15813 -0.08372,0.27595 -0.08216,0.11627 -0.251147,0.17983 0.209289,0.0682 0.31781,0.22014 0.110071,0.15193 0.110071,0.36277 0,0.29146 -0.206189,0.48989 -0.206189,0.19844 -0.542603,0.19844 -0.336414,0 -0.542602,-0.19844 -0.206189,-0.19998 -0.206189,-0.49764 0,-0.22169 0.111621,-0.37052 0.113171,-0.15038 0.32091,-0.20464 z m -0.05581,-0.47284 q 0,0.16123 0.103869,0.26355 0.10387,0.10232 0.269751,0.10232 0.161231,0 0.26355,-0.10077 0.10387,-0.10232 0.10387,-0.24959 0,-0.15348 -0.10697,-0.25735 -0.10542,-0.10542 -0.26355,-0.10542 -0.15968,0 -0.2651,0.10232 -0.10542,0.10232 -0.10542,0.24494 z m -0.08992,1.04955 q 0,0.11937 0.05581,0.23099 0.05736,0.11163 0.168982,0.17364 0.111621,0.0605 0.240296,0.0605 0.199987,0 0.330212,-0.12868 0.130225,-0.12867 0.130225,-0.32711 0,-0.20154 -0.134876,-0.33331 -0.133325,-0.13178 -0.334863,-0.13178 -0.196887,0 -0.327112,0.13023 -0.128674,0.13022 -0.128674,0.32556 z"
         style="font-family:sans-serif;-inkscape-font-specification:sans-serif"
         id="path167297" />
      <path
         d="m -37.302825,152.18658 v -2.27272 h 0.279052 v 1.29604 l 0.660425,-0.66973 h 0.361218 l -0.629419,0.61082 0.692981,1.03559 h -0.344165 l -0.544152,-0.8418 -0.196888,0.18913 v 0.65267 z"
         style="font-family:sans-serif;-inkscape-font-specification:sans-serif"
         id="path167299" />
    </g>
    <path
       id="path2068"
       style="fill:none;fill-opacity:0.5;stroke:#000000;stroke-width:0.5;stroke-linecap:round;stroke-linejoin:round;stroke-dasharray:none"
       d="m -61.93858,187.90454 c 0.55228,0 1,0.44772 1,1 0,0.55228 -0.44772,1 -1,1 -0.55228,0 -1,-0.44772 -1,-1 0,-0.55228 0.44772,-1 1,-1 z" />
    <path
       id="path2070"
       style="fill:none;fill-opacity:0.5;stroke:#000000;stroke-width:0.5;stroke-linecap:round;stroke-linejoin:round;stroke-dasharray:none"
       d="m -61.93858,197.90454 c 0.55228,0 1,0.44772 1,1 0,0.55228 -0.44772,1 -1,1 -0.55228,0 -1,-0.44772 -1,-1 0,-0.55228 0.44772,-1 1,-1 z" />
    <g
       aria-label="R1"
       id="text2074"
       style="font-size:3.88056px;line-height:100%;font-family:Sans;-inkscape-font-specification:Sans;letter-spacing:0px;word-spacing:0px;stroke:#000000;stroke-width:0">
      <path
         d="m -39.881654,147.90454 v -2.77778 h 1.231623 q 0.371381,0 0.564651,0.0758 0.19327,0.0739 0.308854,0.26338 0.115583,0.18948 0.115583,0.41875 0,0.29559 -0.191376,0.49833 -0.191375,0.20275 -0.591179,0.2577 0.1459,0.0701 0.221692,0.13832 0.161059,0.14779 0.305064,0.36948 l 0.483175,0.75603 h -0.462332 l -0.367592,-0.57791 q -0.161059,-0.25012 -0.265273,-0.38275 -0.104214,-0.13264 -0.187586,-0.1857 -0.08148,-0.0531 -0.166742,-0.0739 -0.06253,-0.0133 -0.204639,-0.0133 h -0.426331 v 1.23352 z m 0.367592,-1.55184 h 0.790133 q 0.252009,0 0.39412,-0.0512 0.14211,-0.0531 0.216007,-0.16675 0.0739,-0.11558 0.0739,-0.25011 0,-0.19706 -0.144005,-0.32401 -0.142111,-0.12695 -0.450964,-0.12695 h -0.879189 z"
         style="font-family:sans-serif;-inkscape-font-specification:sans-serif"
         id="path167288" />
      <path
         d="m -35.938566,147.90454 h -0.341065 v -2.17334 q -0.123162,0.11748 -0.324011,0.23496 -0.198955,0.11747 -0.358118,0.17621 v -0.32969 q 0.286115,-0.13453 0.500228,-0.32591 0.214113,-0.19137 0.303169,-0.37138 h 0.219797 z"
         style="font-family:sans-serif;-inkscape-font-specification:sans-serif"
         id="path167290" />
    </g>
    <g
       aria-label="A"
       id="text2078"
       style="font-size:3.88056px;line-height:100%;font-family:Sans;-inkscape-font-specification:Sans;letter-spacing:0px;word-spacing:0px;stroke:#000000;stroke-width:0">
      <path
         d="m -67.538262,190.29343 1.066775,-2.77779 h 0.396014 l 1.136883,2.77779 h -0.418752 l -0.324011,-0.8413 h -1.161516 l -0.305063,0.8413 z m 0.801502,-1.14068 h 0.941718 l -0.289905,-0.76929 q -0.132636,-0.35054 -0.197059,-0.57602 -0.05306,0.26717 -0.14969,0.53055 z"
         style="font-family:sans-serif;-inkscape-font-specification:sans-serif"
         id="path167307" />
    </g>
    <g
       aria-label="B"
       id="text2082"
       style="font-size:3.88056px;line-height:100%;font-family:Sans;-inkscape-font-specification:Sans;letter-spacing:0px;word-spacing:0px;stroke:#000000;stroke-width:0">
      <path
         d="m -67.036138,200.29343 v -2.77779 h 1.042143 q 0.318327,0 0.509702,0.0853 0.193271,0.0834 0.301274,0.25959 0.109899,0.17432 0.109899,0.36569 0,0.17812 -0.09663,0.33539 -0.09664,0.15726 -0.2918,0.2539 0.252009,0.0739 0.38654,0.25201 0.136426,0.17811 0.136426,0.42064 0,0.19517 -0.08337,0.36381 -0.08148,0.16674 -0.202744,0.25769 -0.121268,0.0909 -0.305064,0.13832 -0.181901,0.0455 -0.447174,0.0455 z m 0.367593,-1.61059 h 0.600653 q 0.244429,0 0.350538,-0.0322 0.140216,-0.0417 0.210324,-0.13832 0.072,-0.0966 0.072,-0.24253 0,-0.13833 -0.06632,-0.24254 -0.06632,-0.10611 -0.18948,-0.144 -0.123163,-0.0398 -0.422542,-0.0398 h -0.555177 z m 0,1.28279 h 0.691603 q 0.178112,0 0.250114,-0.0133 0.126952,-0.0227 0.212219,-0.0758 0.08527,-0.0531 0.140215,-0.15348 0.05495,-0.10232 0.05495,-0.23496 0,-0.15537 -0.07958,-0.26906 -0.07958,-0.11558 -0.221693,-0.16106 -0.140215,-0.0474 -0.405488,-0.0474 h -0.642338 z"
         style="font-family:sans-serif;-inkscape-font-specification:sans-serif"
         id="path167310" />
    </g>
    <path
       id="path2084"
       style="fill:#000000;fill-opacity:1;stroke:none;stroke-width:1.04298;stroke-linecap:butt;stroke-linejoin:miter;stroke-miterlimit:4;stroke-dasharray:none;stroke-opacity:1"
       d="m -46.93858,188.90454 h 0.89999 m 0,0 c 0,-0.49703 -0.40293,-0.89996 -0.89999,-0.89996 -0.49702,0 -0.90001,0.40293 -0.90001,0.89996 0,0.49703 0.40293,0.89997 0.89995,0.89997 0.49706,0 0.90005,-0.40294 0.90005,-0.89997 z" />
    <g
       aria-label="T1"
       id="text2102"
       style="font-size:3.88056px;line-height:100%;font-family:Sans;-inkscape-font-specification:Sans;letter-spacing:0px;word-spacing:0px;stroke:#000000;stroke-width:0">
      <path
         d="m -37.74857,177.90454 v -2.44998 h -0.915191 v -0.3278 h 2.201763 v 0.3278 h -0.91898 v 2.44998 z"
         style="font-family:sans-serif;-inkscape-font-specification:sans-serif"
         id="path167302" />
      <path
         d="m -34.938575,177.90454 h -0.341064 v -2.17334 q -0.123163,0.11748 -0.324012,0.23496 -0.198954,0.11747 -0.358118,0.17621 v -0.32969 q 0.286115,-0.13453 0.500228,-0.32591 0.214113,-0.19137 0.303169,-0.37138 h 0.219797 z"
         style="font-family:sans-serif;-inkscape-font-specification:sans-serif"
         id="path167304" />
    </g>
    <g
       aria-label="T2"
       id="text2106"
       style="font-size:3.88056px;line-height:100%;font-family:Sans;-inkscape-font-specification:Sans;letter-spacing:0px;word-spacing:0px;stroke:#000000;stroke-width:0">
      <path
         d="m -9.0233807,184.6937 v -2.44999 h -0.9151906 v -0.3278 h 2.201763 v 0.3278 h -0.9189803 v 2.44999 z"
         style="font-family:sans-serif;-inkscape-font-specification:sans-serif"
         id="path167335" />
      <path
         d="m -5.7055777,184.36589 v 0.32781 h -1.8360657 q -0.00379,-0.12317 0.039791,-0.23686 0.070108,-0.18758 0.223587,-0.36948 0.1553739,-0.1819 0.4471739,-0.42065 0.4528583,-0.37138 0.6120219,-0.58739 0.1591635,-0.2179 0.1591635,-0.41117 0,-0.20275 -0.1458999,-0.34107 -0.1440052,-0.14021 -0.3770661,-0.14021 -0.2463246,0 -0.3941194,0.14779 -0.1477948,0.1478 -0.1496896,0.40928 l -0.3505388,-0.036 q 0.036001,-0.39222 0.270957,-0.59686 0.2349558,-0.20654 0.63097,-0.20654 0.3998038,0 0.6328647,0.22169 0.233061,0.2217 0.233061,0.5495 0,0.16674 -0.068213,0.3278 -0.068213,0.16106 -0.2273765,0.33917 -0.1572688,0.17811 -0.5248609,0.48886 -0.3069584,0.25769 -0.3941194,0.35054 -0.087161,0.091 -0.1440051,0.18379 z"
         style="font-family:sans-serif;-inkscape-font-specification:sans-serif"
         id="path167337" />
    </g>
    <path
       style="fill:none;stroke:#000000;stroke-width:0.4;stroke-linecap:butt;stroke-linejoin:miter;stroke-dasharray:none;stroke-opacity:1"
       d="m -29.93858,179.90454 3,4 h 11"
       id="path2112" />
    <path
       style="fill:none;stroke:#000000;stroke-width:0.4;stroke-linecap:butt;stroke-linejoin:miter;stroke-dasharray:none;stroke-opacity:1"
       d="m -35.93858,179.90454 -3,4 v 5 h -22"
       id="path2114" />
    <path
       style="fill:#000000;fill-opacity:1;stroke:none;stroke-width:0.264583px;stroke-linecap:butt;stroke-linejoin:miter;stroke-opacity:1"
       d="m -38.76799,182.00905 1.60083,1.19889 -1.87963,0.8416 z"
       id="path2116" />
    <path
       id="path2122"
       style="fill:#000000;fill-opacity:1;stroke:none;stroke-width:1.04298;stroke-linecap:butt;stroke-linejoin:miter;stroke-miterlimit:4;stroke-dasharray:none;stroke-opacity:1"
       d="m -11.93858,138.90454 h 0.89999 m 0,0 c 0,-0.49703 -0.40293,-0.89996 -0.89999,-0.89996 -0.49702,0 -0.90001,0.40293 -0.90001,0.89996 0,0.49703 0.40293,0.89997 0.89995,0.89997 0.49706,0 0.90005,-0.40294 0.90005,-0.89997 z" />
    <path
       style="fill:none;stroke:#000000;stroke-width:0.4;stroke-linecap:butt;stroke-linejoin:miter;stroke-dasharray:none;stroke-opacity:1"
       d="m 28.06143,138.90454 h -60.00001 v 41"
       id="path2124" />
    <path
       id="path2126"
       d="m -30.43858,152.90454 h -3 v -9 h 3 z"
       style="fill:#ffffff;fill-opacity:1;stroke:#000000;stroke-width:0.5;stroke-linecap:butt;stroke-linejoin:miter;stroke-miterlimit:4;stroke-dasharray:none;stroke-opacity:1" />
    <g
       aria-label="900"
       id="text2130"
       style="font-size:3.175px;line-height:100%;font-family:Sans;-inkscape-font-specification:Sans;letter-spacing:0px;word-spacing:0px;stroke:#000000;stroke-width:0">
      <path
         d="m -20.910363,151.66104 0.268201,-0.0248 q 0.03411,0.18914 0.130224,0.2744 0.09612,0.0853 0.246497,0.0853 0.128674,0 0.224792,-0.0589 0.09767,-0.0589 0.159681,-0.15658 0.06201,-0.0992 0.103869,-0.26665 0.04186,-0.16743 0.04186,-0.34107 0,-0.0186 -0.0016,-0.0558 -0.08372,0.13333 -0.229444,0.21704 -0.144177,0.0822 -0.313159,0.0822 -0.282153,0 -0.47749,-0.20464 -0.195337,-0.20464 -0.195337,-0.5395 0,-0.34572 0.203088,-0.55656 0.204639,-0.21084 0.511597,-0.21084 0.221692,0 0.404627,0.11938 0.184484,0.11937 0.279052,0.34106 0.09612,0.22014 0.09612,0.63872 0,0.43563 -0.09457,0.69453 -0.09457,0.25735 -0.282154,0.39223 -0.186035,0.13487 -0.437182,0.13487 -0.266651,0 -0.435633,-0.14728 -0.168982,-0.14882 -0.203088,-0.41702 z m 1.142566,-1.00304 q 0,-0.2403 -0.128674,-0.38138 -0.127124,-0.14107 -0.306958,-0.14107 -0.186036,0 -0.324012,0.15193 -0.137976,0.15192 -0.137976,0.39377 0,0.21704 0.130225,0.35347 0.131775,0.13487 0.324011,0.13487 0.193787,0 0.31781,-0.13487 0.125574,-0.13643 0.125574,-0.37672 z"
         style="font-family:sans-serif;-inkscape-font-specification:sans-serif"
         id="path167281" />
      <path
         d="m -19.186437,151.06572 q 0,-0.40307 0.08216,-0.64802 0.08372,-0.2465 0.246497,-0.37982 0.164331,-0.13333 0.412378,-0.13333 0.182934,0 0.32091,0.0744 0.137976,0.0729 0.227893,0.21239 0.08992,0.13797 0.141077,0.33796 0.05116,0.19844 0.05116,0.5364 0,0.39998 -0.08217,0.64647 -0.08216,0.24495 -0.246496,0.37983 -0.162781,0.13332 -0.412378,0.13332 -0.328662,0 -0.516248,-0.23564 -0.224792,-0.28371 -0.224792,-0.92398 z m 0.286804,0 q 0,0.55966 0.130225,0.74569 0.131774,0.18449 0.324011,0.18449 0.192236,0 0.322461,-0.18604 0.131775,-0.18603 0.131775,-0.74414 0,-0.5612 -0.131775,-0.74569 -0.130225,-0.18448 -0.325562,-0.18448 -0.192236,0 -0.306958,0.16278 -0.144177,0.20774 -0.144177,0.76739 z"
         style="font-family:sans-serif;-inkscape-font-specification:sans-serif"
         id="path167283" />
      <path
         d="m -17.420654,151.06572 q 0,-0.40307 0.08217,-0.64802 0.08372,-0.2465 0.246497,-0.37982 0.164331,-0.13333 0.412377,-0.13333 0.182935,0 0.320911,0.0744 0.137976,0.0729 0.227893,0.21239 0.08992,0.13797 0.141077,0.33796 0.05116,0.19844 0.05116,0.5364 0,0.39998 -0.08216,0.64647 -0.08217,0.24495 -0.246497,0.37983 -0.16278,0.13332 -0.412378,0.13332 -0.328662,0 -0.516247,-0.23564 -0.224793,-0.28371 -0.224793,-0.92398 z m 0.286805,0 q 0,0.55966 0.130224,0.74569 0.131775,0.18449 0.324011,0.18449 0.192237,0 0.322461,-0.18604 0.131775,-0.18603 0.131775,-0.74414 0,-0.5612 -0.131775,-0.74569 -0.130224,-0.18448 -0.325561,-0.18448 -0.192236,0 -0.306958,0.16278 -0.144177,0.20774 -0.144177,0.76739 z"
         style="font-family:sans-serif;-inkscape-font-specification:sans-serif"
         id="path167285" />
    </g>
    <path
       style="fill:#000000;fill-opacity:1;stroke:none;stroke-width:0.264583px;stroke-linecap:butt;stroke-linejoin:miter;stroke-opacity:1"
       d="m 35.06142,131.90454 c -2,0 -3,1 -4,2 1,1 2,2 4,2 h 17 v -4 z"
       id="path4025" />
    <path
       style="fill:#000000;fill-opacity:0.25;stroke:none;stroke-width:0.264583px;stroke-linecap:butt;stroke-linejoin:miter;stroke-opacity:1"
       d="m 34.06142,132.90454 1,-1 h 16 v 4 h -16 l -1,-1 z"
       id="path4027" />
    <g
       aria-label="4.75-5.25V"
       id="text4031"
       style="font-size:3.175px;line-height:100%;font-family:Sans;-inkscape-font-specification:Sans;letter-spacing:0px;word-spacing:0px;fill:#ffffff;stroke:#000000;stroke-width:0">
      <path
         d="m 35.755647,135.02618 v -0.45733 h -0.930176 v -0.38137 l 0.985986,-1.44333 h 0.365869 v 1.44178 h 0.282153 v 0.38292 h -0.282153 v 0.45733 z m 0,-0.84025 v -0.7767 l -0.522449,0.7767 z"
         style="font-weight:bold;font-family:sans-serif;-inkscape-font-specification:'sans-serif Bold'"
         id="path167236" />
      <path
         d="m 36.760236,135.02618 v -0.43563 h 0.435633 v 0.43563 z"
         style="font-weight:bold;font-family:sans-serif;-inkscape-font-specification:'sans-serif Bold'"
         id="path167238" />
      <path
         d="m 37.549335,133.18909 v -0.40463 h 1.489832 v 0.31626 q -0.184485,0.18138 -0.375171,0.5209 -0.190686,0.33951 -0.291455,0.72244 -0.09922,0.38137 -0.09767,0.68212 h -0.42013 q 0.01085,-0.47128 0.193787,-0.96118 0.184485,-0.48989 0.491443,-0.87591 z"
         style="font-weight:bold;font-family:sans-serif;-inkscape-font-specification:'sans-serif Bold'"
         id="path167240" />
      <path
         d="m 39.32132,134.44172 0.434082,-0.045 q 0.0186,0.14727 0.110071,0.23409 0.09147,0.0853 0.21084,0.0853 0.136426,0 0.230993,-0.11008 0.09457,-0.11162 0.09457,-0.33486 0,-0.20929 -0.09457,-0.31316 -0.09302,-0.10542 -0.243396,-0.10542 -0.187585,0 -0.336413,0.16588 l -0.353467,-0.0512 0.223242,-1.18287 h 1.151868 v 0.40773 h -0.821655 l -0.06821,0.38602 q 0.145727,-0.0729 0.297656,-0.0729 0.289905,0 0.491443,0.21084 0.201538,0.21084 0.201538,0.54725 0,0.2806 -0.162781,0.50074 -0.221692,0.30076 -0.615466,0.30076 -0.31471,0 -0.513147,-0.16898 -0.198438,-0.16898 -0.237195,-0.45424 z"
         style="font-weight:bold;font-family:sans-serif;-inkscape-font-specification:'sans-serif Bold'"
         id="path167242" />
      <path
         d="m 41.124311,134.42002 v -0.43563 h 0.855762 v 0.43563 z"
         style="font-weight:bold;font-family:sans-serif;-inkscape-font-specification:'sans-serif Bold'"
         id="path167244" />
      <path
         d="m 42.144404,134.44172 0.434082,-0.045 q 0.0186,0.14727 0.11007,0.23409 0.09147,0.0853 0.21084,0.0853 0.136426,0 0.230994,-0.11008 0.09457,-0.11162 0.09457,-0.33486 0,-0.20929 -0.09457,-0.31316 -0.09302,-0.10542 -0.243396,-0.10542 -0.187586,0 -0.336414,0.16588 l -0.353466,-0.0512 0.223242,-1.18287 h 1.151867 v 0.40773 h -0.821655 l -0.06821,0.38602 q 0.145728,-0.0729 0.297656,-0.0729 0.289905,0 0.491443,0.21084 0.201538,0.21084 0.201538,0.54725 0,0.2806 -0.16278,0.50074 -0.221692,0.30076 -0.615467,0.30076 -0.314709,0 -0.513147,-0.16898 -0.198437,-0.16898 -0.237194,-0.45424 z"
         style="font-weight:bold;font-family:sans-serif;-inkscape-font-specification:'sans-serif Bold'"
         id="path167246" />
      <path
         d="m 43.997004,135.02618 v -0.43563 h 0.435632 v 0.43563 z"
         style="font-weight:bold;font-family:sans-serif;-inkscape-font-specification:'sans-serif Bold'"
         id="path167248" />
      <path
         d="m 46.25733,134.62156 v 0.40462 h -1.527038 q 0.02481,-0.22944 0.148828,-0.43408 0.124023,-0.20619 0.489893,-0.5457 0.294555,-0.2744 0.361218,-0.37207 0.08992,-0.13488 0.08992,-0.26665 0,-0.14573 -0.07906,-0.22324 -0.07752,-0.0791 -0.215491,-0.0791 -0.136426,0 -0.217041,0.0822 -0.08062,0.0822 -0.09302,0.27285 l -0.434082,-0.0434 q 0.03876,-0.35967 0.243396,-0.51625 0.204638,-0.15658 0.511596,-0.15658 0.336414,0 0.52865,0.18139 0.192236,0.18138 0.192236,0.45113 0,0.15348 -0.05581,0.29301 -0.05426,0.13797 -0.173633,0.2899 -0.07906,0.10077 -0.285254,0.28991 -0.206189,0.18913 -0.261999,0.25114 -0.05426,0.062 -0.08837,0.12093 z"
         style="font-weight:bold;font-family:sans-serif;-inkscape-font-specification:'sans-serif Bold'"
         id="path167250" />
      <path
         d="m 46.558088,134.44172 0.434082,-0.045 q 0.0186,0.14727 0.110071,0.23409 0.09147,0.0853 0.21084,0.0853 0.136425,0 0.230993,-0.11008 0.09457,-0.11162 0.09457,-0.33486 0,-0.20929 -0.09457,-0.31316 -0.09302,-0.10542 -0.243396,-0.10542 -0.187585,0 -0.336413,0.16588 l -0.353467,-0.0512 0.223242,-1.18287 h 1.151868 v 0.40773 h -0.821656 l -0.06821,0.38602 q 0.145727,-0.0729 0.297656,-0.0729 0.289905,0 0.491443,0.21084 0.201538,0.21084 0.201538,0.54725 0,0.2806 -0.162781,0.50074 -0.221692,0.30076 -0.615466,0.30076 -0.31471,0 -0.513147,-0.16898 -0.198438,-0.16898 -0.237195,-0.45424 z"
         style="font-weight:bold;font-family:sans-serif;-inkscape-font-specification:'sans-serif Bold'"
         id="path167252" />
      <path
         d="m 48.993598,135.02618 -0.812354,-2.27273 h 0.497644 l 0.575159,1.68207 0.556555,-1.68207 h 0.486792 l -0.813904,2.27273 z"
         style="font-weight:bold;font-family:sans-serif;-inkscape-font-specification:'sans-serif Bold'"
         id="path167254" />
    </g>
    <path
       style="fill:none;stroke:#000000;stroke-width:0.4;stroke-linecap:butt;stroke-linejoin:miter;stroke-dasharray:none;stroke-opacity:1"
       d="m -33.93858,179.90454 -3,4 v 15 h -24"
       id="path7542" />
    <path
       style="fill:#000000;fill-opacity:1;stroke:none;stroke-width:0.264583px;stroke-linecap:butt;stroke-linejoin:miter;stroke-opacity:1"
       d="m -36.76799,182.00905 1.60083,1.19889 -1.87963,0.8416 z"
       id="path7545" />
    <path
       style="fill:none;stroke:#000000;stroke-width:0.4;stroke-linecap:butt;stroke-linejoin:miter;stroke-dasharray:none;stroke-opacity:1"
       d="m -15.93859,181.90454 4,-3 10e-6,-40"
       id="path10943" />
    <path
       style="fill:none;stroke:#000000;stroke-width:0.4;stroke-linecap:butt;stroke-linejoin:miter;stroke-dasharray:none;stroke-opacity:1"
       d="m -15.93859,185.90454 4,3 10e-6,29 h 6"
       id="path10945" />
    <path
       style="fill:#000000;fill-opacity:1;stroke:none;stroke-width:0.264583px;stroke-linecap:butt;stroke-linejoin:miter;stroke-opacity:1"
       d="m -13.83408,188.73395 1.19889,-1.60083 0.8416,1.87963 z"
       id="path10947" />
    <path
       style="fill:none;stroke:#000000;stroke-width:0.4;stroke-linecap:butt;stroke-linejoin:miter;stroke-dasharray:none;stroke-opacity:1"
       d="m -5.93857,215.90454 4,-3 -1e-5,-19"
       id="path12655" />
    <path
       style="fill:none;stroke:#000000;stroke-width:0.4;stroke-linecap:butt;stroke-linejoin:miter;stroke-dasharray:none;stroke-opacity:1"
       d="m -5.93857,219.90454 4,3 -1e-5,5"
       id="path12657" />
    <path
       style="fill:#000000;fill-opacity:1;stroke:none;stroke-width:0.264583px;stroke-linecap:butt;stroke-linejoin:miter;stroke-opacity:1"
       d="m -3.83406,222.73395 1.19889,-1.60083 0.8416,1.87963 z"
       id="path12659" />
    <g
       aria-label="T6"
       id="text12663"
       style="font-size:3.88056px;line-height:100%;font-family:Sans;-inkscape-font-specification:Sans;letter-spacing:0px;word-spacing:0px;stroke:#000000;stroke-width:0">
      <path
         d="m 30.976619,194.6937 v -2.44999 h -0.91519 v -0.3278 h 2.201763 v 0.3278 h -0.918981 v 2.44999 z"
         style="font-family:sans-serif;-inkscape-font-specification:sans-serif"
         id="path167383" />
      <path
         d="m 34.271685,192.59615 -0.33917,0.0265 q -0.04548,-0.20085 -0.128847,-0.2918 -0.138321,-0.1459 -0.341065,-0.1459 -0.162953,0 -0.286115,0.091 -0.161059,0.11748 -0.253904,0.34296 -0.09285,0.22549 -0.09663,0.64234 0.123162,-0.18758 0.301274,-0.27853 0.178111,-0.0909 0.373276,-0.0909 0.341065,0 0.57981,0.252 0.240641,0.25012 0.240641,0.64803 0,0.26148 -0.113689,0.48696 -0.111793,0.22359 -0.308853,0.34296 -0.19706,0.11938 -0.447174,0.11938 -0.426331,0 -0.695393,-0.31265 -0.269062,-0.31454 -0.269062,-1.03456 0,-0.80529 0.297484,-1.17099 0.259588,-0.31833 0.699183,-0.31833 0.327801,0 0.53623,0.1838 0.210323,0.18379 0.252009,0.50781 z m -1.392682,1.19751 q 0,0.17622 0.0739,0.33728 0.07579,0.16106 0.210323,0.24632 0.134531,0.0834 0.282326,0.0834 0.216008,0 0.371382,-0.17432 0.155374,-0.17432 0.155374,-0.4737 0,-0.28801 -0.15348,-0.45286 -0.153479,-0.16674 -0.38654,-0.16674 -0.231166,0 -0.392224,0.16674 -0.161059,0.16485 -0.161059,0.43391 z"
         style="font-family:sans-serif;-inkscape-font-specification:sans-serif"
         id="path167385" />
    </g>
    <path
       style="fill:none;stroke:#000000;stroke-width:0.3;stroke-linecap:butt;stroke-linejoin:miter;stroke-dasharray:none;stroke-opacity:1"
       d="M -5.93857,217.90454 H -6.93858"
       id="path12665" />
    <path
       id="path12667"
       style="fill:#000000;fill-opacity:1;stroke:none;stroke-width:1.04298;stroke-linecap:butt;stroke-linejoin:miter;stroke-miterlimit:4;stroke-dasharray:none;stroke-opacity:1"
       d="m 13.06142,227.90454 h 0.89999 m 0,0 c 0,-0.49703 -0.40293,-0.89996 -0.89999,-0.89996 -0.49702,0 -0.90001,0.40293 -0.90001,0.89996 0,0.49703 0.40293,0.89997 0.89995,0.89997 0.49706,0 0.90005,-0.40294 0.90005,-0.89997 z" />
    <path
       id="path12669"
       style="fill:#000000;fill-opacity:1;stroke:none;stroke-width:1.04298;stroke-linecap:butt;stroke-linejoin:miter;stroke-miterlimit:4;stroke-dasharray:none;stroke-opacity:1"
       d="m -11.93858,163.90454 h 0.89999 m 0,0 c 0,-0.49703 -0.40293,-0.89996 -0.89999,-0.89996 -0.49702,0 -0.90001,0.40293 -0.90001,0.89996 0,0.49703 0.40293,0.89997 0.89995,0.89997 0.49706,0 0.90005,-0.40294 0.90005,-0.89997 z" />
    <path
       id="path12671"
       style="fill:#000000;fill-opacity:1;stroke:none;stroke-width:1.04298;stroke-linecap:butt;stroke-linejoin:miter;stroke-miterlimit:4;stroke-dasharray:none;stroke-opacity:1"
       d="m 28.06142,158.90454 h 0.89999 m 0,0 c 0,-0.49703 -0.40293,-0.89996 -0.89999,-0.89996 -0.49702,0 -0.90001,0.40293 -0.90001,0.89996 0,0.49703 0.40293,0.89997 0.89995,0.89997 0.49706,0 0.90005,-0.40294 0.90005,-0.89997 z" />
    <g
       aria-label="D1"
       id="text12677"
       style="font-size:3.88056px;line-height:100%;font-family:Sans;-inkscape-font-specification:Sans;letter-spacing:0px;word-spacing:0px;stroke:#000000;stroke-width:0">
      <path
         d="m -55.887339,214.6937 v -2.77779 h 0.956876 q 0.324012,0 0.494545,0.0398 0.238745,0.0549 0.407383,0.19896 0.219797,0.18569 0.327801,0.47559 0.109898,0.28801 0.109898,0.65939 0,0.31644 -0.0739,0.56087 -0.0739,0.24443 -0.18948,0.40549 -0.115584,0.15916 -0.253904,0.252 -0.136426,0.0909 -0.331591,0.13832 -0.19327,0.0474 -0.445279,0.0474 z m 0.367592,-0.32781 h 0.593074 q 0.274747,0 0.430121,-0.0512 0.157269,-0.0512 0.250114,-0.144 0.130741,-0.13074 0.202744,-0.35054 0.0739,-0.22169 0.0739,-0.53623 0,-0.4358 -0.144005,-0.66887 -0.14211,-0.23495 -0.346749,-0.31453 -0.147795,-0.0568 -0.475596,-0.0568 h -0.5836 z"
         style="font-family:sans-serif;-inkscape-font-specification:sans-serif"
         id="path167313" />
      <path
         d="m -51.938566,214.6937 h -0.341065 v -2.17335 q -0.123162,0.11748 -0.324011,0.23496 -0.198955,0.11748 -0.358118,0.17622 v -0.3297 q 0.286115,-0.13453 0.500228,-0.32591 0.214113,-0.19137 0.303169,-0.37138 h 0.219797 z"
         style="font-family:sans-serif;-inkscape-font-specification:sans-serif"
         id="path167315" />
    </g>
    <path
       id="path12685"
       d="m -10.43858,152.90454 h -3 v -9 h 3 z"
       style="fill:#ffffff;fill-opacity:1;stroke:#000000;stroke-width:0.5;stroke-linecap:butt;stroke-linejoin:miter;stroke-miterlimit:4;stroke-dasharray:none;stroke-opacity:1" />
    <path
       id="path12687"
       d="m -10.43859,207.90454 h -3 v -9 h 3 z"
       style="fill:#ffffff;fill-opacity:1;stroke:#000000;stroke-width:0.5;stroke-linecap:butt;stroke-linejoin:miter;stroke-miterlimit:4;stroke-dasharray:none;stroke-opacity:1" />
    <path
       id="path14409"
       d="m -0.43858,207.90454 h -3 v -9 h 3 z"
       style="fill:#ffffff;fill-opacity:1;stroke:#000000;stroke-width:0.5;stroke-linecap:butt;stroke-linejoin:miter;stroke-miterlimit:4;stroke-dasharray:none;stroke-opacity:1" />
    <path
       id="path14411"
       d="m -39.93858,216.90454 h 6 l -3,-6 z"
       style="fill:none;stroke:#000000;stroke-width:0.5;stroke-linecap:butt;stroke-linejoin:miter;stroke-miterlimit:4;stroke-dasharray:none;stroke-opacity:1" />
    <path
       id="path14413"
       d="m -38.93858,209.90454 h -1 v 1 h 6 v 1 h -1"
       style="fill:none;stroke:#000000;stroke-width:0.5;stroke-linecap:butt;stroke-linejoin:miter;stroke-miterlimit:4;stroke-dasharray:none;stroke-opacity:1" />
    <path
       style="fill:none;stroke:#000000;stroke-width:0.4;stroke-linecap:butt;stroke-linejoin:miter;stroke-dasharray:none;stroke-opacity:1"
       d="m -36.93858,227.90454 v -29"
       id="path14415" />
    <path
       id="path14419"
       d="m -49.93858,216.90454 h 6 l -3,-6 z"
       style="fill:none;stroke:#000000;stroke-width:0.5;stroke-linecap:butt;stroke-linejoin:miter;stroke-miterlimit:4;stroke-dasharray:none;stroke-opacity:1" />
    <path
       id="path14421"
       d="m -48.93858,209.90454 h -1 v 1 h 6 v 1 h -1"
       style="fill:none;stroke:#000000;stroke-width:0.5;stroke-linecap:butt;stroke-linejoin:miter;stroke-miterlimit:4;stroke-dasharray:none;stroke-opacity:1" />
    <path
       style="fill:none;stroke:#000000;stroke-width:0.4;stroke-linecap:butt;stroke-linejoin:miter;stroke-dasharray:none;stroke-opacity:1"
       d="m -36.93858,227.90454 h -10 v -39"
       id="path14423" />
    <path
       style="fill:none;stroke:#000000;stroke-width:0.4;stroke-linecap:butt;stroke-linejoin:miter;stroke-dasharray:none;stroke-opacity:1"
       d="m 28.06142,227.90454 h -65"
       id="path14427" />
    <path
       id="path14429"
       style="fill:#000000;fill-opacity:1;stroke:none;stroke-width:1.04298;stroke-linecap:butt;stroke-linejoin:miter;stroke-miterlimit:4;stroke-dasharray:none;stroke-opacity:1"
       d="m -36.93858,198.90454 h 0.89999 m 0,0 c 0,-0.49703 -0.40293,-0.89996 -0.89999,-0.89996 -0.49702,0 -0.90001,0.40293 -0.90001,0.89996 0,0.49703 0.40293,0.89997 0.89995,0.89997 0.49706,0 0.90005,-0.40294 0.90005,-0.89997 z" />
    <path
       id="path14437"
       style="fill:#000000;fill-opacity:1;stroke:none;stroke-width:1.04298;stroke-linecap:butt;stroke-linejoin:miter;stroke-miterlimit:4;stroke-dasharray:none;stroke-opacity:1"
       d="m -1.93858,227.90454 h 0.89999 m 0,0 c 0,-0.49703 -0.40293,-0.89996 -0.89999,-0.89996 -0.49702,0 -0.90001,0.40293 -0.90001,0.89996 0,0.49703 0.40293,0.89997 0.89995,0.89997 0.49706,0 0.90005,-0.40294 0.90005,-0.89997 z" />
    <path
       id="path14439"
       style="fill:#000000;fill-opacity:1;stroke:none;stroke-width:1.04298;stroke-linecap:butt;stroke-linejoin:miter;stroke-miterlimit:4;stroke-dasharray:none;stroke-opacity:1"
       d="m -1.93858,193.90454 h 0.89999 m 0,0 c 0,-0.49703 -0.40293,-0.89996 -0.89999,-0.89996 -0.49702,0 -0.90001,0.40293 -0.90001,0.89996 0,0.49703 0.40293,0.89997 0.89995,0.89997 0.49706,0 0.90005,-0.40294 0.90005,-0.89997 z" />
    <path
       id="path14441"
       style="fill:#000000;fill-opacity:1;stroke:none;stroke-width:1.04298;stroke-linecap:butt;stroke-linejoin:miter;stroke-miterlimit:4;stroke-dasharray:none;stroke-opacity:1"
       d="m -36.93858,227.90454 h 0.89999 m 0,0 c 0,-0.49703 -0.40293,-0.89996 -0.89999,-0.89996 -0.49702,0 -0.90001,0.40293 -0.90001,0.89996 0,0.49703 0.40293,0.89997 0.89995,0.89997 0.49706,0 0.90005,-0.40294 0.90005,-0.89997 z" />
    <g
       aria-label="T3"
       id="text16273"
       style="font-size:3.88056px;line-height:100%;font-family:Sans;-inkscape-font-specification:Sans;letter-spacing:0px;word-spacing:0px;stroke:#000000;stroke-width:0">
      <path
         d="m 0.97661889,218.6937 v -2.44999 H 0.06142824 v -0.3278 H 2.2631912 v 0.3278 H 1.344211 v 2.44999 z"
         style="font-family:sans-serif;-inkscape-font-specification:sans-serif"
         id="path167371" />
      <path
         d="m 2.5038315,217.96041 0.3410648,-0.0455 q 0.058739,0.28991 0.1989545,0.41875 0.1421104,0.12695 0.3448545,0.12695 0.2406401,0 0.4054881,-0.16674 0.1667429,-0.16674 0.1667429,-0.41307 0,-0.23495 -0.1534792,-0.38654 -0.1534792,-0.15348 -0.3903298,-0.15348 -0.096635,0 -0.2406402,0.0379 l 0.037896,-0.29938 q 0.034107,0.004 0.054949,0.004 0.2179025,0 0.3922245,-0.11369 0.1743221,-0.11369 0.1743221,-0.35054 0,-0.18758 -0.126952,-0.31074 -0.1269519,-0.12317 -0.3278012,-0.12317 -0.1989545,0 -0.3315908,0.12506 -0.1326363,0.12506 -0.1705324,0.37517 l -0.3410648,-0.0606 q 0.062528,-0.34296 0.2842207,-0.53055 0.2216921,-0.18948 0.5513881,-0.18948 0.2273766,0 0.4187518,0.0985 0.1913753,0.0966 0.2918,0.26528 0.1023194,0.16863 0.1023194,0.35811 0,0.18001 -0.096635,0.3278 -0.096635,0.1478 -0.2861155,0.23496 0.2463246,0.0568 0.3827505,0.23685 0.1364259,0.17811 0.1364259,0.44717 0,0.36381 -0.2652726,0.61771 -0.2652727,0.25201 -0.6707609,0.25201 -0.3656972,0 -0.6082322,-0.2179 -0.2406402,-0.21791 -0.2747467,-0.56465 z"
         style="font-family:sans-serif;-inkscape-font-specification:sans-serif"
         id="path167373" />
    </g>
    <g
       aria-label="R5"
       id="text18000"
       style="font-size:3.88056px;line-height:100%;font-family:Sans;-inkscape-font-specification:Sans;letter-spacing:0px;word-spacing:0px;stroke:#000000;stroke-width:0">
      <path
         d="m 4.5612467,182.85718 v -2.77779 h 1.231623 q 0.3713817,0 0.5646518,0.0758 0.1932701,0.0739 0.3088532,0.26337 0.115583,0.18948 0.115583,0.41876 0,0.29559 -0.1913752,0.49833 -0.1913753,0.20274 -0.5911791,0.25769 0.1459,0.0701 0.2216922,0.13832 0.1610584,0.1478 0.3050635,0.36949 l 0.4831752,0.75603 H 6.547002 l -0.3675921,-0.57792 q -0.1610584,-0.25011 -0.2652727,-0.38275 -0.1042142,-0.13263 -0.1875856,-0.18569 -0.081477,-0.0531 -0.1667429,-0.0739 -0.062528,-0.0133 -0.2046389,-0.0133 h -0.426331 v 1.23352 z m 0.3675921,-1.55185 h 0.7901335 q 0.2520091,0 0.3941194,-0.0512 0.1421104,-0.053 0.2160077,-0.16674 0.073897,-0.11558 0.073897,-0.25011 0,-0.19706 -0.1440051,-0.32402 -0.1421104,-0.12695 -0.4509635,-0.12695 H 4.9288388 Z"
         style="font-family:sans-serif;-inkscape-font-specification:sans-serif"
         id="path167345" />
      <path
         d="m 7.2196576,182.12957 0.3581181,-0.0303 q 0.039791,0.26148 0.1837961,0.39412 0.1458999,0.13074 0.3505388,0.13074 0.2463246,0 0.416857,-0.18569 0.1705325,-0.18569 0.1705325,-0.49265 0,-0.2918 -0.164848,-0.46044 -0.1629532,-0.16864 -0.4282259,-0.16864 -0.164848,0 -0.2974843,0.0758 -0.1326364,0.0739 -0.2084285,0.19327 l -0.320222,-0.0417 0.2690622,-1.42679 h 1.3813126 v 0.32591 H 7.8222055 l -0.1496896,0.74655 q 0.2501143,-0.17432 0.5248609,-0.17432 0.3638025,0 0.6139167,0.25201 0.2501142,0.25201 0.2501142,0.64802 0,0.37707 -0.2197973,0.65181 -0.2671674,0.33728 -0.7294998,0.33728 -0.3789609,0 -0.6196011,-0.21222 -0.2387454,-0.21222 -0.2728519,-0.56276 z"
         style="font-family:sans-serif;-inkscape-font-specification:sans-serif"
         id="path167347" />
    </g>
    <g
       aria-label="3.5k"
       id="text18004"
       style="font-size:3.175px;line-height:100%;font-family:Sans;-inkscape-font-specification:Sans;letter-spacing:0px;word-spacing:0px;stroke:#000000;stroke-width:0">
      <path
         d="m 3.2059756,186.58662 0.2790528,-0.0372 q 0.048059,0.2372 0.1627807,0.34262 0.116272,0.10387 0.2821533,0.10387 0.1968872,0 0.3317627,-0.13643 0.1364258,-0.13642 0.1364258,-0.33796 0,-0.19224 -0.1255737,-0.31626 -0.1255738,-0.12557 -0.3193604,-0.12557 -0.079065,0 -0.1968872,0.031 l 0.031006,-0.24495 q 0.027905,0.003 0.044958,0.003 0.1782837,0 0.3209106,-0.093 0.142627,-0.093 0.142627,-0.28681 0,-0.15348 -0.1038697,-0.25424 -0.1038696,-0.10077 -0.2682006,-0.10077 -0.1627808,0 -0.2713013,0.10232 -0.1085205,0.10232 -0.1395264,0.30695 l -0.2790527,-0.0496 q 0.05116,-0.2806 0.2325439,-0.43408 0.1813843,-0.15503 0.4511353,-0.15503 0.1860351,0 0.3426147,0.0806 0.1565796,0.0791 0.2387451,0.21704 0.083716,0.13798 0.083716,0.293 0,0.14728 -0.079065,0.26821 -0.079065,0.12092 -0.2340942,0.19223 0.2015381,0.0465 0.3131592,0.19379 0.1116211,0.14573 0.1116211,0.36587 0,0.29765 -0.2170411,0.50539 -0.217041,0.20619 -0.5488037,0.20619 -0.2992065,0 -0.497644,-0.17828 -0.1968872,-0.17829 -0.2247925,-0.46199 z"
         style="font-family:sans-serif;-inkscape-font-specification:sans-serif"
         id="path167350" />
      <path
         d="m 5.1267886,187.18658 v -0.31781 h 0.31781 v 0.31781 z"
         style="font-family:sans-serif;-inkscape-font-specification:sans-serif"
         id="path167352" />
      <path
         d="m 5.8523257,186.59127 0.2930053,-0.0248 q 0.032556,0.21394 0.1503785,0.32246 0.1193725,0.10697 0.2868042,0.10697 0.201538,0 0.3410644,-0.15193 0.1395264,-0.15193 0.1395264,-0.40308 0,-0.23874 -0.1348755,-0.37672 -0.1333252,-0.13797 -0.3503662,-0.13797 -0.1348755,0 -0.243396,0.062 -0.1085205,0.0605 -0.1705322,0.15813 l -0.2619995,-0.0341 0.2201415,-1.16737 h 1.1301636 v 0.26665 H 6.3453188 l -0.1224731,0.61082 q 0.2046387,-0.14263 0.4294311,-0.14263 0.2976563,0 0.502295,0.20619 0.2046386,0.20619 0.2046386,0.5302 0,0.30851 -0.179834,0.5333 -0.2185913,0.27595 -0.5968627,0.27595 -0.3100586,0 -0.5069458,-0.17363 -0.195337,-0.17363 -0.2232422,-0.46044 z"
         style="font-family:sans-serif;-inkscape-font-specification:sans-serif"
         id="path167354" />
      <path
         d="m 7.6971742,187.18658 v -2.27272 h 0.2790527 v 1.29604 l 0.6604248,-0.66973 h 0.3612182 l -0.6294189,0.61082 0.692981,1.03559 H 8.7172669 l -0.5441528,-0.8418 -0.1968872,0.18913 v 0.65267 z"
         style="font-family:sans-serif;-inkscape-font-specification:sans-serif"
         id="path167356" />
    </g>
    <g
       aria-label="R6"
       id="text18008"
       style="font-size:3.88056px;line-height:100%;font-family:Sans;-inkscape-font-specification:Sans;letter-spacing:0px;word-spacing:0px;stroke:#000000;stroke-width:0">
      <path
         d="m 19.583983,147.85718 v -2.77779 h 1.231623 q 0.371382,0 0.564652,0.0758 0.19327,0.0739 0.308853,0.26337 0.115583,0.18948 0.115583,0.41876 0,0.29559 -0.191375,0.49833 -0.191376,0.20274 -0.59118,0.25769 0.1459,0.0701 0.221693,0.13832 0.161058,0.1478 0.305063,0.36949 l 0.483175,0.75603 h -0.462332 l -0.367592,-0.57792 q -0.161058,-0.25011 -0.265273,-0.38275 -0.104214,-0.13263 -0.187585,-0.18569 -0.08148,-0.0531 -0.166743,-0.0739 -0.06253,-0.0133 -0.204639,-0.0133 h -0.426331 v 1.23352 z m 0.367592,-1.55185 h 0.790133 q 0.252009,0 0.39412,-0.0512 0.14211,-0.053 0.216008,-0.16674 0.0739,-0.11558 0.0739,-0.25011 0,-0.19706 -0.144005,-0.32402 -0.142111,-0.12695 -0.450964,-0.12695 h -0.879189 z"
         style="font-family:sans-serif;-inkscape-font-specification:sans-serif"
         id="path167266" />
      <path
         d="m 24.012141,145.75963 -0.33917,0.0265 q -0.04547,-0.20085 -0.128847,-0.2918 -0.13832,-0.1459 -0.341064,-0.1459 -0.162954,0 -0.286116,0.091 -0.161058,0.11747 -0.253904,0.34296 -0.09285,0.22548 -0.09663,0.64234 0.123163,-0.18759 0.301274,-0.27854 0.178112,-0.091 0.373277,-0.091 0.341065,0 0.57981,0.25201 0.24064,0.25011 0.24064,0.64802 0,0.26148 -0.113688,0.48697 -0.111794,0.22358 -0.308853,0.34296 -0.19706,0.11937 -0.447174,0.11937 -0.426331,0 -0.695393,-0.31264 -0.269063,-0.31454 -0.269063,-1.03457 0,-0.80529 0.297485,-1.17099 0.259588,-0.31832 0.699183,-0.31832 0.327801,0 0.536229,0.18379 0.210324,0.1838 0.252009,0.50781 z m -1.392681,1.19752 q 0,0.17621 0.0739,0.33727 0.07579,0.16106 0.210324,0.24633 0.134531,0.0834 0.282325,0.0834 0.216008,0 0.371382,-0.17433 0.155374,-0.17432 0.155374,-0.4737 0,-0.28801 -0.153479,-0.45285 -0.153479,-0.16675 -0.38654,-0.16675 -0.231166,0 -0.392225,0.16675 -0.161058,0.16484 -0.161058,0.43391 z"
         style="font-family:sans-serif;-inkscape-font-specification:sans-serif"
         id="path167268" />
    </g>
    <g
       aria-label="50"
       id="text18012"
       style="font-size:3.175px;line-height:100%;font-family:Sans;-inkscape-font-specification:Sans;letter-spacing:0px;word-spacing:0px;stroke:#000000;stroke-width:0">
      <path
         d="m 20.813557,151.59127 0.293005,-0.0248 q 0.03256,0.21394 0.150378,0.32246 0.119373,0.10697 0.286805,0.10697 0.201538,0 0.341064,-0.15193 0.139526,-0.15193 0.139526,-0.40308 0,-0.23874 -0.134875,-0.37672 -0.133325,-0.13797 -0.350366,-0.13797 -0.134876,0 -0.243396,0.062 -0.108521,0.0605 -0.170532,0.15813 l -0.262,-0.0341 0.220142,-1.16737 h 1.130163 v 0.26665 H 21.30655 l -0.122473,0.61082 q 0.204638,-0.14263 0.429431,-0.14263 0.297656,0 0.502295,0.20619 0.204638,0.20619 0.204638,0.5302 0,0.30851 -0.179834,0.5333 -0.218591,0.27595 -0.596862,0.27595 -0.310059,0 -0.506946,-0.17363 -0.195337,-0.17363 -0.223242,-0.46044 z"
         style="font-family:sans-serif;-inkscape-font-specification:sans-serif"
         id="path167271" />
      <path
         d="m 22.57934,151.06572 q 0,-0.40307 0.08217,-0.64802 0.08372,-0.2465 0.246496,-0.37982 0.164331,-0.13333 0.412378,-0.13333 0.182935,0 0.320911,0.0744 0.137976,0.0729 0.227893,0.21239 0.08992,0.13797 0.141077,0.33796 0.05116,0.19844 0.05116,0.5364 0,0.39998 -0.08216,0.64647 -0.08217,0.24495 -0.246497,0.37983 -0.16278,0.13332 -0.412378,0.13332 -0.328662,0 -0.516247,-0.23564 -0.224793,-0.28371 -0.224793,-0.92398 z m 0.286805,0 q 0,0.55966 0.130224,0.74569 0.131775,0.18449 0.324011,0.18449 0.192237,0 0.322461,-0.18604 0.131775,-0.18603 0.131775,-0.74414 0,-0.5612 -0.131775,-0.74569 -0.130224,-0.18448 -0.325561,-0.18448 -0.192237,0 -0.306958,0.16278 -0.144177,0.20774 -0.144177,0.76739 z"
         style="font-family:sans-serif;-inkscape-font-specification:sans-serif"
         id="path167273" />
    </g>
    <path
       id="path21476"
       d="m -16.93858,187.90454 v 1 h 1 v -10 h 1 v 1"
       style="fill:none;stroke:#000000;stroke-width:0.5;stroke-linecap:butt;stroke-linejoin:miter;stroke-miterlimit:4;stroke-dasharray:none;stroke-opacity:1" />
    <path
       id="path24579"
       d="m -6.93858,221.90454 v 1 h 1 v -10 h 1 v 1"
       style="fill:none;stroke:#000000;stroke-width:0.5;stroke-linecap:butt;stroke-linejoin:miter;stroke-miterlimit:4;stroke-dasharray:none;stroke-opacity:1" />
    <path
       id="path24581"
       d="m 23.06142,197.90454 v 1 h 1 v -10 h 1 v 1"
       style="fill:none;stroke:#000000;stroke-width:0.5;stroke-linecap:butt;stroke-linejoin:miter;stroke-miterlimit:4;stroke-dasharray:none;stroke-opacity:1" />
    <path
       id="path24583"
       d="m -1.93858,167.90454 v 1 h 1 v -10 h 1 v 1"
       style="fill:none;stroke:#000000;stroke-width:0.5;stroke-linecap:butt;stroke-linejoin:miter;stroke-miterlimit:4;stroke-dasharray:none;stroke-opacity:1" />
    <path
       id="path24585"
       d="m -37.93858,178.90454 h -1 v 1 h 14 v 1 h -1"
       style="fill:none;stroke:#000000;stroke-width:0.5;stroke-linecap:butt;stroke-linejoin:miter;stroke-miterlimit:4;stroke-dasharray:none;stroke-opacity:1" />
  </g>
</svg>
