<?xml version="1.0" encoding="UTF-8" standalone="no"?>
<!-- Created with Inkscape (http://www.inkscape.org/) -->

<svg
   width="39.646008mm"
   height="49.426472mm"
   viewBox="0 0 39.64601 49.426472"
   version="1.1"
   id="svg18062"
   xmlns="http://www.w3.org/2000/svg"
   xmlns:svg="http://www.w3.org/2000/svg">
  <defs
     id="defs18059" />
  <g
     id="layer1"
     transform="translate(-67.952544,-77.671773)">
    <path
       style="fill:none;stroke:#000000;stroke-width:0.4;stroke-linecap:butt;stroke-linejoin:miter;stroke-dasharray:none;stroke-opacity:1"
       d="m 84.559798,90.22568 v 6 h -10"
       id="path2423" />
    <path
       style="fill:none;stroke:#000000;stroke-width:0.4;stroke-linecap:butt;stroke-linejoin:miter;stroke-dasharray:none;stroke-opacity:1"
       d="m 85.559798,90.22568 h 3 v -6"
       id="path2425" />
    <path
       style="fill:none;stroke:#000000;stroke-width:0.4;stroke-linecap:butt;stroke-linejoin:miter;stroke-dasharray:none;stroke-opacity:1"
       d="m 85.559798,93.22568 h 3 v 29"
       id="path2427" />
    <circle
       style="fill:none;stroke:#000000;stroke-width:0.5;stroke-linecap:round;stroke-linejoin:round;stroke-dasharray:none;stroke-opacity:1"
       id="circle2429"
       cx="86.809799"
       cy="93.225677"
       r="5.6246567" />
    <path
       id="path2433"
       style="fill:#000000;fill-opacity:1;stroke:none;stroke-width:0.344499;stroke-linecap:round;stroke-linejoin:round"
       d="m 89.209798,96.22864 c 0,0.35898 -0.29102,0.65 -0.65,0.65 -0.35898,0 -0.65,-0.29102 -0.65,-0.65 0,-0.35899 0.29102,-0.65 0.65,-0.65 0.35898,0 0.65,0.29101 0.65,0.65 z" />
    <path
       style="fill:#000000;fill-opacity:1;stroke:none;stroke-width:0.264583px;stroke-linecap:butt;stroke-linejoin:miter;stroke-opacity:1"
       d="m 87.360158,94.22568 v -2 l -1.80036,1 z"
       id="path2435" />
    <path
       style="fill:none;stroke:#000000;stroke-width:0.4;stroke-linecap:butt;stroke-linejoin:miter;stroke-dasharray:none;stroke-opacity:1"
       d="m 85.559798,96.22568 h 3"
       id="path2431" />
    <path
       style="fill:none;stroke:#000000;stroke-width:0.4;stroke-linecap:butt;stroke-linejoin:miter;stroke-dasharray:none;stroke-opacity:1"
       d="m 85.559798,95.22568 v 2"
       id="path2437" />
    <path
       style="fill:none;stroke:#000000;stroke-width:0.4;stroke-linecap:butt;stroke-linejoin:miter;stroke-dasharray:none;stroke-opacity:1"
       d="m 85.559798,92.22568 v 2"
       id="path2439" />
    <path
       style="fill:none;stroke:#000000;stroke-width:0.4;stroke-linecap:butt;stroke-linejoin:miter;stroke-dasharray:none;stroke-opacity:1"
       d="m 85.559798,89.22568 v 2"
       id="path2441" />
    <path
       style="fill:none;stroke:#000000;stroke-width:0.4;stroke-linecap:butt;stroke-linejoin:miter;stroke-dasharray:none;stroke-opacity:1"
       d="m 88.559798,103.07566 9,0.15002"
       id="path2483" />
    <g
       aria-label="GND"
       id="text2489"
       style="font-size:3.88056px;line-height:100%;font-family:Sans;-inkscape-font-specification:Sans;letter-spacing:0px;word-spacing:0px;stroke:#000000;stroke-width:0">
      <path
         d="m 85.847384,125.96136 v -0.32591 l 1.176674,-0.002 v 1.03077 q -0.270957,0.21601 -0.558968,0.32591 -0.28801,0.108 -0.591179,0.108 -0.409277,0 -0.744658,-0.17432 -0.333486,-0.17622 -0.504018,-0.50781 -0.170532,-0.33159 -0.170532,-0.74087 0,-0.40548 0.168637,-0.75602 0.170533,-0.35244 0.48886,-0.52297 0.318327,-0.17053 0.733289,-0.17053 0.301274,0 0.543809,0.0985 0.24443,0.0966 0.382751,0.27096 0.13832,0.17432 0.210323,0.45475 l -0.331591,0.091 q -0.06253,-0.21222 -0.155374,-0.33349 -0.09284,-0.12126 -0.265272,-0.19327 -0.172428,-0.0739 -0.382751,-0.0739 -0.252009,0 -0.435805,0.0777 -0.183796,0.0758 -0.297484,0.20085 -0.111794,0.12506 -0.174322,0.27475 -0.106109,0.25769 -0.106109,0.55897 0,0.37138 0.126951,0.62149 0.128847,0.25012 0.373277,0.37138 0.24443,0.12127 0.519176,0.12127 0.238746,0 0.466122,-0.0909 0.227377,-0.0928 0.344855,-0.19706 v -0.51728 z"
         style="font-family:sans-serif;-inkscape-font-specification:sans-serif"
         id="path63537" />
      <path
         d="m 87.562182,127.05087 v -2.77778 h 0.377066 l 1.459,2.18092 v -2.18092 h 0.352434 v 2.77778 h -0.377066 l -1.459,-2.18281 v 2.18281 z"
         style="font-family:sans-serif;-inkscape-font-specification:sans-serif"
         id="path63539" />
      <path
         d="m 90.368388,127.05087 v -2.77778 h 0.956876 q 0.324012,0 0.494544,0.0398 0.238746,0.0549 0.407383,0.19895 0.219798,0.1857 0.327802,0.4756 0.109898,0.28801 0.109898,0.65939 0,0.31643 -0.0739,0.56086 -0.0739,0.24443 -0.189481,0.40549 -0.115583,0.15917 -0.253903,0.25201 -0.136426,0.091 -0.331591,0.13832 -0.19327,0.0474 -0.445279,0.0474 z m 0.367592,-0.3278 h 0.593074 q 0.274747,0 0.430121,-0.0512 0.157268,-0.0512 0.250114,-0.144 0.130741,-0.13074 0.202744,-0.35054 0.0739,-0.22169 0.0739,-0.53623 0,-0.43581 -0.144005,-0.66887 -0.14211,-0.23495 -0.346749,-0.31454 -0.147795,-0.0568 -0.475596,-0.0568 h -0.5836 z"
         style="font-family:sans-serif;-inkscape-font-specification:sans-serif"
         id="path63541" />
    </g>
    <path
       style="fill:none;stroke:#000000;stroke-width:0.7;stroke-linecap:butt;stroke-linejoin:miter;stroke-miterlimit:4;stroke-dasharray:none;stroke-opacity:1"
       d="m 85.559798,122.22568 h 6"
       id="path2491" />
    <path
       id="path2493"
       style="fill:none;fill-opacity:0.5;stroke:#000000;stroke-width:0.5;stroke-linecap:round;stroke-linejoin:round;stroke-dasharray:none"
       d="m 88.559798,82.22568 a 1,1 0 0 1 1,1 1,1 0 0 1 -1,1 1,1 0 0 1 -1,-1 1,1 0 0 1 1,-1 z" />
    <g
       aria-label="+VDD"
       id="text2499"
       style="font-size:3.88056px;line-height:100%;font-family:Sans;-inkscape-font-specification:Sans;letter-spacing:0px;word-spacing:0px;stroke:#000000;stroke-width:0">
      <path
         d="m 85.242138,80.000486 v -0.761712 h -0.756027 v -0.318327 h 0.756027 V 78.16442 h 0.322117 v 0.756027 h 0.756027 v 0.318327 h -0.756027 v 0.761712 z"
         style="font-family:sans-serif;-inkscape-font-specification:sans-serif"
         id="path63511" />
      <path
         d="m 87.629592,80.449554 -1.076249,-2.777783 h 0.397909 l 0.721921,2.017967 q 0.08716,0.242535 0.1459,0.454753 0.06442,-0.227377 0.149689,-0.454753 l 0.750343,-2.017967 h 0.375171 l -1.087618,2.777783 z"
         style="font-family:sans-serif;-inkscape-font-specification:sans-serif"
         id="path63513" />
      <path
         d="m 89.319189,81.225666 v -1.805559 h 0.62197 q 0.210607,0 0.321453,0.02586 0.155185,0.03572 0.264799,0.129321 0.142869,0.120699 0.213071,0.309137 0.07143,0.187207 0.07143,0.428605 0,0.205681 -0.04803,0.36456 -0.04803,0.15888 -0.123162,0.263567 -0.07513,0.103457 -0.165038,0.163806 -0.08868,0.05912 -0.215534,0.08991 -0.125625,0.03079 -0.289431,0.03079 z m 0.238935,-0.21307 h 0.385498 q 0.178585,0 0.279578,-0.03325 0.102225,-0.03325 0.162575,-0.0936 0.08498,-0.08498 0.131783,-0.22785 0.04803,-0.1441 0.04803,-0.348549 0,-0.283273 -0.0936,-0.434763 -0.09237,-0.152721 -0.225387,-0.204449 -0.09607,-0.03695 -0.309137,-0.03695 h -0.37934 z"
         style="font-size:65%;baseline-shift:sub"
         id="path63515" />
      <path
         d="m 91.14076,81.225666 v -1.805559 h 0.621969 q 0.210608,0 0.321454,0.02586 0.155184,0.03572 0.264799,0.129321 0.142868,0.120699 0.213071,0.309137 0.07143,0.187207 0.07143,0.428605 0,0.205681 -0.04803,0.36456 -0.04803,0.15888 -0.123162,0.263567 -0.07513,0.103457 -0.165037,0.163806 -0.08868,0.05912 -0.215534,0.08991 -0.125626,0.03079 -0.289432,0.03079 z m 0.238934,-0.21307 h 0.385498 q 0.178586,0 0.279579,-0.03325 0.102225,-0.03325 0.162574,-0.0936 0.08498,-0.08498 0.131784,-0.22785 0.04803,-0.1441 0.04803,-0.348549 0,-0.283273 -0.0936,-0.434763 -0.09237,-0.152721 -0.225387,-0.204449 -0.09607,-0.03695 -0.309138,-0.03695 h -0.37934 z"
         style="font-size:65%;baseline-shift:sub"
         id="path63517" />
    </g>
    <path
       style="fill:#000000;fill-opacity:1;stroke:none;stroke-width:0.264583px;stroke-linecap:butt;stroke-linejoin:miter;stroke-opacity:1"
       d="m 95.559798,81.22568 c -2,0 -3,1 -4,2 1,1 2,2 4,2 h 7.000002 v -4 z"
       id="path2501" />
    <path
       style="fill:#000000;fill-opacity:0.25;stroke:none;stroke-width:0.264583px;stroke-linecap:butt;stroke-linejoin:miter;stroke-opacity:1"
       d="m 94.559798,82.22568 1,-1 h 6.000002 v 4 h -6.000002 l -1,-1 z"
       id="path2503" />
    <g
       aria-label="5V"
       id="text2507"
       style="font-size:3.175px;line-height:100%;font-family:Sans;-inkscape-font-specification:Sans;letter-spacing:0px;word-spacing:0px;fill:#ffffff;stroke:#000000;stroke-width:0">
      <path
         d="m 96.190149,83.758221 0.434082,-0.04496 q 0.0186,0.147278 0.110071,0.234094 0.09147,0.08527 0.21084,0.08527 0.136425,0 0.230993,-0.110071 0.09457,-0.111621 0.09457,-0.334863 0,-0.209289 -0.09457,-0.313159 -0.09302,-0.10542 -0.243396,-0.10542 -0.187585,0 -0.336413,0.165881 l -0.353467,-0.05116 0.223242,-1.182874 h 1.151868 v 0.407727 h -0.821656 l -0.06821,0.386023 q 0.145727,-0.07286 0.297656,-0.07286 0.289905,0 0.491443,0.210839 0.201538,0.21084 0.201538,0.547254 0,0.280603 -0.162781,0.500744 -0.221692,0.300757 -0.615466,0.300757 -0.31471,0 -0.513147,-0.168982 -0.198438,-0.168982 -0.237195,-0.454236 z"
         style="font-weight:bold;font-family:sans-serif;-inkscape-font-specification:'sans-serif Bold'"
         id="path63520" />
      <path
         d="m 98.625659,84.342682 -0.812353,-2.27273 h 0.497644 l 0.575158,1.682068 0.556556,-1.682068 h 0.486792 l -0.813904,2.27273 z"
         style="font-weight:bold;font-family:sans-serif;-inkscape-font-specification:'sans-serif Bold'"
         id="path63522" />
    </g>
    <path
       id="path2509"
       style="fill:#000000;fill-opacity:1;stroke:none;stroke-width:1.04298;stroke-linecap:butt;stroke-linejoin:miter;stroke-miterlimit:4;stroke-dasharray:none;stroke-opacity:1"
       d="m 88.559798,103.07568 h 0.89999 m 0,0 c 0,-0.49703 -0.40293,-0.89996 -0.89999,-0.89996 -0.49702,0 -0.90001,0.40293 -0.90001,0.89996 0,0.49703 0.40293,0.89997 0.89995,0.89997 0.49706,0 0.90005,-0.40294 0.90005,-0.89997 z" />
    <path
       id="path2511"
       style="fill:none;fill-opacity:0.5;stroke:#000000;stroke-width:0.5;stroke-linecap:round;stroke-linejoin:round;stroke-dasharray:none"
       d="m 98.559798,102.22568 a 1,1 0 0 1 1,1 1,1 0 0 1 -1,1 1,1 0 0 1 -1,-1 1,1 0 0 1 1,-1 z" />
    <path
       id="path2513"
       style="fill:none;fill-opacity:0.5;stroke:#000000;stroke-width:0.5;stroke-linecap:round;stroke-linejoin:round;stroke-dasharray:none"
       d="m 73.559798,95.22568 a 1,1 0 0 1 1,1 1,1 0 0 1 -1,1 1,1 0 0 1 -1,-1 1,1 0 0 1 1,-1 z" />
    <g
       aria-label="Out"
       id="text2517"
       style="font-size:3.88056px;line-height:100%;font-family:Sans;-inkscape-font-specification:Sans;letter-spacing:0px;word-spacing:0px;stroke:#000000;stroke-width:0">
      <path
         d="m 101.55981,103.26268 q 0,-0.6916 0.37138,-1.08193 0.37138,-0.39223 0.95877,-0.39223 0.38465,0 0.6935,0.1838 0.30885,0.18379 0.46991,0.51349 0.16295,0.3278 0.16295,0.74466 0,0.42254 -0.17053,0.75602 -0.17053,0.33349 -0.48317,0.50592 -0.31265,0.17053 -0.67455,0.17053 -0.39223,0 -0.70108,-0.18948 -0.30885,-0.18948 -0.46802,-0.51728 -0.15916,-0.3278 -0.15916,-0.6935 z m 0.37896,0.006 q 0,0.50213 0.26906,0.79203 0.27096,0.28801 0.67834,0.28801 0.41496,0 0.68213,-0.2918 0.26906,-0.2918 0.26906,-0.82803 0,-0.33917 -0.11558,-0.59118 -0.11369,-0.2539 -0.33538,-0.39222 -0.2198,-0.14022 -0.49454,-0.14022 -0.39033,0 -0.67266,0.26907 -0.28043,0.26716 -0.28043,0.89434 z"
         style="font-family:sans-serif;-inkscape-font-specification:sans-serif"
         id="path63530" />
      <path
         d="m 105.96523,104.61557 v -0.29559 q -0.23496,0.34107 -0.63855,0.34107 -0.17811,0 -0.33349,-0.0682 -0.15347,-0.0682 -0.22927,-0.17053 -0.0739,-0.10421 -0.10421,-0.2539 -0.0208,-0.10043 -0.0208,-0.31833 v -1.24678 h 0.34106 v 1.11604 q 0,0.26716 0.0208,0.36001 0.0322,0.13453 0.13643,0.21222 0.10421,0.0758 0.25769,0.0758 0.15348,0 0.28801,-0.0777 0.13453,-0.0796 0.18948,-0.21411 0.0568,-0.13643 0.0568,-0.39412 v -1.07814 h 0.34106 v 2.01228 z"
         style="font-family:sans-serif;-inkscape-font-specification:sans-serif"
         id="path63532" />
      <path
         d="m 107.54929,104.31051 0.0493,0.30127 q -0.144,0.0303 -0.25769,0.0303 -0.18569,0 -0.28801,-0.0587 -0.10232,-0.0587 -0.14401,-0.15348 -0.0417,-0.0966 -0.0417,-0.40359 v -1.15773 h -0.25012 v -0.26527 h 0.25012 v -0.49834 l 0.33917,-0.20463 v 0.70297 h 0.34296 v 0.26527 h -0.34296 v 1.17667 q 0,0.1459 0.0171,0.18759 0.0189,0.0417 0.0587,0.0663 0.0417,0.0246 0.11748,0.0246 0.0568,0 0.14969,-0.0133 z"
         style="font-family:sans-serif;-inkscape-font-specification:sans-serif"
         id="path63534" />
    </g>
    <g
       aria-label="In"
       id="text2521"
       style="font-size:3.88056px;line-height:100%;font-family:Sans;-inkscape-font-specification:Sans;letter-spacing:0px;word-spacing:0px;stroke:#000000;stroke-width:0">
      <path
         d="M 67.952545,97.614594 V 94.83681 h 0.367592 v 2.777784 z"
         style="font-family:sans-serif;-inkscape-font-specification:sans-serif"
         id="path63554" />
      <path
         d="m 68.92458,97.614594 v -2.012283 h 0.306958 v 0.286115 q 0.221692,-0.33159 0.640444,-0.33159 0.181901,0 0.333486,0.06632 0.153479,0.06442 0.229271,0.170532 0.07579,0.106109 0.106109,0.252009 0.01895,0.09474 0.01895,0.331591 v 1.237308 H 70.218731 V 96.39055 q 0,-0.208429 -0.03979,-0.310748 -0.03979,-0.104215 -0.14211,-0.164848 -0.100425,-0.06253 -0.236851,-0.06253 -0.217902,0 -0.377066,0.138321 -0.157268,0.138321 -0.157268,0.524861 v 1.098987 z"
         style="font-family:sans-serif;-inkscape-font-specification:sans-serif"
         id="path63556" />
    </g>
    <g
       aria-label="T1"
       id="text2525"
       style="font-size:3.88056px;line-height:100%;font-family:Sans;-inkscape-font-specification:Sans;letter-spacing:0px;word-spacing:0px;stroke:#000000;stroke-width:0">
      <path
         d="M 95.47499,94.62027 V 92.170287 H 94.5598 v -0.327801 h 2.201763 v 0.327801 h -0.91898 v 2.449983 z"
         style="font-family:sans-serif;-inkscape-font-specification:sans-serif"
         id="path63525" />
      <path
         d="m 98.284986,94.62027 h -0.341065 v -2.173341 q -0.123162,0.117478 -0.324012,0.234956 -0.198954,0.117478 -0.358118,0.176216 v -0.329696 q 0.286116,-0.134531 0.500229,-0.325906 0.214113,-0.191375 0.303168,-0.371382 h 0.219798 z"
         style="font-family:sans-serif;-inkscape-font-specification:sans-serif"
         id="path63527" />
    </g>
    <path
       id="path6990"
       d="m 90.0598,117.22568 h -3 v -9 h 2.999997 z"
       style="fill:#ffffff;fill-opacity:1;stroke:#000000;stroke-width:0.5;stroke-linecap:butt;stroke-linejoin:miter;stroke-miterlimit:4;stroke-dasharray:none;stroke-opacity:1" />
    <g
       aria-label="R1"
       id="text9230"
       style="font-size:3.88056px;line-height:100%;font-family:Sans;-inkscape-font-specification:Sans;letter-spacing:0px;word-spacing:0px;stroke:#000000;stroke-width:0">
      <path
         d="m 80.616709,112.22568 v -2.77779 h 1.231623 q 0.371382,0 0.564652,0.0758 0.19327,0.0739 0.308853,0.26337 0.115583,0.18948 0.115583,0.41876 0,0.29559 -0.191375,0.49833 -0.191375,0.20274 -0.591179,0.25769 0.1459,0.0701 0.221692,0.13832 0.161058,0.1478 0.305063,0.36949 l 0.483176,0.75603 h -0.462333 l -0.367592,-0.57792 q -0.161058,-0.25011 -0.265272,-0.38275 -0.104215,-0.13263 -0.187586,-0.18569 -0.08148,-0.053 -0.166743,-0.0739 -0.06253,-0.0133 -0.204639,-0.0133 h -0.426331 v 1.23352 z m 0.367592,-1.55185 h 0.790134 q 0.252009,0 0.394119,-0.0512 0.14211,-0.053 0.216008,-0.16674 0.0739,-0.11558 0.0739,-0.25011 0,-0.19706 -0.144005,-0.32402 -0.14211,-0.12695 -0.450963,-0.12695 h -0.87919 z"
         style="font-family:sans-serif;-inkscape-font-specification:sans-serif"
         id="path63549" />
      <path
         d="m 84.559798,112.22568 h -0.341065 v -2.17334 q -0.123163,0.11747 -0.324012,0.23495 -0.198954,0.11748 -0.358118,0.17622 v -0.3297 q 0.286116,-0.13453 0.500228,-0.3259 0.214113,-0.19138 0.303169,-0.37138 h 0.219798 z"
         style="font-family:sans-serif;-inkscape-font-specification:sans-serif"
         id="path63551" />
    </g>
    <g
       aria-label="1M"
       id="text9336"
       style="font-size:3.175px;line-height:100%;font-family:Sans;-inkscape-font-specification:Sans;letter-spacing:0px;word-spacing:0px;stroke:#000000;stroke-width:0">
      <path
         d="m 81.572385,116.50772 h -0.279053 v -1.77819 q -0.100769,0.0961 -0.2651,0.19224 -0.162781,0.0961 -0.293006,0.14418 v -0.26975 q 0.234095,-0.11007 0.409278,-0.26665 0.175183,-0.15658 0.248047,-0.30386 h 0.179834 z"
         style="font-family:sans-serif;-inkscape-font-specification:sans-serif"
         id="path63544" />
      <path
         d="m 82.390939,116.50772 v -2.27273 h 0.452686 l 0.537951,1.60921 q 0.07442,0.22479 0.108521,0.33641 0.03876,-0.12402 0.120923,-0.36432 l 0.544153,-1.5813 h 0.404626 v 2.27273 h -0.289905 v -1.90221 l -0.660424,1.90221 h -0.271302 l -0.657324,-1.93476 v 1.93476 z"
         style="font-family:sans-serif;-inkscape-font-specification:sans-serif"
         id="path63546" />
    </g>
  </g>
</svg>
