<?xml version="1.0" encoding="UTF-8" standalone="no"?>
<svg
   xmlns:dc="http://purl.org/dc/elements/1.1/"
   xmlns:cc="http://creativecommons.org/ns#"
   xmlns:rdf="http://www.w3.org/1999/02/22-rdf-syntax-ns#"
   xmlns:svg="http://www.w3.org/2000/svg"
   xmlns="http://www.w3.org/2000/svg"
   width="12.99032"
   height="15"
   viewBox="0 0 3.4370222 3.9687501"
   version="1.1"
   id="svg963">
  <defs
     id="defs957" />
  <metadata
     id="metadata960">
    <rdf:RDF>
      <cc:Work
         rdf:about="">
        <dc:format>image/svg+xml</dc:format>
        <dc:type
           rdf:resource="http://purl.org/dc/dcmitype/StillImage" />
        <dc:title></dc:title>
      </cc:Work>
    </rdf:RDF>
  </metadata>
  <g
     id="layer1"
     transform="translate(-95.262918,-57.49985)">
    <g
       id="g1559"
       transform="matrix(0.13229064,0,0,0.13229064,82.660526,49.893158)">
      <path
         id="path1542"
         style="fill:#ed4566;fill-opacity:1;stroke:none;stroke-width:0.999999px;stroke-linecap:butt;stroke-linejoin:miter;stroke-opacity:1"
         d="m 409.14648,217.32227 -49.09765,28.34765 v 56.69141 l 49.09765,28.34765 49.09766,-28.34765 v -56.69141 z m 0,11.33984 39.27735,22.67578 v 45.35547 l -39.27735,22.67578 -39.27929,-22.67578 v -45.35547 z"
         transform="scale(0.26458333)" />
      <path
         style="fill:#ed4566;fill-opacity:1;stroke:none;stroke-width:0.264583px;stroke-linecap:butt;stroke-linejoin:miter;stroke-opacity:1"
         d="m 108.25317,63.499999 -6.92819,4.000003 6.9282,3.999998 6.9282,-4 z"
         id="path1546" />
      <path
         style="fill:#ed4566;fill-opacity:1;stroke:none;stroke-width:0.264583px;stroke-linecap:butt;stroke-linejoin:miter;stroke-opacity:1"
         d="m 100.45895,68.999998 v 8 L 107.38715,81 v -8 z"
         id="path1548" />
      <path
         style="fill:#ed4566;fill-opacity:1;stroke:none;stroke-width:0.264583px;stroke-linecap:butt;stroke-linejoin:miter;stroke-opacity:1"
         d="m 109.1192,72.999999 v 7.999999 l 6.9282,-4 z"
         id="path1550" />
    </g>
  </g>
</svg>
