<?xml version="1.0" encoding="UTF-8" standalone="no"?>
<!-- Created with Inkscape (http://www.inkscape.org/) -->

<svg
   width="62.536457mm"
   height="49.544949mm"
   viewBox="0 0 62.536457 49.544948"
   version="1.1"
   id="svg5240"
   xmlns="http://www.w3.org/2000/svg"
   xmlns:svg="http://www.w3.org/2000/svg">
  <defs
     id="defs5237" />
  <g
     id="layer1"
     transform="translate(-639.12817,-560.21875)">
    <path
       style="fill:none;stroke:#000000;stroke-width:0.396875;stroke-linecap:round;stroke-linejoin:round;stroke-miterlimit:4;stroke-dasharray:none;stroke-opacity:1"
       d="m 659.1464,579.04882 h 6.5625 v 9.375 h -6.5625 z"
       id="path4807" />
    <path
       id="path4809"
       style="fill:none;stroke:#000000;stroke-width:0.396875;stroke-linecap:butt;stroke-linejoin:miter;stroke-miterlimit:4;stroke-dasharray:none;stroke-opacity:1"
       d="m 665.7089,583.73632 h 4.6875 v -8.4375 m -11.25,11.25 h -5.625 v -11.25 m 5.625,5.625 h -2.8125 v -3.75 h 5.625 v -1.875" />
    <path
       id="path4817"
       d="m 659.1464,575.29882 v -2.8125 h 5.625 v 2.8125 z"
       style="fill:none;stroke:#000000;stroke-width:0.396875;stroke-linecap:round;stroke-linejoin:round;stroke-miterlimit:4;stroke-dasharray:none;stroke-opacity:1" />
    <path
       style="fill:none;stroke:#000000;stroke-width:0.396875;stroke-linecap:round;stroke-linejoin:round;stroke-miterlimit:4;stroke-dasharray:none;stroke-opacity:1"
       d="m 650.7089,575.29882 v -2.8125 h 5.625 v 2.8125 z"
       id="path4819" />
    <path
       id="path4821"
       d="m 642.2714,575.29882 v -2.8125 h 5.625 v 2.8125 z"
       style="fill:none;stroke:#000000;stroke-width:0.396875;stroke-linecap:round;stroke-linejoin:round;stroke-miterlimit:4;stroke-dasharray:none;stroke-opacity:1" />
    <path
       style="fill:none;stroke:#000000;stroke-width:0.396875;stroke-linecap:round;stroke-linejoin:round;stroke-miterlimit:4;stroke-dasharray:none;stroke-opacity:1"
       d="m 684.4589,575.29882 v -2.8125 h 5.625 v 2.8125 z"
       id="path4823" />
    <path
       id="path4825"
       d="m 676.0214,575.29882 v -2.8125 h 5.625 v 2.8125 z"
       style="fill:none;stroke:#000000;stroke-width:0.396875;stroke-linecap:round;stroke-linejoin:round;stroke-miterlimit:4;stroke-dasharray:none;stroke-opacity:1" />
    <path
       style="fill:none;stroke:#000000;stroke-width:0.396875;stroke-linecap:round;stroke-linejoin:round;stroke-miterlimit:4;stroke-dasharray:none;stroke-opacity:1"
       d="m 667.5839,575.29882 v -2.8125 h 5.625 v 2.8125 z"
       id="path4827" />
    <path
       id="path4829"
       d="m 692.8964,575.29882 v -2.8125 h 5.625 v 2.8125 z"
       style="fill:none;stroke:#000000;stroke-width:0.396875;stroke-linecap:round;stroke-linejoin:round;stroke-miterlimit:4;stroke-dasharray:none;stroke-opacity:1" />
    <path
       id="path4831"
       d="m 639.4589,575.29882 h 61.875 v 28.125 h -61.875 z"
       style="fill:none;stroke:#000000;stroke-width:0.661458;stroke-linecap:round;stroke-linejoin:round;stroke-miterlimit:4;stroke-dasharray:none;stroke-opacity:1" />
    <path
       id="path4833"
       d="m 639.4589,587.02141 v 4.67982 c 1.29441,0 2.33991,-1.0455 2.33991,-2.33991 0,-1.29442 -1.0455,-2.33991 -2.33991,-2.33991 z"
       style="fill:none;stroke:#000000;stroke-width:0.661458;stroke-linecap:round;stroke-linejoin:round;stroke-miterlimit:4;stroke-dasharray:none;stroke-opacity:1" />
    <path
       id="path4835"
       d="m 690.0839,579.04882 h -6.5625 v 9.375 h 6.5625 z"
       style="fill:none;stroke:#000000;stroke-width:0.396875;stroke-linecap:round;stroke-linejoin:round;stroke-miterlimit:4;stroke-dasharray:none;stroke-opacity:1" />
    <path
       d="m 683.5214,583.73632 h -4.6875 v -8.4375 m 11.25,11.25 h 5.625 v -11.25 m -5.625,5.625 h 2.8125 v -3.75 h -5.625 v -1.875"
       style="fill:none;stroke:#000000;stroke-width:0.396875;stroke-linecap:butt;stroke-linejoin:miter;stroke-miterlimit:4;stroke-dasharray:none;stroke-opacity:1"
       id="path4837" />
    <path
       id="path4845"
       d="m 650.7089,599.67382 h 6.5625 v -9.375 h -6.5625 z"
       style="fill:none;stroke:#000000;stroke-width:0.396875;stroke-linecap:round;stroke-linejoin:round;stroke-miterlimit:4;stroke-dasharray:none;stroke-opacity:1" />
    <path
       d="m 657.2714,594.98632 h 4.6875 v 8.4375 m -11.25,-11.25 h -5.625 v 11.25 m 5.625,-5.625 h -2.8125 v 3.75 h 5.625 v 1.875"
       style="fill:none;stroke:#000000;stroke-width:0.396875;stroke-linecap:butt;stroke-linejoin:miter;stroke-miterlimit:4;stroke-dasharray:none;stroke-opacity:1"
       id="path4847" />
    <path
       style="fill:none;stroke:#000000;stroke-width:0.396875;stroke-linecap:round;stroke-linejoin:round;stroke-miterlimit:4;stroke-dasharray:none;stroke-opacity:1"
       d="m 659.1464,606.23632 v -2.8125 h 5.625 v 2.8125 z"
       id="path4855" />
    <path
       id="path4857"
       d="m 650.7089,606.23632 v -2.8125 h 5.625 v 2.8125 z"
       style="fill:none;stroke:#000000;stroke-width:0.396875;stroke-linecap:round;stroke-linejoin:round;stroke-miterlimit:4;stroke-dasharray:none;stroke-opacity:1" />
    <path
       style="fill:none;stroke:#000000;stroke-width:0.396875;stroke-linecap:round;stroke-linejoin:round;stroke-miterlimit:4;stroke-dasharray:none;stroke-opacity:1"
       d="m 642.2714,606.23632 v -2.8125 h 5.625 v 2.8125 z"
       id="path4859" />
    <path
       id="path4861"
       d="m 684.4589,606.23632 v -2.8125 h 5.625 v 2.8125 z"
       style="fill:none;stroke:#000000;stroke-width:0.396875;stroke-linecap:round;stroke-linejoin:round;stroke-miterlimit:4;stroke-dasharray:none;stroke-opacity:1" />
    <path
       style="fill:none;stroke:#000000;stroke-width:0.396875;stroke-linecap:round;stroke-linejoin:round;stroke-miterlimit:4;stroke-dasharray:none;stroke-opacity:1"
       d="m 676.0214,606.23632 v -2.8125 h 5.625 v 2.8125 z"
       id="path4863" />
    <path
       id="path4865"
       d="m 667.5839,606.23632 v -2.8125 h 5.625 v 2.8125 z"
       style="fill:none;stroke:#000000;stroke-width:0.396875;stroke-linecap:round;stroke-linejoin:round;stroke-miterlimit:4;stroke-dasharray:none;stroke-opacity:1" />
    <path
       style="fill:none;stroke:#000000;stroke-width:0.396875;stroke-linecap:round;stroke-linejoin:round;stroke-miterlimit:4;stroke-dasharray:none;stroke-opacity:1"
       d="m 692.8964,606.23632 v -2.8125 h 5.625 v 2.8125 z"
       id="path4867" />
    <path
       style="fill:none;stroke:#000000;stroke-width:0.396875;stroke-linecap:round;stroke-linejoin:round;stroke-miterlimit:4;stroke-dasharray:none;stroke-opacity:1"
       d="m 681.6464,599.67382 h -6.5625 v -9.375 h 6.5625 z"
       id="path4869" />
    <path
       id="path4871"
       style="fill:none;stroke:#000000;stroke-width:0.396875;stroke-linecap:butt;stroke-linejoin:miter;stroke-miterlimit:4;stroke-dasharray:none;stroke-opacity:1"
       d="m 675.0839,594.98632 h -4.6875 v 8.4375 m 11.25,-11.25 h 5.625 v 11.25 m -5.625,-5.625 h 2.8125 v 3.75 h -5.625 v 1.875" />
    <text
       id="text4959"
       y="602.4599"
       x="641.81134"
       style="font-style:normal;font-variant:normal;font-weight:normal;font-stretch:normal;font-size:3.175px;line-height:0%;font-family:sans-serif;-inkscape-font-specification:Sans;text-align:start;letter-spacing:0px;word-spacing:0px;writing-mode:lr-tb;text-anchor:start;fill:#000000;fill-opacity:1;stroke:#000000;stroke-width:0.0529167;stroke-miterlimit:4;stroke-dasharray:none;stroke-opacity:1"
       xml:space="preserve"><tspan
         y="602.4599"
         x="641.81134"
         id="tspan4961"
         style="font-size:2.64583px;line-height:1.25;font-family:sans-serif;stroke-width:0.0529167">1</tspan></text>
    <text
       xml:space="preserve"
       style="font-style:normal;font-variant:normal;font-weight:normal;font-stretch:normal;font-size:3.175px;line-height:0%;font-family:sans-serif;-inkscape-font-specification:Sans;text-align:start;letter-spacing:0px;word-spacing:0px;writing-mode:lr-tb;text-anchor:start;fill:#000000;fill-opacity:1;stroke:#000000;stroke-width:0.0529167;stroke-miterlimit:4;stroke-dasharray:none;stroke-opacity:1"
       x="694.97058"
       y="602.4599"
       id="text4963"><tspan
         y="602.4599"
         x="694.97058"
         id="tspan4965"
         style="font-size:2.64583px;line-height:1.25;font-family:sans-serif;stroke-width:0.0529167">7</tspan></text>
    <text
       id="text4967"
       y="578.16437"
       x="697.33813"
       style="font-style:normal;font-variant:normal;font-weight:normal;font-stretch:normal;font-size:3.175px;line-height:0%;font-family:sans-serif;-inkscape-font-specification:Sans;text-align:start;letter-spacing:0px;word-spacing:0px;writing-mode:lr-tb;text-anchor:start;fill:#000000;fill-opacity:1;stroke:#000000;stroke-width:0.0529167;stroke-miterlimit:4;stroke-dasharray:none;stroke-opacity:1"
       xml:space="preserve"><tspan
         y="578.16437"
         x="697.33813"
         id="tspan4969"
         style="font-size:2.64583px;line-height:1.25;font-family:sans-serif;stroke-width:0.0529167">8</tspan></text>
    <text
       xml:space="preserve"
       style="font-style:normal;font-variant:normal;font-weight:normal;font-stretch:normal;font-size:3.175px;line-height:0%;font-family:sans-serif;-inkscape-font-specification:Sans;text-align:start;letter-spacing:0px;word-spacing:0px;writing-mode:lr-tb;text-anchor:start;fill:#000000;fill-opacity:1;stroke:#000000;stroke-width:0.0529167;stroke-miterlimit:4;stroke-dasharray:none;stroke-opacity:1"
       x="643.53168"
       y="578.16437"
       id="text4971"><tspan
         y="578.16437"
         x="643.53168"
         id="tspan4973"
         style="font-size:2.64583px;line-height:1.25;font-family:sans-serif;stroke-width:0.0529167">14</tspan></text>
    <text
       id="text5147"
       y="609.69525"
       x="691.88721"
       style="font-style:normal;font-variant:normal;font-weight:normal;font-stretch:normal;font-size:3.175px;line-height:0%;font-family:sans-serif;-inkscape-font-specification:Sans;text-align:start;letter-spacing:0px;word-spacing:0px;writing-mode:lr-tb;text-anchor:start;fill:#000000;fill-opacity:1;stroke:#000000;stroke-width:0.0529167;stroke-miterlimit:4;stroke-dasharray:none;stroke-opacity:1"
       xml:space="preserve"><tspan
         y="609.69525"
         x="691.88721"
         id="tspan5149"
         style="font-size:3.43958px;line-height:1.25;font-family:sans-serif;stroke-width:0.0529167">GND</tspan></text>
    <g
       transform="matrix(0.26458333,0,0,0.26458333,634.77456,460.7604)"
       id="g5203">
      <text
         xml:space="preserve"
         style="font-style:normal;font-variant:normal;font-weight:normal;font-stretch:normal;line-height:0%;font-family:sans-serif;-inkscape-font-specification:Sans;text-align:start;letter-spacing:0px;word-spacing:0px;writing-mode:lr-tb;text-anchor:start;fill:#000000;fill-opacity:1;stroke:none"
         x="102.75591"
         y="471.25964"
         id="text5205"><tspan
           id="tspan5207"
           x="102.75591"
           y="471.25964"
           style="font-size:18px;line-height:1.25;font-family:sans-serif">1</tspan></text>
      <text
         xml:space="preserve"
         style="font-style:normal;font-variant:normal;font-weight:normal;font-stretch:normal;line-height:0%;font-family:sans-serif;-inkscape-font-specification:Sans;text-align:start;letter-spacing:0px;word-spacing:0px;writing-mode:lr-tb;text-anchor:start;fill:#000000;fill-opacity:1;stroke:#000000;stroke-width:0.4;stroke-miterlimit:4;stroke-dasharray:none;stroke-opacity:1"
         x="99.212601"
         y="470.32321"
         id="text5209"><tspan
           id="tspan5211"
           x="99.212601"
           y="470.32321"
           style="font-size:10px;line-height:1.25;font-family:sans-serif">=</tspan></text>
    </g>
    <g
       id="g5213"
       transform="matrix(0.26458333,0,0,0.26458333,659.14956,460.7604)">
      <text
         id="text5215"
         y="471.25964"
         x="102.75591"
         style="font-style:normal;font-variant:normal;font-weight:normal;font-stretch:normal;line-height:0%;font-family:sans-serif;-inkscape-font-specification:Sans;text-align:start;letter-spacing:0px;word-spacing:0px;writing-mode:lr-tb;text-anchor:start;fill:#000000;fill-opacity:1;stroke:none"
         xml:space="preserve"><tspan
           y="471.25964"
           x="102.75591"
           id="tspan5217"
           style="font-size:18px;line-height:1.25;font-family:sans-serif">1</tspan></text>
      <text
         id="text5219"
         y="470.32321"
         x="99.212601"
         style="font-style:normal;font-variant:normal;font-weight:normal;font-stretch:normal;line-height:0%;font-family:sans-serif;-inkscape-font-specification:Sans;text-align:start;letter-spacing:0px;word-spacing:0px;writing-mode:lr-tb;text-anchor:start;fill:#000000;fill-opacity:1;stroke:#000000;stroke-width:0.4;stroke-miterlimit:4;stroke-dasharray:none;stroke-opacity:1"
         xml:space="preserve"><tspan
           y="470.32321"
           x="99.212601"
           id="tspan5221"
           style="font-size:10px;line-height:1.25;font-family:sans-serif">=</tspan></text>
    </g>
    <g
       transform="matrix(0.26458333,0,0,0.26458333,650.71206,472.01039)"
       id="g5223">
      <text
         xml:space="preserve"
         style="font-style:normal;font-variant:normal;font-weight:normal;font-stretch:normal;line-height:0%;font-family:sans-serif;-inkscape-font-specification:Sans;text-align:start;letter-spacing:0px;word-spacing:0px;writing-mode:lr-tb;text-anchor:start;fill:#000000;fill-opacity:1;stroke:none"
         x="102.75591"
         y="471.25964"
         id="text5225"><tspan
           id="tspan5227"
           x="102.75591"
           y="471.25964"
           style="font-size:18px;line-height:1.25;font-family:sans-serif">1</tspan></text>
      <text
         xml:space="preserve"
         style="font-style:normal;font-variant:normal;font-weight:normal;font-stretch:normal;line-height:0%;font-family:sans-serif;-inkscape-font-specification:Sans;text-align:start;letter-spacing:0px;word-spacing:0px;writing-mode:lr-tb;text-anchor:start;fill:#000000;fill-opacity:1;stroke:#000000;stroke-width:0.4;stroke-miterlimit:4;stroke-dasharray:none;stroke-opacity:1"
         x="99.212601"
         y="470.32321"
         id="text5229"><tspan
           id="tspan5231"
           x="99.212601"
           y="470.32321"
           style="font-size:10px;line-height:1.25;font-family:sans-serif">=</tspan></text>
    </g>
    <g
       id="g5233"
       transform="matrix(0.26458333,0,0,0.26458333,626.33706,472.01039)">
      <text
         id="text5235"
         y="471.25964"
         x="102.75591"
         style="font-style:normal;font-variant:normal;font-weight:normal;font-stretch:normal;line-height:0%;font-family:sans-serif;-inkscape-font-specification:Sans;text-align:start;letter-spacing:0px;word-spacing:0px;writing-mode:lr-tb;text-anchor:start;fill:#000000;fill-opacity:1;stroke:none"
         xml:space="preserve"><tspan
           y="471.25964"
           x="102.75591"
           id="tspan5237"
           style="font-size:18px;line-height:1.25;font-family:sans-serif">1</tspan></text>
      <text
         id="text5239"
         y="470.32321"
         x="99.212601"
         style="font-style:normal;font-variant:normal;font-weight:normal;font-stretch:normal;line-height:0%;font-family:sans-serif;-inkscape-font-specification:Sans;text-align:start;letter-spacing:0px;word-spacing:0px;writing-mode:lr-tb;text-anchor:start;fill:#000000;fill-opacity:1;stroke:#000000;stroke-width:0.4;stroke-miterlimit:4;stroke-dasharray:none;stroke-opacity:1"
         xml:space="preserve"><tspan
           y="470.32321"
           x="99.212601"
           id="tspan5241"
           style="font-size:10px;line-height:1.25;font-family:sans-serif">=</tspan></text>
    </g>
    <text
       id="text5243"
       y="565.92383"
       x="663.83673"
       style="font-style:normal;font-variant:normal;font-weight:normal;font-stretch:normal;font-size:3.175px;line-height:0%;font-family:sans-serif;-inkscape-font-specification:Sans;text-align:start;letter-spacing:0px;word-spacing:0px;writing-mode:lr-tb;text-anchor:start;fill:#000000;fill-opacity:1;stroke:none;stroke-width:0.264583"
       xml:space="preserve"><tspan
         id="tspan5245"
         x="663.83673"
         y="565.92383"
         style="font-size:7.9375px;line-height:1.25;font-family:sans-serif;stroke-width:0.264583">266</tspan></text>
    <text
       xml:space="preserve"
       style="font-style:normal;font-variant:normal;font-weight:normal;font-stretch:normal;font-size:3.175px;line-height:0%;font-family:sans-serif;-inkscape-font-specification:Sans;text-align:start;letter-spacing:0px;word-spacing:0px;writing-mode:lr-tb;text-anchor:start;fill:#000000;fill-opacity:1;stroke:#000000;stroke-width:0.0529167;stroke-miterlimit:4;stroke-dasharray:none;stroke-opacity:1"
       x="642.22375"
       y="571.46942"
       id="text7933"><tspan
         id="tspan7935"
         x="642.22375"
         y="571.46942"
         style="font-size:3.43958px;line-height:1.25;font-family:sans-serif;stroke-width:0.0529167">Vcc</tspan></text>
    <path
       id="path7999"
       d="m 665.7089,583.73632 c 0,0.39398 0.31939,0.71337 0.71336,0.71337 0.39398,0 0.71337,-0.31939 0.71337,-0.71337 0,-0.39398 -0.31939,-0.71336 -0.71337,-0.71336 -0.39397,0 -0.71336,0.31938 -0.71336,0.71336 z"
       style="fill:#ffffff;fill-opacity:1;stroke:#000000;stroke-width:0.396875;stroke-linecap:round;stroke-linejoin:round;stroke-miterlimit:4;stroke-dasharray:none;stroke-opacity:1" />
    <path
       style="fill:#ffffff;fill-opacity:1;stroke:#000000;stroke-width:0.396875;stroke-linecap:round;stroke-linejoin:round;stroke-miterlimit:4;stroke-dasharray:none;stroke-opacity:1"
       d="m 683.5214,583.73632 c 0,0.39398 -0.31939,0.71337 -0.71337,0.71337 -0.39397,0 -0.71336,-0.31939 -0.71336,-0.71337 0,-0.39398 0.31939,-0.71336 0.71336,-0.71336 0.39398,0 0.71337,0.31938 0.71337,0.71336 z"
       id="path8001" />
    <path
       id="path8003"
       d="m 675.0839,594.98632 c 0,0.39398 -0.31939,0.71337 -0.71337,0.71337 -0.39397,0 -0.71336,-0.31939 -0.71336,-0.71337 0,-0.39398 0.31939,-0.71337 0.71336,-0.71337 0.39398,0 0.71337,0.31939 0.71337,0.71337 z"
       style="fill:#ffffff;fill-opacity:1;stroke:#000000;stroke-width:0.396875;stroke-linecap:round;stroke-linejoin:round;stroke-miterlimit:4;stroke-dasharray:none;stroke-opacity:1" />
    <path
       style="fill:#ffffff;fill-opacity:1;stroke:#000000;stroke-width:0.396875;stroke-linecap:round;stroke-linejoin:round;stroke-miterlimit:4;stroke-dasharray:none;stroke-opacity:1"
       d="m 657.2714,594.98632 c 0,0.39398 0.31938,0.71337 0.71336,0.71337 0.39397,0 0.71337,-0.31939 0.71337,-0.71337 0,-0.39398 -0.3194,-0.71337 -0.71337,-0.71337 -0.39398,0 -0.71336,0.31939 -0.71336,0.71337 z"
       id="path8005" />
  </g>
</svg>
