<?xml version="1.0" encoding="UTF-8" standalone="no"?>
<svg
   width="33.073238"
   height="38"
   viewBox="0 0 8.7506278 10.054165"
   version="1.1"
   id="svg871"
   xmlns="http://www.w3.org/2000/svg"
   xmlns:svg="http://www.w3.org/2000/svg"
   xmlns:rdf="http://www.w3.org/1999/02/22-rdf-syntax-ns#"
   xmlns:cc="http://creativecommons.org/ns#"
   xmlns:dc="http://purl.org/dc/elements/1.1/">
  <defs
     id="defs865">
    <linearGradient
       id="linearGradient3468">
      <stop
         id="stop3470"
         offset="0"
         style="stop-color:#fdfdfc;stop-opacity:0.78431374" />
      <stop
         id="stop3472"
         offset="1"
         style="stop-color:#ffffff;stop-opacity:0.05172414" />
    </linearGradient>
    <linearGradient
       id="linearGradient5197">
      <stop
         offset="0"
         style="stop-color:#000000;stop-opacity:1"
         id="stop5199" />
      <stop
         offset="1"
         style="stop-color:#ffffff;stop-opacity:1"
         id="stop5201" />
    </linearGradient>
    <linearGradient
       id="linearGradient3225">
      <stop
         offset="0"
         style="stop-color:#000000;stop-opacity:0.71951222"
         id="stop3227" />
      <stop
         offset="1"
         style="stop-color:#ffffff;stop-opacity:0"
         id="stop3229" />
    </linearGradient>
    <linearGradient
       id="linearGradient23837">
      <stop
         offset="0"
         style="stop-color:#ffba00;stop-opacity:1"
         id="stop23839" />
      <stop
         offset="1"
         style="stop-color:#ffffba;stop-opacity:1"
         id="stop23841" />
    </linearGradient>
  </defs>
  <metadata
     id="metadata868">
    <rdf:RDF>
      <cc:Work
         rdf:about="">
        <dc:format>image/svg+xml</dc:format>
        <dc:type
           rdf:resource="http://purl.org/dc/dcmitype/StillImage" />
      </cc:Work>
    </rdf:RDF>
  </metadata>
  <g
     id="layer1"
     transform="translate(132.1534,61.009923)">
    <g
       id="g32664"
       transform="matrix(0.32432842,0,0,0.32432842,-89.292297,-41.22267)">
      <path
         style="fill:#60cc7e;fill-opacity:1;stroke:#105323;stroke-width:1;stroke-linecap:round;stroke-linejoin:round;stroke-miterlimit:4;stroke-dasharray:none;stroke-opacity:1"
         d="m -131.65341,-53.009933 12.99038,7.5 12.99038,-7.5 -12.99038,-7.5 z"
         id="path54" />
      <path
         style="fill:#1a8638;fill-opacity:1;stroke:#105323;stroke-width:1;stroke-linecap:round;stroke-linejoin:round;stroke-miterlimit:4;stroke-dasharray:none;stroke-opacity:1"
         d="m -131.65341,-53.009933 v 15 l 12.99038,7.5 v -15 z"
         id="path56" />
      <path
         style="fill:#24b94d;fill-opacity:1;stroke:#105323;stroke-width:1;stroke-linecap:round;stroke-linejoin:round;stroke-miterlimit:4;stroke-dasharray:none;stroke-opacity:1"
         d="m -118.66303,-30.509933 v -15 l 12.99038,-7.5 v 15 z"
         id="path58" />
      <g
         id="g6595"
         transform="matrix(1.0851183,0.62649334,0,1.264823,-228.64836,-164.37936)">
        <circle
           r="3.8971143"
           cy="49.706059"
           cx="95.372223"
           id="circle6583"
           style="opacity:1;fill:#ffffff;fill-opacity:1;stroke:#4480c8;stroke-width:0.3;stroke-linecap:round;stroke-linejoin:round;stroke-miterlimit:4;stroke-dasharray:none;stroke-opacity:1" />
        <circle
           style="opacity:1;fill:#8cc63e;fill-opacity:1;stroke:none;stroke-width:0.263329;stroke-linecap:round;stroke-linejoin:round;stroke-miterlimit:4;stroke-dasharray:none;stroke-opacity:1"
           id="circle6585"
           cx="95.372223"
           cy="49.706059"
           r="3.4207487" />
        <g
           transform="matrix(1.1730148,0,0,1.1730148,-16.500806,-8.599884)"
           id="g6593"
           style="font-style:normal;font-weight:normal;font-size:2.38015px;line-height:1.25;font-family:sans-serif;letter-spacing:0px;word-spacing:0px;fill:#ffffff;fill-opacity:1;stroke:none;stroke-width:0.0595036"
           aria-label="AIX">
          <path
             id="path6587"
             style="font-style:normal;font-variant:normal;font-weight:bold;font-stretch:normal;font-family:sans-serif;-inkscape-font-specification:'sans-serif Bold';fill:#ffffff;fill-opacity:1;stroke-width:0.0595036"
             d="m 94.379717,50.257514 h -0.699633 l -0.110407,0.316113 h -0.449764 l 0.642686,-1.735135 h 0.533441 l 0.642686,1.735135 H 94.488962 Z M 93.791654,49.93559 h 0.475332 l -0.237085,-0.690335 z" />
          <path
             id="path6589"
             style="font-style:normal;font-variant:normal;font-weight:bold;font-stretch:normal;font-family:sans-serif;-inkscape-font-specification:'sans-serif Bold';fill:#ffffff;fill-opacity:1;stroke-width:0.0595036"
             d="m 95.167675,48.838492 h 0.44744 v 1.735135 h -0.44744 z" />
          <path
             id="path6591"
             style="font-style:normal;font-variant:normal;font-weight:bold;font-stretch:normal;font-family:sans-serif;-inkscape-font-specification:'sans-serif Bold';fill:#ffffff;fill-opacity:1;stroke-width:0.0595036"
             d="m 97.022515,49.688046 0.60201,0.885581 h -0.466034 l -0.405601,-0.592712 -0.402115,0.592712 h -0.468359 l 0.60201,-0.885581 -0.578766,-0.849554 h 0.467197 l 0.380033,0.559009 0.37887,-0.559009 h 0.469521 z" />
        </g>
      </g>
    </g>
  </g>
</svg>
