<?xml version="1.0" encoding="UTF-8" standalone="no"?>
<!-- Created with Inkscape (http://www.inkscape.org/) -->

<svg
   version="1.0"
   width="15.481732"
   height="15"
   id="svg2"
   xmlns:xlink="http://www.w3.org/1999/xlink"
   xmlns="http://www.w3.org/2000/svg"
   xmlns:svg="http://www.w3.org/2000/svg">
  <defs
     id="defs4">
    <linearGradient
       id="linearGradient23837">
      <stop
         id="stop23839"
         style="stop-color:#ffba00;stop-opacity:1"
         offset="0" />
      <stop
         id="stop23841"
         style="stop-color:#ffffba;stop-opacity:1"
         offset="1" />
    </linearGradient>
    <linearGradient
       id="linearGradient10084">
      <stop
         id="stop10086"
         style="stop-color:#000000;stop-opacity:1"
         offset="0" />
      <stop
         id="stop10088"
         style="stop-color:#000000;stop-opacity:0"
         offset="1" />
    </linearGradient>
    <linearGradient
       id="linearGradient5197">
      <stop
         id="stop5199"
         style="stop-color:#000000;stop-opacity:1"
         offset="0" />
      <stop
         id="stop5201"
         style="stop-color:#ffffff;stop-opacity:1"
         offset="1" />
    </linearGradient>
    <linearGradient
       id="linearGradient3225">
      <stop
         id="stop3227"
         style="stop-color:#000000;stop-opacity:0.71951222"
         offset="0" />
      <stop
         id="stop3229"
         style="stop-color:#ffffff;stop-opacity:0"
         offset="1" />
    </linearGradient>
    <linearGradient
       x1="263.61029"
       y1="435.38452"
       x2="358.50229"
       y2="314.54004"
       id="linearGradient7163"
       xlink:href="#linearGradient5197"
       gradientUnits="userSpaceOnUse"
       spreadMethod="reflect"
       gradientTransform="matrix(1.6597987,0,0,1.5671594,-315.8768,-358.60667)" />
    <linearGradient
       x1="353.82788"
       y1="353.77969"
       x2="370.98239"
       y2="331.95367"
       id="linearGradient10090"
       xlink:href="#linearGradient5197"
       gradientUnits="userSpaceOnUse"
       gradientTransform="matrix(1.7904309,0,0,1.5914941,-364.7002,-368.04162)" />
    <linearGradient
       x1="353.82788"
       y1="353.77969"
       x2="370.98239"
       y2="331.95367"
       id="linearGradient10111"
       xlink:href="#linearGradient5197"
       gradientUnits="userSpaceOnUse" />
    <linearGradient
       x1="283.11636"
       y1="420.78415"
       x2="450.77399"
       y2="341.96973"
       id="linearGradient11090"
       xlink:href="#linearGradient5197"
       gradientUnits="userSpaceOnUse"
       gradientTransform="matrix(1.7780927,0,0,1.9037854,-374.5503,-475.54954)" />
    <linearGradient
       x1="278.7821"
       y1="598.48175"
       x2="300.01877"
       y2="538.17981"
       id="linearGradient23835"
       xlink:href="#linearGradient23837"
       gradientUnits="userSpaceOnUse"
       gradientTransform="matrix(1.7348179,0,0,1.8905525,-333.7095,-549.36202)" />
    <linearGradient
       x1="278.7821"
       y1="598.48175"
       x2="300.01877"
       y2="538.17981"
       id="linearGradient3203"
       xlink:href="#linearGradient23837"
       gradientUnits="userSpaceOnUse"
       gradientTransform="matrix(1.7348179,0,0,1.8905525,-52.55231,-549.36202)" />
    <linearGradient
       x1="375.17139"
       y1="481.12695"
       x2="375.17139"
       y2="627.55237"
       id="linearGradient5169"
       xlink:href="#linearGradient3225"
       gradientUnits="userSpaceOnUse" />
    <linearGradient
       x1="374.40475"
       y1="322.73111"
       x2="376.95914"
       y2="480.08231"
       id="linearGradient3323"
       xlink:href="#linearGradient3225"
       gradientUnits="userSpaceOnUse"
       gradientTransform="matrix(1.0235525,0,0,1.050454,-12.200122,-42.415783)" />
    <linearGradient
       x1="380.47522"
       y1="608.65906"
       x2="381.77103"
       y2="498.26285"
       id="linearGradient3331"
       xlink:href="#linearGradient3225"
       gradientUnits="userSpaceOnUse" />
    <linearGradient
       x1="351.30554"
       y1="540.31189"
       x2="353.6087"
       y2="645.33484"
       id="linearGradient3347"
       xlink:href="#linearGradient3225"
       gradientUnits="userSpaceOnUse" />
    <linearGradient
       x1="353.82788"
       y1="353.77969"
       x2="370.98239"
       y2="331.95367"
       id="linearGradient2254"
       xlink:href="#linearGradient5197"
       gradientUnits="userSpaceOnUse" />
    <linearGradient
       x1="416.03726"
       y1="314.99216"
       x2="416.67383"
       y2="287.50903"
       id="linearGradient2365"
       xlink:href="#linearGradient5197"
       gradientUnits="userSpaceOnUse"
       gradientTransform="matrix(1.5914941,0,0,1.5914941,-290.4104,-368.04162)" />
    <linearGradient
       x1="333.62714"
       y1="305.53073"
       x2="338.83194"
       y2="276.24545"
       id="linearGradient2368"
       xlink:href="#linearGradient5197"
       gradientUnits="userSpaceOnUse"
       gradientTransform="matrix(1.5914941,0,0,1.5914941,-290.4104,-368.04162)" />
    <linearGradient
       x1="379.11264"
       y1="378.87973"
       x2="383.80917"
       y2="225.32318"
       id="linearGradient2371"
       xlink:href="#linearGradient5197"
       gradientUnits="userSpaceOnUse"
       gradientTransform="matrix(1.5914941,0,0,1.5914941,-290.4104,-368.04162)"
       spreadMethod="repeat" />
    <linearGradient
       x1="267.00482"
       y1="450.1579"
       x2="195.34068"
       y2="423.26831"
       id="linearGradient2375"
       xlink:href="#linearGradient5197"
       gradientUnits="userSpaceOnUse"
       gradientTransform="matrix(1.5914941,0,0,1.5914941,-290.4104,-368.04162)" />
    <linearGradient
       x1="346.8956"
       y1="409.87292"
       x2="406.49899"
       y2="371.66501"
       id="linearGradient2379"
       xlink:href="#linearGradient23837"
       gradientUnits="userSpaceOnUse"
       gradientTransform="matrix(1.5914941,0,0,1.5914941,-290.4104,-368.04162)" />
    <linearGradient
       x1="228.8004"
       y1="401.76709"
       x2="361.57016"
       y2="343.16568"
       id="linearGradient2382"
       xlink:href="#linearGradient5197"
       gradientUnits="userSpaceOnUse"
       gradientTransform="matrix(1.5914941,0,0,1.5914941,-290.4104,-368.04162)" />
    <linearGradient
       x1="335.76212"
       y1="383.67514"
       x2="432.98227"
       y2="334.34232"
       id="linearGradient2385"
       xlink:href="#linearGradient5197"
       gradientUnits="userSpaceOnUse"
       gradientTransform="matrix(1.5914941,0,0,1.5914941,-290.4104,-368.04162)" />
    <linearGradient
       x1="584.44714"
       y1="496.83411"
       x2="411.60892"
       y2="312.98669"
       id="linearGradient2388"
       xlink:href="#linearGradient5197"
       gradientUnits="userSpaceOnUse"
       gradientTransform="matrix(1.5914941,0,0,1.5914941,-290.4104,-368.04162)" />
    <linearGradient
       x1="533.03326"
       y1="446.52438"
       x2="547.33417"
       y2="428.58325"
       id="linearGradient2392"
       xlink:href="#linearGradient3225"
       gradientUnits="userSpaceOnUse"
       gradientTransform="matrix(1.5914941,0,0,1.5914941,-290.4104,-368.04162)" />
    <linearGradient
       x1="263.61029"
       y1="435.38452"
       x2="358.50229"
       y2="314.54004"
       id="linearGradient7163-0"
       xlink:href="#linearGradient5197"
       gradientUnits="userSpaceOnUse"
       spreadMethod="reflect" />
    <linearGradient
       x1="533.03326"
       y1="446.52438"
       x2="547.33417"
       y2="428.58325"
       id="linearGradient2392-5"
       xlink:href="#linearGradient3225"
       gradientUnits="userSpaceOnUse"
       gradientTransform="matrix(1.5914941,0,0,1.5914941,-1056.2044,29.12901)" />
    <linearGradient
       x1="283.11636"
       y1="420.78415"
       x2="450.77399"
       y2="341.96973"
       id="linearGradient11090-4"
       xlink:href="#linearGradient5197"
       gradientUnits="userSpaceOnUse" />
    <linearGradient
       x1="584.44714"
       y1="496.83411"
       x2="411.60892"
       y2="312.98669"
       id="linearGradient2388-1"
       xlink:href="#linearGradient5197"
       gradientUnits="userSpaceOnUse"
       gradientTransform="matrix(1.5914941,0,0,1.5914941,-1056.2044,29.12901)" />
    <linearGradient
       x1="335.76212"
       y1="383.67514"
       x2="432.98227"
       y2="334.34232"
       id="linearGradient2385-5"
       xlink:href="#linearGradient5197"
       gradientUnits="userSpaceOnUse"
       gradientTransform="matrix(1.5914941,0,0,1.5914941,-1056.2044,29.12901)" />
    <linearGradient
       x1="228.8004"
       y1="401.76709"
       x2="361.57016"
       y2="343.16568"
       id="linearGradient2382-1"
       xlink:href="#linearGradient5197"
       gradientUnits="userSpaceOnUse"
       gradientTransform="matrix(1.5914941,0,0,1.5914941,-1056.2044,29.12901)" />
    <linearGradient
       x1="346.8956"
       y1="409.87292"
       x2="406.49899"
       y2="371.66501"
       id="linearGradient2379-8"
       xlink:href="#linearGradient23837"
       gradientUnits="userSpaceOnUse"
       gradientTransform="matrix(1.5914941,0,0,1.5914941,-1056.2044,29.12901)" />
    <linearGradient
       x1="267.00482"
       y1="450.1579"
       x2="195.34068"
       y2="423.26831"
       id="linearGradient2375-6"
       xlink:href="#linearGradient5197"
       gradientUnits="userSpaceOnUse"
       gradientTransform="matrix(1.5914941,0,0,1.5914941,-1056.2044,29.12901)" />
    <linearGradient
       x1="379.11264"
       y1="378.87973"
       x2="383.80917"
       y2="225.32318"
       id="linearGradient2371-2"
       xlink:href="#linearGradient5197"
       gradientUnits="userSpaceOnUse"
       gradientTransform="matrix(1.5914941,0,0,1.5914941,-1056.2044,29.12901)"
       spreadMethod="repeat" />
    <linearGradient
       x1="333.62714"
       y1="305.53073"
       x2="338.83194"
       y2="276.24545"
       id="linearGradient2368-3"
       xlink:href="#linearGradient5197"
       gradientUnits="userSpaceOnUse"
       gradientTransform="matrix(1.5914941,0,0,1.5914941,-1056.2044,29.12901)" />
    <linearGradient
       x1="416.03726"
       y1="314.99216"
       x2="416.67383"
       y2="287.50903"
       id="linearGradient2365-2"
       xlink:href="#linearGradient5197"
       gradientUnits="userSpaceOnUse"
       gradientTransform="matrix(1.5914941,0,0,1.5914941,-1056.2044,29.12901)" />
    <linearGradient
       x1="278.7821"
       y1="598.48175"
       x2="300.01877"
       y2="538.17981"
       id="linearGradient23835-0"
       xlink:href="#linearGradient23837"
       gradientUnits="userSpaceOnUse" />
    <radialGradient
       xlink:href="#linearGradient6062"
       id="radialGradient6078"
       cx="604.57355"
       cy="-19.574995"
       fx="604.57355"
       fy="-19.574995"
       r="94.627533"
       gradientUnits="userSpaceOnUse"
       gradientTransform="matrix(0.18475678,0,0,0.19818494,-349.88821,986.84648)" />
    <linearGradient
       id="linearGradient6062">
      <stop
         style="stop-color:#94ef16;stop-opacity:1"
         offset="0"
         id="stop6064" />
      <stop
         style="stop-color:#557334;stop-opacity:1"
         offset="1"
         id="stop6066" />
    </linearGradient>
    <linearGradient
       xlink:href="#linearGradient3468"
       id="linearGradient6084"
       x1="604.547"
       y1="-104.44051"
       x2="604.547"
       y2="-0.038252577"
       gradientUnits="userSpaceOnUse"
       gradientTransform="matrix(0.1661641,0,0,0.1661641,-338.64757,986.21967)" />
    <linearGradient
       id="linearGradient3468">
      <stop
         id="stop3470"
         offset="0"
         style="stop-color:#fdfdfc;stop-opacity:0.78431374" />
      <stop
         id="stop3472"
         offset="1"
         style="stop-color:#ffffff;stop-opacity:0.05172414" />
    </linearGradient>
    <radialGradient
       xlink:href="#linearGradient6062"
       id="radialGradient6078-6"
       cx="604.57355"
       cy="-19.574995"
       fx="604.57355"
       fy="-19.574995"
       r="94.627533"
       gradientUnits="userSpaceOnUse"
       gradientTransform="matrix(0.18475678,0,0,0.19818494,-349.88821,986.84648)" />
    <linearGradient
       xlink:href="#linearGradient3468"
       id="linearGradient6084-8"
       x1="604.547"
       y1="-104.44051"
       x2="604.547"
       y2="-0.038252577"
       gradientUnits="userSpaceOnUse"
       gradientTransform="matrix(0.1661641,0,0,0.1661641,-338.64757,986.21967)" />
  </defs>
  <g
     id="g7925"
     transform="scale(0.02543596)">
    <path
       id="path886"
       style="fill:#070707;fill-opacity:1;fill-rule:evenodd;stroke:none;stroke-width:1px;stroke-linecap:butt;stroke-linejoin:miter;stroke-opacity:1"
       d="M 304.32761,2.7319e-4 C 289.21561,-0.02602702 273.95271,1.8461681 258.86083,5.7991013 202.1303,20.658201 153.4236,65.974286 135.8081,120.28347 c -5.54542,17.0967 -6.58713,23.51065 -8.23242,50.74415 -4.01978,66.5371 -18.42294,92.99525 -75.59766,138.87695 -20.06183,16.0993 -27.44672,23.27062 -39.57226,38.41992 -10.44588,13.0507 -13.23822,19.49778 -12.20508,28.17578 0.70813,5.9482 1.63788,7.52527 5.5332,9.38477 5.3235,2.5413 6.86736,1.92216 33.51367,-13.43164 27.38226,-15.7778 44.51314,-22.88337 47.63672,-19.75977 0.92342,0.9234 2.15364,8.98818 2.73438,17.92188 2.49465,38.3764 14.28038,72.60836 36.59179,106.28906 8.94695,13.506 11.87386,16.83108 14.26758,16.20508 64.4626,51.30089 77.56593,80.7702 163.84959,79.90131 92.47379,-0.93122 127.01172,-48.68662 163.8496,-79.90131 2.3937,0.626 5.3207,-2.69908 14.2676,-16.20508 22.3114,-33.6807 34.0971,-67.91266 36.5918,-106.28906 0.5807,-8.9337 1.811,-16.99848 2.7344,-17.92188 3.1236,-3.1236 20.2544,3.98197 47.6367,19.75977 26.6463,15.3538 28.1902,15.97294 33.5137,13.43164 3.8953,-1.8595 4.8251,-3.43657 5.5332,-9.38477 1.0332,-8.678 -1.7592,-15.12508 -12.2051,-28.17578 -12.1255,-15.1493 -19.5105,-22.32062 -39.5723,-38.41992 -57.1747,-45.8817 -71.5779,-72.33985 -75.5976,-138.87695 -1.6453,-27.2335 -2.6869,-33.64745 -8.2324,-50.74415 C 455.23171,65.974286 406.52491,20.658201 349.79441,5.7991013 334.70251,1.8461681 319.43961,-0.02602701 304.32761,2.7319e-4 Z" />
    <ellipse
       style="fill:#d9d9d9;fill-opacity:1;stroke:none;stroke-width:1.91689;stroke-linecap:round;stroke-linejoin:round;stroke-dasharray:5.75069, 5.75069;stroke-opacity:0.33"
       id="path4560"
       cx="243.1557"
       cy="171.86057"
       rx="59.291775"
       ry="74.010658" />
    <ellipse
       style="fill:#d9d9d9;fill-opacity:1;stroke:none;stroke-width:1.63751;stroke-linecap:round;stroke-linejoin:round;stroke-dasharray:4.91252, 4.91252;stroke-opacity:0.33"
       id="ellipse4642"
       cx="177.46297"
       cy="-364.9342"
       rx="53.498528"
       ry="59.857224"
       transform="rotate(90)" />
    <ellipse
       style="fill:#070707;fill-opacity:1;stroke:none;stroke-width:1.89659;stroke-linecap:round;stroke-linejoin:round;stroke-dasharray:5.68979, 5.68979;stroke-opacity:0.33"
       id="path4702"
       cx="282.6189"
       cy="176.41843"
       rx="17.409729"
       ry="27.464876" />
    <ellipse
       style="fill:#070707;fill-opacity:1;stroke:none;stroke-width:1.69948;stroke-linecap:round;stroke-linejoin:round;stroke-dasharray:5.09847, 5.09847;stroke-opacity:0.33"
       id="ellipse4784"
       cx="323.08276"
       cy="179.27274"
       rx="15.600407"
       ry="24.610565" />
    <path
       id="path3099"
       style="fill:#f2f2f2;fill-opacity:1;stroke-width:0.942594;stroke-linecap:round;stroke-linejoin:round"
       d="m 304.32812,223.06641 c -28.72676,0 -66.30737,6.94214 -88.11914,20.61914 -61.72657,38.70544 -80.74218,109.11959 -80.74218,150.54883 0,11.2508 -0.55094,61.37716 18.1875,92.40429 31.62398,52.36301 81.19812,68.73383 150.67382,68.73438 69.47572,-5.5e-4 119.0479,-16.37137 150.67188,-68.73438 18.73844,-31.02713 18.1875,-81.15349 18.1875,-92.40429 0,-41.42924 -19.01562,-111.84339 -80.74219,-150.54883 -21.81177,-13.677 -59.39042,-20.61914 -88.11719,-20.61914 z" />
    <path
       id="path3487"
       style="fill:#f4c80b;fill-opacity:1;stroke:none;stroke-width:1.14161px;stroke-linecap:butt;stroke-linejoin:miter;stroke-opacity:1"
       d="m 304.32761,205.703 c -29.4593,0.36341 -60.16498,14.49633 -62.65929,28.41098 -2.79114,15.57062 40.21086,54.30948 53.37707,68.95825 2.43242,2.70641 5.81913,4.09464 9.28222,3.91091 3.46319,0.18373 6.8499,-1.2045 9.28232,-3.91091 13.16621,-14.64877 56.16822,-53.38763 53.37709,-68.95825 -2.49431,-13.91465 -33.20001,-28.04757 -62.65941,-28.41098 z" />
    <path
       d="m 96.071,587.49677 c -13.84107,-4.93502 -19.59754,-14.08905 -18.61506,-31.06055 1.41399,-24.4259 17.13171,-42.84467 50.37159,-58.13837 20.32292,-9.3506 35.56386,-10.74832 62.03517,-10.46945 16.332,0.17205 28.49089,2.73162 40.0176,6.43632 25.67941,8.2534 44.17611,22.84028 53.40751,39.80138 4.8235,8.8624 7.208,23.62745 5.2493,34.06785 -1.3849,7.3827 -7.9268,15.0295 -15.9914,18.69282 -5.97689,2.7149 -12.22949,2.9191 -88.39377,2.8867 -65.31735,-0.028 -83.20457,-0.478 -88.08094,-2.2167 z"
       id="path3017"
       style="fill:#f4c80b;fill-opacity:1" />
    <path
       d="m 512.58431,587.49677 c 13.8411,-4.93502 19.5975,-14.08905 18.6151,-31.06055 -1.414,-24.4259 -17.1317,-42.84467 -50.3716,-58.13837 -20.3229,-9.3506 -35.5639,-10.74832 -62.0352,-10.46945 -16.332,0.17205 -28.4909,2.73162 -40.0176,6.43632 -25.6794,8.2534 -44.1761,22.84028 -53.4075,39.80138 -4.8235,8.8624 -7.208,23.62745 -5.2493,34.06785 1.3849,7.3827 7.9268,15.0295 15.9914,18.69282 5.9769,2.7149 12.2295,2.9191 88.3938,2.8867 65.3173,-0.028 83.2045,-0.478 88.0809,-2.2167 z"
       id="path17575"
       style="fill:#f4c80b;fill-opacity:1" />
  </g>
</svg>
