<?xml version="1.0" encoding="UTF-8" standalone="no"?>
<!-- Created with Inkscape (http://www.inkscape.org/) -->

<svg
   width="62.536465mm"
   height="49.518444mm"
   viewBox="0 0 62.536465 49.518444"
   version="1.1"
   id="svg2552"
   xmlns="http://www.w3.org/2000/svg"
   xmlns:svg="http://www.w3.org/2000/svg">
  <defs
     id="defs2549" />
  <g
     id="layer1"
     transform="translate(69.02247,-169.04587)">
    <path
       style="fill:none;stroke:#000000;stroke-width:0.396875;stroke-linecap:round;stroke-linejoin:round;stroke-miterlimit:4;stroke-dasharray:none;stroke-opacity:1"
       d="m -49.004241,184.12595 v -2.8125 h 5.625005 v 2.8125 z"
       id="path5818" />
    <path
       id="path5820"
       d="m -57.44174,184.12595 v -2.8125 h 5.625 v 2.8125 z"
       style="fill:none;stroke:#000000;stroke-width:0.396875;stroke-linecap:round;stroke-linejoin:round;stroke-miterlimit:4;stroke-dasharray:none;stroke-opacity:1" />
    <path
       style="fill:none;stroke:#000000;stroke-width:0.396875;stroke-linecap:round;stroke-linejoin:round;stroke-miterlimit:4;stroke-dasharray:none;stroke-opacity:1"
       d="m -65.879241,184.12595 v -2.8125 h 5.625002 v 2.8125 z"
       id="path5822" />
    <path
       id="path5824"
       d="m -23.691736,184.12595 v -2.8125 h 5.624999 v 2.8125 z"
       style="fill:none;stroke:#000000;stroke-width:0.396875;stroke-linecap:round;stroke-linejoin:round;stroke-miterlimit:4;stroke-dasharray:none;stroke-opacity:1" />
    <path
       style="fill:none;stroke:#000000;stroke-width:0.396875;stroke-linecap:round;stroke-linejoin:round;stroke-miterlimit:4;stroke-dasharray:none;stroke-opacity:1"
       d="m -32.129238,184.12595 v -2.8125 h 5.625 v 2.8125 z"
       id="path5826" />
    <path
       id="path5828"
       d="m -40.566739,184.12595 v -2.8125 h 5.625002 v 2.8125 z"
       style="fill:none;stroke:#000000;stroke-width:0.396875;stroke-linecap:round;stroke-linejoin:round;stroke-miterlimit:4;stroke-dasharray:none;stroke-opacity:1" />
    <path
       style="fill:none;stroke:#000000;stroke-width:0.396875;stroke-linecap:round;stroke-linejoin:round;stroke-miterlimit:4;stroke-dasharray:none;stroke-opacity:1"
       d="m -15.254237,184.12595 v -2.8125 h 5.6250017 v 2.8125 z"
       id="path5830" />
    <path
       style="fill:none;stroke:#000000;stroke-width:0.661458;stroke-linecap:round;stroke-linejoin:round;stroke-miterlimit:4;stroke-dasharray:none;stroke-opacity:1"
       d="m -68.691741,184.12595 h 61.8750053 v 28.125 H -68.691741 Z"
       id="path5832" />
    <path
       style="fill:none;stroke:#000000;stroke-width:0.661458;stroke-linecap:round;stroke-linejoin:round;stroke-miterlimit:4;stroke-dasharray:none;stroke-opacity:1"
       d="m -68.691741,195.84854 v 4.67982 c 1.294419,0 2.339909,-1.04549 2.339909,-2.33991 0,-1.29442 -1.04549,-2.33991 -2.339909,-2.33991 z"
       id="path5834" />
    <path
       style="fill:none;stroke:#000000;stroke-width:0.396875;stroke-linecap:round;stroke-linejoin:round;stroke-miterlimit:4;stroke-dasharray:none;stroke-opacity:1"
       d="m -23.691736,187.87595 h 6.5625 v 9.375 h -6.5625 z"
       id="path5852" />
    <path
       style="fill:none;stroke:#000000;stroke-width:0.396875;stroke-linecap:round;stroke-linejoin:round;stroke-miterlimit:4;stroke-dasharray:none;stroke-opacity:1"
       d="m -49.941739,201.00095 v -6.5625 h -9.375 v 6.5625 z"
       id="path5860" />
    <path
       id="path5868"
       d="m -49.004241,215.06345 v -2.8125 h 5.625005 v 2.8125 z"
       style="fill:none;stroke:#000000;stroke-width:0.396875;stroke-linecap:round;stroke-linejoin:round;stroke-miterlimit:4;stroke-dasharray:none;stroke-opacity:1" />
    <path
       style="fill:none;stroke:#000000;stroke-width:0.396875;stroke-linecap:round;stroke-linejoin:round;stroke-miterlimit:4;stroke-dasharray:none;stroke-opacity:1"
       d="m -57.44174,215.06345 v -2.8125 h 5.625 v 2.8125 z"
       id="path5870" />
    <path
       id="path5872"
       d="m -65.879241,215.06345 v -2.8125 h 5.625002 v 2.8125 z"
       style="fill:none;stroke:#000000;stroke-width:0.396875;stroke-linecap:round;stroke-linejoin:round;stroke-miterlimit:4;stroke-dasharray:none;stroke-opacity:1" />
    <path
       style="fill:none;stroke:#000000;stroke-width:0.396875;stroke-linecap:round;stroke-linejoin:round;stroke-miterlimit:4;stroke-dasharray:none;stroke-opacity:1"
       d="m -23.691736,215.06345 v -2.8125 h 5.624999 v 2.8125 z"
       id="path5874" />
    <path
       id="path5876"
       d="m -32.129238,215.06345 v -2.8125 h 5.625 v 2.8125 z"
       style="fill:none;stroke:#000000;stroke-width:0.396875;stroke-linecap:round;stroke-linejoin:round;stroke-miterlimit:4;stroke-dasharray:none;stroke-opacity:1" />
    <path
       style="fill:none;stroke:#000000;stroke-width:0.396875;stroke-linecap:round;stroke-linejoin:round;stroke-miterlimit:4;stroke-dasharray:none;stroke-opacity:1"
       d="m -40.566739,215.06345 v -2.8125 h 5.625002 v 2.8125 z"
       id="path5878" />
    <path
       id="path5880"
       d="m -15.254237,215.06345 v -2.8125 h 5.6250017 v 2.8125 z"
       style="fill:none;stroke:#000000;stroke-width:0.396875;stroke-linecap:round;stroke-linejoin:round;stroke-miterlimit:4;stroke-dasharray:none;stroke-opacity:1" />
    <path
       id="path5882"
       d="m -32.129238,208.50095 h 6.5625 v -9.375 h -6.5625 z"
       style="fill:none;stroke:#000000;stroke-width:0.396875;stroke-linecap:round;stroke-linejoin:round;stroke-miterlimit:4;stroke-dasharray:none;stroke-opacity:1" />
    <text
       xml:space="preserve"
       style="font-style:normal;font-variant:normal;font-weight:normal;font-stretch:normal;font-size:3.175px;line-height:0%;font-family:sans-serif;-inkscape-font-specification:Sans;text-align:start;letter-spacing:0px;word-spacing:0px;writing-mode:lr-tb;text-anchor:start;fill:#000000;fill-opacity:1;stroke:#000000;stroke-width:0.0529167;stroke-miterlimit:4;stroke-dasharray:none;stroke-opacity:1"
       x="-66.339317"
       y="211.28694"
       id="text5836"><tspan
         id="tspan5838"
         x="-66.339317"
         y="211.28694"
         style="font-size:2.64583px;line-height:1.25;font-family:sans-serif;stroke-width:0.0529167">1</tspan></text>
    <text
       id="text5840"
       y="211.28694"
       x="-13.180068"
       style="font-style:normal;font-variant:normal;font-weight:normal;font-stretch:normal;font-size:3.175px;line-height:0%;font-family:sans-serif;-inkscape-font-specification:Sans;text-align:start;letter-spacing:0px;word-spacing:0px;writing-mode:lr-tb;text-anchor:start;fill:#000000;fill-opacity:1;stroke:#000000;stroke-width:0.0529167;stroke-miterlimit:4;stroke-dasharray:none;stroke-opacity:1"
       xml:space="preserve"><tspan
         id="tspan5842"
         x="-13.180068"
         y="211.28694"
         style="font-size:2.64583px;line-height:1.25;font-family:sans-serif;stroke-width:0.0529167">7</tspan></text>
    <text
       xml:space="preserve"
       style="font-style:normal;font-variant:normal;font-weight:normal;font-stretch:normal;font-size:3.175px;line-height:0%;font-family:sans-serif;-inkscape-font-specification:Sans;text-align:start;letter-spacing:0px;word-spacing:0px;writing-mode:lr-tb;text-anchor:start;fill:#000000;fill-opacity:1;stroke:#000000;stroke-width:0.0529167;stroke-miterlimit:4;stroke-dasharray:none;stroke-opacity:1"
       x="-10.812464"
       y="187.04411"
       id="text5844"><tspan
         id="tspan5846"
         x="-10.812464"
         y="187.04411"
         style="font-size:2.64583px;line-height:1.25;font-family:sans-serif;stroke-width:0.0529167">8</tspan></text>
    <text
       id="text5848"
       y="187.04413"
       x="-64.618973"
       style="font-style:normal;font-variant:normal;font-weight:normal;font-stretch:normal;font-size:3.175px;line-height:0%;font-family:sans-serif;-inkscape-font-specification:Sans;text-align:start;letter-spacing:0px;word-spacing:0px;writing-mode:lr-tb;text-anchor:start;fill:#000000;fill-opacity:1;stroke:#000000;stroke-width:0.0529167;stroke-miterlimit:4;stroke-dasharray:none;stroke-opacity:1"
       xml:space="preserve"><tspan
         id="tspan5850"
         x="-64.618973"
         y="187.04413"
         style="font-size:2.64583px;line-height:1.25;font-family:sans-serif;stroke-width:0.0529167">14</tspan></text>
    <text
       id="text5856"
       y="194.25754"
       x="-22.046436"
       style="font-style:normal;font-variant:normal;font-weight:normal;font-stretch:normal;font-size:3.175px;line-height:0%;font-family:sans-serif;-inkscape-font-specification:Sans;text-align:start;letter-spacing:0px;word-spacing:0px;writing-mode:lr-tb;text-anchor:start;fill:#000000;fill-opacity:1;stroke:none;stroke-width:0.264583"
       xml:space="preserve"><tspan
         y="194.25754"
         x="-22.046436"
         id="tspan5858"
         style="font-size:4.7625px;line-height:1.25;font-family:sans-serif;stroke-width:0.264583">&amp;</tspan></text>
    <text
       id="text5864"
       y="199.41379"
       x="-56.265186"
       style="font-style:normal;font-variant:normal;font-weight:normal;font-stretch:normal;font-size:3.175px;line-height:0%;font-family:sans-serif;-inkscape-font-specification:Sans;text-align:start;letter-spacing:0px;word-spacing:0px;writing-mode:lr-tb;text-anchor:start;fill:#000000;fill-opacity:1;stroke:none;stroke-width:0.264583"
       xml:space="preserve"><tspan
         y="199.41379"
         x="-56.265186"
         id="tspan5866"
         style="font-size:4.7625px;line-height:1.25;font-family:sans-serif;stroke-width:0.264583">&amp;</tspan></text>
    <text
       xml:space="preserve"
       style="font-style:normal;font-variant:normal;font-weight:normal;font-stretch:normal;font-size:3.175px;line-height:0%;font-family:sans-serif;-inkscape-font-specification:Sans;text-align:start;letter-spacing:0px;word-spacing:0px;writing-mode:lr-tb;text-anchor:start;fill:#000000;fill-opacity:1;stroke:none;stroke-width:0.264583"
       x="-30.483936"
       y="205.50754"
       id="text5886"><tspan
         id="tspan5888"
         x="-30.483936"
         y="205.50754"
         style="font-size:4.7625px;line-height:1.25;font-family:sans-serif;stroke-width:0.264583">&amp;</tspan></text>
    <text
       xml:space="preserve"
       style="font-style:normal;font-variant:normal;font-weight:normal;font-stretch:normal;font-size:3.175px;line-height:0%;font-family:sans-serif;-inkscape-font-specification:Sans;text-align:start;letter-spacing:0px;word-spacing:0px;writing-mode:lr-tb;text-anchor:start;fill:#000000;fill-opacity:1;stroke:#000000;stroke-width:0.0529167;stroke-miterlimit:4;stroke-dasharray:none;stroke-opacity:1"
       x="-65.926903"
       y="180.32292"
       id="text5890"><tspan
         id="tspan5892"
         x="-65.926903"
         y="180.32292"
         style="font-size:3.43958px;line-height:1.25;font-family:sans-serif;stroke-width:0.0529167">Vcc</tspan></text>
    <text
       xml:space="preserve"
       style="font-style:normal;font-variant:normal;font-weight:normal;font-stretch:normal;font-size:3.175px;line-height:0%;font-family:sans-serif;-inkscape-font-specification:Sans;text-align:start;letter-spacing:0px;word-spacing:0px;writing-mode:lr-tb;text-anchor:start;fill:#000000;fill-opacity:1;stroke:#000000;stroke-width:0.0529167;stroke-miterlimit:4;stroke-dasharray:none;stroke-opacity:1"
       x="-16.263407"
       y="218.49586"
       id="text5894"><tspan
         id="tspan5896"
         x="-16.263407"
         y="218.49586"
         style="font-size:3.43958px;line-height:1.25;font-family:sans-serif;stroke-width:0.0529167">GND</tspan></text>
    <text
       xml:space="preserve"
       style="font-style:normal;font-variant:normal;font-weight:normal;font-stretch:normal;font-size:3.175px;line-height:0%;font-family:sans-serif;-inkscape-font-specification:Sans;text-align:start;letter-spacing:0px;word-spacing:0px;writing-mode:lr-tb;text-anchor:start;fill:#000000;fill-opacity:1;stroke:none;stroke-width:0.264583"
       x="-41.874142"
       y="174.75095"
       id="text5898"><tspan
         y="174.75095"
         x="-41.874142"
         id="tspan5900"
         style="font-size:7.9375px;line-height:1.25;font-family:sans-serif;stroke-width:0.264583">11</tspan></text>
    <path
       id="path3645"
       style="fill:none;stroke:#000000;stroke-width:0.396875;stroke-linecap:butt;stroke-linejoin:miter;stroke-miterlimit:4;stroke-dasharray:none;stroke-opacity:1"
       d="m -54.62924,194.43845 v -2.8125 h 8.437502 v -7.5 m -5.625002,16.875 v 8.4375 h -2.8125 v 2.8125 m -2.8125,-11.25 v 2.8125 h -4.687501 v -15 h 7.500001 v -4.6875 m 0,16.875 v 5.625 h -8.437499 v 5.625" />
    <path
       id="path3647"
       style="fill:none;stroke:#000000;stroke-width:0.396875;stroke-linecap:butt;stroke-linejoin:miter;stroke-miterlimit:4;stroke-dasharray:none;stroke-opacity:1"
       d="m -46.191738,212.25095 v -11.25 h 14.062498 m 6.562502,2.8125 h 4.687499 v 8.4375 m -11.250001,-8.4375 h -5.625 l 3e-6,8.4375 m 5.624999,-5.625 h -2.812499 v 3.75 h 5.624999 v 1.875" />
    <path
       id="path3649"
       style="fill:none;stroke:#000000;stroke-width:0.396875;stroke-linecap:butt;stroke-linejoin:miter;stroke-miterlimit:4;stroke-dasharray:none;stroke-opacity:1"
       d="M -23.691739,195.37595 H -37.75424 v -11.25 m 20.625004,8.4375 h 4.687498 v -8.4375 m -11.250001,8.4375 h -5.624999 l 3e-6,-8.4375 m 5.624999,5.625 h -2.8125 v -3.75 h 5.624999 v -1.875" />
  </g>
</svg>
