<?xml version="1.0" encoding="UTF-8" standalone="no"?>
<svg
   xmlns:dc="http://purl.org/dc/elements/1.1/"
   xmlns:cc="http://creativecommons.org/ns#"
   xmlns:rdf="http://www.w3.org/1999/02/22-rdf-syntax-ns#"
   xmlns:svg="http://www.w3.org/2000/svg"
   xmlns="http://www.w3.org/2000/svg"
   width="10.536865"
   height="15"
   viewBox="0 0 2.7878788 3.9687499"
   version="1.1"
   id="svg857">
  <defs
     id="defs851" />
  <metadata
     id="metadata854">
    <rdf:RDF>
      <cc:Work
         rdf:about="">
        <dc:format>image/svg+xml</dc:format>
        <dc:type
           rdf:resource="http://purl.org/dc/dcmitype/StillImage" />
        <dc:title></dc:title>
      </cc:Work>
    </rdf:RDF>
  </metadata>
  <g
     id="layer1"
     transform="translate(-101.53711,-82.797825)">
    <g
       id="g1476"
       transform="matrix(0.10267546,0,0,0.10267546,91.11174,74.29652)"
       style="stroke-width:9.73943">
      <path
         style="color:#000000;font-style:normal;font-variant:normal;font-weight:normal;font-stretch:normal;font-size:medium;line-height:normal;font-family:sans-serif;font-variant-ligatures:normal;font-variant-position:normal;font-variant-caps:normal;font-variant-numeric:normal;font-variant-alternates:normal;font-variant-east-asian:normal;font-feature-settings:normal;font-variation-settings:normal;text-indent:0;text-align:start;text-decoration:none;text-decoration-line:none;text-decoration-style:solid;text-decoration-color:#000000;letter-spacing:normal;word-spacing:normal;text-transform:none;writing-mode:lr-tb;direction:ltr;text-orientation:mixed;dominant-baseline:auto;baseline-shift:baseline;text-anchor:start;white-space:normal;shape-padding:0;shape-margin:0;inline-size:0;clip-rule:nonzero;display:inline;overflow:visible;visibility:visible;opacity:1;isolation:auto;mix-blend-mode:normal;color-interpolation:sRGB;color-interpolation-filters:linearRGB;solid-color:#000000;solid-opacity:1;vector-effect:none;fill:#2c3953;fill-opacity:1;fill-rule:nonzero;stroke:none;stroke-width:9.73943;stroke-linecap:round;stroke-linejoin:round;stroke-miterlimit:4;stroke-dasharray:none;stroke-dashoffset:0;stroke-opacity:1;color-rendering:auto;image-rendering:auto;shape-rendering:auto;text-rendering:auto;enable-background:accumulate;stop-color:#000000;stop-opacity:1"
         d="m 108.14648,96.615234 a 2.0002,2.0002 0 0 0 -1.17968,0.400391 c -3.41693,2.562998 -5.43002,6.589985 -5.42969,10.861325 0,7.47387 6.10231,13.57422 13.57617,13.57422 7.47386,0 13.57617,-6.10035 13.57617,-13.57422 0,-4.27124 -2.01269,-8.298582 -5.42968,-10.861325 a 2.0002,2.0002 0 0 0 -2.40039,0 c -1.65772,1.243284 -3.67396,1.916016 -5.7461,1.916016 -2.07234,-3e-5 -4.08831,-0.672491 -5.74609,-1.916016 a 2.0002,2.0002 0 0 0 -1.22071,-0.400391 z m 0.36914,4.410156 c 2.02725,1.14393 4.25045,1.90622 6.59766,1.90625 2.34746,0 4.57219,-0.76016 6.59961,-1.9043 1.85952,1.79285 2.97656,4.23213 2.97656,6.84961 0,5.31211 -4.26407,9.57422 -9.57617,9.57422 -5.3121,0 -9.57617,-4.26211 -9.57617,-9.57422 -2e-4,-2.61826 1.11811,-5.05845 2.97851,-6.85156 z"
         id="path1434" />
      <path
         id="path1439"
         style="fill:#32a9dd;fill-opacity:1;stroke:none;stroke-width:38.9576;stroke-linecap:round;stroke-linejoin:round;stroke-miterlimit:4;stroke-dasharray:none"
         d="m 114.50315,94.505867 a 2.5631506,2.5631506 0 0 1 -2.56315,2.563151 2.5631506,2.5631506 0 0 1 -2.56315,-2.563151 2.5631506,2.5631506 0 0 1 2.56315,-2.563151 2.5631506,2.5631506 0 0 1 2.56315,2.563151 z" />
      <path
         id="circle1441"
         style="fill:#32a9dd;fill-opacity:1;stroke:none;stroke-width:38.9576;stroke-linecap:round;stroke-linejoin:round;stroke-miterlimit:4;stroke-dasharray:none"
         d="m 121.4395,93.278549 a 2.3068357,2.3068357 0 0 1 -2.30684,2.306836 2.3068357,2.3068357 0 0 1 -2.30684,-2.306836 2.3068357,2.3068357 0 0 1 2.30684,-2.306835 2.3068357,2.3068357 0 0 1 2.30684,2.306835 z" />
      <path
         id="circle1443"
         style="fill:#32a9dd;fill-opacity:1;stroke:none;stroke-width:38.9576;stroke-linecap:round;stroke-linejoin:round;stroke-miterlimit:4;stroke-dasharray:none"
         d="m 117.13329,90.128105 a 2.0505204,2.0505204 0 0 1 -2.05052,2.050521 2.0505204,2.0505204 0 0 1 -2.05052,-2.050521 2.0505204,2.0505204 0 0 1 2.05052,-2.05052 2.0505204,2.0505204 0 0 1 2.05052,2.05052 z" />
      <path
         id="circle1445"
         style="fill:#32a9dd;fill-opacity:1;stroke:none;stroke-width:38.9576;stroke-linecap:round;stroke-linejoin:round;stroke-miterlimit:4;stroke-dasharray:none"
         d="m 119.80379,86.555626 a 1.7942054,1.7942054 0 0 1 -1.79421,1.794205 1.7942054,1.7942054 0 0 1 -1.7942,-1.794205 1.7942054,1.7942054 0 0 1 1.7942,-1.794206 1.7942054,1.7942054 0 0 1 1.79421,1.794206 z" />
      <path
         id="circle1447"
         style="fill:#32a9dd;fill-opacity:1;stroke:none;stroke-width:38.9576;stroke-linecap:round;stroke-linejoin:round;stroke-miterlimit:4;stroke-dasharray:none"
         d="m 116.08779,84.335716 a 1.5378904,1.5378904 0 0 1 -1.53789,1.537891 1.5378904,1.5378904 0 0 1 -1.53789,-1.537891 1.5378904,1.5378904 0 0 1 1.53789,-1.53789 1.5378904,1.5378904 0 0 1 1.53789,1.53789 z" />
    </g>
  </g>
</svg>
