<?xml version="1.0" encoding="UTF-8" standalone="no"?>
<!-- Created with Inkscape (http://www.inkscape.org/) -->

<svg
   width="149.64601mm"
   height="71.426476mm"
   viewBox="0 0 149.64601 71.426476"
   version="1.1"
   id="svg31775"
   xmlns="http://www.w3.org/2000/svg"
   xmlns:svg="http://www.w3.org/2000/svg">
  <defs
     id="defs31772" />
  <g
     id="layer1"
     transform="translate(11.762819,-91.653783)">
    <path
       style="fill:none;stroke:#000000;stroke-width:0.4;stroke-linecap:butt;stroke-linejoin:miter;stroke-dasharray:none;stroke-opacity:1"
       d="m 99.84442,125.20769 v 6 h -10"
       id="path26349" />
    <path
       style="fill:none;stroke:#000000;stroke-width:0.4;stroke-linecap:butt;stroke-linejoin:miter;stroke-dasharray:none;stroke-opacity:1"
       d="m 100.84442,125.20769 h 3 v -7"
       id="path26351" />
    <path
       style="fill:none;stroke:#000000;stroke-width:0.4;stroke-linecap:butt;stroke-linejoin:miter;stroke-dasharray:none;stroke-opacity:1"
       d="m 100.84442,128.20769 h 3 v 25 h 15"
       id="path26353" />
    <circle
       style="fill:none;stroke:#000000;stroke-width:0.5;stroke-linecap:round;stroke-linejoin:round;stroke-dasharray:none;stroke-opacity:1"
       id="circle26355"
       cx="102.09442"
       cy="128.20769"
       r="5.6246567" />
    <path
       id="path26357"
       style="fill:#000000;fill-opacity:1;stroke:none;stroke-width:0.344499;stroke-linecap:round;stroke-linejoin:round"
       d="m 104.49442,131.21065 c 0,0.35898 -0.29102,0.65 -0.65,0.65 -0.35898,0 -0.65,-0.29102 -0.65,-0.65 0,-0.35899 0.29102,-0.65 0.65,-0.65 0.35898,0 0.65,0.29101 0.65,0.65 z" />
    <path
       style="fill:#000000;fill-opacity:1;stroke:none;stroke-width:0.264583px;stroke-linecap:butt;stroke-linejoin:miter;stroke-opacity:1"
       d="m 102.64478,129.20769 v -2 l -1.80036,1 z"
       id="path26359" />
    <path
       style="fill:none;stroke:#000000;stroke-width:0.4;stroke-linecap:butt;stroke-linejoin:miter;stroke-dasharray:none;stroke-opacity:1"
       d="m 100.84442,131.20769 h 3"
       id="path26361" />
    <path
       style="fill:none;stroke:#000000;stroke-width:0.4;stroke-linecap:butt;stroke-linejoin:miter;stroke-dasharray:none;stroke-opacity:1"
       d="m 100.84442,130.20769 v 2"
       id="path26363" />
    <path
       style="fill:none;stroke:#000000;stroke-width:0.4;stroke-linecap:butt;stroke-linejoin:miter;stroke-dasharray:none;stroke-opacity:1"
       d="m 100.84442,127.20769 v 2"
       id="path26365" />
    <path
       style="fill:none;stroke:#000000;stroke-width:0.4;stroke-linecap:butt;stroke-linejoin:miter;stroke-dasharray:none;stroke-opacity:1"
       d="m 100.84442,124.20769 v 2"
       id="path26367" />
    <path
       style="fill:none;stroke:#000000;stroke-width:0.4;stroke-linecap:butt;stroke-linejoin:miter;stroke-dasharray:none;stroke-opacity:1"
       d="m 118.84442,118.20769 h 9"
       id="path26369" />
    <path
       id="path26377"
       style="fill:none;fill-opacity:0.5;stroke:#000000;stroke-width:0.5;stroke-linecap:round;stroke-linejoin:round;stroke-dasharray:none"
       d="m 118.84442,96.20769 a 1,1 0 0 1 1,1 1,1 0 0 1 -1,1 1,1 0 0 1 -1,-1 1,1 0 0 1 1,-1 z" />
    <g
       aria-label="+VDD"
       id="text26383"
       style="font-size:3.88056px;line-height:100%;font-family:Sans;-inkscape-font-specification:Sans;letter-spacing:0px;word-spacing:0px;stroke:#000000;stroke-width:0">
      <path
         d="m 115.52675,93.982496 v -0.761712 h -0.75602 v -0.318327 h 0.75602 V 92.14643 h 0.32212 v 0.756027 h 0.75603 v 0.318327 h -0.75603 v 0.761712 z"
         style="font-family:sans-serif;-inkscape-font-specification:sans-serif"
         id="path33817" />
      <path
         d="m 117.91421,94.431564 -1.07625,-2.777783 h 0.39791 l 0.72192,2.017967 q 0.0872,0.242535 0.1459,0.454753 0.0644,-0.227377 0.14969,-0.454753 l 0.75034,-2.017967 h 0.37517 l -1.08762,2.777783 z"
         style="font-family:sans-serif;-inkscape-font-specification:sans-serif"
         id="path33819" />
      <path
         d="m 119.6038,95.207676 v -1.805559 h 0.62197 q 0.21061,0 0.32146,0.02586 0.15518,0.03572 0.2648,0.12932 0.14286,0.1207 0.21307,0.309138 0.0714,0.187207 0.0714,0.428605 0,0.205681 -0.048,0.36456 -0.048,0.158879 -0.12316,0.263567 -0.0751,0.103457 -0.16504,0.163806 -0.0887,0.05912 -0.21554,0.08991 -0.12562,0.03079 -0.28943,0.03079 z m 0.23894,-0.21307 h 0.3855 q 0.17858,0 0.27958,-0.03325 0.10222,-0.03325 0.16257,-0.0936 0.085,-0.08498 0.13178,-0.22785 0.048,-0.1441 0.048,-0.348549 0,-0.283274 -0.0936,-0.434763 -0.0924,-0.152721 -0.22538,-0.20445 -0.0961,-0.03695 -0.30914,-0.03695 h -0.37934 z"
         style="font-size:65%;baseline-shift:sub"
         id="path33821" />
      <path
         d="m 121.42537,95.207676 v -1.805559 h 0.62197 q 0.21061,0 0.32146,0.02586 0.15518,0.03572 0.2648,0.12932 0.14286,0.1207 0.21307,0.309138 0.0714,0.187207 0.0714,0.428605 0,0.205681 -0.048,0.36456 -0.048,0.158879 -0.12316,0.263567 -0.0751,0.103457 -0.16504,0.163806 -0.0887,0.05912 -0.21554,0.08991 -0.12562,0.03079 -0.28943,0.03079 z m 0.23894,-0.21307 h 0.3855 q 0.17858,0 0.27958,-0.03325 0.10222,-0.03325 0.16257,-0.0936 0.085,-0.08498 0.13178,-0.22785 0.048,-0.1441 0.048,-0.348549 0,-0.283274 -0.0936,-0.434763 -0.0924,-0.152721 -0.22538,-0.20445 -0.0961,-0.03695 -0.30914,-0.03695 h -0.37934 z"
         style="font-size:65%;baseline-shift:sub"
         id="path33823" />
    </g>
    <path
       style="fill:#000000;fill-opacity:1;stroke:none;stroke-width:0.264583px;stroke-linecap:butt;stroke-linejoin:miter;stroke-opacity:1"
       d="m 125.84442,95.20769 c -2,0 -3,1 -4,2 1,1 2,2 4,2 h 7 v -4 z"
       id="path26385" />
    <path
       style="fill:#000000;fill-opacity:0.25;stroke:none;stroke-width:0.264583px;stroke-linecap:butt;stroke-linejoin:miter;stroke-opacity:1"
       d="m 124.84442,96.20769 1,-1 h 6 v 4 h -6 l -1,-1 z"
       id="path26387" />
    <g
       aria-label="5V"
       id="text26391"
       style="font-size:3.175px;line-height:100%;font-family:Sans;-inkscape-font-specification:Sans;letter-spacing:0px;word-spacing:0px;fill:#ffffff;stroke:#000000;stroke-width:0">
      <path
         d="m 126.47476,97.740231 0.43408,-0.04496 q 0.0186,0.147278 0.11007,0.234094 0.0915,0.08527 0.21084,0.08527 0.13642,0 0.23099,-0.110071 0.0946,-0.111621 0.0946,-0.334863 0,-0.209289 -0.0946,-0.313159 -0.093,-0.10542 -0.24339,-0.10542 -0.18759,0 -0.33642,0.165881 l -0.35346,-0.05116 0.22324,-1.182874 h 1.15187 v 0.407727 h -0.82166 l -0.0682,0.386023 q 0.14573,-0.07286 0.29765,-0.07286 0.28991,0 0.49145,0.21084 0.20153,0.21084 0.20153,0.547254 0,0.280603 -0.16278,0.500744 -0.22169,0.300757 -0.61546,0.300757 -0.31471,0 -0.51315,-0.168982 -0.19844,-0.168982 -0.23719,-0.454236 z"
         style="font-weight:bold;font-family:sans-serif;-inkscape-font-specification:'sans-serif Bold'"
         id="path33812" />
      <path
         d="m 128.91027,98.324692 -0.81236,-2.27273 h 0.49765 l 0.57516,1.682068 0.55655,-1.682068 h 0.48679 l -0.8139,2.27273 z"
         style="font-weight:bold;font-family:sans-serif;-inkscape-font-specification:'sans-serif Bold'"
         id="path33814" />
    </g>
    <path
       id="path26393"
       style="fill:#000000;fill-opacity:1;stroke:none;stroke-width:1.04298;stroke-linecap:butt;stroke-linejoin:miter;stroke-miterlimit:4;stroke-dasharray:none;stroke-opacity:1"
       d="m 118.84442,118.20769 h 0.89999 m 0,0 c 0,-0.49703 -0.40293,-0.89996 -0.89999,-0.89996 -0.49702,0 -0.90001,0.40293 -0.90001,0.89996 0,0.49703 0.40293,0.89997 0.89995,0.89997 0.49706,0 0.90005,-0.40294 0.90005,-0.89997 z" />
    <path
       id="path26395"
       style="fill:none;fill-opacity:0.5;stroke:#000000;stroke-width:0.5;stroke-linecap:round;stroke-linejoin:round;stroke-dasharray:none"
       d="m 128.84442,117.20769 a 1,1 0 0 1 1,1 1,1 0 0 1 -1,1 1,1 0 0 1 -1,-1 1,1 0 0 1 1,-1 z" />
    <path
       id="path26397"
       style="fill:none;fill-opacity:0.5;stroke:#000000;stroke-width:0.5;stroke-linecap:round;stroke-linejoin:round;stroke-dasharray:none"
       d="m 88.84442,130.20769 c 0.55228,0 1,0.44772 1,1 0,0.55228 -0.44772,1 -1,1 -0.55228,0 -1,-0.44772 -1,-1 0,-0.55228 0.44772,-1 1,-1 z" />
    <g
       aria-label="Out"
       id="text26401"
       style="font-size:3.88056px;line-height:100%;font-family:Sans;-inkscape-font-specification:Sans;letter-spacing:0px;word-spacing:0px;stroke:#000000;stroke-width:0">
      <path
         d="m 131.84445,118.24463 q 0,-0.69161 0.37138,-1.08194 0.37138,-0.39222 0.95877,-0.39222 0.38464,0 0.6935,0.1838 0.30885,0.18379 0.46991,0.51349 0.16295,0.3278 0.16295,0.74466 0,0.42254 -0.17053,0.75602 -0.17053,0.33349 -0.48318,0.50592 -0.31264,0.17053 -0.67455,0.17053 -0.39222,0 -0.70107,-0.18948 -0.30886,-0.18948 -0.46802,-0.51728 -0.15916,-0.3278 -0.15916,-0.6935 z m 0.37896,0.006 q 0,0.50213 0.26906,0.79203 0.27096,0.28801 0.67834,0.28801 0.41496,0 0.68213,-0.2918 0.26906,-0.2918 0.26906,-0.82803 0,-0.33917 -0.11558,-0.59118 -0.11369,-0.2539 -0.33538,-0.39222 -0.2198,-0.14022 -0.49455,-0.14022 -0.39033,0 -0.67265,0.26907 -0.28043,0.26716 -0.28043,0.89434 z"
         style="font-family:sans-serif;-inkscape-font-specification:sans-serif"
         id="path33800" />
      <path
         d="m 136.24987,119.59752 v -0.29559 q -0.23496,0.34106 -0.63855,0.34106 -0.17811,0 -0.33349,-0.0682 -0.15348,-0.0682 -0.22927,-0.17053 -0.0739,-0.10422 -0.10421,-0.2539 -0.0208,-0.10043 -0.0208,-0.31833 v -1.24678 h 0.34107 v 1.11604 q 0,0.26716 0.0208,0.36001 0.0322,0.13453 0.13643,0.21222 0.10421,0.0758 0.25769,0.0758 0.15348,0 0.28801,-0.0777 0.13453,-0.0796 0.18948,-0.21411 0.0568,-0.13643 0.0568,-0.39412 v -1.07814 h 0.34106 v 2.01228 z"
         style="font-family:sans-serif;-inkscape-font-specification:sans-serif"
         id="path33802" />
      <path
         d="m 137.83392,119.29246 0.0493,0.30127 q -0.14401,0.0303 -0.2577,0.0303 -0.18569,0 -0.28801,-0.0587 -0.10231,-0.0587 -0.144,-0.15348 -0.0417,-0.0966 -0.0417,-0.4036 v -1.15772 h -0.25011 v -0.26527 h 0.25011 v -0.49834 l 0.33917,-0.20464 v 0.70298 h 0.34296 v 0.26527 h -0.34296 v 1.17667 q 0,0.1459 0.0171,0.18759 0.019,0.0417 0.0587,0.0663 0.0417,0.0246 0.11747,0.0246 0.0568,0 0.14969,-0.0133 z"
         style="font-family:sans-serif;-inkscape-font-specification:sans-serif"
         id="path33804" />
    </g>
    <g
       aria-label="A"
       id="text26405"
       style="font-size:3.88056px;line-height:100%;font-family:Sans;-inkscape-font-specification:Sans;letter-spacing:0px;word-spacing:0px;stroke:#000000;stroke-width:0">
      <path
         d="m 83.244743,132.5966 1.066775,-2.77778 h 0.396014 l 1.136883,2.77778 h -0.418752 l -0.324012,-0.84129 h -1.161515 l -0.305063,0.84129 z m 0.801502,-1.14067 h 0.941718 l -0.289905,-0.76929 q -0.132636,-0.35054 -0.19706,-0.57602 -0.05305,0.26717 -0.149689,0.53054 z"
         style="font-family:sans-serif;-inkscape-font-specification:sans-serif"
         id="path33777" />
    </g>
    <g
       aria-label="T2"
       id="text26409"
       style="font-size:3.88056px;line-height:100%;font-family:Sans;-inkscape-font-specification:Sans;letter-spacing:0px;word-spacing:0px;stroke:#000000;stroke-width:0">
      <path
         d="m 110.75962,129.60228 v -2.44998 h -0.91519 v -0.3278 h 2.20176 v 0.3278 h -0.91898 v 2.44998 z"
         style="font-family:sans-serif;-inkscape-font-specification:sans-serif"
         id="path33783" />
      <path
         d="m 114.07742,129.27448 v 0.3278 h -1.83606 q -0.004,-0.12316 0.0398,-0.23685 0.0701,-0.18759 0.22359,-0.36949 0.15537,-0.1819 0.44717,-0.42064 0.45286,-0.37139 0.61202,-0.58739 0.15916,-0.21791 0.15916,-0.41118 0,-0.20274 -0.1459,-0.34106 -0.144,-0.14022 -0.37706,-0.14022 -0.24633,0 -0.39412,0.1478 -0.1478,0.14779 -0.14969,0.40928 l -0.35054,-0.036 q 0.036,-0.39222 0.27096,-0.59686 0.23495,-0.20653 0.63097,-0.20653 0.3998,0 0.63286,0.22169 0.23306,0.22169 0.23306,0.54949 0,0.16675 -0.0682,0.3278 -0.0682,0.16106 -0.22738,0.33917 -0.15726,0.17812 -0.52486,0.48886 -0.30696,0.2577 -0.39412,0.35054 -0.0872,0.091 -0.144,0.1838 z"
         style="font-family:sans-serif;-inkscape-font-specification:sans-serif"
         id="path33785" />
    </g>
    <path
       style="fill:none;stroke:#000000;stroke-width:0.4;stroke-linecap:butt;stroke-linejoin:miter;stroke-dasharray:none;stroke-opacity:1"
       d="m 114.84442,105.20769 v 6 h -11 v 7 h 15"
       id="path26411" />
    <path
       style="fill:none;stroke:#000000;stroke-width:0.4;stroke-linecap:butt;stroke-linejoin:miter;stroke-dasharray:none;stroke-opacity:1"
       d="m 115.84442,108.20769 h 3 v 10"
       id="path26413" />
    <circle
       style="fill:none;stroke:#000000;stroke-width:0.5;stroke-linecap:round;stroke-linejoin:round;stroke-dasharray:none;stroke-opacity:1"
       id="circle26415"
       cx="117.09442"
       cy="-108.20769"
       r="5.6246567"
       transform="scale(1,-1)" />
    <path
       id="path26417"
       style="fill:#000000;fill-opacity:1;stroke:none;stroke-width:0.344499;stroke-linecap:round;stroke-linejoin:round"
       d="m 119.49442,111.20769 c 0,-0.35898 -0.29102,-0.65 -0.65,-0.65 -0.35898,0 -0.65,0.29102 -0.65,0.65 0,0.35899 0.29102,0.65 0.65,0.65 0.35898,0 0.65,-0.29101 0.65,-0.65 z" />
    <path
       style="fill:#000000;fill-opacity:1;stroke:none;stroke-width:0.264583px;stroke-linecap:butt;stroke-linejoin:miter;stroke-opacity:1"
       d="m 117.64478,107.20769 v 2 l -1.80036,-1 z"
       id="path26419" />
    <path
       style="fill:none;stroke:#000000;stroke-width:0.4;stroke-linecap:butt;stroke-linejoin:miter;stroke-dasharray:none;stroke-opacity:1"
       d="m 118.84442,111.20769 h -3"
       id="path26421" />
    <path
       style="fill:none;stroke:#000000;stroke-width:0.4;stroke-linecap:butt;stroke-linejoin:miter;stroke-dasharray:none;stroke-opacity:1"
       d="m 115.84442,112.20769 v -8"
       id="path26423" />
    <g
       aria-label="T1"
       id="text26427"
       style="font-size:3.88056px;line-height:100%;font-family:Sans;-inkscape-font-specification:Sans;letter-spacing:0px;word-spacing:0px;stroke:#000000;stroke-width:0">
      <path
         d="m 125.75962,109.60228 v -2.44998 h -0.91519 v -0.3278 h 2.20176 v 0.3278 h -0.91898 v 2.44998 z"
         style="font-family:sans-serif;-inkscape-font-specification:sans-serif"
         id="path33807" />
      <path
         d="m 128.56962,109.60228 h -0.34107 v -2.17334 q -0.12316,0.11748 -0.32401,0.23495 -0.19896,0.11748 -0.35812,0.17622 v -0.32969 q 0.28612,-0.13454 0.50023,-0.32591 0.21411,-0.19138 0.30317,-0.37138 h 0.2198 z"
         style="font-family:sans-serif;-inkscape-font-specification:sans-serif"
         id="path33809" />
    </g>
    <path
       style="fill:none;stroke:#000000;stroke-width:0.4;stroke-linecap:butt;stroke-linejoin:miter;stroke-dasharray:none;stroke-opacity:1"
       d="m 115.84442,105.20769 h 3 v -7"
       id="path26429" />
    <path
       id="path26474"
       style="fill:#000000;fill-opacity:1;stroke:none;stroke-width:1.04298;stroke-linecap:butt;stroke-linejoin:miter;stroke-miterlimit:4;stroke-dasharray:none;stroke-opacity:1"
       d="m 103.84442,118.20769 h 0.89999 m 0,0 c 0,-0.49703 -0.40293,-0.89996 -0.89999,-0.89996 -0.49702,0 -0.90001,0.40293 -0.90001,0.89996 0,0.49703 0.40293,0.89997 0.89995,0.89997 0.49706,0 0.90005,-0.40294 0.90005,-0.89997 z" />
    <path
       style="fill:none;stroke:#000000;stroke-width:0.4;stroke-linecap:butt;stroke-linejoin:miter;stroke-dasharray:none;stroke-opacity:1"
       d="m 114.84442,140.20769 v 6 h -25"
       id="path26476" />
    <path
       style="fill:none;stroke:#000000;stroke-width:0.4;stroke-linecap:butt;stroke-linejoin:miter;stroke-dasharray:none;stroke-opacity:1"
       d="m 115.84442,140.20769 h 3 v -22"
       id="path26478" />
    <path
       style="fill:none;stroke:#000000;stroke-width:0.4;stroke-linecap:butt;stroke-linejoin:miter;stroke-dasharray:none;stroke-opacity:1"
       d="m 115.84442,143.20769 h 3 v 15"
       id="path26480" />
    <circle
       style="fill:none;stroke:#000000;stroke-width:0.5;stroke-linecap:round;stroke-linejoin:round;stroke-dasharray:none;stroke-opacity:1"
       id="circle26482"
       cx="117.09442"
       cy="143.20769"
       r="5.6246567" />
    <path
       id="path26484"
       style="fill:#000000;fill-opacity:1;stroke:none;stroke-width:0.344499;stroke-linecap:round;stroke-linejoin:round"
       d="m 119.49442,146.21065 c 0,0.35898 -0.29102,0.65 -0.65,0.65 -0.35898,0 -0.65,-0.29102 -0.65,-0.65 0,-0.35899 0.29102,-0.65 0.65,-0.65 0.35898,0 0.65,0.29101 0.65,0.65 z" />
    <path
       style="fill:#000000;fill-opacity:1;stroke:none;stroke-width:0.264583px;stroke-linecap:butt;stroke-linejoin:miter;stroke-opacity:1"
       d="m 117.64478,144.20769 v -2 l -1.80036,1 z"
       id="path26486" />
    <path
       style="fill:none;stroke:#000000;stroke-width:0.4;stroke-linecap:butt;stroke-linejoin:miter;stroke-dasharray:none;stroke-opacity:1"
       d="m 115.84442,146.20769 h 3"
       id="path26488" />
    <path
       style="fill:none;stroke:#000000;stroke-width:0.4;stroke-linecap:butt;stroke-linejoin:miter;stroke-dasharray:none;stroke-opacity:1"
       d="m 115.84442,145.20769 v 2"
       id="path26490" />
    <path
       style="fill:none;stroke:#000000;stroke-width:0.4;stroke-linecap:butt;stroke-linejoin:miter;stroke-dasharray:none;stroke-opacity:1"
       d="m 115.84442,142.20769 v 2"
       id="path26492" />
    <path
       style="fill:none;stroke:#000000;stroke-width:0.4;stroke-linecap:butt;stroke-linejoin:miter;stroke-dasharray:none;stroke-opacity:1"
       d="m 115.84442,139.20769 v 2"
       id="path26494" />
    <g
       aria-label="GND"
       id="text26498"
       style="font-size:3.88056px;line-height:100%;font-family:Sans;-inkscape-font-specification:Sans;letter-spacing:0px;word-spacing:0px;stroke:#000000;stroke-width:0">
      <path
         d="m 116.132,161.94337 v -0.32591 l 1.17667,-0.002 v 1.03077 q -0.27095,0.21601 -0.55897,0.32591 -0.28801,0.108 -0.59117,0.108 -0.40928,0 -0.74466,-0.17432 -0.33349,-0.17622 -0.50402,-0.50781 -0.17053,-0.33159 -0.17053,-0.74087 0,-0.40548 0.16863,-0.75602 0.17054,-0.35244 0.48886,-0.52297 0.31833,-0.17053 0.73329,-0.17053 0.30128,0 0.54381,0.0985 0.24443,0.0966 0.38275,0.27096 0.13832,0.17432 0.21033,0.45475 l -0.33159,0.0909 q -0.0625,-0.21222 -0.15538,-0.33349 -0.0928,-0.12126 -0.26527,-0.19327 -0.17243,-0.0739 -0.38275,-0.0739 -0.25201,0 -0.43581,0.0777 -0.18379,0.0758 -0.29748,0.20085 -0.11179,0.12506 -0.17432,0.27475 -0.10611,0.25769 -0.10611,0.55897 0,0.37138 0.12695,0.62149 0.12885,0.25012 0.37328,0.37138 0.24443,0.12127 0.51917,0.12127 0.23875,0 0.46612,-0.0909 0.22738,-0.0928 0.34486,-0.19706 v -0.51728 z"
         style="font-family:sans-serif;-inkscape-font-specification:sans-serif"
         id="path33793" />
      <path
         d="m 117.8468,163.03288 v -2.77778 h 0.37706 l 1.459,2.18092 v -2.18092 h 0.35244 v 2.77778 h -0.37707 l -1.459,-2.18281 v 2.18281 z"
         style="font-family:sans-serif;-inkscape-font-specification:sans-serif"
         id="path33795" />
      <path
         d="m 120.653,163.03288 v -2.77778 h 0.95688 q 0.32401,0 0.49454,0.0398 0.23875,0.0549 0.40739,0.19895 0.21979,0.1857 0.3278,0.4756 0.1099,0.28801 0.1099,0.65939 0,0.31643 -0.0739,0.56086 -0.0739,0.24443 -0.18948,0.40549 -0.11559,0.15917 -0.25391,0.25201 -0.13642,0.0909 -0.33159,0.13832 -0.19327,0.0474 -0.44528,0.0474 z m 0.36759,-0.3278 h 0.59308 q 0.27475,0 0.43012,-0.0512 0.15727,-0.0512 0.25011,-0.144 0.13074,-0.13074 0.20275,-0.35054 0.0739,-0.22169 0.0739,-0.53623 0,-0.43581 -0.144,-0.66887 -0.14211,-0.23495 -0.34675,-0.31454 -0.14779,-0.0568 -0.4756,-0.0568 h -0.5836 z"
         style="font-family:sans-serif;-inkscape-font-specification:sans-serif"
         id="path33797" />
    </g>
    <path
       style="fill:none;stroke:#000000;stroke-width:0.7;stroke-linecap:butt;stroke-linejoin:miter;stroke-miterlimit:4;stroke-dasharray:none;stroke-opacity:1"
       d="m 115.84442,158.20769 h 6"
       id="path26500" />
    <path
       id="path26502"
       style="fill:none;fill-opacity:0.5;stroke:#000000;stroke-width:0.5;stroke-linecap:round;stroke-linejoin:round;stroke-dasharray:none"
       d="m 88.84442,145.20769 c 0.55228,0 1,0.44772 1,1 0,0.55228 -0.44772,1 -1,1 -0.55228,0 -1,-0.44772 -1,-1 0,-0.55228 0.44772,-1 1,-1 z" />
    <g
       aria-label="B"
       id="text26506"
       style="font-size:3.88056px;line-height:100%;font-family:Sans;-inkscape-font-specification:Sans;letter-spacing:0px;word-spacing:0px;stroke:#000000;stroke-width:0">
      <path
         d="m 83.746867,147.5966 v -2.77778 h 1.042143 q 0.318327,0 0.509702,0.0853 0.19327,0.0834 0.301274,0.25958 0.109899,0.17433 0.109899,0.3657 0,0.17811 -0.09664,0.33538 -0.09663,0.15727 -0.2918,0.25391 0.252009,0.0739 0.38654,0.252 0.136426,0.17812 0.136426,0.42065 0,0.19517 -0.08337,0.3638 -0.08148,0.16675 -0.202745,0.2577 -0.121267,0.0909 -0.305063,0.13832 -0.181901,0.0455 -0.447174,0.0455 z m 0.367592,-1.61058 h 0.600653 q 0.24443,0 0.350539,-0.0322 0.140216,-0.0417 0.210324,-0.13832 0.072,-0.0966 0.072,-0.24254 0,-0.13832 -0.06632,-0.24253 -0.06632,-0.10611 -0.189481,-0.14401 -0.123162,-0.0398 -0.422541,-0.0398 h -0.555178 z m 0,1.28278 h 0.691604 q 0.178112,0 0.250114,-0.0133 0.126952,-0.0227 0.212218,-0.0758 0.08527,-0.0531 0.140216,-0.15348 0.05495,-0.10232 0.05495,-0.23496 0,-0.15537 -0.07958,-0.26906 -0.07958,-0.11558 -0.221692,-0.16106 -0.140215,-0.0474 -0.405488,-0.0474 h -0.642339 z"
         style="font-family:sans-serif;-inkscape-font-specification:sans-serif"
         id="path33780" />
    </g>
    <g
       aria-label="T3"
       id="text26510"
       style="font-size:3.88056px;line-height:100%;font-family:Sans;-inkscape-font-specification:Sans;letter-spacing:0px;word-spacing:0px;stroke:#000000;stroke-width:0">
      <path
         d="m 125.75962,144.60228 v -2.44998 h -0.91519 v -0.3278 h 2.20176 v 0.3278 h -0.91898 v 2.44998 z"
         style="font-family:sans-serif;-inkscape-font-specification:sans-serif"
         id="path33788" />
      <path
         d="m 127.28683,143.86899 0.34107,-0.0455 q 0.0587,0.28991 0.19895,0.41876 0.14211,0.12695 0.34486,0.12695 0.24064,0 0.40548,-0.16674 0.16675,-0.16675 0.16675,-0.41307 0,-0.23496 -0.15348,-0.38654 -0.15348,-0.15348 -0.39033,-0.15348 -0.0966,0 -0.24064,0.0379 l 0.0379,-0.29938 q 0.0341,0.004 0.055,0.004 0.21791,0 0.39223,-0.11369 0.17432,-0.11369 0.17432,-0.35054 0,-0.18759 -0.12695,-0.31075 -0.12695,-0.12316 -0.3278,-0.12316 -0.19896,0 -0.33159,0.12506 -0.13264,0.12505 -0.17054,0.37517 l -0.34106,-0.0606 q 0.0625,-0.34296 0.28422,-0.53054 0.22169,-0.18948 0.55139,-0.18948 0.22737,0 0.41875,0.0985 0.19138,0.0966 0.2918,0.26527 0.10232,0.16864 0.10232,0.35812 0,0.18 -0.0966,0.3278 -0.0966,0.14779 -0.28611,0.23495 0.24632,0.0568 0.38275,0.23686 0.13643,0.17811 0.13643,0.44717 0,0.3638 -0.26528,0.61771 -0.26527,0.252 -0.67076,0.252 -0.3657,0 -0.60823,-0.2179 -0.24064,-0.2179 -0.27475,-0.56465 z"
         style="font-family:sans-serif;-inkscape-font-specification:sans-serif"
         id="path33790" />
    </g>
    <path
       id="path26512"
       style="fill:#000000;fill-opacity:1;stroke:none;stroke-width:1.04298;stroke-linecap:butt;stroke-linejoin:miter;stroke-miterlimit:4;stroke-dasharray:none;stroke-opacity:1"
       d="m 118.84442,153.20769 h 0.89999 m 0,0 c 0,-0.49703 -0.40293,-0.89996 -0.89999,-0.89996 -0.49702,0 -0.90001,0.40293 -0.90001,0.89996 0,0.49703 0.40293,0.89997 0.89995,0.89997 0.49706,0 0.90005,-0.40294 0.90005,-0.89997 z" />
    <path
       style="fill:none;stroke:#000000;stroke-width:0.4;stroke-linecap:butt;stroke-linejoin:miter;stroke-dasharray:none;stroke-opacity:1"
       d="m 57.84442,125.20769 v 6 h -13"
       id="path21112" />
    <path
       style="fill:none;stroke:#000000;stroke-width:0.4;stroke-linecap:butt;stroke-linejoin:miter;stroke-dasharray:none;stroke-opacity:1"
       d="m 58.84442,125.20769 h 3 v -7"
       id="path21114" />
    <path
       style="fill:none;stroke:#000000;stroke-width:0.4;stroke-linecap:butt;stroke-linejoin:miter;stroke-dasharray:none;stroke-opacity:1"
       d="m 58.84442,128.20769 h 3 v 17 h -3"
       id="path21116" />
    <circle
       style="fill:none;stroke:#000000;stroke-width:0.5;stroke-linecap:round;stroke-linejoin:round;stroke-dasharray:none;stroke-opacity:1"
       id="circle21118"
       cx="60.094421"
       cy="128.20769"
       r="5.6246567" />
    <path
       id="path21120"
       style="fill:#000000;fill-opacity:1;stroke:none;stroke-width:0.344499;stroke-linecap:round;stroke-linejoin:round"
       d="m 62.49442,131.21065 c 0,0.35898 -0.29102,0.65 -0.65,0.65 -0.35898,0 -0.65,-0.29102 -0.65,-0.65 0,-0.35899 0.29102,-0.65 0.65,-0.65 0.35898,0 0.65,0.29101 0.65,0.65 z" />
    <path
       style="fill:#000000;fill-opacity:1;stroke:none;stroke-width:0.264583px;stroke-linecap:butt;stroke-linejoin:miter;stroke-opacity:1"
       d="m 60.64478,129.20769 v -2 l -1.80036,1 z"
       id="path21122" />
    <path
       style="fill:none;stroke:#000000;stroke-width:0.4;stroke-linecap:butt;stroke-linejoin:miter;stroke-dasharray:none;stroke-opacity:1"
       d="m 58.84442,131.20769 h 3"
       id="path21124" />
    <path
       style="fill:none;stroke:#000000;stroke-width:0.4;stroke-linecap:butt;stroke-linejoin:miter;stroke-dasharray:none;stroke-opacity:1"
       d="m 58.84442,130.20769 v 2"
       id="path21126" />
    <path
       style="fill:none;stroke:#000000;stroke-width:0.4;stroke-linecap:butt;stroke-linejoin:miter;stroke-dasharray:none;stroke-opacity:1"
       d="m 58.84442,127.20769 v 2"
       id="path21128" />
    <path
       style="fill:none;stroke:#000000;stroke-width:0.4;stroke-linecap:butt;stroke-linejoin:miter;stroke-dasharray:none;stroke-opacity:1"
       d="m 58.84442,124.20769 v 2"
       id="path21130" />
    <path
       style="fill:none;stroke:#000000;stroke-width:0.4;stroke-linecap:butt;stroke-linejoin:miter;stroke-dasharray:none;stroke-opacity:1"
       d="m 61.84442,118.20769 h 9"
       id="path21132" />
    <g
       aria-label="GND"
       id="text21136"
       style="font-size:3.88056px;line-height:100%;font-family:Sans;-inkscape-font-specification:Sans;letter-spacing:0px;word-spacing:0px;stroke:#000000;stroke-width:0">
      <path
         d="m 59.131991,161.94337 v -0.32591 l 1.176674,-0.002 v 1.03077 q -0.270957,0.21601 -0.558968,0.32591 -0.28801,0.108 -0.591179,0.108 -0.409278,0 -0.744658,-0.17432 -0.333486,-0.17622 -0.504018,-0.50781 -0.170532,-0.33159 -0.170532,-0.74087 0,-0.40548 0.168637,-0.75602 0.170533,-0.35244 0.48886,-0.52297 0.318327,-0.17053 0.733289,-0.17053 0.301274,0 0.543809,0.0985 0.24443,0.0966 0.382751,0.27096 0.13832,0.17432 0.210323,0.45475 l -0.331591,0.0909 q -0.06253,-0.21222 -0.155374,-0.33349 -0.09285,-0.12126 -0.265272,-0.19327 -0.172428,-0.0739 -0.382751,-0.0739 -0.252009,0 -0.435805,0.0777 -0.183796,0.0758 -0.297484,0.20085 -0.111794,0.12506 -0.174322,0.27475 -0.106109,0.25769 -0.106109,0.55897 0,0.37138 0.126951,0.62149 0.128847,0.25012 0.373277,0.37138 0.24443,0.12127 0.519176,0.12127 0.238746,0 0.466122,-0.0909 0.227377,-0.0928 0.344855,-0.19706 v -0.51728 z"
         style="font-family:sans-serif;-inkscape-font-specification:sans-serif"
         id="path33764" />
      <path
         d="m 60.846789,163.03288 v -2.77778 h 0.377066 l 1.459,2.18092 v -2.18092 h 0.352434 v 2.77778 h -0.377067 l -1.458999,-2.18281 v 2.18281 z"
         style="font-family:sans-serif;-inkscape-font-specification:sans-serif"
         id="path33766" />
      <path
         d="m 63.652995,163.03288 v -2.77778 h 0.956876 q 0.324012,0 0.494544,0.0398 0.238746,0.0549 0.407383,0.19895 0.219798,0.1857 0.327801,0.4756 0.109899,0.28801 0.109899,0.65939 0,0.31643 -0.0739,0.56086 -0.0739,0.24443 -0.189481,0.40549 -0.115583,0.15917 -0.253904,0.25201 -0.136425,0.0909 -0.33159,0.13832 -0.19327,0.0474 -0.445279,0.0474 z m 0.367592,-0.3278 h 0.593074 q 0.274747,0 0.430121,-0.0512 0.157268,-0.0512 0.250114,-0.144 0.130741,-0.13074 0.202744,-0.35054 0.0739,-0.22169 0.0739,-0.53623 0,-0.43581 -0.144005,-0.66887 -0.14211,-0.23495 -0.346749,-0.31454 -0.147795,-0.0568 -0.475596,-0.0568 h -0.5836 z"
         style="font-family:sans-serif;-inkscape-font-specification:sans-serif"
         id="path33768" />
    </g>
    <path
       style="fill:none;stroke:#000000;stroke-width:0.7;stroke-linecap:butt;stroke-linejoin:miter;stroke-miterlimit:4;stroke-dasharray:none;stroke-opacity:1"
       d="m 58.84442,158.20769 h 6"
       id="path21138" />
    <path
       id="path21140"
       style="fill:none;fill-opacity:0.5;stroke:#000000;stroke-width:0.5;stroke-linecap:round;stroke-linejoin:round;stroke-dasharray:none"
       d="m 61.84442,96.20769 a 1,1 0 0 1 1,1 1,1 0 0 1 -1,1 1,1 0 0 1 -1,-1 1,1 0 0 1 1,-1 z" />
    <g
       aria-label="+VDD"
       id="text21146"
       style="font-size:3.88056px;line-height:100%;font-family:Sans;-inkscape-font-specification:Sans;letter-spacing:0px;word-spacing:0px;stroke:#000000;stroke-width:0">
      <path
         d="m 58.526753,93.982496 v -0.761712 h -0.756027 v -0.318327 h 0.756027 V 92.14643 h 0.322117 v 0.756027 h 0.756027 v 0.318327 H 58.84887 v 0.761712 z"
         style="font-family:sans-serif;-inkscape-font-specification:sans-serif"
         id="path33728" />
      <path
         d="m 60.914207,94.431564 -1.076249,-2.777783 h 0.397909 l 0.72192,2.017967 q 0.08716,0.242535 0.1459,0.454753 0.06442,-0.227377 0.14969,-0.454753 l 0.750342,-2.017967 h 0.375172 l -1.087618,2.777783 z"
         style="font-family:sans-serif;-inkscape-font-specification:sans-serif"
         id="path33730" />
      <path
         d="m 62.603804,95.207676 v -1.805559 h 0.621969 q 0.210608,0 0.321454,0.02586 0.155184,0.03572 0.264799,0.12932 0.142868,0.1207 0.213071,0.309138 0.07143,0.187207 0.07143,0.428605 0,0.205681 -0.04803,0.36456 -0.04803,0.158879 -0.123163,0.263567 -0.07513,0.103457 -0.165037,0.163806 -0.08868,0.05912 -0.215534,0.08991 -0.125626,0.03079 -0.289432,0.03079 z m 0.238935,-0.21307 h 0.385498 q 0.178585,0 0.279578,-0.03325 0.102225,-0.03325 0.162574,-0.0936 0.08498,-0.08498 0.131784,-0.22785 0.04803,-0.1441 0.04803,-0.348549 0,-0.283274 -0.0936,-0.434763 -0.09237,-0.152721 -0.225387,-0.20445 -0.09607,-0.03695 -0.309137,-0.03695 h -0.37934 z"
         style="font-size:65%;baseline-shift:sub"
         id="path33732" />
      <path
         d="m 64.425374,95.207676 v -1.805559 h 0.62197 q 0.210607,0 0.321453,0.02586 0.155185,0.03572 0.264799,0.12932 0.142869,0.1207 0.213071,0.309138 0.07143,0.187207 0.07143,0.428605 0,0.205681 -0.04803,0.36456 -0.04803,0.158879 -0.123162,0.263567 -0.07513,0.103457 -0.165038,0.163806 -0.08868,0.05912 -0.215534,0.08991 -0.125625,0.03079 -0.289431,0.03079 z m 0.238935,-0.21307 h 0.385498 q 0.178585,0 0.279578,-0.03325 0.102225,-0.03325 0.162575,-0.0936 0.08498,-0.08498 0.131783,-0.22785 0.04803,-0.1441 0.04803,-0.348549 0,-0.283274 -0.0936,-0.434763 -0.09237,-0.152721 -0.225387,-0.20445 -0.09607,-0.03695 -0.309137,-0.03695 h -0.37934 z"
         style="font-size:65%;baseline-shift:sub"
         id="path33734" />
    </g>
    <path
       style="fill:#000000;fill-opacity:1;stroke:none;stroke-width:0.264583px;stroke-linecap:butt;stroke-linejoin:miter;stroke-opacity:1"
       d="m 68.84442,95.20769 c -2,0 -3,1 -4,2 1,1 2,2 4,2 h 7 v -4 z"
       id="path21148" />
    <path
       style="fill:#000000;fill-opacity:0.25;stroke:none;stroke-width:0.264583px;stroke-linecap:butt;stroke-linejoin:miter;stroke-opacity:1"
       d="m 67.84442,96.20769 1,-1 h 6 v 4 h -6 l -1,-1 z"
       id="path21150" />
    <g
       aria-label="5V"
       id="text21154"
       style="font-size:3.175px;line-height:100%;font-family:Sans;-inkscape-font-specification:Sans;letter-spacing:0px;word-spacing:0px;fill:#ffffff;stroke:#000000;stroke-width:0">
      <path
         d="m 69.474756,97.740231 0.434082,-0.04496 q 0.0186,0.147278 0.110071,0.234094 0.09147,0.08527 0.21084,0.08527 0.136425,0 0.230993,-0.110071 0.09457,-0.111621 0.09457,-0.334863 0,-0.209289 -0.09457,-0.313159 -0.09302,-0.10542 -0.243396,-0.10542 -0.187585,0 -0.336413,0.165881 l -0.353467,-0.05116 0.223242,-1.182874 h 1.151868 v 0.407727 H 70.08092 l -0.06821,0.386023 q 0.145727,-0.07286 0.297656,-0.07286 0.289905,0 0.491443,0.21084 0.201538,0.21084 0.201538,0.547254 0,0.280603 -0.162781,0.500744 -0.221692,0.300757 -0.615466,0.300757 -0.31471,0 -0.513147,-0.168982 -0.198438,-0.168982 -0.237195,-0.454236 z"
         style="font-weight:bold;font-family:sans-serif;-inkscape-font-specification:'sans-serif Bold'"
         id="path33737" />
      <path
         d="m 71.910266,98.324692 -0.812353,-2.27273 h 0.497644 l 0.575158,1.682068 0.556555,-1.682068 h 0.486792 l -0.813903,2.27273 z"
         style="font-weight:bold;font-family:sans-serif;-inkscape-font-specification:'sans-serif Bold'"
         id="path33739" />
    </g>
    <path
       id="path21156"
       style="fill:#000000;fill-opacity:1;stroke:none;stroke-width:1.04298;stroke-linecap:butt;stroke-linejoin:miter;stroke-miterlimit:4;stroke-dasharray:none;stroke-opacity:1"
       d="m 61.84442,118.20769 h 0.89999 m 0,0 c 0,-0.49703 -0.40293,-0.89996 -0.89999,-0.89996 -0.49702,0 -0.90001,0.40293 -0.90001,0.89996 0,0.49703 0.40293,0.89997 0.89995,0.89997 0.49706,0 0.90005,-0.40294 0.90005,-0.89997 z" />
    <path
       id="path21158"
       style="fill:none;fill-opacity:0.5;stroke:#000000;stroke-width:0.5;stroke-linecap:round;stroke-linejoin:round;stroke-dasharray:none"
       d="m 71.84442,117.20769 a 1,1 0 0 1 1,1 1,1 0 0 1 -1,1 1,1 0 0 1 -1,-1 1,1 0 0 1 1,-1 z" />
    <path
       id="path21160"
       style="fill:none;fill-opacity:0.5;stroke:#000000;stroke-width:0.5;stroke-linecap:round;stroke-linejoin:round;stroke-dasharray:none"
       d="m 43.84442,130.20769 c 0.55228,0 1,0.44772 1,1 0,0.55228 -0.44772,1 -1,1 -0.55228,0 -1,-0.44772 -1,-1 0,-0.55228 0.44772,-1 1,-1 z" />
    <g
       aria-label="Out"
       id="text21164"
       style="font-size:3.88056px;line-height:100%;font-family:Sans;-inkscape-font-specification:Sans;letter-spacing:0px;word-spacing:0px;stroke:#000000;stroke-width:0">
      <path
         d="m 74.844446,118.24463 q 0,-0.69161 0.371382,-1.08194 0.371381,-0.39222 0.958771,-0.39222 0.384645,0 0.693498,0.1838 0.308854,0.18379 0.469912,0.51349 0.162953,0.3278 0.162953,0.74466 0,0.42254 -0.170532,0.75602 -0.170533,0.33349 -0.483175,0.50592 -0.312643,0.17053 -0.674551,0.17053 -0.392224,0 -0.701078,-0.18948 -0.308853,-0.18948 -0.468016,-0.51728 -0.159164,-0.3278 -0.159164,-0.6935 z m 0.378961,0.006 q 0,0.50213 0.269062,0.79203 0.270957,0.28801 0.67834,0.28801 0.414962,0 0.68213,-0.2918 0.269062,-0.2918 0.269062,-0.82803 0,-0.33917 -0.115583,-0.59118 -0.113688,-0.2539 -0.33538,-0.39222 -0.219798,-0.14022 -0.494544,-0.14022 -0.39033,0 -0.672656,0.26907 -0.280431,0.26716 -0.280431,0.89434 z"
         style="font-family:sans-serif;-inkscape-font-specification:sans-serif"
         id="path33747" />
      <path
         d="m 79.249867,119.59752 v -0.29559 q -0.234956,0.34106 -0.638549,0.34106 -0.178112,0 -0.333486,-0.0682 -0.153479,-0.0682 -0.229271,-0.17053 -0.0739,-0.10422 -0.104215,-0.2539 -0.02084,-0.10043 -0.02084,-0.31833 v -1.24678 h 0.341064 v 1.11604 q 0,0.26716 0.02084,0.36001 0.03221,0.13453 0.136426,0.21222 0.104214,0.0758 0.257694,0.0758 0.153479,0 0.28801,-0.0777 0.134531,-0.0796 0.18948,-0.21411 0.05684,-0.13643 0.05684,-0.39412 v -1.07814 h 0.341064 v 2.01228 z"
         style="font-family:sans-serif;-inkscape-font-specification:sans-serif"
         id="path33749" />
      <path
         d="m 80.833923,119.29246 0.04927,0.30127 q -0.144005,0.0303 -0.257693,0.0303 -0.185691,0 -0.28801,-0.0587 -0.10232,-0.0587 -0.144006,-0.15348 -0.04169,-0.0966 -0.04169,-0.4036 v -1.15772 h -0.250115 v -0.26527 h 0.250115 v -0.49834 l 0.33917,-0.20464 v 0.70298 h 0.342959 v 0.26527 h -0.342959 v 1.17667 q 0,0.1459 0.01705,0.18759 0.01895,0.0417 0.05874,0.0663 0.04169,0.0246 0.117478,0.0246 0.05684,0 0.149689,-0.0133 z"
         style="font-family:sans-serif;-inkscape-font-specification:sans-serif"
         id="path33751" />
    </g>
    <g
       aria-label="A"
       id="text21168"
       style="font-size:3.88056px;line-height:100%;font-family:Sans;-inkscape-font-specification:Sans;letter-spacing:0px;word-spacing:0px;stroke:#000000;stroke-width:0">
      <path
         d="m 38.244743,132.5966 1.066775,-2.77778 h 0.396014 l 1.136883,2.77778 h -0.418752 l -0.324012,-0.84129 h -1.161515 l -0.305063,0.84129 z m 0.801502,-1.14067 h 0.941718 l -0.289905,-0.76929 q -0.132636,-0.35054 -0.19706,-0.57602 -0.05305,0.26717 -0.149689,0.53054 z"
         style="font-family:sans-serif;-inkscape-font-specification:sans-serif"
         id="path33774" />
    </g>
    <g
       aria-label="T2"
       id="text21172"
       style="font-size:3.88056px;line-height:100%;font-family:Sans;-inkscape-font-specification:Sans;letter-spacing:0px;word-spacing:0px;stroke:#000000;stroke-width:0">
      <path
         d="m 68.75962,129.60228 v -2.44998 h -0.91519 v -0.3278 h 2.201763 v 0.3278 h -0.918981 v 2.44998 z"
         style="font-family:sans-serif;-inkscape-font-specification:sans-serif"
         id="path33754" />
      <path
         d="m 72.077423,129.27448 v 0.3278 h -1.836065 q -0.0038,-0.12316 0.03979,-0.23685 0.07011,-0.18759 0.223587,-0.36949 0.155374,-0.1819 0.447174,-0.42064 0.452859,-0.37139 0.612022,-0.58739 0.159164,-0.21791 0.159164,-0.41118 0,-0.20274 -0.1459,-0.34106 -0.144005,-0.14022 -0.377066,-0.14022 -0.246325,0 -0.39412,0.1478 -0.147794,0.14779 -0.149689,0.40928 l -0.350539,-0.036 q 0.036,-0.39222 0.270957,-0.59686 0.234956,-0.20653 0.63097,-0.20653 0.399804,0 0.632865,0.22169 0.233061,0.22169 0.233061,0.54949 0,0.16675 -0.06821,0.3278 -0.06821,0.16106 -0.227377,0.33917 -0.157269,0.17812 -0.524861,0.48886 -0.306958,0.2577 -0.394119,0.35054 -0.08716,0.091 -0.144005,0.1838 z"
         style="font-family:sans-serif;-inkscape-font-specification:sans-serif"
         id="path33756" />
    </g>
    <path
       style="fill:none;stroke:#000000;stroke-width:0.4;stroke-linecap:butt;stroke-linejoin:miter;stroke-dasharray:none;stroke-opacity:1"
       d="m 57.84442,105.20769 v 6 h -9 v 7 h 13"
       id="path21174" />
    <path
       style="fill:none;stroke:#000000;stroke-width:0.4;stroke-linecap:butt;stroke-linejoin:miter;stroke-dasharray:none;stroke-opacity:1"
       d="m 58.84442,108.20769 h 3 v 10"
       id="path21176" />
    <circle
       style="fill:none;stroke:#000000;stroke-width:0.5;stroke-linecap:round;stroke-linejoin:round;stroke-dasharray:none;stroke-opacity:1"
       id="circle21178"
       cx="60.094421"
       cy="-108.20769"
       r="5.6246567"
       transform="scale(1,-1)" />
    <path
       id="path21180"
       style="fill:#000000;fill-opacity:1;stroke:none;stroke-width:0.344499;stroke-linecap:round;stroke-linejoin:round"
       d="m 62.49442,111.20769 c 0,-0.35898 -0.29102,-0.65 -0.65,-0.65 -0.35898,0 -0.65,0.29102 -0.65,0.65 0,0.35899 0.29102,0.65 0.65,0.65 0.35898,0 0.65,-0.29101 0.65,-0.65 z" />
    <path
       style="fill:#000000;fill-opacity:1;stroke:none;stroke-width:0.264583px;stroke-linecap:butt;stroke-linejoin:miter;stroke-opacity:1"
       d="m 60.64478,107.20769 v 2 l -1.80036,-1 z"
       id="path21182" />
    <path
       style="fill:none;stroke:#000000;stroke-width:0.4;stroke-linecap:butt;stroke-linejoin:miter;stroke-dasharray:none;stroke-opacity:1"
       d="m 61.84442,111.20769 h -3"
       id="path21184" />
    <path
       style="fill:none;stroke:#000000;stroke-width:0.4;stroke-linecap:butt;stroke-linejoin:miter;stroke-dasharray:none;stroke-opacity:1"
       d="m 58.84442,112.20769 v -8"
       id="path21186" />
    <g
       aria-label="T1"
       id="text21190"
       style="font-size:3.88056px;line-height:100%;font-family:Sans;-inkscape-font-specification:Sans;letter-spacing:0px;word-spacing:0px;stroke:#000000;stroke-width:0">
      <path
         d="m 68.75962,109.60228 v -2.44998 h -0.91519 v -0.3278 h 2.201763 v 0.3278 h -0.918981 v 2.44998 z"
         style="font-family:sans-serif;-inkscape-font-specification:sans-serif"
         id="path33742" />
      <path
         d="m 71.569616,109.60228 h -0.341065 v -2.17334 q -0.123163,0.11748 -0.324012,0.23495 -0.198954,0.11748 -0.358118,0.17622 v -0.32969 q 0.286116,-0.13454 0.500229,-0.32591 0.214112,-0.19138 0.303168,-0.37138 h 0.219798 z"
         style="font-family:sans-serif;-inkscape-font-specification:sans-serif"
         id="path33744" />
    </g>
    <path
       style="fill:none;stroke:#000000;stroke-width:0.4;stroke-linecap:butt;stroke-linejoin:miter;stroke-dasharray:none;stroke-opacity:1"
       d="m 58.84442,105.20769 h 3 v -7"
       id="path21192" />
    <path
       style="fill:none;stroke:#000000;stroke-width:0.4;stroke-linecap:butt;stroke-linejoin:miter;stroke-dasharray:none;stroke-opacity:1"
       d="m 57.84442,145.20769 v 6 h -13"
       id="path23692" />
    <path
       style="fill:none;stroke:#000000;stroke-width:0.4;stroke-linecap:butt;stroke-linejoin:miter;stroke-dasharray:none;stroke-opacity:1"
       d="m 58.84442,148.20769 h 3 v 10"
       id="path23696" />
    <circle
       style="fill:none;stroke:#000000;stroke-width:0.5;stroke-linecap:round;stroke-linejoin:round;stroke-dasharray:none;stroke-opacity:1"
       id="circle23698"
       cx="60.094421"
       cy="148.20769"
       r="5.6246567" />
    <path
       id="path23700"
       style="fill:#000000;fill-opacity:1;stroke:none;stroke-width:0.344499;stroke-linecap:round;stroke-linejoin:round"
       d="m 62.49442,151.21065 c 0,0.35898 -0.29102,0.65 -0.65,0.65 -0.35898,0 -0.65,-0.29102 -0.65,-0.65 0,-0.35899 0.29102,-0.65 0.65,-0.65 0.35898,0 0.65,0.29101 0.65,0.65 z" />
    <path
       style="fill:#000000;fill-opacity:1;stroke:none;stroke-width:0.264583px;stroke-linecap:butt;stroke-linejoin:miter;stroke-opacity:1"
       d="m 60.64478,149.20769 v -2 l -1.80036,1 z"
       id="path23702" />
    <path
       style="fill:none;stroke:#000000;stroke-width:0.4;stroke-linecap:butt;stroke-linejoin:miter;stroke-dasharray:none;stroke-opacity:1"
       d="m 58.84442,151.20769 h 3"
       id="path23704" />
    <path
       style="fill:none;stroke:#000000;stroke-width:0.4;stroke-linecap:butt;stroke-linejoin:miter;stroke-dasharray:none;stroke-opacity:1"
       d="m 58.84442,150.20769 v 2"
       id="path23706" />
    <path
       style="fill:none;stroke:#000000;stroke-width:0.4;stroke-linecap:butt;stroke-linejoin:miter;stroke-dasharray:none;stroke-opacity:1"
       d="m 58.84442,147.20769 v 2"
       id="path23708" />
    <path
       style="fill:none;stroke:#000000;stroke-width:0.4;stroke-linecap:butt;stroke-linejoin:miter;stroke-dasharray:none;stroke-opacity:1"
       d="m 58.84442,144.20769 v 2"
       id="path23710" />
    <path
       id="path23712"
       style="fill:none;fill-opacity:0.5;stroke:#000000;stroke-width:0.5;stroke-linecap:round;stroke-linejoin:round;stroke-dasharray:none"
       d="m 43.84442,150.20769 c 0.55228,0 1,0.44772 1,1 0,0.55228 -0.44772,1 -1,1 -0.55228,0 -1,-0.44772 -1,-1 0,-0.55228 0.44772,-1 1,-1 z" />
    <g
       aria-label="B"
       id="text23716"
       style="font-size:3.88056px;line-height:100%;font-family:Sans;-inkscape-font-specification:Sans;letter-spacing:0px;word-spacing:0px;stroke:#000000;stroke-width:0">
      <path
         d="m 38.746867,152.5966 v -2.77778 h 1.042143 q 0.318327,0 0.509702,0.0853 0.19327,0.0834 0.301274,0.25958 0.109899,0.17433 0.109899,0.3657 0,0.17811 -0.09663,0.33538 -0.09663,0.15727 -0.2918,0.25391 0.252009,0.0739 0.38654,0.252 0.136426,0.17812 0.136426,0.42065 0,0.19517 -0.08337,0.3638 -0.08148,0.16675 -0.202745,0.2577 -0.121267,0.0909 -0.305063,0.13832 -0.181901,0.0455 -0.447174,0.0455 z m 0.367592,-1.61058 h 0.600653 q 0.24443,0 0.350539,-0.0322 0.140216,-0.0417 0.210324,-0.13832 0.072,-0.0966 0.072,-0.24254 0,-0.13832 -0.06632,-0.24253 -0.06632,-0.10611 -0.189481,-0.14401 -0.123162,-0.0398 -0.422541,-0.0398 h -0.555178 z m 0,1.28278 h 0.691604 q 0.178112,0 0.250114,-0.0133 0.126952,-0.0227 0.212218,-0.0758 0.08527,-0.0531 0.140216,-0.15348 0.05495,-0.10232 0.05495,-0.23496 0,-0.15537 -0.07958,-0.26906 -0.07958,-0.11558 -0.221692,-0.16106 -0.140215,-0.0474 -0.405488,-0.0474 h -0.642339 z"
         style="font-family:sans-serif;-inkscape-font-specification:sans-serif"
         id="path33771" />
    </g>
    <g
       aria-label="T3"
       id="text23720"
       style="font-size:3.88056px;line-height:100%;font-family:Sans;-inkscape-font-specification:Sans;letter-spacing:0px;word-spacing:0px;stroke:#000000;stroke-width:0">
      <path
         d="m 68.75962,149.60228 v -2.44998 h -0.91519 v -0.3278 h 2.201763 v 0.3278 h -0.918981 v 2.44998 z"
         style="font-family:sans-serif;-inkscape-font-specification:sans-serif"
         id="path33759" />
      <path
         d="m 70.286833,148.86899 0.341065,-0.0455 q 0.05874,0.28991 0.198954,0.41876 0.142111,0.12695 0.344855,0.12695 0.24064,0 0.405488,-0.16674 0.166743,-0.16675 0.166743,-0.41307 0,-0.23496 -0.15348,-0.38654 -0.153479,-0.15348 -0.390329,-0.15348 -0.09664,0 -0.24064,0.0379 l 0.0379,-0.29938 q 0.03411,0.004 0.05495,0.004 0.217902,0 0.392225,-0.11369 0.174322,-0.11369 0.174322,-0.35054 0,-0.18759 -0.126952,-0.31075 -0.126952,-0.12316 -0.327802,-0.12316 -0.198954,0 -0.33159,0.12506 -0.132637,0.12505 -0.170533,0.37517 l -0.341065,-0.0606 q 0.06253,-0.34296 0.284221,-0.53054 0.221692,-0.18948 0.551388,-0.18948 0.227377,0 0.418752,0.0985 0.191375,0.0966 0.2918,0.26527 0.102319,0.16864 0.102319,0.35812 0,0.18 -0.09664,0.3278 -0.09663,0.14779 -0.286115,0.23495 0.246324,0.0568 0.38275,0.23686 0.136426,0.17811 0.136426,0.44717 0,0.3638 -0.265272,0.61771 -0.265273,0.252 -0.670761,0.252 -0.365697,0 -0.608232,-0.2179 -0.240641,-0.2179 -0.274747,-0.56465 z"
         style="font-family:sans-serif;-inkscape-font-specification:sans-serif"
         id="path33761" />
    </g>
    <path
       style="fill:none;stroke:#000000;stroke-width:0.4;stroke-linecap:butt;stroke-linejoin:miter;stroke-dasharray:none;stroke-opacity:1"
       d="m 7.84442,145.20769 v 6 h -13"
       id="path13638" />
    <path
       style="fill:none;stroke:#000000;stroke-width:0.4;stroke-linecap:butt;stroke-linejoin:miter;stroke-dasharray:none;stroke-opacity:1"
       d="m 8.84442,145.20769 h 3 v -7"
       id="path13640" />
    <path
       style="fill:none;stroke:#000000;stroke-width:0.4;stroke-linecap:butt;stroke-linejoin:miter;stroke-dasharray:none;stroke-opacity:1"
       d="m 8.84442,148.20769 h 3 v 10"
       id="path13642" />
    <circle
       style="fill:none;stroke:#000000;stroke-width:0.5;stroke-linecap:round;stroke-linejoin:round;stroke-dasharray:none;stroke-opacity:1"
       id="circle13644"
       cx="10.09442"
       cy="148.20769"
       r="5.6246567" />
    <path
       id="path13646"
       style="fill:#000000;fill-opacity:1;stroke:none;stroke-width:0.344499;stroke-linecap:round;stroke-linejoin:round"
       d="m 12.49442,151.21065 c 0,0.35898 -0.29102,0.65 -0.65,0.65 -0.35898,0 -0.65,-0.29102 -0.65,-0.65 0,-0.35899 0.29102,-0.65 0.65,-0.65 0.35898,0 0.65,0.29101 0.65,0.65 z" />
    <path
       style="fill:#000000;fill-opacity:1;stroke:none;stroke-width:0.264583px;stroke-linecap:butt;stroke-linejoin:miter;stroke-opacity:1"
       d="m 10.64478,149.20769 v -2 l -1.80036,1 z"
       id="path13648" />
    <path
       style="fill:none;stroke:#000000;stroke-width:0.4;stroke-linecap:butt;stroke-linejoin:miter;stroke-dasharray:none;stroke-opacity:1"
       d="m 8.84442,151.20769 h 3"
       id="path13650" />
    <path
       style="fill:none;stroke:#000000;stroke-width:0.4;stroke-linecap:butt;stroke-linejoin:miter;stroke-dasharray:none;stroke-opacity:1"
       d="m 8.84442,150.20769 v 2"
       id="path13652" />
    <path
       style="fill:none;stroke:#000000;stroke-width:0.4;stroke-linecap:butt;stroke-linejoin:miter;stroke-dasharray:none;stroke-opacity:1"
       d="m 8.84442,147.20769 v 2"
       id="path13654" />
    <path
       style="fill:none;stroke:#000000;stroke-width:0.4;stroke-linecap:butt;stroke-linejoin:miter;stroke-dasharray:none;stroke-opacity:1"
       d="m 8.84442,144.20769 v 2"
       id="path13656" />
    <path
       style="fill:none;stroke:#000000;stroke-width:0.4;stroke-linecap:butt;stroke-linejoin:miter;stroke-dasharray:none;stroke-opacity:1"
       d="m 11.84442,138.20769 h 9"
       id="path13658" />
    <g
       aria-label="GND"
       id="text13662"
       style="font-size:3.88056px;line-height:100%;font-family:Sans;-inkscape-font-specification:Sans;letter-spacing:0px;word-spacing:0px;stroke:#000000;stroke-width:0">
      <path
         d="m 9.1319896,161.94337 v -0.32591 l 1.1766734,-0.002 v 1.03077 q -0.270957,0.21601 -0.5589671,0.32591 -0.2880103,0.108 -0.5911791,0.108 -0.4092778,0 -0.7446582,-0.17432 -0.3334856,-0.17622 -0.504018,-0.50781 -0.1705324,-0.33159 -0.1705324,-0.74087 0,-0.40548 0.1686376,-0.75602 0.1705324,-0.35244 0.4888596,-0.52297 0.3183271,-0.17053 0.7332894,-0.17053 0.3012739,0 0.5438089,0.0985 0.2444298,0.0966 0.3827503,0.27096 0.138321,0.17432 0.210324,0.45475 l -0.3315913,0.0909 q -0.062529,-0.21222 -0.1553739,-0.33349 -0.092845,-0.12126 -0.2652727,-0.19327 -0.1724272,-0.0739 -0.3827505,-0.0739 -0.252009,0 -0.4358051,0.0777 -0.183796,0.0758 -0.2974843,0.20085 -0.1117935,0.12506 -0.1743221,0.27475 -0.106109,0.25769 -0.106109,0.55897 0,0.37138 0.1269519,0.62149 0.1288467,0.25012 0.3732765,0.37138 0.2444298,0.12127 0.5191765,0.12127 0.2387454,0 0.4661219,-0.0909 0.2273766,-0.0928 0.3448545,-0.19706 v -0.51728 z"
         style="font-family:sans-serif;-inkscape-font-specification:sans-serif"
         id="path33716" />
      <path
         d="m 10.846788,163.03288 v -2.77778 h 0.377066 l 1.458999,2.18092 v -2.18092 h 0.352434 v 2.77778 h -0.377066 l -1.459,-2.18281 v 2.18281 z"
         style="font-family:sans-serif;-inkscape-font-specification:sans-serif"
         id="path33718" />
      <path
         d="m 13.652993,163.03288 v -2.77778 h 0.956877 q 0.324011,0 0.494544,0.0398 0.238745,0.0549 0.407383,0.19895 0.219797,0.1857 0.327801,0.4756 0.109899,0.28801 0.109899,0.65939 0,0.31643 -0.0739,0.56086 -0.0739,0.24443 -0.18948,0.40549 -0.115583,0.15917 -0.253904,0.25201 -0.136426,0.0909 -0.331591,0.13832 -0.19327,0.0474 -0.445279,0.0474 z m 0.367593,-0.3278 h 0.593073 q 0.274747,0 0.430121,-0.0512 0.157269,-0.0512 0.250114,-0.144 0.130742,-0.13074 0.202744,-0.35054 0.0739,-0.22169 0.0739,-0.53623 0,-0.43581 -0.144005,-0.66887 -0.142111,-0.23495 -0.34675,-0.31454 -0.147794,-0.0568 -0.475596,-0.0568 h -0.583599 z"
         style="font-family:sans-serif;-inkscape-font-specification:sans-serif"
         id="path33720" />
    </g>
    <path
       style="fill:none;stroke:#000000;stroke-width:0.7;stroke-linecap:butt;stroke-linejoin:miter;stroke-miterlimit:4;stroke-dasharray:none;stroke-opacity:1"
       d="m 8.84442,158.20769 h 6"
       id="path13664" />
    <path
       id="path13666"
       style="fill:none;fill-opacity:0.5;stroke:#000000;stroke-width:0.5;stroke-linecap:round;stroke-linejoin:round;stroke-dasharray:none"
       d="m 11.84442,116.20769 a 1,1 0 0 1 1,1 1,1 0 0 1 -1,1 1,1 0 0 1 -1,-1 1,1 0 0 1 1,-1 z" />
    <g
       aria-label="+VDD"
       id="text13672"
       style="font-size:3.88056px;line-height:100%;font-family:Sans;-inkscape-font-specification:Sans;letter-spacing:0px;word-spacing:0px;stroke:#000000;stroke-width:0">
      <path
         d="m 8.5267514,113.98249 v -0.76171 H 7.7707243 v -0.31833 h 0.7560271 v -0.75603 h 0.3221168 v 0.75603 h 0.756027 v 0.31833 h -0.756027 v 0.76171 z"
         style="font-family:sans-serif;-inkscape-font-specification:sans-serif"
         id="path33685" />
      <path
         d="m 10.914205,114.43156 -1.0762487,-2.77779 h 0.3979087 l 0.721921,2.01797 q 0.08716,0.24254 0.1459,0.45475 0.06442,-0.22737 0.149689,-0.45475 l 0.750343,-2.01797 h 0.375171 l -1.087618,2.77779 z"
         style="font-family:sans-serif;-inkscape-font-specification:sans-serif"
         id="path33687" />
      <path
         d="m 12.603802,115.20767 v -1.80556 h 0.62197 q 0.210607,0 0.321454,0.0259 0.155184,0.0357 0.264799,0.12932 0.142868,0.1207 0.21307,0.30914 0.07143,0.18721 0.07143,0.42861 0,0.20568 -0.04803,0.36456 -0.04803,0.15888 -0.123162,0.26356 -0.07513,0.10346 -0.165038,0.16381 -0.08868,0.0591 -0.215534,0.0899 -0.125625,0.0308 -0.289431,0.0308 z m 0.238935,-0.21307 h 0.385498 q 0.178586,0 0.279579,-0.0333 0.102224,-0.0333 0.162574,-0.0936 0.08498,-0.085 0.131784,-0.22785 0.04803,-0.1441 0.04803,-0.34855 0,-0.28327 -0.0936,-0.43476 -0.09237,-0.15272 -0.225387,-0.20445 -0.09607,-0.037 -0.309137,-0.037 h -0.37934 z"
         style="font-size:65%;baseline-shift:sub"
         id="path33689" />
      <path
         d="m 14.425373,115.20767 v -1.80556 h 0.621969 q 0.210608,0 0.321454,0.0259 0.155184,0.0357 0.264799,0.12932 0.142868,0.1207 0.213071,0.30914 0.07143,0.18721 0.07143,0.42861 0,0.20568 -0.04803,0.36456 -0.04803,0.15888 -0.123163,0.26356 -0.07513,0.10346 -0.165037,0.16381 -0.08868,0.0591 -0.215534,0.0899 -0.125626,0.0308 -0.289432,0.0308 z m 0.238935,-0.21307 h 0.385498 q 0.178585,0 0.279578,-0.0333 0.102225,-0.0333 0.162574,-0.0936 0.08498,-0.085 0.131784,-0.22785 0.04803,-0.1441 0.04803,-0.34855 0,-0.28327 -0.0936,-0.43476 -0.09237,-0.15272 -0.225387,-0.20445 -0.09607,-0.037 -0.309138,-0.037 h -0.379339 z"
         style="font-size:65%;baseline-shift:sub"
         id="path33691" />
    </g>
    <path
       style="fill:#000000;fill-opacity:1;stroke:none;stroke-width:0.264583px;stroke-linecap:butt;stroke-linejoin:miter;stroke-opacity:1"
       d="m 18.84442,115.20769 c -2,0 -3,1 -4,2 1,1 2,2 4,2 h 7 v -4 z"
       id="path13674" />
    <path
       style="fill:#000000;fill-opacity:0.25;stroke:none;stroke-width:0.264583px;stroke-linecap:butt;stroke-linejoin:miter;stroke-opacity:1"
       d="m 17.84442,116.20769 1,-1 h 6 v 4 h -6 l -1,-1 z"
       id="path13676" />
    <g
       aria-label="5V"
       id="text13680"
       style="font-size:3.175px;line-height:100%;font-family:Sans;-inkscape-font-specification:Sans;letter-spacing:0px;word-spacing:0px;fill:#ffffff;stroke:#000000;stroke-width:0">
      <path
         d="m 19.474754,117.74023 0.434082,-0.045 q 0.0186,0.14728 0.110071,0.2341 0.09147,0.0853 0.21084,0.0853 0.136425,0 0.230993,-0.11007 0.09457,-0.11162 0.09457,-0.33486 0,-0.20929 -0.09457,-0.31316 -0.09302,-0.10542 -0.243396,-0.10542 -0.187585,0 -0.336413,0.16588 l -0.353467,-0.0512 0.223242,-1.18287 h 1.151868 v 0.40773 h -0.821656 l -0.06821,0.38602 q 0.145727,-0.0729 0.297656,-0.0729 0.289905,0 0.491443,0.21084 0.201538,0.21084 0.201538,0.54726 0,0.2806 -0.162781,0.50074 -0.221692,0.30076 -0.615466,0.30076 -0.31471,0 -0.513147,-0.16898 -0.198438,-0.16898 -0.237195,-0.45424 z"
         style="font-weight:bold;font-family:sans-serif;-inkscape-font-specification:'sans-serif Bold'"
         id="path33694" />
      <path
         d="m 21.910264,118.32469 -0.812353,-2.27273 h 0.497644 l 0.575158,1.68207 0.556556,-1.68207 h 0.486792 l -0.813904,2.27273 z"
         style="font-weight:bold;font-family:sans-serif;-inkscape-font-specification:'sans-serif Bold'"
         id="path33696" />
    </g>
    <path
       id="path13682"
       style="fill:#000000;fill-opacity:1;stroke:none;stroke-width:1.04298;stroke-linecap:butt;stroke-linejoin:miter;stroke-miterlimit:4;stroke-dasharray:none;stroke-opacity:1"
       d="m 11.84442,138.20769 h 0.89999 m 0,0 c 0,-0.49703 -0.40293,-0.89996 -0.89999,-0.89996 -0.49702,0 -0.90001,0.40293 -0.90001,0.89996 0,0.49703 0.40293,0.89997 0.89995,0.89997 0.49706,0 0.90005,-0.40294 0.90005,-0.89997 z" />
    <path
       id="path13684"
       style="fill:none;fill-opacity:0.5;stroke:#000000;stroke-width:0.5;stroke-linecap:round;stroke-linejoin:round;stroke-dasharray:none"
       d="m 21.84442,137.20769 a 1,1 0 0 1 1,1 1,1 0 0 1 -1,1 1,1 0 0 1 -1,-1 1,1 0 0 1 1,-1 z" />
    <path
       id="path13686"
       style="fill:none;fill-opacity:0.5;stroke:#000000;stroke-width:0.5;stroke-linecap:round;stroke-linejoin:round;stroke-dasharray:none"
       d="m -6.15558,150.20769 c 0.55228,0 1,0.44772 1,1 0,0.55228 -0.44772,1 -1,1 -0.55228,0 -1,-0.44772 -1,-1 0,-0.55228 0.44772,-1 1,-1 z" />
    <g
       aria-label="Out"
       id="text13690"
       style="font-size:3.88056px;line-height:100%;font-family:Sans;-inkscape-font-specification:Sans;letter-spacing:0px;word-spacing:0px;stroke:#000000;stroke-width:0">
      <path
         d="m 24.844444,138.24463 q 0,-0.69161 0.371382,-1.08194 0.371382,-0.39222 0.958771,-0.39222 0.384645,0 0.693498,0.1838 0.308854,0.18379 0.469912,0.51349 0.162953,0.3278 0.162953,0.74466 0,0.42254 -0.170532,0.75602 -0.170533,0.33349 -0.483175,0.50592 -0.312643,0.17053 -0.674551,0.17053 -0.392224,0 -0.701078,-0.18948 -0.308853,-0.18948 -0.468016,-0.51728 -0.159164,-0.3278 -0.159164,-0.6935 z m 0.378961,0.006 q 0,0.50213 0.269062,0.79203 0.270957,0.28801 0.67834,0.28801 0.414963,0 0.68213,-0.2918 0.269062,-0.2918 0.269062,-0.82803 0,-0.33917 -0.115583,-0.59118 -0.113688,-0.2539 -0.33538,-0.39222 -0.219798,-0.14022 -0.494544,-0.14022 -0.39033,0 -0.672656,0.26907 -0.280431,0.26716 -0.280431,0.89434 z"
         style="font-family:sans-serif;-inkscape-font-specification:sans-serif"
         id="path33704" />
      <path
         d="m 29.249865,139.59752 v -0.29559 q -0.234956,0.34106 -0.638549,0.34106 -0.178112,0 -0.333486,-0.0682 -0.153479,-0.0682 -0.229271,-0.17053 -0.0739,-0.10422 -0.104214,-0.2539 -0.02084,-0.10043 -0.02084,-0.31833 v -1.24678 h 0.341064 v 1.11604 q 0,0.26716 0.02084,0.36001 0.03221,0.13453 0.136426,0.21222 0.104215,0.0758 0.257694,0.0758 0.153479,0 0.28801,-0.0777 0.134531,-0.0796 0.18948,-0.21411 0.05685,-0.13643 0.05685,-0.39412 v -1.07814 h 0.341064 v 2.01228 z"
         style="font-family:sans-serif;-inkscape-font-specification:sans-serif"
         id="path33706" />
      <path
         d="m 30.833921,139.29246 0.04926,0.30127 q -0.144005,0.0303 -0.257693,0.0303 -0.185691,0 -0.28801,-0.0587 -0.10232,-0.0587 -0.144005,-0.15348 -0.04169,-0.0966 -0.04169,-0.4036 v -1.15772 h -0.250114 v -0.26527 h 0.250114 v -0.49834 l 0.33917,-0.20464 v 0.70298 h 0.342959 v 0.26527 h -0.342959 v 1.17667 q 0,0.1459 0.01705,0.18759 0.01895,0.0417 0.05874,0.0663 0.04169,0.0246 0.117478,0.0246 0.05684,0 0.149689,-0.0133 z"
         style="font-family:sans-serif;-inkscape-font-specification:sans-serif"
         id="path33708" />
    </g>
    <g
       aria-label="In"
       id="text13694"
       style="font-size:3.88056px;line-height:100%;font-family:Sans;-inkscape-font-specification:Sans;letter-spacing:0px;word-spacing:0px;stroke:#000000;stroke-width:0">
      <path
         d="m -11.762819,152.5966 v -2.77778 h 0.367592 v 2.77778 z"
         style="font-family:sans-serif;-inkscape-font-specification:sans-serif"
         id="path33723" />
      <path
         d="m -10.790784,152.5966 v -2.01228 h 0.306959 v 0.28612 q 0.221692,-0.33159 0.6404435,-0.33159 0.1819012,0 0.3334856,0.0663 0.1534792,0.0644 0.2292714,0.17054 0.075792,0.10611 0.106109,0.25201 0.018948,0.0947 0.018948,0.33159 v 1.2373 h -0.3410649 v -1.22404 q 0,-0.20843 -0.039791,-0.31075 -0.039791,-0.10421 -0.1421103,-0.16485 -0.1004247,-0.0625 -0.2368506,-0.0625 -0.2179029,0 -0.3770659,0.13832 -0.157269,0.13832 -0.157269,0.52486 v 1.09898 z"
         style="font-family:sans-serif;-inkscape-font-specification:sans-serif"
         id="path33725" />
    </g>
    <g
       aria-label="T2"
       id="text13698"
       style="font-size:3.88056px;line-height:100%;font-family:Sans;-inkscape-font-specification:Sans;letter-spacing:0px;word-spacing:0px;stroke:#000000;stroke-width:0">
      <path
         d="m 18.759618,149.60228 v -2.44998 h -0.91519 v -0.3278 h 2.201763 v 0.3278 H 19.12721 v 2.44998 z"
         style="font-family:sans-serif;-inkscape-font-specification:sans-serif"
         id="path33711" />
      <path
         d="m 22.077421,149.27448 v 0.3278 h -1.836065 q -0.0038,-0.12316 0.03979,-0.23685 0.07011,-0.18759 0.223586,-0.36949 0.155374,-0.1819 0.447174,-0.42064 0.452859,-0.37139 0.612022,-0.58739 0.159164,-0.21791 0.159164,-0.41118 0,-0.20274 -0.1459,-0.34106 -0.144005,-0.14022 -0.377066,-0.14022 -0.246325,0 -0.39412,0.1478 -0.147794,0.14779 -0.149689,0.40928 l -0.350539,-0.036 q 0.036,-0.39222 0.270957,-0.59686 0.234956,-0.20653 0.63097,-0.20653 0.399804,0 0.632865,0.22169 0.233061,0.22169 0.233061,0.54949 0,0.16675 -0.06821,0.3278 -0.06821,0.16106 -0.227377,0.33917 -0.157269,0.17812 -0.524861,0.48886 -0.306958,0.2577 -0.394119,0.35054 -0.08716,0.091 -0.144005,0.1838 z"
         style="font-family:sans-serif;-inkscape-font-specification:sans-serif"
         id="path33713" />
    </g>
    <path
       style="fill:none;stroke:#000000;stroke-width:0.4;stroke-linecap:butt;stroke-linejoin:miter;stroke-dasharray:none;stroke-opacity:1"
       d="m 7.84442,125.20769 v 6 h -9 v 7 h 13"
       id="path13700" />
    <path
       style="fill:none;stroke:#000000;stroke-width:0.4;stroke-linecap:butt;stroke-linejoin:miter;stroke-dasharray:none;stroke-opacity:1"
       d="m 8.84442,128.20769 h 3 v 10"
       id="path13702" />
    <circle
       style="fill:none;stroke:#000000;stroke-width:0.5;stroke-linecap:round;stroke-linejoin:round;stroke-dasharray:none;stroke-opacity:1"
       id="circle13704"
       cx="10.09442"
       cy="-128.20769"
       r="5.6246567"
       transform="scale(1,-1)" />
    <path
       id="path13706"
       style="fill:#000000;fill-opacity:1;stroke:none;stroke-width:0.344499;stroke-linecap:round;stroke-linejoin:round"
       d="m 12.49442,131.20769 c 0,-0.35898 -0.29102,-0.65 -0.65,-0.65 -0.35898,0 -0.65,0.29102 -0.65,0.65 0,0.35899 0.29102,0.65 0.65,0.65 0.35898,0 0.65,-0.29101 0.65,-0.65 z" />
    <path
       style="fill:#000000;fill-opacity:1;stroke:none;stroke-width:0.264583px;stroke-linecap:butt;stroke-linejoin:miter;stroke-opacity:1"
       d="m 10.64478,127.20769 v 2 l -1.80036,-1 z"
       id="path13708" />
    <path
       style="fill:none;stroke:#000000;stroke-width:0.4;stroke-linecap:butt;stroke-linejoin:miter;stroke-dasharray:none;stroke-opacity:1"
       d="m 11.84442,131.20769 h -3"
       id="path13710" />
    <path
       style="fill:none;stroke:#000000;stroke-width:0.4;stroke-linecap:butt;stroke-linejoin:miter;stroke-dasharray:none;stroke-opacity:1"
       d="m 8.84442,132.20769 v -8"
       id="path13716" />
    <g
       aria-label="T1"
       id="text13722"
       style="font-size:3.88056px;line-height:100%;font-family:Sans;-inkscape-font-specification:Sans;letter-spacing:0px;word-spacing:0px;stroke:#000000;stroke-width:0">
      <path
         d="m 18.759618,129.60228 v -2.44998 h -0.91519 v -0.3278 h 2.201763 v 0.3278 H 19.12721 v 2.44998 z"
         style="font-family:sans-serif;-inkscape-font-specification:sans-serif"
         id="path33699" />
      <path
         d="m 21.569614,129.60228 h -0.341065 v -2.17334 q -0.123162,0.11748 -0.324012,0.23495 -0.198954,0.11748 -0.358118,0.17622 v -0.32969 q 0.286116,-0.13454 0.500229,-0.32591 0.214113,-0.19138 0.303168,-0.37138 h 0.219798 z"
         style="font-family:sans-serif;-inkscape-font-specification:sans-serif"
         id="path33701" />
    </g>
    <path
       style="fill:none;stroke:#000000;stroke-width:0.4;stroke-linecap:butt;stroke-linejoin:miter;stroke-dasharray:none;stroke-opacity:1"
       d="m 8.84442,125.20769 h 3 v -7"
       id="path13724" />
  </g>
</svg>
