<?xml version="1.0" encoding="UTF-8" standalone="no"?>
<!-- Created with Inkscape (http://www.inkscape.org/) -->

<svg
   width="39.638432mm"
   height="64.426476mm"
   viewBox="0 0 39.638434 64.426476"
   version="1.1"
   id="svg18062"
   xmlns="http://www.w3.org/2000/svg"
   xmlns:svg="http://www.w3.org/2000/svg">
  <defs
     id="defs18059" />
  <g
     id="layer1"
     transform="translate(-100.11407,-72.380743)">
    <path
       style="fill:none;stroke:#000000;stroke-width:0.4;stroke-linecap:butt;stroke-linejoin:miter;stroke-dasharray:none;stroke-opacity:1"
       d="m 116.71375,103.93465 v 6 h -10"
       id="path25182" />
    <path
       style="fill:none;stroke:#000000;stroke-width:0.4;stroke-linecap:butt;stroke-linejoin:miter;stroke-dasharray:none;stroke-opacity:1"
       d="m 117.71375,103.93465 h 3 v -25"
       id="path25184" />
    <path
       style="fill:none;stroke:#000000;stroke-width:0.4;stroke-linecap:butt;stroke-linejoin:miter;stroke-dasharray:none;stroke-opacity:1"
       d="m 117.71375,106.93465 h 3 v 12 h -3"
       id="path25186" />
    <circle
       style="fill:none;stroke:#000000;stroke-width:0.5;stroke-linecap:round;stroke-linejoin:round;stroke-dasharray:none;stroke-opacity:1"
       id="circle25188"
       cx="118.96375"
       cy="106.93465"
       r="5.6246567" />
    <path
       id="path25192"
       style="fill:#000000;fill-opacity:1;stroke:none;stroke-width:0.344499;stroke-linecap:round;stroke-linejoin:round"
       d="m 121.36375,109.93761 c 0,0.35898 -0.29102,0.65 -0.65,0.65 -0.35898,0 -0.65,-0.29102 -0.65,-0.65 0,-0.35899 0.29102,-0.65 0.65,-0.65 0.35898,0 0.65,0.29101 0.65,0.65 z" />
    <path
       style="fill:#000000;fill-opacity:1;stroke:none;stroke-width:0.264583px;stroke-linecap:butt;stroke-linejoin:miter;stroke-opacity:1"
       d="m 119.51411,107.93465 v -2 l -1.80036,1 z"
       id="path25194" />
    <path
       style="fill:none;stroke:#000000;stroke-width:0.4;stroke-linecap:butt;stroke-linejoin:miter;stroke-dasharray:none;stroke-opacity:1"
       d="m 117.71375,109.93465 h 3"
       id="path25190" />
    <path
       style="fill:none;stroke:#000000;stroke-width:0.4;stroke-linecap:butt;stroke-linejoin:miter;stroke-dasharray:none;stroke-opacity:1"
       d="m 117.71375,108.93465 v 2"
       id="path25196" />
    <path
       style="fill:none;stroke:#000000;stroke-width:0.4;stroke-linecap:butt;stroke-linejoin:miter;stroke-dasharray:none;stroke-opacity:1"
       d="m 117.71375,105.93465 v 2"
       id="path25198" />
    <path
       style="fill:none;stroke:#000000;stroke-width:0.4;stroke-linecap:butt;stroke-linejoin:miter;stroke-dasharray:none;stroke-opacity:1"
       d="m 117.71375,102.93465 v 2"
       id="path25200" />
    <path
       style="fill:none;stroke:#000000;stroke-width:0.4;stroke-linecap:butt;stroke-linejoin:miter;stroke-dasharray:none;stroke-opacity:1"
       d="m 120.71375,96.93465 h 9"
       id="path25212" />
    <g
       aria-label="GND"
       id="text25216"
       style="font-size:3.88056px;line-height:100%;font-family:Sans;-inkscape-font-specification:Sans;letter-spacing:0px;word-spacing:0px;stroke:#000000;stroke-width:0">
      <path
         d="m 118.00134,135.67033 v -0.32591 l 1.17667,-0.002 v 1.03077 q -0.27096,0.21601 -0.55897,0.32591 -0.28801,0.108 -0.59118,0.108 -0.40927,0 -0.74465,-0.17432 -0.33349,-0.17622 -0.50402,-0.50781 -0.17053,-0.33159 -0.17053,-0.74087 0,-0.40548 0.16863,-0.75602 0.17054,-0.35244 0.48886,-0.52297 0.31833,-0.17053 0.73329,-0.17053 0.30128,0 0.54381,0.0985 0.24443,0.0966 0.38275,0.27096 0.13832,0.17432 0.21033,0.45475 l -0.3316,0.091 q -0.0625,-0.21222 -0.15537,-0.33349 -0.0928,-0.12126 -0.26527,-0.19327 -0.17243,-0.0739 -0.38275,-0.0739 -0.25201,0 -0.43581,0.0777 -0.18379,0.0758 -0.29748,0.20085 -0.1118,0.12506 -0.17432,0.27475 -0.10611,0.25769 -0.10611,0.55897 0,0.37138 0.12695,0.62149 0.12885,0.25012 0.37328,0.37138 0.24443,0.12127 0.51917,0.12127 0.23875,0 0.46612,-0.0909 0.22738,-0.0928 0.34486,-0.19706 v -0.51728 z"
         style="font-family:sans-serif;-inkscape-font-specification:sans-serif"
         id="path77126" />
      <path
         d="m 119.71614,136.75984 v -2.77778 h 0.37706 l 1.459,2.18092 v -2.18092 h 0.35244 v 2.77778 h -0.37707 l -1.459,-2.18281 v 2.18281 z"
         style="font-family:sans-serif;-inkscape-font-specification:sans-serif"
         id="path77128" />
      <path
         d="m 122.52234,136.75984 v -2.77778 h 0.95688 q 0.32401,0 0.49454,0.0398 0.23875,0.0549 0.40738,0.19895 0.2198,0.18569 0.32781,0.4756 0.10989,0.28801 0.10989,0.65939 0,0.31643 -0.0739,0.56086 -0.0739,0.24443 -0.18948,0.40549 -0.11559,0.15917 -0.25391,0.25201 -0.13642,0.0909 -0.33159,0.13832 -0.19327,0.0474 -0.44528,0.0474 z m 0.36759,-0.3278 h 0.59308 q 0.27474,0 0.43012,-0.0512 0.15727,-0.0512 0.25011,-0.144 0.13074,-0.13075 0.20275,-0.35054 0.0739,-0.2217 0.0739,-0.53623 0,-0.43581 -0.144,-0.66887 -0.14211,-0.23495 -0.34675,-0.31454 -0.1478,-0.0568 -0.4756,-0.0568 h -0.5836 z"
         style="font-family:sans-serif;-inkscape-font-specification:sans-serif"
         id="path77130" />
    </g>
    <path
       style="fill:none;stroke:#000000;stroke-width:0.7;stroke-linecap:butt;stroke-linejoin:miter;stroke-miterlimit:4;stroke-dasharray:none;stroke-opacity:1"
       d="m 117.71375,131.93465 h 6"
       id="path25218" />
    <path
       id="path25220"
       style="fill:none;fill-opacity:0.5;stroke:#000000;stroke-width:0.5;stroke-linecap:round;stroke-linejoin:round;stroke-dasharray:none"
       d="m 120.71375,76.93465 a 1,1 0 0 1 1,1 1,1 0 0 1 -1,1 1,1 0 0 1 -1,-1 1,1 0 0 1 1,-1 z" />
    <g
       aria-label="+VDD"
       id="text25226"
       style="font-size:3.88056px;line-height:100%;font-family:Sans;-inkscape-font-specification:Sans;letter-spacing:0px;word-spacing:0px;stroke:#000000;stroke-width:0">
      <path
         d="m 117.39608,74.709455 v -0.761712 h -0.75602 v -0.318327 h 0.75602 v -0.756027 h 0.32212 v 0.756027 h 0.75603 v 0.318327 h -0.75603 v 0.761712 z"
         style="font-family:sans-serif;-inkscape-font-specification:sans-serif"
         id="path77083" />
      <path
         d="m 119.78354,75.158524 -1.07625,-2.777784 h 0.39791 l 0.72192,2.017967 q 0.0872,0.242535 0.1459,0.454753 0.0644,-0.227377 0.14969,-0.454753 l 0.75034,-2.017967 h 0.37517 l -1.08762,2.777784 z"
         style="font-family:sans-serif;-inkscape-font-specification:sans-serif"
         id="path77085" />
      <path
         d="m 121.47314,75.934636 v -1.80556 h 0.62196 q 0.21061,0 0.32146,0.02586 0.15518,0.03572 0.2648,0.129321 0.14287,0.120699 0.21307,0.309137 0.0714,0.187207 0.0714,0.428605 0,0.205681 -0.048,0.36456 -0.048,0.15888 -0.12316,0.263568 -0.0751,0.103456 -0.16504,0.163805 -0.0887,0.05912 -0.21553,0.08991 -0.12563,0.03079 -0.28944,0.03079 z m 0.23893,-0.213071 h 0.3855 q 0.17858,0 0.27958,-0.03325 0.10222,-0.03325 0.16257,-0.0936 0.085,-0.08498 0.13178,-0.227851 0.048,-0.1441 0.048,-0.348549 0,-0.283273 -0.0936,-0.434763 -0.0924,-0.152721 -0.22538,-0.204449 -0.0961,-0.03695 -0.30914,-0.03695 h -0.37934 z"
         style="font-size:65%;baseline-shift:sub"
         id="path77087" />
      <path
         d="m 123.29471,75.934636 v -1.80556 h 0.62197 q 0.2106,0 0.32145,0.02586 0.15518,0.03572 0.2648,0.129321 0.14287,0.120699 0.21307,0.309137 0.0714,0.187207 0.0714,0.428605 0,0.205681 -0.048,0.36456 -0.048,0.15888 -0.12316,0.263568 -0.0751,0.103456 -0.16504,0.163805 -0.0887,0.05912 -0.21553,0.08991 -0.12563,0.03079 -0.28944,0.03079 z m 0.23893,-0.213071 h 0.3855 q 0.17858,0 0.27958,-0.03325 0.10222,-0.03325 0.16257,-0.0936 0.085,-0.08498 0.13178,-0.227851 0.048,-0.1441 0.048,-0.348549 0,-0.283273 -0.0936,-0.434763 -0.0924,-0.152721 -0.22538,-0.204449 -0.0961,-0.03695 -0.30914,-0.03695 h -0.37934 z"
         style="font-size:65%;baseline-shift:sub"
         id="path77089" />
    </g>
    <path
       style="fill:#000000;fill-opacity:1;stroke:none;stroke-width:0.264583px;stroke-linecap:butt;stroke-linejoin:miter;stroke-opacity:1"
       d="m 127.71375,75.93465 c -2,0 -3,1 -4,2 1,1 2,2 4,2 h 7 v -4 z"
       id="path25228" />
    <path
       style="fill:#000000;fill-opacity:0.25;stroke:none;stroke-width:0.264583px;stroke-linecap:butt;stroke-linejoin:miter;stroke-opacity:1"
       d="m 126.71375,76.93465 1,-1 h 6 v 4 h -6 l -1,-1 z"
       id="path25230" />
    <g
       aria-label="5V"
       id="text25234"
       style="font-size:3.175px;line-height:100%;font-family:Sans;-inkscape-font-specification:Sans;letter-spacing:0px;word-spacing:0px;fill:#ffffff;stroke:#000000;stroke-width:0">
      <path
         d="m 128.34409,78.467191 0.43409,-0.04496 q 0.0186,0.147278 0.11007,0.234094 0.0915,0.08527 0.21084,0.08527 0.13642,0 0.23099,-0.11007 0.0946,-0.111621 0.0946,-0.334864 0,-0.209289 -0.0946,-0.313159 -0.093,-0.10542 -0.24339,-0.10542 -0.18759,0 -0.33642,0.165882 l -0.35347,-0.05116 0.22325,-1.182874 h 1.15186 v 0.407727 h -0.82165 l -0.0682,0.386023 q 0.14572,-0.07286 0.29765,-0.07286 0.28991,0 0.49145,0.210839 0.20153,0.21084 0.20153,0.547254 0,0.280603 -0.16278,0.500744 -0.22169,0.300757 -0.61546,0.300757 -0.31471,0 -0.51315,-0.168982 -0.19844,-0.168982 -0.2372,-0.454235 z"
         style="font-weight:bold;font-family:sans-serif;-inkscape-font-specification:'sans-serif Bold'"
         id="path77092" />
      <path
         d="m 130.77961,79.051651 -0.81236,-2.272729 h 0.49765 l 0.57515,1.682067 0.55656,-1.682067 h 0.48679 l -0.8139,2.272729 z"
         style="font-weight:bold;font-family:sans-serif;-inkscape-font-specification:'sans-serif Bold'"
         id="path77094" />
    </g>
    <path
       id="path25236"
       style="fill:#000000;fill-opacity:1;stroke:none;stroke-width:1.04298;stroke-linecap:butt;stroke-linejoin:miter;stroke-miterlimit:4;stroke-dasharray:none;stroke-opacity:1"
       d="m 120.71375,96.93465 h 0.89999 m 0,0 c 0,-0.49703 -0.40293,-0.89996 -0.89999,-0.89996 -0.49702,0 -0.90001,0.40293 -0.90001,0.89996 0,0.49703 0.40293,0.89997 0.89995,0.89997 0.49706,0 0.90005,-0.40294 0.90005,-0.89997 z" />
    <path
       id="path25238"
       style="fill:none;fill-opacity:0.5;stroke:#000000;stroke-width:0.5;stroke-linecap:round;stroke-linejoin:round;stroke-dasharray:none"
       d="m 130.71375,95.93465 a 1,1 0 0 1 1,1 1,1 0 0 1 -1,1 1,1 0 0 1 -1,-1 1,1 0 0 1 1,-1 z" />
    <path
       id="path25240"
       style="fill:none;fill-opacity:0.5;stroke:#000000;stroke-width:0.5;stroke-linecap:round;stroke-linejoin:round;stroke-dasharray:none"
       d="m 105.71375,108.93465 a 1,1 0 0 1 1,1 1,1 0 0 1 -1,1 1,1 0 0 1 -1,-1 1,1 0 0 1 1,-1 z" />
    <g
       aria-label="Out"
       id="text25244"
       style="font-size:3.88056px;line-height:100%;font-family:Sans;-inkscape-font-specification:Sans;letter-spacing:0px;word-spacing:0px;stroke:#000000;stroke-width:0">
      <path
         d="m 133.71375,96.971588 q 0,-0.691604 0.37139,-1.081934 0.37138,-0.392224 0.95877,-0.392224 0.38464,0 0.6935,0.183796 0.30885,0.183796 0.46991,0.513492 0.16295,0.327801 0.16295,0.744658 0,0.422541 -0.17053,0.756027 -0.17053,0.333486 -0.48318,0.505913 -0.31264,0.170532 -0.67455,0.170532 -0.39222,0 -0.70108,-0.18948 -0.30885,-0.189481 -0.46801,-0.517282 -0.15917,-0.327801 -0.15917,-0.693498 z m 0.37897,0.0057 q 0,0.502123 0.26906,0.792028 0.27095,0.288011 0.67834,0.288011 0.41496,0 0.68213,-0.2918 0.26906,-0.2918 0.26906,-0.82803 0,-0.33917 -0.11558,-0.591179 -0.11369,-0.253904 -0.33538,-0.392224 -0.2198,-0.140216 -0.49455,-0.140216 -0.39033,0 -0.67265,0.269062 -0.28043,0.267168 -0.28043,0.894348 z"
         style="font-family:sans-serif;-inkscape-font-specification:sans-serif"
         id="path77109" />
      <path
         d="m 138.11918,98.324478 v -0.295589 q -0.23496,0.341064 -0.63855,0.341064 -0.17812,0 -0.33349,-0.06821 -0.15348,-0.06821 -0.22927,-0.170532 -0.0739,-0.104214 -0.10422,-0.253904 -0.0208,-0.100424 -0.0208,-0.318327 v -1.246781 h 0.34107 v 1.11604 q 0,0.267167 0.0208,0.360012 0.0322,0.134532 0.13643,0.212219 0.10421,0.07579 0.25769,0.07579 0.15348,0 0.28801,-0.07769 0.13453,-0.07958 0.18948,-0.214113 0.0568,-0.136426 0.0568,-0.39412 v -1.078143 h 0.34107 v 2.012282 z"
         style="font-family:sans-serif;-inkscape-font-specification:sans-serif"
         id="path77111" />
      <path
         d="m 139.70323,98.019415 0.0493,0.301274 q -0.14401,0.03032 -0.2577,0.03032 -0.18569,0 -0.28801,-0.05874 -0.10232,-0.05874 -0.144,-0.153479 -0.0417,-0.09663 -0.0417,-0.403593 v -1.157726 h -0.25011 v -0.265272 h 0.25011 v -0.498334 l 0.33917,-0.204639 v 0.702973 h 0.34296 v 0.265272 h -0.34296 v 1.176674 q 0,0.1459 0.0171,0.187586 0.0189,0.04169 0.0587,0.06632 0.0417,0.02463 0.11748,0.02463 0.0568,0 0.14969,-0.01326 z"
         style="font-family:sans-serif;-inkscape-font-specification:sans-serif"
         id="path77113" />
    </g>
    <g
       aria-label="A"
       id="text25248"
       style="font-size:3.88056px;line-height:100%;font-family:Sans;-inkscape-font-specification:Sans;letter-spacing:0px;word-spacing:0px;stroke:#000000;stroke-width:0">
      <path
         d="m 100.11407,111.32356 1.06678,-2.77778 h 0.39601 l 1.13689,2.77778 h -0.41876 l -0.32401,-0.84129 h -1.16151 l -0.30507,0.84129 z m 0.80151,-1.14067 h 0.94171 l -0.2899,-0.76929 q -0.13264,-0.35054 -0.19706,-0.57602 -0.053,0.26717 -0.14969,0.53054 z"
         style="font-family:sans-serif;-inkscape-font-specification:sans-serif"
         id="path77136" />
    </g>
    <g
       aria-label="T1"
       id="text25252"
       style="font-size:3.88056px;line-height:100%;font-family:Sans;-inkscape-font-specification:Sans;letter-spacing:0px;word-spacing:0px;stroke:#000000;stroke-width:0">
      <path
         d="m 127.62894,108.32924 v -2.44998 h -0.91519 v -0.3278 h 2.20177 v 0.3278 h -0.91898 v 2.44998 z"
         style="font-family:sans-serif;-inkscape-font-specification:sans-serif"
         id="path77116" />
      <path
         d="m 130.43894,108.32924 h -0.34107 v -2.17334 q -0.12316,0.11748 -0.32401,0.23495 -0.19895,0.11748 -0.35812,0.17622 v -0.3297 q 0.28612,-0.13453 0.50023,-0.3259 0.21412,-0.19138 0.30317,-0.37138 h 0.2198 z"
         style="font-family:sans-serif;-inkscape-font-specification:sans-serif"
         id="path77118" />
    </g>
    <path
       id="path25254"
       d="m 122.21375,91.93465 h -3 v -9 h 3 z"
       style="fill:#ffffff;fill-opacity:1;stroke:#000000;stroke-width:0.5;stroke-linecap:butt;stroke-linejoin:miter;stroke-miterlimit:4;stroke-dasharray:none;stroke-opacity:1" />
    <g
       aria-label="R1"
       id="text25258"
       style="font-size:3.88056px;line-height:100%;font-family:Sans;-inkscape-font-specification:Sans;letter-spacing:0px;word-spacing:0px;stroke:#000000;stroke-width:0">
      <path
         d="m 112.77066,85.934647 v -2.777784 h 1.23163 q 0.37138,0 0.56465,0.07579 0.19327,0.0739 0.30885,0.263378 0.11558,0.18948 0.11558,0.418752 0,0.295589 -0.19137,0.498333 -0.19138,0.202745 -0.59118,0.257694 0.1459,0.07011 0.22169,0.138321 0.16106,0.147794 0.30507,0.369487 l 0.48317,0.756027 h -0.46233 l -0.36759,-0.577916 q -0.16106,-0.250114 -0.26528,-0.38275 -0.10421,-0.132637 -0.18758,-0.185691 -0.0815,-0.05306 -0.16675,-0.0739 -0.0625,-0.01326 -0.20463,-0.01326 h -0.42634 v 1.233518 z m 0.36759,-1.551845 h 0.79014 q 0.25201,0 0.39412,-0.05116 0.14211,-0.05306 0.21601,-0.166743 0.0739,-0.115583 0.0739,-0.250114 0,-0.19706 -0.144,-0.324012 -0.14211,-0.126952 -0.45097,-0.126952 h -0.87919 z"
         style="font-family:sans-serif;-inkscape-font-specification:sans-serif"
         id="path77097" />
      <path
         d="m 116.71375,85.934647 h -0.34106 v -2.173341 q -0.12317,0.117478 -0.32402,0.234955 -0.19895,0.117478 -0.35811,0.176217 v -0.329696 q 0.28611,-0.134531 0.50023,-0.325906 0.21411,-0.191375 0.30316,-0.371382 h 0.2198 z"
         style="font-family:sans-serif;-inkscape-font-specification:sans-serif"
         id="path77099" />
    </g>
    <g
       aria-label="10k"
       id="text25262"
       style="font-size:3.175px;line-height:100%;font-family:Sans;-inkscape-font-specification:Sans;letter-spacing:0px;word-spacing:0px;stroke:#000000;stroke-width:0">
      <path
         d="m 112.78997,90.21669 h -0.27906 v -1.778186 q -0.10076,0.09612 -0.2651,0.192236 -0.16278,0.09612 -0.293,0.144178 v -0.269751 q 0.23409,-0.110071 0.40928,-0.266651 0.17518,-0.156579 0.24804,-0.303857 h 0.17984 z"
         style="font-family:sans-serif;-inkscape-font-specification:sans-serif"
         id="path77102" />
      <path
         d="m 113.50465,89.095828 q 0,-0.403076 0.0822,-0.648022 0.0837,-0.246497 0.24649,-0.379822 0.16434,-0.133325 0.41238,-0.133325 0.18294,0 0.32091,0.07441 0.13798,0.07286 0.2279,0.21239 0.0899,0.137976 0.14107,0.337964 0.0512,0.198437 0.0512,0.536401 0,0.399976 -0.0822,0.646472 -0.0822,0.244947 -0.2465,0.379822 -0.16278,0.133325 -0.41238,0.133325 -0.32866,0 -0.51625,-0.235644 -0.22479,-0.283704 -0.22479,-0.923975 z m 0.28681,0 q 0,0.559656 0.13022,0.745691 0.13178,0.184485 0.32401,0.184485 0.19224,0 0.32246,-0.186035 0.13178,-0.186035 0.13178,-0.744141 0,-0.561206 -0.13178,-0.745691 -0.13022,-0.184485 -0.32556,-0.184485 -0.19223,0 -0.30696,0.162781 -0.14417,0.20774 -0.14417,0.767395 z"
         style="font-family:sans-serif;-inkscape-font-specification:sans-serif"
         id="path77104" />
      <path
         d="m 115.3495,90.21669 v -2.272729 h 0.27905 v 1.296045 l 0.66043,-0.669727 h 0.36122 l -0.62942,0.610815 0.69298,1.035596 h -0.34417 l -0.54415,-0.841809 -0.19689,0.189136 v 0.652673 z"
         style="font-family:sans-serif;-inkscape-font-specification:sans-serif"
         id="path77106" />
    </g>
    <path
       style="fill:none;stroke:#000000;stroke-width:0.4;stroke-linecap:butt;stroke-linejoin:miter;stroke-dasharray:none;stroke-opacity:1"
       d="m 116.71375,118.93465 v 6 h -10"
       id="path27851" />
    <path
       style="fill:none;stroke:#000000;stroke-width:0.4;stroke-linecap:butt;stroke-linejoin:miter;stroke-dasharray:none;stroke-opacity:1"
       d="m 117.71375,121.93465 h 3 v 10"
       id="path27855" />
    <circle
       style="fill:none;stroke:#000000;stroke-width:0.5;stroke-linecap:round;stroke-linejoin:round;stroke-dasharray:none;stroke-opacity:1"
       id="circle27857"
       cx="118.96375"
       cy="121.93465"
       r="5.6246567" />
    <path
       id="path27861"
       style="fill:#000000;fill-opacity:1;stroke:none;stroke-width:0.344499;stroke-linecap:round;stroke-linejoin:round"
       d="m 121.36375,124.93761 c 0,0.35898 -0.29102,0.65 -0.65,0.65 -0.35898,0 -0.65,-0.29102 -0.65,-0.65 0,-0.35899 0.29102,-0.65 0.65,-0.65 0.35898,0 0.65,0.29101 0.65,0.65 z" />
    <path
       style="fill:#000000;fill-opacity:1;stroke:none;stroke-width:0.264583px;stroke-linecap:butt;stroke-linejoin:miter;stroke-opacity:1"
       d="m 119.51411,122.93465 v -2 l -1.80036,1 z"
       id="path27863" />
    <path
       style="fill:none;stroke:#000000;stroke-width:0.4;stroke-linecap:butt;stroke-linejoin:miter;stroke-dasharray:none;stroke-opacity:1"
       d="m 117.71375,124.93465 h 3"
       id="path27859" />
    <path
       style="fill:none;stroke:#000000;stroke-width:0.4;stroke-linecap:butt;stroke-linejoin:miter;stroke-dasharray:none;stroke-opacity:1"
       d="m 117.71375,123.93465 v 2"
       id="path27865" />
    <path
       style="fill:none;stroke:#000000;stroke-width:0.4;stroke-linecap:butt;stroke-linejoin:miter;stroke-dasharray:none;stroke-opacity:1"
       d="m 117.71375,120.93465 v 2"
       id="path27867" />
    <path
       style="fill:none;stroke:#000000;stroke-width:0.4;stroke-linecap:butt;stroke-linejoin:miter;stroke-dasharray:none;stroke-opacity:1"
       d="m 117.71375,117.93465 v 2"
       id="path27869" />
    <path
       id="path27879"
       style="fill:none;fill-opacity:0.5;stroke:#000000;stroke-width:0.5;stroke-linecap:round;stroke-linejoin:round;stroke-dasharray:none"
       d="m 105.71375,123.93465 a 1,1 0 0 1 1,1 1,1 0 0 1 -1,1 1,1 0 0 1 -1,-1 1,1 0 0 1 1,-1 z" />
    <g
       aria-label="B"
       id="text27883"
       style="font-size:3.88056px;line-height:100%;font-family:Sans;-inkscape-font-specification:Sans;letter-spacing:0px;word-spacing:0px;stroke:#000000;stroke-width:0">
      <path
         d="m 100.6162,126.32356 v -2.77778 h 1.04214 q 0.31833,0 0.5097,0.0853 0.19327,0.0834 0.30128,0.25958 0.1099,0.17433 0.1099,0.3657 0,0.17811 -0.0966,0.33538 -0.0966,0.15727 -0.2918,0.2539 0.25201,0.0739 0.38654,0.25201 0.13643,0.17812 0.13643,0.42065 0,0.19517 -0.0834,0.3638 -0.0815,0.16675 -0.20275,0.2577 -0.12127,0.091 -0.30506,0.13832 -0.1819,0.0455 -0.44718,0.0455 z m 0.36759,-1.61058 h 0.60065 q 0.24443,0 0.35054,-0.0322 0.14022,-0.0417 0.21033,-0.13832 0.072,-0.0966 0.072,-0.24254 0,-0.13832 -0.0663,-0.24253 -0.0663,-0.10611 -0.18948,-0.14401 -0.12316,-0.0398 -0.42254,-0.0398 h -0.55518 z m 0,1.28278 h 0.6916 q 0.17812,0 0.25012,-0.0133 0.12695,-0.0227 0.21222,-0.0758 0.0853,-0.0531 0.14021,-0.15348 0.055,-0.10232 0.055,-0.23496 0,-0.15537 -0.0796,-0.26906 -0.0796,-0.11558 -0.22169,-0.16106 -0.14022,-0.0474 -0.40549,-0.0474 h -0.64234 z"
         style="font-family:sans-serif;-inkscape-font-specification:sans-serif"
         id="path77133" />
    </g>
    <g
       aria-label="T1"
       id="text27887"
       style="font-size:3.88056px;line-height:100%;font-family:Sans;-inkscape-font-specification:Sans;letter-spacing:0px;word-spacing:0px;stroke:#000000;stroke-width:0">
      <path
         d="m 127.62894,123.32924 v -2.44998 h -0.91519 v -0.3278 h 2.20177 v 0.3278 h -0.91898 v 2.44998 z"
         style="font-family:sans-serif;-inkscape-font-specification:sans-serif"
         id="path77121" />
      <path
         d="m 130.43894,123.32924 h -0.34107 v -2.17334 q -0.12316,0.11748 -0.32401,0.23495 -0.19895,0.11748 -0.35812,0.17622 v -0.3297 q 0.28612,-0.13453 0.50023,-0.3259 0.21412,-0.19138 0.30317,-0.37138 h 0.2198 z"
         style="font-family:sans-serif;-inkscape-font-specification:sans-serif"
         id="path77123" />
    </g>
  </g>
</svg>
