<?xml version="1.0" encoding="UTF-8" standalone="no"?>
<!-- Created with Inkscape (http://www.inkscape.org/) -->

<svg
   width="32.740452mm"
   height="21.744139mm"
   viewBox="0 0 32.740451 21.74414"
   version="1.1"
   id="svg24917"
   xmlns="http://www.w3.org/2000/svg"
   xmlns:svg="http://www.w3.org/2000/svg">
  <defs
     id="defs24914" />
  <g
     id="layer1"
     transform="translate(-115.22959,-14.196795)">
    <g
       id="g11561"
       transform="matrix(0.33,0,0,0.33,77.13416,9.3117465)">
      <path
         style="fill:#666666;fill-opacity:1;stroke:#1a1a1a;stroke-width:0.454545;stroke-linecap:round;stroke-linejoin:bevel;stroke-dasharray:none;stroke-opacity:1"
         d="M 212.17622,27.5 190.52559,40 168.87495,27.5 190.52559,15.000002 Z"
         id="path2467" />
      <path
         style="fill:#333333;fill-opacity:1;stroke:#1a1a1a;stroke-width:0.454545;stroke-linecap:round;stroke-linejoin:round;stroke-dasharray:none;stroke-opacity:1"
         d="M 168.87495,27.5 190.52559,40 c 0,0 2.25059,5.970575 2.2548,10.698191 C 192.78563,57.789617 187.84982,63.47042 178.40123,58 169.73319,52.981491 166.83968,42.483849 166.81103,35.671273 166.80553,30.943656 168.87495,27.5 168.87495,27.5 Z"
         id="path2469" />
      <path
         id="path2465"
         style="fill:#4d4d4d;fill-opacity:1;stroke:#1a1a1a;stroke-width:0.454545;stroke-linecap:round;stroke-linejoin:round;stroke-dasharray:none;stroke-opacity:1"
         d="m 192.78246,50.602203 c 0.003,3.864342 -1.40909,7.290566 -4.17618,8.777451 l 21.8847,-12.639046 c 2.6032,-1.547948 3.93925,-4.817023 3.93592,-8.566564 C 214.4209,33.321698 212.17622,27.5 212.17622,27.5 L 190.52559,40 c 0,0 2.25256,5.749858 2.25687,10.602203 z" />
      <path
         style="fill:#b2b2b2;fill-opacity:1;stroke:#666666;stroke-width:0.454545;stroke-linecap:round;stroke-linejoin:round;stroke-dasharray:none;stroke-opacity:1"
         d="m 153.71949,74.250005 1.73205,1 v -2.000007 l -1.73205,-1 z"
         id="path6925" />
      <path
         style="fill:#b2b2b2;fill-opacity:1;stroke:#666666;stroke-width:0.454545;stroke-linecap:round;stroke-linejoin:round;stroke-dasharray:none;stroke-opacity:1"
         d="m 155.45154,75.250001 c 0,0 11.25833,-6.499996 13.85641,-8 2.49999,-1.443377 3.4641,-9.999999 6.06218,-11.499993 2.59808,-1.500002 8.0829,-4.666673 12.12435,-7.000005 v -1.999999 l -12.99038,7.5 C 171.90603,55.75 171.04,64.250005 168.44192,65.750006 l -12.99038,7.499995 z"
         id="path6927" />
      <path
         style="fill:#b2b2b2;fill-opacity:1;stroke:#666666;stroke-width:0.454545;stroke-linecap:round;stroke-linejoin:round;stroke-dasharray:none;stroke-opacity:1"
         d="m 155.45154,73.250001 12.99037,-7.499996 c 2.7538,-1.589906 3.46412,-10.000001 6.0622,-11.500003 2.59808,-1.499995 8.66025,-4.999997 12.99038,-7.5 l -1.73205,-1 c 0,0 -10.39231,6.000005 -12.99038,7.5 -2.59808,1.5 -3.56219,10.056621 -6.0622,11.500003 l -12.99037,7.499996 z"
         id="path6929" />
      <path
         style="fill:#b2b2b2;fill-opacity:1;stroke:#666666;stroke-width:0.454545;stroke-linecap:round;stroke-linejoin:round;stroke-dasharray:none;stroke-opacity:1"
         d="m 127.73874,57.250001 12.99037,-7.499997 c 2.75379,-1.589903 17.32051,-2.000001 19.91859,-3.500003 2.59808,-1.499995 8.66026,-4.999997 12.99039,-7.5 l -1.73205,-1 -12.99039,7.5 c -2.59808,1.500001 -17.41859,2.056626 -19.91859,3.500003 l -12.99037,7.499997 z"
         id="path7403" />
      <path
         style="fill:#b2b2b2;fill-opacity:1;stroke:#666666;stroke-width:0.454545;stroke-linecap:round;stroke-linejoin:round;stroke-dasharray:none;stroke-opacity:1"
         d="m 126.00669,58.250009 1.73205,1 v -2.000008 l -1.73205,-1 z"
         id="path7405" />
      <path
         style="fill:#b2b2b2;fill-opacity:1;stroke:#666666;stroke-width:0.454545;stroke-linecap:round;stroke-linejoin:round;stroke-dasharray:none;stroke-opacity:1"
         d="m 127.73874,59.250001 c 0,0 11.25833,-6.499996 13.85641,-8 2.49999,-1.443377 17.3205,-2.000002 19.91858,-3.499996 L 173.63809,40.75 v -1.999999 l -12.99039,7.5 c -2.59807,1.499996 -17.3205,2.000004 -19.91858,3.500005 l -12.99038,7.499995 z"
         id="path7407" />
      <path
         style="fill:#b2b2b2;fill-opacity:1;stroke:#666666;stroke-width:0.454545;stroke-linecap:round;stroke-linejoin:round;stroke-dasharray:none;stroke-opacity:1"
         d="m 141.59516,65.249998 38.97113,-22.499996 -1.73205,-1 -38.97113,22.499997 z"
         id="path7409" />
      <path
         style="fill:#b2b2b2;fill-opacity:1;stroke:#666666;stroke-width:0.454545;stroke-linecap:round;stroke-linejoin:round;stroke-dasharray:none;stroke-opacity:1"
         d="m 139.86309,66.250005 1.73205,1 v -2.000007 l -1.73205,-1 z"
         id="path7411" />
      <path
         style="fill:#b2b2b2;fill-opacity:1;stroke:#666666;stroke-width:0.454545;stroke-linecap:round;stroke-linejoin:round;stroke-dasharray:none;stroke-opacity:1"
         d="m 141.59514,67.250001 38.97115,-22.5 v -1.999999 l -38.97115,22.499999 z"
         id="path7413" />
    </g>
    <g
       aria-label="C"
       transform="matrix(0.85736514,-0.495,0.99,0.57157674,-161.10106,7.7899113)"
       id="g57915"
       style="font-size:3.52778px;line-height:1.25;stroke-width:0.529166">
      <path
         d="m 140.96987,169.36859 0.33417,0.0844 q -0.10507,0.41169 -0.37896,0.62873 -0.27216,0.21532 -0.66662,0.21532 -0.40825,0 -0.66491,-0.16537 -0.25494,-0.16709 -0.38929,-0.48231 -0.13264,-0.31523 -0.13264,-0.67696 0,-0.39447 0.14986,-0.6873 0.15159,-0.29456 0.42892,-0.44614 0.27905,-0.15331 0.61322,-0.15331 0.37896,0 0.63735,0.19293 0.25838,0.19292 0.36001,0.5426 l -0.32901,0.0775 q -0.0879,-0.27561 -0.25493,-0.40136 -0.16709,-0.12574 -0.42031,-0.12574 -0.29111,0 -0.48748,0.13952 -0.19465,0.13953 -0.27388,0.37552 -0.0792,0.23426 -0.0792,0.48403 0,0.32212 0.093,0.56328 0.0947,0.23943 0.29283,0.35829 0.19809,0.11885 0.42892,0.11885 0.28077,0 0.47542,-0.16192 0.19465,-0.16192 0.26355,-0.48059 z"
         id="path57913" />
    </g>
    <g
       aria-label="E"
       transform="matrix(0.85736514,-0.495,0.99,0.57157674,-158.05693,-7.9377121)"
       id="g57919"
       style="font-size:3.52778px;line-height:1.25;stroke-width:0.529166">
      <path
         d="m 121.64127,173.22781 v -2.52525 h 1.8259 v 0.298 h -1.49173 v 0.77342 h 1.39699 v 0.29628 h -1.39699 v 0.85955 h 1.55029 v 0.298 z"
         id="path57917" />
    </g>
    <g
       aria-label="B"
       transform="matrix(0.85736514,-0.495,0.99,0.57157674,-147.20508,-2.1887539)"
       id="g57923"
       style="font-size:3.52778px;line-height:1.25;stroke-width:0.529166">
      <path
         d="m 121.34195,167.33006 v -2.52525 h 0.94741 q 0.28938,0 0.46336,0.0775 0.1757,0.0758 0.27389,0.23599 0.0999,0.15847 0.0999,0.33245 0,0.16192 -0.0879,0.30489 -0.0879,0.14297 -0.26528,0.23082 0.2291,0.0672 0.3514,0.2291 0.12403,0.16192 0.12403,0.38241 0,0.17742 -0.0758,0.33073 -0.0741,0.15158 -0.18431,0.23427 -0.11024,0.0827 -0.27733,0.12574 -0.16536,0.0413 -0.40652,0.0413 z m 0.33418,-1.46416 h 0.54605 q 0.22221,0 0.31867,-0.0293 0.12747,-0.0379 0.1912,-0.12574 0.0655,-0.0879 0.0655,-0.22049 0,-0.12575 -0.0603,-0.22049 -0.0603,-0.0965 -0.17226,-0.13091 -0.11196,-0.0362 -0.38412,-0.0362 h -0.50471 z m 0,1.16616 h 0.62873 q 0.16192,0 0.22738,-0.0121 0.11541,-0.0207 0.19292,-0.0689 0.0775,-0.0482 0.12747,-0.13952 0.0499,-0.093 0.0499,-0.2136 0,-0.14125 -0.0723,-0.2446 -0.0724,-0.10508 -0.20154,-0.14642 -0.12747,-0.0431 -0.36863,-0.0431 h -0.58394 z"
         id="path57921" />
    </g>
  </g>
</svg>
