<?xml version="1.0" encoding="UTF-8" standalone="no"?>
<!-- Created with Inkscape (http://www.inkscape.org/) -->

<svg
   width="69.638412mm"
   height="75.42643mm"
   viewBox="0 0 69.638413 75.42643"
   version="1.1"
   id="svg37530"
   xmlns="http://www.w3.org/2000/svg"
   xmlns:svg="http://www.w3.org/2000/svg">
  <defs
     id="defs37527" />
  <g
     id="layer1"
     transform="translate(12.490859,-87.346479)">
    <text
       id="text32053"
       y="162.72554"
       x="18.797205"
       style="font-style:normal;font-variant:normal;font-weight:normal;font-stretch:normal;font-size:3.88056px;line-height:100%;font-family:Sans;-inkscape-font-specification:Sans;text-align:start;letter-spacing:0px;word-spacing:0px;writing-mode:lr-tb;text-anchor:start;fill:#000000;fill-opacity:1;stroke:#000000;stroke-width:0;stroke-miterlimit:4;stroke-dasharray:none;stroke-opacity:1"
       xml:space="preserve"><tspan
         style="font-style:normal;font-variant:normal;font-weight:normal;font-stretch:normal;font-size:3.88056px;font-family:sans-serif;-inkscape-font-specification:sans-serif;text-align:start;writing-mode:lr-tb;text-anchor:start;stroke-width:0;stroke-miterlimit:4;stroke-dasharray:none"
         y="162.72554"
         x="18.797205"
         id="tspan32051">GND</tspan></text>
    <path
       style="fill:none;stroke:#000000;stroke-width:0.7;stroke-linecap:butt;stroke-linejoin:miter;stroke-miterlimit:4;stroke-dasharray:none;stroke-opacity:1"
       d="m 20.10882,157.90037 h 6"
       id="path32055" />
    <path
       id="path32057"
       style="fill:#000000;fill-opacity:1;stroke:none;stroke-width:1.04298;stroke-linecap:butt;stroke-linejoin:miter;stroke-miterlimit:4;stroke-dasharray:none;stroke-opacity:1"
       d="m 23.10882,147.90037 h 0.89999 m 0,0 c 0,-0.49703 -0.40293,-0.89996 -0.89999,-0.89996 -0.49702,0 -0.90001,0.40293 -0.90001,0.89996 0,0.49703 0.40293,0.89997 0.89995,0.89997 0.49706,0 0.90005,-0.40294 0.90005,-0.89997 z" />
    <path
       style="fill:none;stroke:#000000;stroke-width:0.4;stroke-linecap:butt;stroke-linejoin:miter;stroke-dasharray:none;stroke-opacity:1"
       d="m 23.10882,147.90037 6e-5,10.10003"
       id="path32059" />
    <path
       id="path32061"
       style="fill:none;fill-opacity:0.5;stroke:#000000;stroke-width:0.5;stroke-linecap:round;stroke-linejoin:round;stroke-dasharray:none"
       d="m 23.10882,91.90037 a 1,1 0 0 1 1,1 1,1 0 0 1 -1,1 1,1 0 0 1 -1,-1 1,1 0 0 1 1,-1 z" />
    <path
       id="path32063"
       style="fill:none;fill-opacity:0.5;stroke:#000000;stroke-width:0.5;stroke-linecap:round;stroke-linejoin:round;stroke-dasharray:none"
       d="m 48.10882,111.90037 a 1,1 0 0 1 1,1 1,1 0 0 1 -1,1 1,1 0 0 1 -1,-1 1,1 0 0 1 1,-1 z" />
    <path
       style="fill:none;stroke:#000000;stroke-width:0.4;stroke-linecap:butt;stroke-linejoin:miter;stroke-dasharray:none;stroke-opacity:1"
       d="m 38.10882,112.90037 h 9"
       id="path32065" />
    <g
       aria-label="+VCC"
       id="text32071"
       style="font-size:3.88056px;line-height:100%;font-family:Sans;-inkscape-font-specification:Sans;letter-spacing:0px;word-spacing:0px;stroke:#000000;stroke-width:0">
      <path
         d="M 19.930952,89.675191 V 88.91348 h -0.756027 v -0.318327 h 0.756027 v -0.756027 h 0.322117 v 0.756027 h 0.756027 v 0.318327 h -0.756027 v 0.761711 z"
         style="font-family:sans-serif;-inkscape-font-specification:sans-serif"
         id="path119466" />
      <path
         d="m 22.318406,90.12426 -1.076249,-2.777784 h 0.397909 l 0.721921,2.017967 q 0.08716,0.242535 0.1459,0.454753 0.06442,-0.227376 0.149689,-0.454753 l 0.750343,-2.017967 h 0.375171 l -1.087617,2.777784 z"
         style="font-family:sans-serif;-inkscape-font-specification:sans-serif"
         id="path119468" />
      <path
         d="m 25.296281,90.267318 0.238935,0.06035 q -0.07513,0.294358 -0.270957,0.449543 -0.194597,0.153952 -0.476638,0.153952 -0.291895,0 -0.475407,-0.118235 -0.18228,-0.119468 -0.278347,-0.344855 -0.09483,-0.225387 -0.09483,-0.484028 0,-0.282041 0.107152,-0.491417 0.108383,-0.210608 0.306674,-0.318991 0.199523,-0.109614 0.438458,-0.109614 0.270957,0 0.4557,0.137942 0.184744,0.137942 0.257409,0.387961 l -0.23524,0.05542 q -0.06281,-0.19706 -0.18228,-0.286968 -0.119467,-0.08991 -0.300516,-0.08991 -0.208144,0 -0.348549,0.09976 -0.139174,0.09976 -0.195828,0.268494 -0.05665,0.1675 -0.05665,0.346086 0,0.230313 0.06651,0.40274 0.06774,0.171196 0.209376,0.256178 0.141636,0.08498 0.306674,0.08498 0.200754,0 0.339928,-0.115772 0.139173,-0.115773 0.188438,-0.343623 z"
         style="font-size:65%;baseline-shift:sub"
         id="path119470" />
      <path
         d="m 27.117851,90.267318 0.238935,0.06035 q -0.07513,0.294358 -0.270957,0.449543 -0.194596,0.153952 -0.476638,0.153952 -0.291895,0 -0.475406,-0.118235 -0.182281,-0.119468 -0.278347,-0.344855 -0.09483,-0.225387 -0.09483,-0.484028 0,-0.282041 0.107151,-0.491417 0.108383,-0.210608 0.306674,-0.318991 0.199523,-0.109614 0.438458,-0.109614 0.270957,0 0.455701,0.137942 0.184743,0.137942 0.257409,0.387961 l -0.23524,0.05542 q -0.06281,-0.19706 -0.18228,-0.286968 -0.119468,-0.08991 -0.300516,-0.08991 -0.208145,0 -0.34855,0.09976 -0.139173,0.09976 -0.195828,0.268494 -0.05665,0.1675 -0.05665,0.346086 0,0.230313 0.06651,0.40274 0.06774,0.171196 0.209376,0.256178 0.141637,0.08498 0.306674,0.08498 0.200755,0 0.339928,-0.115772 0.139174,-0.115773 0.188438,-0.343623 z"
         style="font-size:65%;baseline-shift:sub"
         id="path119472" />
    </g>
    <g
       aria-label="Out"
       id="text32075"
       style="font-size:3.88056px;line-height:100%;font-family:Sans;-inkscape-font-specification:Sans;letter-spacing:0px;word-spacing:0px;stroke:#000000;stroke-width:0">
      <path
         d="m 51.108816,112.93731 q 0,-0.6916 0.371382,-1.08193 0.371381,-0.39223 0.958771,-0.39223 0.384645,0 0.693498,0.1838 0.308853,0.18379 0.469912,0.51349 0.162953,0.3278 0.162953,0.74466 0,0.42254 -0.170532,0.75602 -0.170533,0.33349 -0.483176,0.50592 -0.312642,0.17053 -0.67455,0.17053 -0.392225,0 -0.701078,-0.18948 -0.308853,-0.18948 -0.468016,-0.51728 -0.159164,-0.3278 -0.159164,-0.6935 z m 0.378961,0.006 q 0,0.50213 0.269062,0.79203 0.270957,0.28801 0.67834,0.28801 0.414962,0 0.68213,-0.2918 0.269062,-0.2918 0.269062,-0.82803 0,-0.33917 -0.115583,-0.59118 -0.113688,-0.2539 -0.33538,-0.39222 -0.219798,-0.14022 -0.494544,-0.14022 -0.39033,0 -0.672656,0.26907 -0.280431,0.26716 -0.280431,0.89434 z"
         style="font-family:sans-serif;-inkscape-font-specification:sans-serif"
         id="path119490" />
      <path
         d="m 55.514237,114.2902 v -0.29559 q -0.234956,0.34106 -0.638549,0.34106 -0.178112,0 -0.333486,-0.0682 -0.153479,-0.0682 -0.229271,-0.17053 -0.0739,-0.10422 -0.104215,-0.2539 -0.02084,-0.10043 -0.02084,-0.31833 v -1.24678 h 0.341064 v 1.11604 q 0,0.26716 0.02084,0.36001 0.03221,0.13453 0.136426,0.21222 0.104214,0.0758 0.257694,0.0758 0.153479,0 0.28801,-0.0777 0.134531,-0.0796 0.18948,-0.21411 0.05684,-0.13643 0.05684,-0.39412 v -1.07814 H 55.8193 v 2.01228 z"
         style="font-family:sans-serif;-inkscape-font-specification:sans-serif"
         id="path119492" />
      <path
         d="m 57.098293,113.98514 0.04926,0.30127 q -0.144005,0.0303 -0.257693,0.0303 -0.185691,0 -0.28801,-0.0587 -0.10232,-0.0587 -0.144006,-0.15348 -0.04169,-0.0966 -0.04169,-0.40359 v -1.15773 h -0.250115 v -0.26527 h 0.250115 v -0.49834 l 0.33917,-0.20464 v 0.70298 h 0.342959 v 0.26527 h -0.342959 v 1.17667 q 0,0.1459 0.01705,0.18759 0.01895,0.0417 0.05874,0.0663 0.04169,0.0246 0.117478,0.0246 0.05684,0 0.149689,-0.0133 z"
         style="font-family:sans-serif;-inkscape-font-specification:sans-serif"
         id="path119494" />
    </g>
    <g
       aria-label="A"
       id="text32079"
       style="font-size:3.88056px;line-height:100%;font-family:Sans;-inkscape-font-specification:Sans;letter-spacing:0px;word-spacing:0px;stroke:#000000;stroke-width:0">
      <path
         d="m -12.490859,124.28925 1.066775,-2.77778 h 0.396015 l 1.1368824,2.77778 h -0.4187514 l -0.324012,-0.84129 h -1.161515 l -0.305064,0.84129 z m 0.801503,-1.14067 h 0.941718 l -0.289905,-0.76929 q -0.132637,-0.35054 -0.19706,-0.57602 -0.05306,0.26717 -0.14969,0.53054 z"
         style="font-family:sans-serif;-inkscape-font-specification:sans-serif"
         id="path119531" />
    </g>
    <path
       style="fill:none;stroke:#000000;stroke-width:0.4;stroke-linecap:butt;stroke-linejoin:miter;stroke-dasharray:none;stroke-opacity:1"
       d="m 23.10882,93.90037 v 19"
       id="path32081" />
    <path
       id="path32083"
       d="m 24.60882,107.90037 h -3 v -9 h 3 z"
       style="fill:#ffffff;fill-opacity:1;stroke:#000000;stroke-width:0.5;stroke-linecap:butt;stroke-linejoin:miter;stroke-miterlimit:4;stroke-dasharray:none;stroke-opacity:1" />
    <path
       id="path32087"
       style="fill:none;fill-opacity:0.5;stroke:#000000;stroke-width:0.5;stroke-linecap:round;stroke-linejoin:round;stroke-dasharray:none"
       d="m -6.89118,121.90037 a 1,1 0 0 1 1,1 1,1 0 0 1 -1,1 1,1 0 0 1 -1,-1 1,1 0 0 1 1,-1 z" />
    <g
       aria-label="10k"
       id="text32091"
       style="font-size:3.175px;line-height:100%;font-family:Sans;-inkscape-font-specification:Sans;letter-spacing:0px;word-spacing:0px;stroke:#000000;stroke-width:0">
      <path
         d="M 6.9459904,118.86161 H 6.6669376 v -1.77819 q -0.100769,0.0961 -0.2651001,0.19224 -0.1627807,0.0961 -0.2930053,0.14418 v -0.26975 q 0.2340942,-0.11007 0.4092773,-0.26665 0.1751831,-0.15658 0.2480469,-0.30386 h 0.179834 z"
         style="font-family:sans-serif;-inkscape-font-specification:sans-serif"
         id="path119507" />
      <path
         d="m 7.6606754,117.74075 q 0,-0.40308 0.082166,-0.64802 0.083716,-0.2465 0.2464966,-0.37983 0.1643311,-0.13332 0.4123779,-0.13332 0.1829346,0 0.3209107,0.0744 0.137976,0.0729 0.227893,0.21239 0.089917,0.13798 0.1410767,0.33797 0.05116,0.19843 0.05116,0.5364 0,0.39997 -0.082166,0.64647 -0.082166,0.24495 -0.2464965,0.37982 -0.1627808,0.13333 -0.412378,0.13333 -0.3286621,0 -0.5162475,-0.23565 -0.2247925,-0.2837 -0.2247925,-0.92397 z m 0.2868042,0 q 0,0.55965 0.1302246,0.74569 0.1317749,0.18448 0.3240112,0.18448 0.1922364,0 0.322461,-0.18603 0.1317749,-0.18604 0.1317749,-0.74414 0,-0.56121 -0.1317749,-0.74569 -0.1302246,-0.18449 -0.3255616,-0.18449 -0.1922363,0 -0.306958,0.16278 -0.1441772,0.20774 -0.1441772,0.7674 z"
         style="font-family:sans-serif;-inkscape-font-specification:sans-serif"
         id="path119509" />
      <path
         d="m 9.505524,118.86161 v -2.27273 h 0.2790527 v 1.29605 l 0.6604253,-0.66973 h 0.361218 l -0.629419,0.61081 0.692981,1.0356 h -0.344165 l -0.5441531,-0.84181 -0.1968872,0.18914 v 0.65267 z"
         style="font-family:sans-serif;-inkscape-font-specification:sans-serif"
         id="path119511" />
    </g>
    <g
       aria-label="R1"
       id="text32095"
       style="font-size:3.88056px;line-height:100%;font-family:Sans;-inkscape-font-specification:Sans;letter-spacing:0px;word-spacing:0px;stroke:#000000;stroke-width:0">
      <path
         d="m 0.10882984,118.90037 v -2.77779 H 1.3404529 q 0.3713817,0 0.5646518,0.0758 0.19327,0.0739 0.3088531,0.26337 0.1155831,0.18948 0.1155831,0.41876 0,0.29559 -0.1913753,0.49833 -0.1913752,0.20274 -0.591179,0.25769 0.1458999,0.0701 0.2216921,0.13832 0.1610584,0.1478 0.3050636,0.36949 l 0.4831752,0.75603 H 2.0945851 L 1.726993,118.32245 q -0.1610584,-0.25011 -0.2652726,-0.38275 -0.1042143,-0.13263 -0.1875857,-0.18569 -0.081477,-0.053 -0.1667428,-0.0739 -0.062529,-0.0133 -0.20463891,-0.0133 H 0.47642195 v 1.23352 z m 0.36759211,-1.55185 H 1.2665555 q 0.252009,0 0.3941194,-0.0512 0.1421103,-0.053 0.2160077,-0.16674 0.073897,-0.11558 0.073897,-0.25011 0,-0.19706 -0.1440052,-0.32402 -0.1421103,-0.12695 -0.4509635,-0.12695 H 0.47642195 Z"
         style="font-family:sans-serif;-inkscape-font-specification:sans-serif"
         id="path119514" />
      <path
         d="M 4.0519183,118.90037 H 3.7108535 v -2.17334 q -0.1231623,0.11747 -0.3240116,0.23495 -0.1989545,0.11748 -0.3581181,0.17622 v -0.3297 q 0.2861155,-0.13453 0.5002284,-0.3259 0.214113,-0.19138 0.3031688,-0.37138 h 0.2197973 z"
         style="font-family:sans-serif;-inkscape-font-specification:sans-serif"
         id="path119516" />
    </g>
    <g
       aria-label="T1"
       id="text32099"
       style="font-size:3.88056px;line-height:100%;font-family:Sans;-inkscape-font-specification:Sans;letter-spacing:0px;word-spacing:0px;stroke:#000000;stroke-width:0">
      <path
         d="m 30.024019,123.90037 v -2.44998 h -0.915191 v -0.32781 h 2.201763 v 0.32781 h -0.91898 v 2.44998 z"
         style="font-family:sans-serif;-inkscape-font-specification:sans-serif"
         id="path119497" />
      <path
         d="m 32.834014,123.90037 h -0.341065 v -2.17334 q -0.123162,0.11747 -0.324011,0.23495 -0.198955,0.11748 -0.358118,0.17622 v -0.3297 q 0.286115,-0.13453 0.500228,-0.3259 0.214113,-0.19138 0.303169,-0.37138 h 0.219797 z"
         style="font-family:sans-serif;-inkscape-font-specification:sans-serif"
         id="path119499" />
    </g>
    <g
       aria-label="R3"
       id="text32103"
       style="font-size:3.88056px;line-height:100%;font-family:Sans;-inkscape-font-specification:Sans;letter-spacing:0px;word-spacing:0px;stroke:#000000;stroke-width:0">
      <path
         d="m 14.62949,102.8511 v -2.77779 h 1.231623 q 0.371382,0 0.564652,0.0758 0.19327,0.0739 0.308853,0.26337 0.115583,0.18948 0.115583,0.41876 0,0.29558 -0.191375,0.49833 -0.191375,0.20274 -0.591179,0.25769 0.1459,0.0701 0.221692,0.13832 0.161058,0.1478 0.305064,0.36949 l 0.483175,0.75603 h -0.462333 l -0.367592,-0.57792 q -0.161058,-0.25011 -0.265272,-0.38275 -0.104215,-0.13264 -0.187586,-0.18569 -0.08148,-0.053 -0.166743,-0.0739 -0.06253,-0.0133 -0.204639,-0.0133 h -0.426331 v 1.23352 z m 0.367592,-1.55185 h 0.790134 q 0.252009,0 0.394119,-0.0512 0.142111,-0.053 0.216008,-0.16674 0.0739,-0.11558 0.0739,-0.25011 0,-0.19706 -0.144005,-0.32402 -0.14211,-0.12695 -0.450963,-0.12695 h -0.87919 z"
         style="font-family:sans-serif;-inkscape-font-specification:sans-serif"
         id="path119480" />
      <path
         d="m 17.289796,102.11781 0.341065,-0.0455 q 0.05874,0.28991 0.198954,0.41875 0.142111,0.12696 0.344855,0.12696 0.24064,0 0.405488,-0.16675 0.166743,-0.16674 0.166743,-0.41306 0,-0.23496 -0.153479,-0.38654 -0.15348,-0.15348 -0.39033,-0.15348 -0.09664,0 -0.24064,0.0379 l 0.0379,-0.29938 q 0.03411,0.004 0.05495,0.004 0.217903,0 0.392225,-0.11369 0.174322,-0.11368 0.174322,-0.35053 0,-0.18759 -0.126952,-0.31075 -0.126952,-0.12316 -0.327802,-0.12316 -0.198954,0 -0.33159,0.12505 -0.132637,0.12506 -0.170533,0.37517 l -0.341065,-0.0606 q 0.06253,-0.34296 0.284221,-0.53054 0.221692,-0.18949 0.551388,-0.18949 0.227377,0 0.418752,0.0985 0.191375,0.0966 0.2918,0.26528 0.102319,0.16863 0.102319,0.35812 0,0.18 -0.09663,0.3278 -0.09663,0.14779 -0.286115,0.23495 0.246325,0.0568 0.38275,0.23685 0.136426,0.17811 0.136426,0.44718 0,0.3638 -0.265272,0.6177 -0.265273,0.25201 -0.670761,0.25201 -0.365697,0 -0.608232,-0.2179 -0.240641,-0.2179 -0.274747,-0.56465 z"
         style="font-family:sans-serif;-inkscape-font-specification:sans-serif"
         id="path119482" />
    </g>
    <g
       aria-label="1M"
       id="text32107"
       style="font-size:3.175px;line-height:100%;font-family:Sans;-inkscape-font-specification:Sans;letter-spacing:0px;word-spacing:0px;stroke:#000000;stroke-width:0">
      <path
         d="m 16.121405,107.1824 h -0.279052 v -1.77818 q -0.100769,0.0961 -0.2651,0.19223 -0.162781,0.0961 -0.293006,0.14418 v -0.26975 q 0.234094,-0.11007 0.409278,-0.26665 0.175183,-0.15658 0.248046,-0.30386 h 0.179834 z"
         style="font-family:sans-serif;-inkscape-font-specification:sans-serif"
         id="path119485" />
      <path
         d="m 16.93996,107.1824 v -2.27273 h 0.452686 l 0.537951,1.60921 q 0.07441,0.22479 0.108521,0.33641 0.03876,-0.12402 0.120923,-0.36432 l 0.544152,-1.5813 h 0.404627 v 2.27273 h -0.289905 v -1.90221 l -0.660425,1.90221 h -0.271301 l -0.657324,-1.93476 v 1.93476 z"
         style="font-family:sans-serif;-inkscape-font-specification:sans-serif"
         id="path119487" />
    </g>
    <path
       style="fill:#000000;fill-opacity:1;stroke:none;stroke-width:0.264583px;stroke-linecap:butt;stroke-linejoin:miter;stroke-opacity:1"
       d="m 30.10882,90.90037 c -2,0 -3,1 -4,2 1,1 2,2 4,2 h 7 v -4 z"
       id="path32113" />
    <path
       style="fill:#000000;fill-opacity:0.25;stroke:none;stroke-width:0.264583px;stroke-linecap:butt;stroke-linejoin:miter;stroke-opacity:1"
       d="m 29.10882,91.90037 1,-1 h 6 v 4 h -6 l -1,-1 z"
       id="path32115" />
    <g
       aria-label="5V"
       id="text32119"
       style="font-size:3.175px;line-height:100%;font-family:Sans;-inkscape-font-specification:Sans;letter-spacing:0px;word-spacing:0px;fill:#ffffff;stroke:#000000;stroke-width:0">
      <path
         d="m 30.739185,93.432881 0.434082,-0.04496 q 0.0186,0.147278 0.110071,0.234094 0.09147,0.08527 0.21084,0.08527 0.136425,0 0.230993,-0.110071 0.09457,-0.111621 0.09457,-0.334863 0,-0.20929 -0.09457,-0.313159 -0.09302,-0.10542 -0.243396,-0.10542 -0.187585,0 -0.336413,0.165881 l -0.353467,-0.05116 0.223242,-1.182874 h 1.151868 v 0.407727 h -0.821656 l -0.06821,0.386023 q 0.145727,-0.07286 0.297656,-0.07286 0.289905,0 0.491443,0.21084 0.201538,0.21084 0.201538,0.547253 0,0.280604 -0.162781,0.500745 -0.221692,0.300757 -0.615466,0.300757 -0.31471,0 -0.513147,-0.168982 -0.198438,-0.168982 -0.237195,-0.454236 z"
         style="font-weight:bold;font-family:sans-serif;-inkscape-font-specification:'sans-serif Bold'"
         id="path119475" />
      <path
         d="m 33.174695,94.017342 -0.812353,-2.27273 h 0.497644 l 0.575158,1.682068 0.556556,-1.682068 h 0.486792 l -0.813904,2.27273 z"
         style="font-weight:bold;font-family:sans-serif;-inkscape-font-specification:'sans-serif Bold'"
         id="path119477" />
    </g>
    <g
       aria-label="B"
       id="text32139"
       style="font-size:3.88056px;line-height:100%;font-family:Sans;-inkscape-font-specification:Sans;letter-spacing:0px;word-spacing:0px;stroke:#000000;stroke-width:0">
      <path
         d="m -11.988734,139.28926 v -2.77778 h 1.042142 q 0.318327,0 0.509703,0.0853 0.19327,0.0834 0.301274,0.25959 0.109898,0.17432 0.109898,0.3657 0,0.17811 -0.09663,0.33538 -0.09664,0.15727 -0.2918,0.2539 0.252009,0.0739 0.386541,0.25201 0.1364255,0.17811 0.1364255,0.42065 0,0.19516 -0.083371,0.3638 -0.081477,0.16674 -0.2027441,0.25769 -0.121267,0.091 -0.305064,0.13833 -0.181901,0.0455 -0.447173,0.0455 z m 0.367592,-1.61058 h 0.600653 q 0.24443,0 0.350539,-0.0322 0.140215,-0.0417 0.210323,-0.13833 0.072,-0.0966 0.072,-0.24253 0,-0.13832 -0.06632,-0.24254 -0.06632,-0.1061 -0.189481,-0.144 -0.123162,-0.0398 -0.422541,-0.0398 h -0.555178 z m 0,1.28278 h 0.691604 q 0.178111,0 0.250114,-0.0133 0.126952,-0.0227 0.212218,-0.0758 0.08527,-0.0531 0.140215,-0.15348 0.05495,-0.10231 0.05495,-0.23495 0,-0.15538 -0.07958,-0.26906 -0.07958,-0.11559 -0.221692,-0.16106 -0.140216,-0.0474 -0.405488,-0.0474 h -0.642339 z"
         style="font-family:sans-serif;-inkscape-font-specification:sans-serif"
         id="path119534" />
    </g>
    <path
       id="path32141"
       style="fill:none;fill-opacity:0.5;stroke:#000000;stroke-width:0.5;stroke-linecap:round;stroke-linejoin:round;stroke-dasharray:none"
       d="m -6.89118,136.90037 a 1,1 0 0 1 1,1 1,1 0 0 1 -1,1 1,1 0 0 1 -1,-1 1,1 0 0 1 1,-1 z" />
    <g
       aria-label="10k"
       id="text32145"
       style="font-size:3.175px;line-height:100%;font-family:Sans;-inkscape-font-specification:Sans;letter-spacing:0px;word-spacing:0px;stroke:#000000;stroke-width:0">
      <path
         d="M 6.9459904,133.86162 H 6.6669376 v -1.77819 q -0.100769,0.0961 -0.2651001,0.19224 -0.1627807,0.0961 -0.2930053,0.14418 v -0.26976 q 0.2340942,-0.11007 0.4092773,-0.26665 0.1751831,-0.15658 0.2480469,-0.30385 h 0.179834 z"
         style="font-family:sans-serif;-inkscape-font-specification:sans-serif"
         id="path119524" />
      <path
         d="m 7.6606754,132.74076 q 0,-0.40308 0.082166,-0.64803 0.083716,-0.24649 0.2464966,-0.37982 0.1643311,-0.13332 0.4123779,-0.13332 0.1829346,0 0.3209107,0.0744 0.137976,0.0729 0.227893,0.21239 0.089917,0.13798 0.1410767,0.33796 0.05116,0.19844 0.05116,0.53641 0,0.39997 -0.082166,0.64647 -0.082166,0.24494 -0.2464965,0.37982 -0.1627808,0.13333 -0.412378,0.13333 -0.3286621,0 -0.5162475,-0.23565 -0.2247925,-0.2837 -0.2247925,-0.92397 z m 0.2868042,0 q 0,0.55965 0.1302246,0.74569 0.1317749,0.18448 0.3240112,0.18448 0.1922364,0 0.322461,-0.18603 0.1317749,-0.18604 0.1317749,-0.74414 0,-0.56121 -0.1317749,-0.74569 -0.1302246,-0.18449 -0.3255616,-0.18449 -0.1922363,0 -0.306958,0.16278 -0.1441772,0.20774 -0.1441772,0.7674 z"
         style="font-family:sans-serif;-inkscape-font-specification:sans-serif"
         id="path119526" />
      <path
         d="m 9.505524,133.86162 v -2.27273 h 0.2790527 v 1.29604 l 0.6604253,-0.66972 h 0.361218 l -0.629419,0.61081 0.692981,1.0356 h -0.344165 l -0.5441531,-0.84181 -0.1968872,0.18913 v 0.65268 z"
         style="font-family:sans-serif;-inkscape-font-specification:sans-serif"
         id="path119528" />
    </g>
    <g
       aria-label="R2"
       id="text32149"
       style="font-size:3.88056px;line-height:100%;font-family:Sans;-inkscape-font-specification:Sans;letter-spacing:0px;word-spacing:0px;stroke:#000000;stroke-width:0">
      <path
         d="m 0.10882984,133.90038 v -2.77779 H 1.3404529 q 0.3713817,0 0.5646518,0.0758 0.19327,0.0739 0.3088531,0.26338 0.1155831,0.18948 0.1155831,0.41875 0,0.29559 -0.1913753,0.49834 -0.1913752,0.20274 -0.591179,0.25769 0.1458999,0.0701 0.2216921,0.13832 0.1610584,0.1478 0.3050636,0.36949 l 0.4831752,0.75603 H 2.0945851 L 1.726993,133.32246 q -0.1610584,-0.25011 -0.2652726,-0.38275 -0.1042143,-0.13264 -0.1875857,-0.18569 -0.081477,-0.0531 -0.1667428,-0.0739 -0.062529,-0.0133 -0.20463891,-0.0133 H 0.47642195 v 1.23352 z m 0.36759211,-1.55185 H 1.2665555 q 0.252009,0 0.3941194,-0.0512 0.1421103,-0.0531 0.2160077,-0.16674 0.073897,-0.11559 0.073897,-0.25012 0,-0.19706 -0.1440052,-0.32401 -0.1421103,-0.12695 -0.4509635,-0.12695 H 0.47642195 Z"
         style="font-family:sans-serif;-inkscape-font-specification:sans-serif"
         id="path119519" />
      <path
         d="m 4.559726,133.57257 v 0.32781 H 2.7236603 q -0.00379,-0.12317 0.039791,-0.23686 0.070108,-0.18758 0.2235869,-0.36948 0.155374,-0.1819 0.4471739,-0.42065 0.4528583,-0.37138 0.6120219,-0.58739 0.1591636,-0.2179 0.1591636,-0.41117 0,-0.20274 -0.1459,-0.34107 -0.1440051,-0.14021 -0.3770661,-0.14021 -0.2463246,0 -0.3941193,0.14779 -0.1477948,0.1478 -0.1496896,0.40928 l -0.3505389,-0.036 q 0.036001,-0.39222 0.2709571,-0.59686 0.2349558,-0.20654 0.6309699,-0.20654 0.3998038,0 0.6328648,0.2217 0.233061,0.22169 0.233061,0.54949 0,0.16674 -0.068213,0.3278 -0.068213,0.16106 -0.2273766,0.33917 -0.1572687,0.17811 -0.5248608,0.48886 -0.3069584,0.25769 -0.3941194,0.35054 -0.087161,0.0909 -0.1440052,0.18379 z"
         style="font-family:sans-serif;-inkscape-font-specification:sans-serif"
         id="path119521" />
    </g>
    <g
       aria-label="T2"
       id="text32153"
       style="font-size:3.88056px;line-height:100%;font-family:Sans;-inkscape-font-specification:Sans;letter-spacing:0px;word-spacing:0px;stroke:#000000;stroke-width:0">
      <path
         d="m 45.024021,138.90038 v -2.44999 H 44.10883 v -0.3278 h 2.201763 v 0.3278 h -0.91898 v 2.44999 z"
         style="font-family:sans-serif;-inkscape-font-specification:sans-serif"
         id="path119502" />
      <path
         d="m 48.341824,138.57257 v 0.32781 h -1.836066 q -0.0038,-0.12317 0.03979,-0.23686 0.07011,-0.18758 0.223587,-0.36948 0.155374,-0.1819 0.447174,-0.42065 0.452858,-0.37138 0.612022,-0.58739 0.159163,-0.2179 0.159163,-0.41117 0,-0.20274 -0.1459,-0.34107 -0.144005,-0.14021 -0.377066,-0.14021 -0.246324,0 -0.394119,0.14779 -0.147795,0.1478 -0.14969,0.40928 l -0.350539,-0.036 q 0.036,-0.39222 0.270957,-0.59686 0.234956,-0.20654 0.63097,-0.20654 0.399804,0 0.632865,0.2217 0.233061,0.22169 0.233061,0.54949 0,0.16674 -0.06821,0.3278 -0.06821,0.16106 -0.227376,0.33917 -0.157269,0.17811 -0.524861,0.48886 -0.306959,0.25769 -0.39412,0.35054 -0.08716,0.0909 -0.144005,0.18379 z"
         style="font-family:sans-serif;-inkscape-font-specification:sans-serif"
         id="path119504" />
    </g>
    <path
       id="path32159"
       style="fill:#000000;fill-opacity:1;stroke:none;stroke-width:1.04298;stroke-linecap:butt;stroke-linejoin:miter;stroke-miterlimit:4;stroke-dasharray:none;stroke-opacity:1"
       d="m 23.10882,112.90037 h 0.89999 m 0,0 c 0,-0.49703 -0.40293,-0.89996 -0.89999,-0.89996 -0.49702,0 -0.90001,0.40293 -0.90001,0.89996 0,0.49703 0.40293,0.89997 0.89995,0.89997 0.49706,0 0.90005,-0.40294 0.90005,-0.89997 z" />
    <path
       id="path32161"
       style="fill:#000000;fill-opacity:1;stroke:none;stroke-width:1.04298;stroke-linecap:butt;stroke-linejoin:miter;stroke-miterlimit:4;stroke-dasharray:none;stroke-opacity:1"
       d="m 38.10882,112.90037 h 0.89999 m 0,0 c 0,-0.49703 -0.40293,-0.89996 -0.89999,-0.89996 -0.49702,0 -0.90001,0.40293 -0.90001,0.89996 0,0.49703 0.40293,0.89997 0.89995,0.89997 0.49706,0 0.90005,-0.40294 0.90005,-0.89997 z" />
    <circle
       style="fill:none;stroke:#000000;stroke-width:0.5;stroke-linecap:round;stroke-linejoin:round;stroke-dasharray:none;stroke-opacity:1"
       id="circle34343"
       cx="21.484156"
       cy="-122.90037"
       r="5.6246567"
       transform="scale(1,-1)" />
    <path
       style="fill:none;stroke:#000000;stroke-width:0.4;stroke-linecap:butt;stroke-linejoin:miter;stroke-dasharray:none;stroke-opacity:1"
       d="m 19.10882,126.90037 v -8"
       id="path34345" />
    <path
       style="fill:none;stroke:#000000;stroke-width:0.4;stroke-linecap:butt;stroke-linejoin:miter;stroke-dasharray:none;stroke-opacity:1"
       d="m 19.10882,122.90037 h -25"
       id="path34347" />
    <path
       style="fill:none;stroke:#000000;stroke-width:0.4;stroke-linecap:butt;stroke-linejoin:miter;stroke-dasharray:none;stroke-opacity:1"
       d="m 19.10882,124.90037 4,3 v 20"
       id="path34349" />
    <path
       style="fill:none;stroke:#000000;stroke-width:0.4;stroke-linecap:butt;stroke-linejoin:miter;stroke-dasharray:none;stroke-opacity:1"
       d="m 19.10882,120.90037 4,-3 v -9"
       id="path34351" />
    <path
       style="fill:#000000;fill-opacity:1;stroke:none;stroke-width:0.264583px;stroke-linecap:butt;stroke-linejoin:miter;stroke-opacity:1"
       d="m 21.16764,120.61868 -1.19889,-1.60083 -0.84159,1.87963 z"
       id="path34353" />
    <path
       id="path32049"
       d="m 9.10882,121.40037 v 3 h -9 v -3 z"
       style="fill:#ffffff;fill-opacity:1;stroke:#000000;stroke-width:0.5;stroke-linecap:butt;stroke-linejoin:miter;stroke-miterlimit:4;stroke-dasharray:none;stroke-opacity:1" />
    <circle
       style="fill:none;stroke:#000000;stroke-width:0.5;stroke-linecap:round;stroke-linejoin:round;stroke-dasharray:none;stroke-opacity:1"
       id="circle34357"
       cx="36.484158"
       cy="-137.90038"
       r="5.6246567"
       transform="scale(1,-1)" />
    <path
       style="fill:none;stroke:#000000;stroke-width:0.4;stroke-linecap:butt;stroke-linejoin:miter;stroke-dasharray:none;stroke-opacity:1"
       d="m 34.10882,141.90037 v -8"
       id="path34359" />
    <path
       style="fill:none;stroke:#000000;stroke-width:0.4;stroke-linecap:butt;stroke-linejoin:miter;stroke-dasharray:none;stroke-opacity:1"
       d="m 34.10882,137.90037 h -40"
       id="path34361" />
    <path
       style="fill:none;stroke:#000000;stroke-width:0.4;stroke-linecap:butt;stroke-linejoin:miter;stroke-dasharray:none;stroke-opacity:1"
       d="m 34.10882,139.90037 4,3 v 5 h -15"
       id="path34363" />
    <path
       style="fill:none;stroke:#000000;stroke-width:0.4;stroke-linecap:butt;stroke-linejoin:miter;stroke-dasharray:none;stroke-opacity:1"
       d="m 34.10882,135.90037 4,-3 v -20 h -15"
       id="path34365" />
    <path
       style="fill:#000000;fill-opacity:1;stroke:none;stroke-width:0.264583px;stroke-linecap:butt;stroke-linejoin:miter;stroke-opacity:1"
       d="m 36.16764,135.61868 -1.19889,-1.60083 -0.84159,1.87963 z"
       id="path34367" />
    <path
       id="path32135"
       d="m 9.10882,136.40037 v 3 h -9 v -3 z"
       style="fill:#ffffff;fill-opacity:1;stroke:#000000;stroke-width:0.5;stroke-linecap:butt;stroke-linejoin:miter;stroke-miterlimit:4;stroke-dasharray:none;stroke-opacity:1" />
  </g>
</svg>
