<?xml version="1.0" encoding="UTF-8" standalone="no"?>
<!-- Created with Inkscape (http://www.inkscape.org/) -->

<svg
   width="62.536461mm"
   height="49.488003mm"
   viewBox="0 0 62.536461 49.488003"
   version="1.1"
   id="svg12618"
   xmlns="http://www.w3.org/2000/svg"
   xmlns:svg="http://www.w3.org/2000/svg">
  <defs
     id="defs12615" />
  <g
     id="layer1"
     transform="translate(-79.96626,-147.44699)">
    <path
       style="fill:none;stroke:#000000;stroke-width:0.396875;stroke-linecap:round;stroke-linejoin:round;stroke-miterlimit:4;stroke-dasharray:none;stroke-opacity:1"
       d="m 99.984488,162.52707 v -2.8125 h 5.625002 v 2.8125 z"
       id="path4270" />
    <path
       id="path4272"
       d="m 91.546987,162.52707 v -2.8125 h 5.625 v 2.8125 z"
       style="fill:none;stroke:#000000;stroke-width:0.396875;stroke-linecap:round;stroke-linejoin:round;stroke-miterlimit:4;stroke-dasharray:none;stroke-opacity:1" />
    <path
       style="fill:none;stroke:#000000;stroke-width:0.396875;stroke-linecap:round;stroke-linejoin:round;stroke-miterlimit:4;stroke-dasharray:none;stroke-opacity:1"
       d="m 83.109488,162.52707 v -2.8125 h 5.625 v 2.8125 z"
       id="path4274" />
    <path
       id="path4276"
       d="m 125.29699,162.52707 v -2.8125 h 5.625 v 2.8125 z"
       style="fill:none;stroke:#000000;stroke-width:0.396875;stroke-linecap:round;stroke-linejoin:round;stroke-miterlimit:4;stroke-dasharray:none;stroke-opacity:1" />
    <path
       style="fill:none;stroke:#000000;stroke-width:0.396875;stroke-linecap:round;stroke-linejoin:round;stroke-miterlimit:4;stroke-dasharray:none;stroke-opacity:1"
       d="m 116.85949,162.52707 v -2.8125 h 5.62499 v 2.8125 z"
       id="path4278" />
    <path
       id="path4280"
       d="m 108.42198,162.52707 v -2.8125 h 5.62501 v 2.8125 z"
       style="fill:none;stroke:#000000;stroke-width:0.396875;stroke-linecap:round;stroke-linejoin:round;stroke-miterlimit:4;stroke-dasharray:none;stroke-opacity:1" />
    <path
       style="fill:none;stroke:#000000;stroke-width:0.396875;stroke-linecap:round;stroke-linejoin:round;stroke-miterlimit:4;stroke-dasharray:none;stroke-opacity:1"
       d="m 133.73449,162.52707 v -2.8125 h 5.625 v 2.8125 z"
       id="path4282" />
    <path
       style="fill:none;stroke:#000000;stroke-width:0.661458;stroke-linecap:round;stroke-linejoin:round;stroke-miterlimit:4;stroke-dasharray:none;stroke-opacity:1"
       d="m 80.296989,162.52707 h 61.875001 v 28.125 H 80.296989 Z"
       id="path4284" />
    <path
       style="fill:none;stroke:#000000;stroke-width:0.661458;stroke-linecap:round;stroke-linejoin:round;stroke-miterlimit:4;stroke-dasharray:none;stroke-opacity:1"
       d="m 80.296989,174.24966 v 4.67981 c 1.294416,0 2.339909,-1.04549 2.339909,-2.3399 0,-1.29442 -1.045493,-2.33991 -2.339909,-2.33991 z"
       id="path4286" />
    <path
       id="path4288"
       d="m 99.984488,193.46455 v -2.81248 h 5.625002 v 2.81248 z"
       style="fill:none;stroke:#000000;stroke-width:0.396875;stroke-linecap:round;stroke-linejoin:round;stroke-miterlimit:4;stroke-dasharray:none;stroke-opacity:1" />
    <path
       style="fill:none;stroke:#000000;stroke-width:0.396875;stroke-linecap:round;stroke-linejoin:round;stroke-miterlimit:4;stroke-dasharray:none;stroke-opacity:1"
       d="m 91.546987,193.46455 v -2.81248 h 5.625 v 2.81248 z"
       id="path4290" />
    <path
       id="path4292"
       d="m 83.109488,193.46455 v -2.81248 h 5.625 v 2.81248 z"
       style="fill:none;stroke:#000000;stroke-width:0.396875;stroke-linecap:round;stroke-linejoin:round;stroke-miterlimit:4;stroke-dasharray:none;stroke-opacity:1" />
    <path
       style="fill:none;stroke:#000000;stroke-width:0.396875;stroke-linecap:round;stroke-linejoin:round;stroke-miterlimit:4;stroke-dasharray:none;stroke-opacity:1"
       d="m 125.29699,193.46455 v -2.81248 h 5.625 v 2.81248 z"
       id="path4294" />
    <path
       id="path4296"
       d="m 116.85949,193.46455 v -2.81248 h 5.62499 v 2.81248 z"
       style="fill:none;stroke:#000000;stroke-width:0.396875;stroke-linecap:round;stroke-linejoin:round;stroke-miterlimit:4;stroke-dasharray:none;stroke-opacity:1" />
    <path
       style="fill:none;stroke:#000000;stroke-width:0.396875;stroke-linecap:round;stroke-linejoin:round;stroke-miterlimit:4;stroke-dasharray:none;stroke-opacity:1"
       d="m 108.42198,193.46455 v -2.81248 h 5.62501 v 2.81248 z"
       id="path4298" />
    <path
       id="path4300"
       d="m 133.73449,193.46455 v -2.81248 h 5.625 v 2.81248 z"
       style="fill:none;stroke:#000000;stroke-width:0.396875;stroke-linecap:round;stroke-linejoin:round;stroke-miterlimit:4;stroke-dasharray:none;stroke-opacity:1" />
    <text
       id="text4340"
       y="153.15207"
       x="107.04905"
       style="font-style:normal;font-variant:normal;font-weight:normal;font-stretch:normal;font-size:3.175px;line-height:0%;font-family:sans-serif;-inkscape-font-specification:Sans;text-align:start;letter-spacing:0px;word-spacing:0px;writing-mode:lr-tb;text-anchor:start;fill:#000000;fill-opacity:1;stroke:none;stroke-width:0.264583"
       xml:space="preserve"><tspan
         y="153.15207"
         x="107.04905"
         id="tspan4342"
         style="font-size:7.9375px;line-height:1.25;font-family:sans-serif;stroke-width:0.264583">73</tspan></text>
    <text
       xml:space="preserve"
       style="font-style:normal;font-variant:normal;font-weight:normal;font-stretch:normal;font-size:3.175px;line-height:0%;font-family:sans-serif;-inkscape-font-specification:Sans;text-align:start;letter-spacing:0px;word-spacing:0px;writing-mode:lr-tb;text-anchor:start;fill:#000000;fill-opacity:1;stroke:#000000;stroke-width:0.0529167;stroke-miterlimit:4;stroke-dasharray:none;stroke-opacity:1"
       x="82.649414"
       y="189.68678"
       id="text4304"><tspan
         id="tspan4306"
         x="82.649414"
         y="189.68678"
         style="font-size:2.64583px;line-height:1.25;font-family:sans-serif;stroke-width:0.0529167">1</tspan></text>
    <text
       id="text4308"
       y="189.69812"
       x="138.18013"
       style="font-style:normal;font-variant:normal;font-weight:normal;font-stretch:normal;font-size:3.175px;line-height:0%;font-family:sans-serif;-inkscape-font-specification:Sans;text-align:start;letter-spacing:0px;word-spacing:0px;writing-mode:lr-tb;text-anchor:start;fill:#000000;fill-opacity:1;stroke:#000000;stroke-width:0.0529167;stroke-miterlimit:4;stroke-dasharray:none;stroke-opacity:1"
       xml:space="preserve"><tspan
         y="189.69812"
         x="138.18013"
         id="tspan4310"
         style="font-size:2.64583px;line-height:1.25;font-family:sans-serif;stroke-width:0.0529167">7</tspan></text>
    <text
       xml:space="preserve"
       style="font-style:normal;font-variant:normal;font-weight:normal;font-stretch:normal;font-size:3.175px;line-height:0%;font-family:sans-serif;-inkscape-font-specification:Sans;text-align:start;letter-spacing:0px;word-spacing:0px;writing-mode:lr-tb;text-anchor:start;fill:#000000;fill-opacity:1;stroke:#000000;stroke-width:0.0529167;stroke-miterlimit:4;stroke-dasharray:none;stroke-opacity:1"
       x="138.17625"
       y="165.39114"
       id="text4312"><tspan
         y="165.39114"
         x="138.17625"
         id="tspan4314"
         style="font-size:2.64583px;line-height:1.25;font-family:sans-serif;stroke-width:0.0529167">8</tspan></text>
    <text
       id="text4316"
       y="165.39113"
       x="82.649414"
       style="font-style:normal;font-variant:normal;font-weight:normal;font-stretch:normal;font-size:3.175px;line-height:0%;font-family:sans-serif;-inkscape-font-specification:Sans;text-align:start;letter-spacing:0px;word-spacing:0px;writing-mode:lr-tb;text-anchor:start;fill:#000000;fill-opacity:1;stroke:#000000;stroke-width:0.0529167;stroke-miterlimit:4;stroke-dasharray:none;stroke-opacity:1"
       xml:space="preserve"><tspan
         y="165.39113"
         x="82.649414"
         id="tspan4318"
         style="font-size:2.64583px;line-height:1.25;font-family:sans-serif;stroke-width:0.0529167">14</tspan></text>
    <text
       xml:space="preserve"
       style="font-style:normal;font-variant:normal;font-weight:normal;font-stretch:normal;font-size:3.175px;line-height:0%;font-family:sans-serif;-inkscape-font-specification:Sans;text-align:start;letter-spacing:0px;word-spacing:0px;writing-mode:lr-tb;text-anchor:start;fill:#000000;fill-opacity:1;stroke:#000000;stroke-width:0.0529167;stroke-miterlimit:4;stroke-dasharray:none;stroke-opacity:1"
       x="108.37432"
       y="196.86823"
       id="text4320"><tspan
         id="tspan4322"
         x="108.37432"
         y="196.86823"
         style="font-size:3.43958px;line-height:1.25;font-family:sans-serif;stroke-width:0.0529167">Vcc</tspan></text>
    <text
       xml:space="preserve"
       style="font-style:normal;font-variant:normal;font-weight:normal;font-stretch:normal;font-size:3.175px;line-height:0%;font-family:sans-serif;-inkscape-font-specification:Sans;text-align:start;letter-spacing:0px;word-spacing:0px;writing-mode:lr-tb;text-anchor:start;fill:#000000;fill-opacity:1;stroke:#000000;stroke-width:0.0529167;stroke-miterlimit:4;stroke-dasharray:none;stroke-opacity:1"
       x="107.41282"
       y="158.69775"
       id="text4324"><tspan
         id="tspan4326"
         x="107.41282"
         y="158.69775"
         style="font-size:3.43958px;line-height:1.25;font-family:sans-serif;stroke-width:0.0529167">GND</tspan></text>
    <text
       xml:space="preserve"
       style="font-style:normal;font-variant:normal;font-weight:normal;font-stretch:normal;font-size:3.175px;line-height:0%;font-family:sans-serif;-inkscape-font-specification:Sans;text-align:start;letter-spacing:0px;word-spacing:0px;writing-mode:lr-tb;text-anchor:start;fill:#000000;fill-opacity:1;stroke:#000000;stroke-width:0.0529167;stroke-miterlimit:4;stroke-dasharray:none;stroke-opacity:1"
       x="100.50869"
       y="196.90852"
       id="text4328"><tspan
         y="196.90852"
         x="100.50869"
         id="tspan4330"
         style="font-size:3.43958px;line-height:1.25;font-family:sans-serif;stroke-width:0.0529167">1K</tspan></text>
    <text
       id="text4336"
       y="158.54828"
       x="100.37769"
       style="font-style:normal;font-variant:normal;font-weight:normal;font-stretch:normal;font-size:3.175px;line-height:0%;font-family:sans-serif;-inkscape-font-specification:Sans;text-align:start;letter-spacing:0px;word-spacing:0px;writing-mode:lr-tb;text-anchor:start;fill:#000000;fill-opacity:1;stroke:#000000;stroke-width:0.0529167;stroke-miterlimit:4;stroke-dasharray:none;stroke-opacity:1"
       xml:space="preserve"><tspan
         y="158.54828"
         x="100.37769"
         id="tspan4338"
         style="font-size:3.43958px;line-height:1.25;font-family:sans-serif;stroke-width:0.0529167">1Q</tspan></text>
    <g
       id="g4581"
       transform="matrix(0.26458333,0,0,0.26458333,75.983274,37.533534)">
      <text
         xml:space="preserve"
         style="font-style:normal;font-variant:normal;font-weight:normal;font-stretch:normal;line-height:0%;font-family:sans-serif;-inkscape-font-specification:Sans;text-align:start;letter-spacing:0px;word-spacing:0px;writing-mode:lr-tb;text-anchor:start;fill:#000000;fill-opacity:1;stroke:#000000;stroke-width:0.2;stroke-miterlimit:4;stroke-dasharray:none;stroke-opacity:1"
         x="60.236221"
         y="602.36218"
         id="text4402"><tspan
           id="tspan4404"
           x="60.236221"
           y="602.36218"
           style="font-size:13px;line-height:1.25;font-family:sans-serif;stroke-width:0.2">1R</tspan></text>
      <path
         style="fill:none;stroke:#000000;stroke-width:1px;stroke-linecap:butt;stroke-linejoin:miter;stroke-opacity:1"
         d="m 68.38977,591.37484 h 8.46529"
         id="path4406" />
    </g>
    <text
       xml:space="preserve"
       style="font-style:normal;font-variant:normal;font-weight:normal;font-stretch:normal;font-size:3.175px;line-height:0%;font-family:sans-serif;-inkscape-font-specification:Sans;text-align:start;letter-spacing:0px;word-spacing:0px;writing-mode:lr-tb;text-anchor:start;fill:#000000;fill-opacity:1;stroke:#000000;stroke-width:0.0529167;stroke-miterlimit:4;stroke-dasharray:none;stroke-opacity:1"
       x="84.051041"
       y="158.69775"
       id="text4410"><tspan
         id="tspan4412"
         x="84.051041"
         y="158.69775"
         style="font-size:3.43958px;line-height:1.25;font-family:sans-serif;stroke-width:0.0529167">1J</tspan></text>
    <g
       transform="matrix(0.26458333,0,0,0.26458333,-41.266861,-56.367336)"
       id="g4416">
      <text
         xml:space="preserve"
         style="font-style:normal;font-variant:normal;font-weight:normal;font-stretch:normal;line-height:0%;font-family:sans-serif;-inkscape-font-specification:Sans;text-align:start;letter-spacing:0px;word-spacing:0px;writing-mode:lr-tb;text-anchor:start;fill:#000000;fill-opacity:1;stroke:#000000;stroke-width:0.2;stroke-miterlimit:4;stroke-dasharray:none;stroke-opacity:1"
         x="503.1496"
         y="812.27948"
         id="text4418"><tspan
           id="tspan4420"
           x="503.1496"
           y="812.27948"
           style="font-size:13px;line-height:1.25;font-family:sans-serif;stroke-width:0.2">1Q</tspan></text>
      <path
         style="fill:none;stroke:#000000;stroke-width:1px;stroke-linecap:butt;stroke-linejoin:miter;stroke-opacity:1"
         d="m 510.96067,801.29216 h 9.28125"
         id="path4422" />
    </g>
    <g
       id="g4586"
       transform="matrix(0.26458333,0,0,0.26458333,75.829955,37.533534)">
      <text
         xml:space="preserve"
         style="font-style:normal;font-variant:normal;font-weight:normal;font-stretch:normal;line-height:0%;font-family:sans-serif;-inkscape-font-specification:Sans;text-align:start;letter-spacing:0px;word-spacing:0px;writing-mode:lr-tb;text-anchor:start;fill:#000000;fill-opacity:1;stroke:#000000;stroke-width:0.2;stroke-miterlimit:4;stroke-dasharray:none;stroke-opacity:1"
         x="24.80315"
         y="602.20349"
         id="text4332"><tspan
           id="tspan4334"
           x="24.80315"
           y="602.20349"
           style="font-size:13px;line-height:1.25;font-family:sans-serif">1CP</tspan></text>
      <path
         id="path4579"
         d="M 32.51477,591.37516 H 49.66756"
         style="fill:none;stroke:#000000;stroke-width:1px;stroke-linecap:butt;stroke-linejoin:miter;stroke-opacity:1" />
    </g>
    <path
       id="path4594"
       style="fill:none;stroke:#000000;stroke-width:0.396875;stroke-linecap:butt;stroke-linejoin:miter;stroke-miterlimit:4;stroke-dasharray:none;stroke-opacity:1"
       d="m 128.10949,162.52707 v 6.5625 h 6.5625 v 3.75 h -1.875 m 3.75,17.8125 v -5.625 h -15 v -3.75 h 1.875 m 4.6875,9.375 v -3.75 h -8.4375 v -8.4375 h 3.75 m -3.75,12.1875 v -1.875 h -1.875 v -13.125 h 5.625 m 0,-2.8125 h -3.75 v -10.3125 m 16.875,0 v 18.75 h -3.75" />
    <path
       id="path4596"
       d="m 121.99526,178.46457 c 0,0.39399 0.31939,0.71337 0.71336,0.71337 0.39398,0 0.71337,-0.31938 0.71337,-0.71337 0,-0.39396 -0.31939,-0.71334 -0.71337,-0.71334 -0.39397,0 -0.71336,0.31938 -0.71336,0.71334 z"
       style="fill:#ffffff;fill-opacity:1;stroke:#000000;stroke-width:0.396875;stroke-linecap:round;stroke-linejoin:round;stroke-miterlimit:4;stroke-dasharray:none;stroke-opacity:1" />
    <path
       style="fill:none;stroke:#000000;stroke-width:0.396875;stroke-linecap:round;stroke-linejoin:round;stroke-miterlimit:4;stroke-dasharray:none;stroke-opacity:1"
       d="m 123.42199,170.96457 h 9.375 v 12.1875 h -9.375 z"
       id="path4598" />
    <path
       style="fill:none;stroke:#000000;stroke-width:0.396875;stroke-linecap:butt;stroke-linejoin:miter;stroke-miterlimit:4;stroke-dasharray:none;stroke-opacity:1"
       d="m 123.42199,174.71457 1.875,0.9375 -1.875,0.9375"
       id="path4600" />
    <path
       style="fill:#ffffff;fill-opacity:1;stroke:#000000;stroke-width:0.396875;stroke-linecap:round;stroke-linejoin:round;stroke-miterlimit:4;stroke-dasharray:none;stroke-opacity:1"
       d="m 132.79699,181.27707 c 0,0.39399 0.31939,0.71337 0.71336,0.71337 0.39398,0 0.71337,-0.31938 0.71337,-0.71337 0,-0.39397 -0.31939,-0.71334 -0.71337,-0.71334 -0.39397,0 -0.71336,0.31937 -0.71336,0.71334 z"
       id="path4602" />
    <text
       id="text4604"
       y="179.40207"
       x="124.35949"
       style="font-style:normal;font-variant:normal;font-weight:normal;font-stretch:normal;font-size:3.175px;line-height:0%;font-family:sans-serif;-inkscape-font-specification:Sans;text-align:start;letter-spacing:0px;word-spacing:0px;writing-mode:lr-tb;text-anchor:start;fill:#000000;fill-opacity:1;stroke:#000000;stroke-width:0.0529167;stroke-miterlimit:4;stroke-dasharray:none;stroke-opacity:1"
       xml:space="preserve"><tspan
         y="179.40207"
         x="124.35949"
         id="tspan4606"
         style="font-size:2.64583px;line-height:1.25;font-family:sans-serif;stroke-width:0.0529167">R</tspan></text>
    <text
       xml:space="preserve"
       style="font-style:normal;font-variant:normal;font-weight:normal;font-stretch:normal;font-size:3.175px;line-height:0%;font-family:sans-serif;-inkscape-font-specification:Sans;text-align:start;letter-spacing:0px;word-spacing:0px;writing-mode:lr-tb;text-anchor:start;fill:#000000;fill-opacity:1;stroke:#000000;stroke-width:0.0529167;stroke-miterlimit:4;stroke-dasharray:none;stroke-opacity:1"
       x="124.35949"
       y="182.21455"
       id="text4608"><tspan
         id="tspan4610"
         x="124.35949"
         y="182.21455"
         style="font-size:2.64583px;line-height:1.25;font-family:sans-serif;stroke-width:0.0529167">J</tspan></text>
    <text
       id="text4612"
       y="173.77707"
       x="124.35949"
       style="font-style:normal;font-variant:normal;font-weight:normal;font-stretch:normal;font-size:3.175px;line-height:0%;font-family:sans-serif;-inkscape-font-specification:Sans;text-align:start;letter-spacing:0px;word-spacing:0px;writing-mode:lr-tb;text-anchor:start;fill:#000000;fill-opacity:1;stroke:#000000;stroke-width:0.0529167;stroke-miterlimit:4;stroke-dasharray:none;stroke-opacity:1"
       xml:space="preserve"><tspan
         y="173.77707"
         x="124.35949"
         id="tspan4614"
         style="font-size:2.64583px;line-height:1.25;font-family:sans-serif;stroke-width:0.0529167">K</tspan></text>
    <text
       xml:space="preserve"
       style="font-style:normal;font-variant:normal;font-weight:normal;font-stretch:normal;font-size:3.175px;line-height:0%;font-family:sans-serif;-inkscape-font-specification:Sans;text-align:start;letter-spacing:0px;word-spacing:0px;writing-mode:lr-tb;text-anchor:start;fill:#000000;fill-opacity:1;stroke:#000000;stroke-width:0.0529167;stroke-miterlimit:4;stroke-dasharray:none;stroke-opacity:1"
       x="129.98448"
       y="182.21455"
       id="text4616"><tspan
         id="tspan4618"
         x="129.98448"
         y="182.21455"
         style="font-size:2.64583px;line-height:1.25;font-family:sans-serif;stroke-width:0.0529167">Q</tspan></text>
    <text
       id="text4620"
       y="173.77707"
       x="129.98448"
       style="font-style:normal;font-variant:normal;font-weight:normal;font-stretch:normal;font-size:3.175px;line-height:0%;font-family:sans-serif;-inkscape-font-specification:Sans;text-align:start;letter-spacing:0px;word-spacing:0px;writing-mode:lr-tb;text-anchor:start;fill:#000000;fill-opacity:1;stroke:#000000;stroke-width:0.0529167;stroke-miterlimit:4;stroke-dasharray:none;stroke-opacity:1"
       xml:space="preserve"><tspan
         y="173.77707"
         x="129.98448"
         id="tspan4622"
         style="font-size:2.64583px;line-height:1.25;font-family:sans-serif;stroke-width:0.0529167">Q</tspan></text>
    <path
       style="fill:none;stroke:#000000;stroke-width:0.264583px;stroke-linecap:butt;stroke-linejoin:miter;stroke-opacity:1"
       d="m 130.08439,179.96923 h 1.875"
       id="path4624" />
    <path
       style="fill:#ffffff;fill-opacity:1;stroke:#000000;stroke-width:0.396875;stroke-linecap:round;stroke-linejoin:round;stroke-miterlimit:4;stroke-dasharray:none;stroke-opacity:1"
       d="m 121.99526,175.65207 c 0,0.39399 0.31939,0.71337 0.71336,0.71337 0.39398,0 0.71337,-0.31938 0.71337,-0.71337 0,-0.39396 -0.31939,-0.71334 -0.71337,-0.71334 -0.39397,0 -0.71336,0.31938 -0.71336,0.71334 z"
       id="path4626" />
    <path
       d="m 94.359489,162.52707 v 6.5625 h 9.375001 v 3.75 h -2.8125 m 1.875,17.8125 v -5.625 h -13.125 v -3.75 h 1.874999 m 2.8125,9.375 v -3.75 h -6.562501 v -8.4375 h 3.750001 m -5.625,12.1875 v -15 h 5.625 m 0,-2.8125 H 85.92199 v -10.3125 m 16.875,0 v 4.6875 h 2.8125 v 14.0625 h -4.6875"
       style="fill:none;stroke:#000000;stroke-width:0.396875;stroke-linecap:butt;stroke-linejoin:miter;stroke-miterlimit:4;stroke-dasharray:none;stroke-opacity:1"
       id="path4628" />
    <path
       style="fill:#ffffff;fill-opacity:1;stroke:#000000;stroke-width:0.396875;stroke-linecap:round;stroke-linejoin:round;stroke-miterlimit:4;stroke-dasharray:none;stroke-opacity:1"
       d="m 90.12026,178.46457 c 0,0.39399 0.319387,0.71337 0.713364,0.71337 0.393973,0 0.713367,-0.31938 0.713367,-0.71337 0,-0.39396 -0.319394,-0.71334 -0.713367,-0.71334 -0.393977,0 -0.713364,0.31938 -0.713364,0.71334 z"
       id="path4630" />
    <path
       id="path4632"
       d="m 91.546989,170.96457 h 9.375001 v 12.1875 h -9.375001 z"
       style="fill:none;stroke:#000000;stroke-width:0.396875;stroke-linecap:round;stroke-linejoin:round;stroke-miterlimit:4;stroke-dasharray:none;stroke-opacity:1" />
    <path
       id="path4634"
       d="m 91.546994,174.71457 1.874999,0.9375 -1.874999,0.9375"
       style="fill:none;stroke:#000000;stroke-width:0.396875;stroke-linecap:butt;stroke-linejoin:miter;stroke-miterlimit:4;stroke-dasharray:none;stroke-opacity:1" />
    <path
       id="path4636"
       d="m 100.92199,172.83957 c 0,0.39399 0.31939,0.71337 0.71336,0.71337 0.39398,0 0.71337,-0.31938 0.71337,-0.71337 0,-0.39397 -0.31939,-0.71335 -0.71337,-0.71335 -0.39397,0 -0.71336,0.31938 -0.71336,0.71335 z"
       style="fill:#ffffff;fill-opacity:1;stroke:#000000;stroke-width:0.396875;stroke-linecap:round;stroke-linejoin:round;stroke-miterlimit:4;stroke-dasharray:none;stroke-opacity:1" />
    <path
       id="path4640"
       d="m 90.12026,175.65207 c 0,0.39399 0.319387,0.71337 0.713364,0.71337 0.393973,0 0.713367,-0.31938 0.713367,-0.71337 0,-0.39396 -0.319394,-0.71334 -0.713367,-0.71334 -0.393977,0 -0.713364,0.31938 -0.713364,0.71334 z"
       style="fill:#ffffff;fill-opacity:1;stroke:#000000;stroke-width:0.396875;stroke-linecap:round;stroke-linejoin:round;stroke-miterlimit:4;stroke-dasharray:none;stroke-opacity:1" />
    <text
       id="text4642"
       y="173.77707"
       x="98.109489"
       style="font-style:normal;font-variant:normal;font-weight:normal;font-stretch:normal;font-size:3.175px;line-height:0%;font-family:sans-serif;-inkscape-font-specification:Sans;text-align:start;letter-spacing:0px;word-spacing:0px;writing-mode:lr-tb;text-anchor:start;fill:#000000;fill-opacity:1;stroke:#000000;stroke-width:0.0529167;stroke-miterlimit:4;stroke-dasharray:none;stroke-opacity:1"
       xml:space="preserve"><tspan
         y="173.77707"
         x="98.109489"
         id="tspan4644"
         style="font-size:2.64583px;line-height:1.25;font-family:sans-serif;stroke-width:0.0529167">Q</tspan></text>
    <path
       id="path4646"
       d="m 98.209391,171.53174 h 1.874999"
       style="fill:none;stroke:#000000;stroke-width:0.264583px;stroke-linecap:butt;stroke-linejoin:miter;stroke-opacity:1" />
    <text
       xml:space="preserve"
       style="font-style:normal;font-variant:normal;font-weight:normal;font-stretch:normal;font-size:3.175px;line-height:0%;font-family:sans-serif;-inkscape-font-specification:Sans;text-align:start;letter-spacing:0px;word-spacing:0px;writing-mode:lr-tb;text-anchor:start;fill:#000000;fill-opacity:1;stroke:#000000;stroke-width:0.0529167;stroke-miterlimit:4;stroke-dasharray:none;stroke-opacity:1"
       x="98.109489"
       y="182.21455"
       id="text4648"><tspan
         id="tspan4650"
         x="98.109489"
         y="182.21455"
         style="font-size:2.64583px;line-height:1.25;font-family:sans-serif;stroke-width:0.0529167">Q</tspan></text>
    <text
       id="text4652"
       y="173.77707"
       x="92.325714"
       style="font-style:normal;font-variant:normal;font-weight:normal;font-stretch:normal;font-size:3.175px;line-height:0%;font-family:sans-serif;-inkscape-font-specification:Sans;text-align:start;letter-spacing:0px;word-spacing:0px;writing-mode:lr-tb;text-anchor:start;fill:#000000;fill-opacity:1;stroke:#000000;stroke-width:0.0529167;stroke-miterlimit:4;stroke-dasharray:none;stroke-opacity:1"
       xml:space="preserve"><tspan
         y="173.77707"
         x="92.325714"
         id="tspan4654"
         style="font-size:2.64583px;line-height:1.25;font-family:sans-serif;stroke-width:0.0529167">J</tspan></text>
    <text
       xml:space="preserve"
       style="font-style:normal;font-variant:normal;font-weight:normal;font-stretch:normal;font-size:3.175px;line-height:0%;font-family:sans-serif;-inkscape-font-specification:Sans;text-align:start;letter-spacing:0px;word-spacing:0px;writing-mode:lr-tb;text-anchor:start;fill:#000000;fill-opacity:1;stroke:#000000;stroke-width:0.0529167;stroke-miterlimit:4;stroke-dasharray:none;stroke-opacity:1"
       x="92.325714"
       y="179.40207"
       id="text4656"><tspan
         id="tspan4658"
         x="92.325714"
         y="179.40207"
         style="font-size:2.64583px;line-height:1.25;font-family:sans-serif;stroke-width:0.0529167">R</tspan></text>
    <text
       xml:space="preserve"
       style="font-style:normal;font-variant:normal;font-weight:normal;font-stretch:normal;font-size:3.175px;line-height:0%;font-family:sans-serif;-inkscape-font-specification:Sans;text-align:start;letter-spacing:0px;word-spacing:0px;writing-mode:lr-tb;text-anchor:start;fill:#000000;fill-opacity:1;stroke:#000000;stroke-width:0.0529167;stroke-miterlimit:4;stroke-dasharray:none;stroke-opacity:1"
       x="92.325714"
       y="182.21455"
       id="text4660"><tspan
         id="tspan4662"
         x="92.325714"
         y="182.21455"
         style="font-size:2.64583px;line-height:1.25;font-family:sans-serif;stroke-width:0.0529167">K</tspan></text>
    <text
       xml:space="preserve"
       style="font-style:normal;font-variant:normal;font-weight:normal;font-stretch:normal;font-size:3.175px;line-height:0%;font-family:sans-serif;-inkscape-font-specification:Sans;text-align:start;letter-spacing:0px;word-spacing:0px;writing-mode:lr-tb;text-anchor:start;fill:#000000;fill-opacity:1;stroke:#000000;stroke-width:0.0529167;stroke-miterlimit:4;stroke-dasharray:none;stroke-opacity:1"
       x="125.82706"
       y="158.54828"
       id="text4664"><tspan
         id="tspan4666"
         x="125.82706"
         y="158.54828"
         style="font-size:3.43958px;line-height:1.25;font-family:sans-serif;stroke-width:0.0529167">2Q</tspan></text>
    <g
       id="g4668"
       transform="matrix(0.26458333,0,0,0.26458333,1.0575187,-56.367338)">
      <text
         id="text4670"
         y="812.27948"
         x="503.1496"
         style="font-style:normal;font-variant:normal;font-weight:normal;font-stretch:normal;line-height:0%;font-family:sans-serif;-inkscape-font-specification:Sans;text-align:start;letter-spacing:0px;word-spacing:0px;writing-mode:lr-tb;text-anchor:start;fill:#000000;fill-opacity:1;stroke:#000000;stroke-width:0.2;stroke-miterlimit:4;stroke-dasharray:none;stroke-opacity:1"
         xml:space="preserve"><tspan
           style="font-size:13px;line-height:1.25;font-family:sans-serif;stroke-width:0.2"
           y="812.27948"
           x="503.1496"
           id="tspan4672">2Q</tspan></text>
      <path
         id="path4674"
         d="m 510.96067,801.29216 h 9.28125"
         style="fill:none;stroke:#000000;stroke-width:1px;stroke-linecap:butt;stroke-linejoin:miter;stroke-opacity:1" />
    </g>
    <text
       id="text4676"
       y="158.73973"
       x="117.52056"
       style="font-style:normal;font-variant:normal;font-weight:normal;font-stretch:normal;font-size:3.175px;line-height:0%;font-family:sans-serif;-inkscape-font-specification:Sans;text-align:start;letter-spacing:0px;word-spacing:0px;writing-mode:lr-tb;text-anchor:start;fill:#000000;fill-opacity:1;stroke:#000000;stroke-width:0.0529167;stroke-miterlimit:4;stroke-dasharray:none;stroke-opacity:1"
       xml:space="preserve"><tspan
         id="tspan4678"
         x="117.52056"
         y="158.73973"
         style="font-size:3.43958px;line-height:1.25;font-family:sans-serif;stroke-width:0.0529167">2K</tspan></text>
    <g
       id="g4680"
       transform="matrix(0.26458333,0,0,0.26458333,109.71683,37.533534)">
      <text
         id="text4682"
         y="602.20349"
         x="24.80315"
         style="font-style:normal;font-variant:normal;font-weight:normal;font-stretch:normal;line-height:0%;font-family:sans-serif;-inkscape-font-specification:Sans;text-align:start;letter-spacing:0px;word-spacing:0px;writing-mode:lr-tb;text-anchor:start;fill:#000000;fill-opacity:1;stroke:#000000;stroke-width:0.2;stroke-miterlimit:4;stroke-dasharray:none;stroke-opacity:1"
         xml:space="preserve"><tspan
           y="602.20349"
           x="24.80315"
           id="tspan4684"
           style="font-size:13px;line-height:1.25;font-family:sans-serif">2CP</tspan></text>
      <path
         style="fill:none;stroke:#000000;stroke-width:1px;stroke-linecap:butt;stroke-linejoin:miter;stroke-opacity:1"
         d="M 32.51477,591.37516 H 49.66756"
         id="path4686" />
    </g>
    <g
       id="g4688"
       transform="matrix(0.26458333,0,0,0.26458333,109.87015,37.533534)">
      <text
         id="text4690"
         y="602.36218"
         x="60.236221"
         style="font-style:normal;font-variant:normal;font-weight:normal;font-stretch:normal;line-height:0%;font-family:sans-serif;-inkscape-font-specification:Sans;text-align:start;letter-spacing:0px;word-spacing:0px;writing-mode:lr-tb;text-anchor:start;fill:#000000;fill-opacity:1;stroke:#000000;stroke-width:0.2;stroke-miterlimit:4;stroke-dasharray:none;stroke-opacity:1"
         xml:space="preserve"><tspan
           style="font-size:13px;line-height:1.25;font-family:sans-serif;stroke-width:0.2"
           y="602.36218"
           x="60.236221"
           id="tspan4692">2R</tspan></text>
      <path
         id="path4694"
         d="m 68.38977,591.37484 h 8.46529"
         style="fill:none;stroke:#000000;stroke-width:1px;stroke-linecap:butt;stroke-linejoin:miter;stroke-opacity:1" />
    </g>
    <text
       id="text4696"
       y="196.86655"
       x="134.81293"
       style="font-style:normal;font-variant:normal;font-weight:normal;font-stretch:normal;font-size:3.175px;line-height:0%;font-family:sans-serif;-inkscape-font-specification:Sans;text-align:start;letter-spacing:0px;word-spacing:0px;writing-mode:lr-tb;text-anchor:start;fill:#000000;fill-opacity:1;stroke:#000000;stroke-width:0.0529167;stroke-miterlimit:4;stroke-dasharray:none;stroke-opacity:1"
       xml:space="preserve"><tspan
         style="font-size:3.43958px;line-height:1.25;font-family:sans-serif;stroke-width:0.0529167"
         y="196.86655"
         x="134.81293"
         id="tspan4698">2J</tspan></text>
  </g>
</svg>
