<?xml version="1.0" encoding="UTF-8" standalone="no"?>
<svg
   width="40.791363"
   height="38"
   viewBox="0 0 40.791363 38"
   version="1.1"
   id="svg11"
   xmlns="http://www.w3.org/2000/svg"
   xmlns:svg="http://www.w3.org/2000/svg">
  <defs
     id="defs2">
    <linearGradient
       id="fab66c9e-8ade-4b14-85a1-89a3dd7ceae9"
       x1="8.1409998"
       y1="1.048"
       x2="8.1409998"
       y2="13.741"
       gradientUnits="userSpaceOnUse">
      <stop
         offset="0"
         stop-color="#5ea0ef"
         id="stop1" />
      <stop
         offset="1"
         stop-color="#0078d4"
         id="stop2" />
    </linearGradient>
  </defs>
  <g
     id="g11"
     transform="matrix(2.2659511,0,0,2.2659511,0,-1.3799643)"
     style="stroke-width:0.441317">
    <rect
       y="0.60900003"
       width="16.282"
       height="13.678"
       rx="0.76099998"
       fill="url(#fab66c9e-8ade-4b14-85a1-89a3dd7ceae9)"
       id="rect2"
       x="0"
       style="fill:url(#fab66c9e-8ade-4b14-85a1-89a3dd7ceae9);stroke-width:0.441317" />
    <ellipse
       cx="6.5240002"
       cy="5.329"
       rx="1.131"
       ry="1.137"
       fill="#ffffff"
       id="ellipse2"
       style="stroke-width:0.0620665" />
    <ellipse
       cx="9.6590004"
       cy="7.46"
       rx="1.131"
       ry="1.137"
       fill="#ffffff"
       id="ellipse3"
       style="stroke-width:0.0620665" />
    <ellipse
       cx="12.695"
       cy="3.4219999"
       rx="1.131"
       ry="1.137"
       fill="#ffffff"
       id="ellipse4"
       style="stroke-width:0.0620665" />
    <ellipse
       cx="3.5869999"
       cy="9.5109997"
       rx="1.131"
       ry="1.137"
       fill="#ffffff"
       id="ellipse5"
       style="stroke-width:0.0620665" />
    <polygon
       points="6.65,6.02 3.996,9.798 3.177,9.224 6.398,4.64 9.546,6.778 12.296,3.122 13.095,3.723 9.773,8.141 "
       fill="#ffffff"
       id="polygon5"
       style="stroke-width:0.0620665" />
    <path
       d="M 6.931,17.092 A 1.169,1.169 0 0 1 5.763,15.925 c 0.2,-3.889 2.539,-6.362 5.974,-6.362 3.435,0 5.79,2.473 5.974,6.3 A 1.17,1.17 0 0 1 16.6,17.09 H 6.93 Z"
       fill="#ffffff"
       id="path5"
       style="stroke-width:0.0620665" />
    <path
       d="m 11.737,9.85 c 3.427,0 5.52,2.549 5.687,6.029 a 0.881,0.881 0 0 1 -0.836,0.924 H 6.931 A 0.88,0.88 0 0 1 6.05,15.923 c 0,-0.015 0,-0.03 0,-0.046 C 6.227,12.4 8.316,9.85 11.737,9.85 m 0,-0.575 c -3.6,0 -6.058,2.581 -6.26,6.574 v 0.076 a 1.458,1.458 0 0 0 1.456,1.454 h 9.626 0.059 A 1.457,1.457 0 0 0 18,15.85 C 17.811,11.918 15.295,9.275 11.739,9.275 Z"
       fill="#0078d4"
       id="path6"
       style="stroke-width:0.441317" />
    <path
       d="m 14.368,12.272 a 3.991,3.991 0 0 0 -2.382,-1.014 v 1.851 a 2.224,2.224 0 0 1 1.106,0.472 z"
       fill="#50e6ff"
       id="path7"
       style="stroke-width:0.441317" />
    <path
       d="m 9.044,12.272 1.276,1.309 a 2.224,2.224 0 0 1 1.106,-0.472 v -1.851 a 3.994,3.994 0 0 0 -2.382,1.014 z"
       fill="#50e6ff"
       id="path8"
       style="stroke-width:0.441317" />
    <path
       d="m 13.5,13.993 a 2.35,2.35 0 0 1 0.462,1.136 h 1.8 a 4.231,4.231 0 0 0 -0.987,-2.445 z"
       fill="#32bedd"
       id="path9"
       style="stroke-width:0.441317" />
    <path
       d="M 9.917,13.993 8.641,12.684 a 4.223,4.223 0 0 0 -0.986,2.445 h 1.8 a 2.352,2.352 0 0 1 0.462,-1.136 z"
       fill="#50e6ff"
       id="path10"
       style="stroke-width:0.441317" />
    <path
       d="m 14.773,13.526 a 0.4,0.4 0 0 0 -0.363,-0.233 0.388,0.388 0 0 0 -0.167,0.038 l -2.772,1.3 0.334,0.726 2.775,-1.3 a 0.4,0.4 0 0 0 0.193,-0.531 z"
       fill="#e62323"
       id="path11"
       style="stroke-width:0.441317" />
    <circle
       cx="11.737"
       cy="14.963"
       r="0.954"
       fill="#4f4f4f"
       id="circle11"
       style="stroke-width:0.441317" />
  </g>
</svg>
