<?xml version="1.0" encoding="UTF-8" standalone="no"?>
<!-- Created with Inkscape (http://www.inkscape.org/) -->

<svg
   width="62.536457mm"
   height="49.72084mm"
   viewBox="0 0 62.536457 49.720841"
   version="1.1"
   id="svg12618"
   xmlns="http://www.w3.org/2000/svg"
   xmlns:svg="http://www.w3.org/2000/svg">
  <defs
     id="defs12615" />
  <g
     id="layer1"
     transform="translate(-57.151852,-111.90806)">
    <path
       id="path3460"
       d="m 77.170081,126.98814 v -2.8125 h 5.624997 v 2.8125 z"
       style="fill:none;stroke:#000000;stroke-width:0.396875;stroke-linecap:round;stroke-linejoin:round;stroke-miterlimit:4;stroke-dasharray:none;stroke-opacity:1" />
    <path
       style="fill:none;stroke:#000000;stroke-width:0.396875;stroke-linecap:round;stroke-linejoin:round;stroke-miterlimit:4;stroke-dasharray:none;stroke-opacity:1"
       d="m 68.73258,126.98814 v -2.8125 h 5.624999 v 2.8125 z"
       id="path3462" />
    <path
       id="path3464"
       d="m 60.295081,126.98814 v -2.8125 h 5.624999 v 2.8125 z"
       style="fill:none;stroke:#000000;stroke-width:0.396875;stroke-linecap:round;stroke-linejoin:round;stroke-miterlimit:4;stroke-dasharray:none;stroke-opacity:1" />
    <path
       style="fill:none;stroke:#000000;stroke-width:0.396875;stroke-linecap:round;stroke-linejoin:round;stroke-miterlimit:4;stroke-dasharray:none;stroke-opacity:1"
       d="m 102.48258,126.98814 v -2.8125 h 5.625 v 2.8125 z"
       id="path3466" />
    <path
       id="path3468"
       d="m 94.045076,126.98814 v -2.8125 h 5.625 v 2.8125 z"
       style="fill:none;stroke:#000000;stroke-width:0.396875;stroke-linecap:round;stroke-linejoin:round;stroke-miterlimit:4;stroke-dasharray:none;stroke-opacity:1" />
    <path
       style="fill:none;stroke:#000000;stroke-width:0.396875;stroke-linecap:round;stroke-linejoin:round;stroke-miterlimit:4;stroke-dasharray:none;stroke-opacity:1"
       d="m 85.607575,126.98814 v -2.8125 h 5.625002 v 2.8125 z"
       id="path3470" />
    <path
       id="path3472"
       d="m 110.92008,126.98814 v -2.8125 h 5.625 v 2.8125 z"
       style="fill:none;stroke:#000000;stroke-width:0.396875;stroke-linecap:round;stroke-linejoin:round;stroke-miterlimit:4;stroke-dasharray:none;stroke-opacity:1" />
    <path
       id="path3474"
       d="m 57.482581,126.98814 h 61.874999 v 28.125 H 57.482581 Z"
       style="fill:none;stroke:#000000;stroke-width:0.661458;stroke-linecap:round;stroke-linejoin:round;stroke-miterlimit:4;stroke-dasharray:none;stroke-opacity:1" />
    <path
       id="path3476"
       d="m 57.482581,138.71073 v 4.67982 c 1.294416,0 2.339909,-1.04549 2.339909,-2.33991 0,-1.29442 -1.045493,-2.33991 -2.339909,-2.33991 z"
       style="fill:none;stroke:#000000;stroke-width:0.661458;stroke-linecap:round;stroke-linejoin:round;stroke-miterlimit:4;stroke-dasharray:none;stroke-opacity:1" />
    <path
       style="fill:none;stroke:#000000;stroke-width:0.396875;stroke-linecap:round;stroke-linejoin:round;stroke-miterlimit:4;stroke-dasharray:none;stroke-opacity:1"
       d="m 77.170081,157.92562 v -2.81248 h 5.624997 v 2.81248 z"
       id="path3478" />
    <path
       id="path3480"
       d="m 68.73258,157.92562 v -2.81248 h 5.624999 v 2.81248 z"
       style="fill:none;stroke:#000000;stroke-width:0.396875;stroke-linecap:round;stroke-linejoin:round;stroke-miterlimit:4;stroke-dasharray:none;stroke-opacity:1" />
    <path
       style="fill:none;stroke:#000000;stroke-width:0.396875;stroke-linecap:round;stroke-linejoin:round;stroke-miterlimit:4;stroke-dasharray:none;stroke-opacity:1"
       d="m 60.295081,157.92562 v -2.81248 h 5.624999 v 2.81248 z"
       id="path3482" />
    <path
       id="path3484"
       d="m 102.48258,157.92562 v -2.81248 h 5.625 v 2.81248 z"
       style="fill:none;stroke:#000000;stroke-width:0.396875;stroke-linecap:round;stroke-linejoin:round;stroke-miterlimit:4;stroke-dasharray:none;stroke-opacity:1" />
    <path
       style="fill:none;stroke:#000000;stroke-width:0.396875;stroke-linecap:round;stroke-linejoin:round;stroke-miterlimit:4;stroke-dasharray:none;stroke-opacity:1"
       d="m 94.045076,157.92562 v -2.81248 h 5.625 v 2.81248 z"
       id="path3486" />
    <path
       id="path3488"
       d="m 85.607575,157.92562 v -2.81248 h 5.625002 v 2.81248 z"
       style="fill:none;stroke:#000000;stroke-width:0.396875;stroke-linecap:round;stroke-linejoin:round;stroke-miterlimit:4;stroke-dasharray:none;stroke-opacity:1" />
    <path
       style="fill:none;stroke:#000000;stroke-width:0.396875;stroke-linecap:round;stroke-linejoin:round;stroke-miterlimit:4;stroke-dasharray:none;stroke-opacity:1"
       d="m 110.92008,157.92562 v -2.81248 h 5.625 v 2.81248 z"
       id="path3490" />
    <text
       xml:space="preserve"
       style="font-style:normal;font-variant:normal;font-weight:normal;font-stretch:normal;font-size:3.175px;line-height:0%;font-family:sans-serif;-inkscape-font-specification:Sans;text-align:start;letter-spacing:0px;word-spacing:0px;writing-mode:lr-tb;text-anchor:start;fill:#000000;fill-opacity:1;stroke:none;stroke-width:0.264583"
       x="81.781303"
       y="117.61314"
       id="text3492"><tspan
         id="tspan3494"
         x="81.781303"
         y="117.61314"
         style="font-size:7.9375px;line-height:1.25;font-family:sans-serif;stroke-width:0.264583">107</tspan></text>
    <path
       id="path3590"
       style="fill:none;stroke:#000000;stroke-width:0.396875;stroke-linecap:butt;stroke-linejoin:miter;stroke-miterlimit:4;stroke-dasharray:none;stroke-opacity:1"
       d="m 79.982581,126.98814 v 5.625 h -2.8125 v 5.625 m 2.812497,16.875 3e-6,-7.5 m -8.437499,7.5 v -7.5 m -8.437502,7.5 v -19.6875 h 8.437502 v 2.8125 m 2.8125,0 v -5.625 h -2.812503 l 3e-6,-5.625 m 8.437499,11.25 v -2.8125 h 4.687498 v 16.875 h 3.750001 v 2.8125" />
    <path
       id="path3592"
       d="m 74.357579,136.81141 c -0.393991,0 -0.713367,0.31939 -0.713367,0.71337 0,0.39397 0.319376,0.71337 0.713367,0.71337 0.393967,0 0.713343,-0.3194 0.713343,-0.71337 0,-0.39398 -0.319376,-0.71337 -0.713343,-0.71337 z"
       style="fill:#ffffff;fill-opacity:1;stroke:#000000;stroke-width:0.396875;stroke-linecap:round;stroke-linejoin:round;stroke-miterlimit:4;stroke-dasharray:none;stroke-opacity:1" />
    <path
       style="fill:none;stroke:#000000;stroke-width:0.396875;stroke-linecap:round;stroke-linejoin:round;stroke-miterlimit:4;stroke-dasharray:none;stroke-opacity:1"
       d="m 81.85758,138.23814 v 9.375 h -12.1875 v -9.375 z"
       id="path3594" />
    <path
       style="fill:none;stroke:#000000;stroke-width:0.396875;stroke-linecap:butt;stroke-linejoin:miter;stroke-miterlimit:4;stroke-dasharray:none;stroke-opacity:1"
       d="m 78.107579,138.23815 -0.9375,1.875 -0.937499,-1.875"
       id="path3596" />
    <path
       style="fill:#ffffff;fill-opacity:1;stroke:#000000;stroke-width:0.396875;stroke-linecap:round;stroke-linejoin:round;stroke-miterlimit:4;stroke-dasharray:none;stroke-opacity:1"
       d="m 71.545082,147.61314 c -0.393991,0 -0.71337,0.31939 -0.71337,0.71337 0,0.39397 0.319382,0.71336 0.71337,0.71336 0.393965,0 0.713343,-0.31939 0.713343,-0.71336 0,-0.39398 -0.319378,-0.71337 -0.713343,-0.71337 z"
       id="path3598" />
    <path
       style="fill:#ffffff;fill-opacity:1;stroke:#000000;stroke-width:0.396875;stroke-linecap:round;stroke-linejoin:round;stroke-miterlimit:4;stroke-dasharray:none;stroke-opacity:1"
       d="m 77.170079,136.81141 c -0.393991,0 -0.71337,0.31939 -0.71337,0.71337 0,0.39397 0.319379,0.71337 0.71337,0.71337 0.393964,0 0.713343,-0.3194 0.713343,-0.71337 0,-0.39398 -0.319379,-0.71337 -0.713343,-0.71337 z"
       id="path3600" />
    <g
       id="g3797"
       transform="matrix(0.26458333,0,0,0.26458333,-23.142418,3.2381551)">
      <text
         id="text3602"
         y="542.12592"
         x="354.33072"
         style="font-style:normal;font-variant:normal;font-weight:normal;font-stretch:normal;line-height:0%;font-family:sans-serif;-inkscape-font-specification:Sans;text-align:start;letter-spacing:0px;word-spacing:0px;writing-mode:lr-tb;text-anchor:start;fill:#000000;fill-opacity:1;stroke:#000000;stroke-width:0.2;stroke-miterlimit:4;stroke-dasharray:none;stroke-opacity:1"
         xml:space="preserve"><tspan
           y="542.12592"
           x="354.33072"
           id="tspan3604"
           style="font-size:10px;line-height:1.25;font-family:sans-serif">Q</tspan></text>
      <path
         id="path3606"
         d="m 354.70831,533.4521 h 7.08662"
         style="fill:none;stroke:#000000;stroke-width:1px;stroke-linecap:butt;stroke-linejoin:miter;stroke-opacity:1" />
    </g>
    <text
       id="text3608"
       y="146.67563"
       x="79.045074"
       style="font-style:normal;font-variant:normal;font-weight:normal;font-stretch:normal;font-size:3.175px;line-height:0%;font-family:sans-serif;-inkscape-font-specification:Sans;text-align:start;letter-spacing:0px;word-spacing:0px;writing-mode:lr-tb;text-anchor:start;fill:#000000;fill-opacity:1;stroke:#000000;stroke-width:0.0529167;stroke-miterlimit:4;stroke-dasharray:none;stroke-opacity:1"
       xml:space="preserve"><tspan
         y="146.67563"
         x="79.045074"
         id="tspan3610"
         style="font-size:2.64583px;line-height:1.25;font-family:sans-serif;stroke-width:0.0529167">Q</tspan></text>
    <text
       xml:space="preserve"
       style="font-style:normal;font-variant:normal;font-weight:normal;font-stretch:normal;font-size:3.175px;line-height:0%;font-family:sans-serif;-inkscape-font-specification:Sans;text-align:start;letter-spacing:0px;word-spacing:0px;writing-mode:lr-tb;text-anchor:start;fill:#000000;fill-opacity:1;stroke:#000000;stroke-width:0.0529167;stroke-miterlimit:4;stroke-dasharray:none;stroke-opacity:1"
       x="70.607582"
       y="141.05064"
       id="text3612"><tspan
         style="font-size:2.64583px;line-height:1.25;font-family:sans-serif;stroke-width:0.0529167"
         id="tspan3614"
         x="70.607582"
         y="141.05064">J</tspan></text>
    <text
       id="text3616"
       y="141.05064"
       x="73.420082"
       style="font-style:normal;font-variant:normal;font-weight:normal;font-stretch:normal;font-size:3.175px;line-height:0%;font-family:sans-serif;-inkscape-font-specification:Sans;text-align:start;letter-spacing:0px;word-spacing:0px;writing-mode:lr-tb;text-anchor:start;fill:#000000;fill-opacity:1;stroke:#000000;stroke-width:0.0529167;stroke-miterlimit:4;stroke-dasharray:none;stroke-opacity:1"
       xml:space="preserve"><tspan
         style="font-size:2.64583px;line-height:1.25;font-family:sans-serif;stroke-width:0.0529167"
         y="141.05064"
         x="73.420082"
         id="tspan3618">R</tspan></text>
    <text
       id="text3620"
       y="141.05064"
       x="79.045074"
       style="font-style:normal;font-variant:normal;font-weight:normal;font-stretch:normal;font-size:3.175px;line-height:0%;font-family:sans-serif;-inkscape-font-specification:Sans;text-align:start;letter-spacing:0px;word-spacing:0px;writing-mode:lr-tb;text-anchor:start;fill:#000000;fill-opacity:1;stroke:#000000;stroke-width:0.0529167;stroke-miterlimit:4;stroke-dasharray:none;stroke-opacity:1"
       xml:space="preserve"><tspan
         style="font-size:2.64583px;line-height:1.25;font-family:sans-serif;stroke-width:0.0529167"
         y="141.05064"
         x="79.045074"
         id="tspan3622">K</tspan></text>
    <text
       id="text3496"
       y="154.14786"
       x="59.835003"
       style="font-style:normal;font-variant:normal;font-weight:normal;font-stretch:normal;font-size:3.175px;line-height:0%;font-family:sans-serif;-inkscape-font-specification:Sans;text-align:start;letter-spacing:0px;word-spacing:0px;writing-mode:lr-tb;text-anchor:start;fill:#000000;fill-opacity:1;stroke:#000000;stroke-width:0.0529167;stroke-miterlimit:4;stroke-dasharray:none;stroke-opacity:1"
       xml:space="preserve"><tspan
         y="154.14786"
         x="59.835003"
         id="tspan3498"
         style="font-size:2.64583px;line-height:1.25;font-family:sans-serif;stroke-width:0.0529167">1</tspan></text>
    <text
       xml:space="preserve"
       style="font-style:normal;font-variant:normal;font-weight:normal;font-stretch:normal;font-size:3.175px;line-height:0%;font-family:sans-serif;-inkscape-font-specification:Sans;text-align:start;letter-spacing:0px;word-spacing:0px;writing-mode:lr-tb;text-anchor:start;fill:#000000;fill-opacity:1;stroke:#000000;stroke-width:0.0529167;stroke-miterlimit:4;stroke-dasharray:none;stroke-opacity:1"
       x="115.36572"
       y="154.15919"
       id="text3500"><tspan
         id="tspan3502"
         x="115.36572"
         y="154.15919"
         style="font-size:2.64583px;line-height:1.25;font-family:sans-serif;stroke-width:0.0529167">7</tspan></text>
    <text
       id="text3504"
       y="129.85222"
       x="115.36184"
       style="font-style:normal;font-variant:normal;font-weight:normal;font-stretch:normal;font-size:3.175px;line-height:0%;font-family:sans-serif;-inkscape-font-specification:Sans;text-align:start;letter-spacing:0px;word-spacing:0px;writing-mode:lr-tb;text-anchor:start;fill:#000000;fill-opacity:1;stroke:#000000;stroke-width:0.0529167;stroke-miterlimit:4;stroke-dasharray:none;stroke-opacity:1"
       xml:space="preserve"><tspan
         id="tspan3506"
         x="115.36184"
         y="129.85222"
         style="font-size:2.64583px;line-height:1.25;font-family:sans-serif;stroke-width:0.0529167">8</tspan></text>
    <text
       xml:space="preserve"
       style="font-style:normal;font-variant:normal;font-weight:normal;font-stretch:normal;font-size:3.175px;line-height:0%;font-family:sans-serif;-inkscape-font-specification:Sans;text-align:start;letter-spacing:0px;word-spacing:0px;writing-mode:lr-tb;text-anchor:start;fill:#000000;fill-opacity:1;stroke:#000000;stroke-width:0.0529167;stroke-miterlimit:4;stroke-dasharray:none;stroke-opacity:1"
       x="61.555351"
       y="129.85219"
       id="text3508"><tspan
         id="tspan3510"
         x="61.555351"
         y="129.85219"
         style="font-size:2.64583px;line-height:1.25;font-family:sans-serif;stroke-width:0.0529167">14</tspan></text>
    <text
       id="text3512"
       y="123.15865"
       x="60.247421"
       style="font-style:normal;font-variant:normal;font-weight:normal;font-stretch:normal;font-size:3.175px;line-height:0%;font-family:sans-serif;-inkscape-font-specification:Sans;text-align:start;letter-spacing:0px;word-spacing:0px;writing-mode:lr-tb;text-anchor:start;fill:#000000;fill-opacity:1;stroke:#000000;stroke-width:0.0529167;stroke-miterlimit:4;stroke-dasharray:none;stroke-opacity:1"
       xml:space="preserve"><tspan
         y="123.15865"
         x="60.247421"
         id="tspan3514"
         style="font-size:3.43958px;line-height:1.25;font-family:sans-serif;stroke-width:0.0529167">Vcc</tspan></text>
    <text
       id="text3516"
       y="161.35803"
       x="109.91091"
       style="font-style:normal;font-variant:normal;font-weight:normal;font-stretch:normal;font-size:3.175px;line-height:0%;font-family:sans-serif;-inkscape-font-specification:Sans;text-align:start;letter-spacing:0px;word-spacing:0px;writing-mode:lr-tb;text-anchor:start;fill:#000000;fill-opacity:1;stroke:#000000;stroke-width:0.0529167;stroke-miterlimit:4;stroke-dasharray:none;stroke-opacity:1"
       xml:space="preserve"><tspan
         y="161.35803"
         x="109.91091"
         id="tspan3518"
         style="font-size:3.43958px;line-height:1.25;font-family:sans-serif;stroke-width:0.0529167">GND</tspan></text>
    <text
       id="text3520"
       y="161.40002"
       x="86.131783"
       style="font-style:normal;font-variant:normal;font-weight:normal;font-stretch:normal;font-size:3.175px;line-height:0%;font-family:sans-serif;-inkscape-font-specification:Sans;text-align:start;letter-spacing:0px;word-spacing:0px;writing-mode:lr-tb;text-anchor:start;fill:#000000;fill-opacity:1;stroke:#000000;stroke-width:0.0529167;stroke-miterlimit:4;stroke-dasharray:none;stroke-opacity:1"
       xml:space="preserve"><tspan
         id="tspan3522"
         x="86.131783"
         y="161.40002"
         style="font-size:3.43958px;line-height:1.25;font-family:sans-serif;stroke-width:0.0529167">1K</tspan></text>
    <text
       xml:space="preserve"
       style="font-style:normal;font-variant:normal;font-weight:normal;font-stretch:normal;font-size:3.175px;line-height:0%;font-family:sans-serif;-inkscape-font-specification:Sans;text-align:start;letter-spacing:0px;word-spacing:0px;writing-mode:lr-tb;text-anchor:start;fill:#000000;fill-opacity:1;stroke:#000000;stroke-width:0.0529167;stroke-miterlimit:4;stroke-dasharray:none;stroke-opacity:1"
       x="77.563278"
       y="161.41098"
       id="text3524"><tspan
         id="tspan3526"
         x="77.563278"
         y="161.41098"
         style="font-size:3.43958px;line-height:1.25;font-family:sans-serif;stroke-width:0.0529167">1Q</tspan></text>
    <g
       transform="matrix(0.26458333,0,0,0.26458333,53.168867,-36.176035)"
       id="g3528">
      <text
         id="text3530"
         y="602.36218"
         x="60.236221"
         style="font-style:normal;font-variant:normal;font-weight:normal;font-stretch:normal;line-height:0%;font-family:sans-serif;-inkscape-font-specification:Sans;text-align:start;letter-spacing:0px;word-spacing:0px;writing-mode:lr-tb;text-anchor:start;fill:#000000;fill-opacity:1;stroke:#000000;stroke-width:0.2;stroke-miterlimit:4;stroke-dasharray:none;stroke-opacity:1"
         xml:space="preserve"><tspan
           style="font-size:13px;line-height:1.25;font-family:sans-serif;stroke-width:0.2"
           y="602.36218"
           x="60.236221"
           id="tspan3532">1R</tspan></text>
      <path
         id="path3534"
         d="m 68.38977,591.37484 h 8.46529"
         style="fill:none;stroke:#000000;stroke-width:1px;stroke-linecap:butt;stroke-linejoin:miter;stroke-opacity:1" />
    </g>
    <text
       id="text3536"
       y="161.35803"
       x="61.236637"
       style="font-style:normal;font-variant:normal;font-weight:normal;font-stretch:normal;font-size:3.175px;line-height:0%;font-family:sans-serif;-inkscape-font-specification:Sans;text-align:start;letter-spacing:0px;word-spacing:0px;writing-mode:lr-tb;text-anchor:start;fill:#000000;fill-opacity:1;stroke:#000000;stroke-width:0.0529167;stroke-miterlimit:4;stroke-dasharray:none;stroke-opacity:1"
       xml:space="preserve"><tspan
         style="font-size:3.43958px;line-height:1.25;font-family:sans-serif;stroke-width:0.0529167"
         y="161.35803"
         x="61.236637"
         id="tspan3538">1J</tspan></text>
    <g
       id="g3540"
       transform="matrix(0.26458333,0,0,0.26458333,-64.081267,-53.504637)">
      <text
         id="text3542"
         y="812.27948"
         x="503.1496"
         style="font-style:normal;font-variant:normal;font-weight:normal;font-stretch:normal;line-height:0%;font-family:sans-serif;-inkscape-font-specification:Sans;text-align:start;letter-spacing:0px;word-spacing:0px;writing-mode:lr-tb;text-anchor:start;fill:#000000;fill-opacity:1;stroke:#000000;stroke-width:0.2;stroke-miterlimit:4;stroke-dasharray:none;stroke-opacity:1"
         xml:space="preserve"><tspan
           style="font-size:13px;line-height:1.25;font-family:sans-serif;stroke-width:0.2"
           y="812.27948"
           x="503.1496"
           id="tspan3544">1Q</tspan></text>
      <path
         id="path3546"
         d="m 510.96067,801.29216 h 9.28125"
         style="fill:none;stroke:#000000;stroke-width:1px;stroke-linecap:butt;stroke-linejoin:miter;stroke-opacity:1" />
    </g>
    <g
       transform="matrix(0.26458333,0,0,0.26458333,69.890547,-36.176035)"
       id="g3548">
      <text
         id="text3550"
         y="602.20349"
         x="24.80315"
         style="font-style:normal;font-variant:normal;font-weight:normal;font-stretch:normal;line-height:0%;font-family:sans-serif;-inkscape-font-specification:Sans;text-align:start;letter-spacing:0px;word-spacing:0px;writing-mode:lr-tb;text-anchor:start;fill:#000000;fill-opacity:1;stroke:#000000;stroke-width:0.2;stroke-miterlimit:4;stroke-dasharray:none;stroke-opacity:1"
         xml:space="preserve"><tspan
           y="602.20349"
           x="24.80315"
           id="tspan3552"
           style="font-size:13px;line-height:1.25;font-family:sans-serif">1CP</tspan></text>
      <path
         style="fill:none;stroke:#000000;stroke-width:1px;stroke-linecap:butt;stroke-linejoin:miter;stroke-opacity:1"
         d="M 32.51477,591.37516 H 49.66756"
         id="path3554" />
    </g>
    <text
       id="text3624"
       y="161.41098"
       x="94.575165"
       style="font-style:normal;font-variant:normal;font-weight:normal;font-stretch:normal;font-size:3.175px;line-height:0%;font-family:sans-serif;-inkscape-font-specification:Sans;text-align:start;letter-spacing:0px;word-spacing:0px;writing-mode:lr-tb;text-anchor:start;fill:#000000;fill-opacity:1;stroke:#000000;stroke-width:0.0529167;stroke-miterlimit:4;stroke-dasharray:none;stroke-opacity:1"
       xml:space="preserve"><tspan
         y="161.41098"
         x="94.575165"
         id="tspan3626"
         style="font-size:3.43958px;line-height:1.25;font-family:sans-serif;stroke-width:0.0529167">2Q</tspan></text>
    <g
       transform="matrix(0.26458333,0,0,0.26458333,-30.194391,-53.504637)"
       id="g3628">
      <text
         xml:space="preserve"
         style="font-style:normal;font-variant:normal;font-weight:normal;font-stretch:normal;line-height:0%;font-family:sans-serif;-inkscape-font-specification:Sans;text-align:start;letter-spacing:0px;word-spacing:0px;writing-mode:lr-tb;text-anchor:start;fill:#000000;fill-opacity:1;stroke:#000000;stroke-width:0.2;stroke-miterlimit:4;stroke-dasharray:none;stroke-opacity:1"
         x="503.1496"
         y="812.27948"
         id="text3630"><tspan
           id="tspan3632"
           x="503.1496"
           y="812.27948"
           style="font-size:13px;line-height:1.25;font-family:sans-serif;stroke-width:0.2">2Q</tspan></text>
      <path
         style="fill:none;stroke:#000000;stroke-width:1px;stroke-linecap:butt;stroke-linejoin:miter;stroke-opacity:1"
         d="m 510.96067,801.29216 h 9.28125"
         id="path3634" />
    </g>
    <text
       xml:space="preserve"
       style="font-style:normal;font-variant:normal;font-weight:normal;font-stretch:normal;font-size:3.175px;line-height:0%;font-family:sans-serif;-inkscape-font-specification:Sans;text-align:start;letter-spacing:0px;word-spacing:0px;writing-mode:lr-tb;text-anchor:start;fill:#000000;fill-opacity:1;stroke:#000000;stroke-width:0.0529167;stroke-miterlimit:4;stroke-dasharray:none;stroke-opacity:1"
       x="86.268661"
       y="123.19896"
       id="text3636"><tspan
         y="123.19896"
         x="86.268661"
         id="tspan3638"
         style="font-size:3.43958px;line-height:1.25;font-family:sans-serif;stroke-width:0.0529167">2K</tspan></text>
    <g
       transform="matrix(0.26458333,0,0,0.26458333,95.339923,-36.176035)"
       id="g3640">
      <text
         xml:space="preserve"
         style="font-style:normal;font-variant:normal;font-weight:normal;font-stretch:normal;line-height:0%;font-family:sans-serif;-inkscape-font-specification:Sans;text-align:start;letter-spacing:0px;word-spacing:0px;writing-mode:lr-tb;text-anchor:start;fill:#000000;fill-opacity:1;stroke:#000000;stroke-width:0.2;stroke-miterlimit:4;stroke-dasharray:none;stroke-opacity:1"
         x="24.80315"
         y="602.20349"
         id="text3642"><tspan
           id="tspan3644"
           x="24.80315"
           y="602.20349"
           style="font-size:13px;line-height:1.25;font-family:sans-serif">2CP</tspan></text>
      <path
         id="path3646"
         d="M 32.51477,591.37516 H 49.66756"
         style="fill:none;stroke:#000000;stroke-width:1px;stroke-linecap:butt;stroke-linejoin:miter;stroke-opacity:1" />
    </g>
    <g
       transform="matrix(0.26458333,0,0,0.26458333,78.618241,-36.176035)"
       id="g3648">
      <text
         xml:space="preserve"
         style="font-style:normal;font-variant:normal;font-weight:normal;font-stretch:normal;line-height:0%;font-family:sans-serif;-inkscape-font-specification:Sans;text-align:start;letter-spacing:0px;word-spacing:0px;writing-mode:lr-tb;text-anchor:start;fill:#000000;fill-opacity:1;stroke:#000000;stroke-width:0.2;stroke-miterlimit:4;stroke-dasharray:none;stroke-opacity:1"
         x="60.236221"
         y="602.36218"
         id="text3650"><tspan
           id="tspan3652"
           x="60.236221"
           y="602.36218"
           style="font-size:13px;line-height:1.25;font-family:sans-serif;stroke-width:0.2">2R</tspan></text>
      <path
         style="fill:none;stroke:#000000;stroke-width:1px;stroke-linecap:butt;stroke-linejoin:miter;stroke-opacity:1"
         d="m 68.38977,591.37484 h 8.46529"
         id="path3654" />
    </g>
    <text
       xml:space="preserve"
       style="font-style:normal;font-variant:normal;font-weight:normal;font-stretch:normal;font-size:3.175px;line-height:0%;font-family:sans-serif;-inkscape-font-specification:Sans;text-align:start;letter-spacing:0px;word-spacing:0px;writing-mode:lr-tb;text-anchor:start;fill:#000000;fill-opacity:1;stroke:#000000;stroke-width:0.0529167;stroke-miterlimit:4;stroke-dasharray:none;stroke-opacity:1"
       x="111.9985"
       y="123.15697"
       id="text3656"><tspan
         id="tspan3658"
         x="111.9985"
         y="123.15697"
         style="font-size:3.43958px;line-height:1.25;font-family:sans-serif;stroke-width:0.0529167">2J</tspan></text>
    <path
       d="m 105.29508,126.98814 v 5.625 h -2.8125 v 5.625 m 2.8125,16.875 v -7.5 m -8.437499,7.5 3e-6,-7.5 m -8.437504,-20.625 2e-6,8.4375 h 8.437502 v 2.8125 m 2.8125,0 v -5.625 h -2.812503 l 3e-6,-5.625 m 8.437496,11.25 v -2.8125 h 8.4375 v -8.4375"
       style="fill:none;stroke:#000000;stroke-width:0.396875;stroke-linecap:butt;stroke-linejoin:miter;stroke-miterlimit:4;stroke-dasharray:none;stroke-opacity:1"
       id="path3758" />
    <path
       style="fill:#ffffff;fill-opacity:1;stroke:#000000;stroke-width:0.396875;stroke-linecap:round;stroke-linejoin:round;stroke-miterlimit:4;stroke-dasharray:none;stroke-opacity:1"
       d="m 99.670081,136.81141 c -0.393991,0 -0.713367,0.31939 -0.713367,0.71337 0,0.39397 0.319376,0.71337 0.713367,0.71337 0.393969,0 0.713339,-0.3194 0.713339,-0.71337 0,-0.39398 -0.31937,-0.71337 -0.713339,-0.71337 z"
       id="path3760" />
    <path
       id="path3762"
       d="m 107.17008,138.23814 v 9.375 h -12.1875 v -9.375 z"
       style="fill:none;stroke:#000000;stroke-width:0.396875;stroke-linecap:round;stroke-linejoin:round;stroke-miterlimit:4;stroke-dasharray:none;stroke-opacity:1" />
    <path
       id="path3764"
       d="m 103.42008,138.23815 -0.9375,1.875 -0.9375,-1.875"
       style="fill:none;stroke:#000000;stroke-width:0.396875;stroke-linecap:butt;stroke-linejoin:miter;stroke-miterlimit:4;stroke-dasharray:none;stroke-opacity:1" />
    <path
       id="path3766"
       d="m 105.29508,147.61314 c -0.39399,0 -0.71337,0.31939 -0.71337,0.71337 0,0.39397 0.31938,0.71336 0.71337,0.71336 0.39396,0 0.71334,-0.31939 0.71334,-0.71336 0,-0.39398 -0.31938,-0.71337 -0.71334,-0.71337 z"
       style="fill:#ffffff;fill-opacity:1;stroke:#000000;stroke-width:0.396875;stroke-linecap:round;stroke-linejoin:round;stroke-miterlimit:4;stroke-dasharray:none;stroke-opacity:1" />
    <path
       id="path3768"
       d="m 102.48258,136.81141 c -0.39399,0 -0.71337,0.31939 -0.71337,0.71337 0,0.39397 0.31938,0.71337 0.71337,0.71337 0.39397,0 0.71334,-0.3194 0.71334,-0.71337 0,-0.39398 -0.31937,-0.71337 -0.71334,-0.71337 z"
       style="fill:#ffffff;fill-opacity:1;stroke:#000000;stroke-width:0.396875;stroke-linecap:round;stroke-linejoin:round;stroke-miterlimit:4;stroke-dasharray:none;stroke-opacity:1" />
    <g
       id="g3792"
       transform="matrix(0.26458333,0,0,0.26458333,-14.704926,3.2381618)">
      <text
         xml:space="preserve"
         style="font-style:normal;font-variant:normal;font-weight:normal;font-stretch:normal;line-height:0%;font-family:sans-serif;-inkscape-font-specification:Sans;text-align:start;letter-spacing:0px;word-spacing:0px;writing-mode:lr-tb;text-anchor:start;fill:#000000;fill-opacity:1;stroke:#000000;stroke-width:0.2;stroke-miterlimit:4;stroke-dasharray:none;stroke-opacity:1"
         x="450.00003"
         y="542.12592"
         id="text3770"><tspan
           id="tspan3772"
           x="450.00003"
           y="542.12592"
           style="font-size:10px;line-height:1.25;font-family:sans-serif">Q</tspan></text>
      <path
         style="fill:none;stroke:#000000;stroke-width:1px;stroke-linecap:butt;stroke-linejoin:miter;stroke-opacity:1"
         d="m 450.37761,533.4521 h 7.08662"
         id="path3774" />
    </g>
    <text
       xml:space="preserve"
       style="font-style:normal;font-variant:normal;font-weight:normal;font-stretch:normal;font-size:3.175px;line-height:0%;font-family:sans-serif;-inkscape-font-specification:Sans;text-align:start;letter-spacing:0px;word-spacing:0px;writing-mode:lr-tb;text-anchor:start;fill:#000000;fill-opacity:1;stroke:#000000;stroke-width:0.0529167;stroke-miterlimit:4;stroke-dasharray:none;stroke-opacity:1"
       x="95.920082"
       y="146.67563"
       id="text3776"><tspan
         id="tspan3778"
         x="95.920082"
         y="146.67563"
         style="font-size:2.64583px;line-height:1.25;font-family:sans-serif;stroke-width:0.0529167">Q</tspan></text>
    <text
       id="text3780"
       y="141.05064"
       x="104.35758"
       style="font-style:normal;font-variant:normal;font-weight:normal;font-stretch:normal;font-size:3.175px;line-height:0%;font-family:sans-serif;-inkscape-font-specification:Sans;text-align:start;letter-spacing:0px;word-spacing:0px;writing-mode:lr-tb;text-anchor:start;fill:#000000;fill-opacity:1;stroke:#000000;stroke-width:0.0529167;stroke-miterlimit:4;stroke-dasharray:none;stroke-opacity:1"
       xml:space="preserve"><tspan
         y="141.05064"
         x="104.35758"
         id="tspan3782"
         style="font-size:2.64583px;line-height:1.25;font-family:sans-serif;stroke-width:0.0529167">J</tspan></text>
    <text
       xml:space="preserve"
       style="font-style:normal;font-variant:normal;font-weight:normal;font-stretch:normal;font-size:3.175px;line-height:0%;font-family:sans-serif;-inkscape-font-specification:Sans;text-align:start;letter-spacing:0px;word-spacing:0px;writing-mode:lr-tb;text-anchor:start;fill:#000000;fill-opacity:1;stroke:#000000;stroke-width:0.0529167;stroke-miterlimit:4;stroke-dasharray:none;stroke-opacity:1"
       x="98.73259"
       y="141.05064"
       id="text3784"><tspan
         id="tspan3786"
         x="98.73259"
         y="141.05064"
         style="font-size:2.64583px;line-height:1.25;font-family:sans-serif;stroke-width:0.0529167">R</tspan></text>
    <text
       xml:space="preserve"
       style="font-style:normal;font-variant:normal;font-weight:normal;font-stretch:normal;font-size:3.175px;line-height:0%;font-family:sans-serif;-inkscape-font-specification:Sans;text-align:start;letter-spacing:0px;word-spacing:0px;writing-mode:lr-tb;text-anchor:start;fill:#000000;fill-opacity:1;stroke:#000000;stroke-width:0.0529167;stroke-miterlimit:4;stroke-dasharray:none;stroke-opacity:1"
       x="95.920082"
       y="141.05064"
       id="text3788"><tspan
         id="tspan3790"
         x="95.920082"
         y="141.05064"
         style="font-size:2.64583px;line-height:1.25;font-family:sans-serif;stroke-width:0.0529167">K</tspan></text>
  </g>
</svg>
