<?xml version="1.0" encoding="UTF-8" standalone="no"?>
<!-- Created with Inkscape (http://www.inkscape.org/) -->

<svg
   width="26.198172mm"
   height="17.756201mm"
   viewBox="0 0 26.198172 17.756201"
   version="1.1"
   id="svg24917"
   xmlns="http://www.w3.org/2000/svg"
   xmlns:svg="http://www.w3.org/2000/svg">
  <defs
     id="defs24914" />
  <g
     id="layer1"
     transform="translate(-168.35065,-125.64088)">
    <g
       id="g26604"
       transform="matrix(0.33333,0,0,0.33333,112.23433,83.761003)">
      <path
         d="m 244.21877,138.46125 -5.55558,-3.20751 1.65737,-0.95688 q 0.5612,-0.32402 0.93621,-0.44856 0.52332,-0.17539 1.1035,-0.17767 0.75209,-0.005 1.51895,0.22137 0.76637,0.22267 1.50913,0.65151 0.63288,0.36539 0.9937,0.72156 0.36082,0.35614 0.48279,0.65769 0.11814,0.29936 0.0642,0.54489 -0.0543,0.24147 -0.29768,0.49132 -0.23994,0.24801 -0.67644,0.50002 z m -0.0198,-0.74611 1.02722,-0.59307 q 0.47586,-0.27474 0.64269,-0.48919 0.17006,-0.21632 0.1452,-0.41639 -0.035,-0.28171 -0.34996,-0.60752 -0.31532,-0.32989 -0.94441,-0.6931 -0.8716,-0.50322 -1.58715,-0.62834 -0.71603,-0.12919 -1.22967,-0.0165 -0.36973,0.0822 -0.93748,0.40992 l -1.01082,0.5836 z"
         id="path12614"
         style="font-size:3.52778px;line-height:1.25;stroke-width:1.16416" />
      <path
         d="m 190.39013,178.43404 0.53986,-0.38181 q 0.45954,0.21604 0.88286,0.28233 0.42284,0.0623 0.91771,-0.031 0.49122,-0.0955 0.90147,-0.33222 0.36428,-0.21032 0.51828,-0.44352 0.154,-0.2332 0.0724,-0.43567 -0.0818,-0.20658 -0.33955,-0.35532 -0.26149,-0.15092 -0.58601,-0.18678 -0.3284,-0.0381 -0.7629,0.0598 -0.28076,0.0614 -1.12565,0.33922 -0.84861,0.27553 -1.27743,0.33493 -0.55295,0.0788 -1.03063,-7e-5 -0.47822,-0.0827 -0.86097,-0.30371 -0.42064,-0.24286 -0.5777,-0.57229 -0.16082,-0.33158 0.0469,-0.67025 0.20768,-0.33864 0.69342,-0.61908 0.53493,-0.30883 1.14274,-0.42783 0.60738,-0.12298 1.21374,-0.0268 0.60641,0.0961 1.11168,0.369 l -0.55741,0.38302 q -0.57589,-0.27572 -1.13056,-0.26617 -0.5513,0.009 -1.10594,0.32782 -0.57761,0.3335 -0.59714,0.62918 -0.0198,0.29161 0.32485,0.49073 0.29938,0.17292 0.67975,0.17644 0.37724,0.004 1.35624,-0.32356 0.97867,-0.3331 1.41902,-0.41234 0.64368,-0.11352 1.18875,-0.0299 0.54122,0.0814 0.98841,0.33952 0.44337,0.25597 0.61763,0.61048 0.1705,0.35231 -0.0233,0.71795 -0.19426,0.36159 -0.70945,0.65908 -0.6531,0.37705 -1.31593,0.50595 -0.65954,0.12694 -1.35188,0.0198 -0.6928,-0.11198 -1.263,-0.42603 z"
         id="path12616"
         style="font-size:3.52778px;line-height:1.25;stroke-width:1.16416" />
      <path
         d="m 172.82617,166.0879 -0.65179,-0.37631 2.03366,-1.17922 2.06155,1.19024 q -0.0374,0.52039 -0.31636,0.9353 -0.28279,0.41273 -0.80791,0.7159 -0.70888,0.40927 -1.6384,0.54338 -0.93005,0.12999 -1.88859,-0.0824 -0.95856,-0.21237 -1.77712,-0.68496 -0.81098,-0.46822 -1.21996,-1.04163 -0.40949,-0.57748 -0.19932,-1.09271 0.21031,-0.51524 0.92903,-0.93021 0.52182,-0.30128 1.13901,-0.43 0.61675,-0.13279 1.2049,-0.0699 0.58819,0.0629 1.27377,0.31478 l -0.39239,0.43664 q -0.53264,-0.18255 -0.93608,-0.22971 -0.40332,-0.0472 -0.84601,0.0421 -0.44649,0.0871 -0.81078,0.29739 -0.43651,0.25201 -0.59953,0.52547 -0.16676,0.27132 -0.11352,0.52941 0.0565,0.2562 0.24755,0.49158 0.33152,0.4037 0.93407,0.75159 0.74277,0.42883 1.46285,0.59068 0.7234,0.15996 1.3893,0.0556 0.66592,-0.10439 1.1418,-0.37914 0.41351,-0.23875 0.62542,-0.57117 0.20812,-0.33457 0.20306,-0.5724 l -1.03458,-0.59731 z"
         id="path12618"
         style="font-size:3.52778px;line-height:1.25;stroke-width:1.16416" />
      <path
         d="m 191.47069,168.11241 -4.16668,-2.40562 1.24302,-0.71766 c 0.2806,-0.16201 0.51466,-0.27414 0.70217,-0.33643 0.26165,-0.0877 0.53752,-0.1321 0.82761,-0.13332 0.37605,-0.002 0.75579,0.0531 1.13922,0.16603 0.38319,0.11134 0.76047,0.27423 1.13184,0.48865 0.31644,0.18269 0.56487,0.36308 0.74527,0.54117 0.18042,0.17807 0.30111,0.34248 0.3621,0.49325 0.0591,0.14969 0.0751,0.28591 0.0482,0.40867 -0.0272,0.12075 -0.10153,0.24357 -0.22327,0.36849 -0.11996,0.124 -0.28907,0.24901 -0.50732,0.37501 z m -0.0798,-0.79163 0.64755,-0.37386 c 0.19999,-0.11547 0.33504,-0.21826 0.40514,-0.30839 0.0715,-0.0908 0.10198,-0.17838 0.0915,-0.26248 -0.0147,-0.1184 -0.0883,-0.24606 -0.22061,-0.38297 -0.13252,-0.13865 -0.33097,-0.28429 -0.59535,-0.43693 -0.3663,-0.21148 -0.6998,-0.34351 -1.00052,-0.39609 -0.30092,-0.0542 -0.55932,-0.0575 -0.77518,-0.01 -0.15538,0.0345 -0.35237,0.12065 -0.59098,0.2584 l -0.6372,0.36789 z"
         id="path12620"
         style="font-size:3.52778px;line-height:1.25;stroke-width:0.873123" />
      <g
         id="g24382"
         transform="matrix(1.1,0,0,1.1,96.576195,54.390872)">
        <path
           style="fill:#b2b2b2;fill-opacity:1;stroke:#666666;stroke-width:0.454545;stroke-linecap:round;stroke-linejoin:round;stroke-dasharray:none;stroke-opacity:1"
           d="m 101.32497,75.5 10.39231,-6 h 5.19615 L 135.09996,80 v 3 l -10.3923,6 z"
           id="path20805" />
        <path
           style="fill:#b2b2b2;fill-opacity:1;stroke:#666666;stroke-width:0.454545;stroke-linecap:round;stroke-linejoin:round;stroke-dasharray:none;stroke-opacity:1"
           d="m 124.70766,92 v -3 l 10.3923,-6 v 3 z"
           id="path20809" />
        <path
           style="fill:#333333;fill-opacity:1;stroke:#1a1a1a;stroke-width:0.454545;stroke-linecap:round;stroke-linejoin:round;stroke-dasharray:none;stroke-opacity:1"
           d="M 80.540368,88.5 80.067822,82.251833 109.1192,99 v 6 z"
           id="path12580" />
        <path
           style="fill:#4d4d4d;fill-opacity:1;stroke:#1a1a1a;stroke-width:0.454545;stroke-linecap:round;stroke-linejoin:round;stroke-dasharray:none;stroke-opacity:1"
           d="M 109.1192,99 133.03277,85.204887 132.50192,91.5 109.1192,105 Z"
           id="path12582" />
        <path
           style="fill:#4d4d4d;fill-opacity:1;stroke:#1a1a1a;stroke-width:0.454545;stroke-linecap:round;stroke-linejoin:round;stroke-dasharray:none;stroke-opacity:1"
           d="m 109.11917,95 23.38272,-13.5 0.53088,3.704887 L 109.1192,99 Z"
           id="path12584" />
        <path
           style="fill:#333333;fill-opacity:1;stroke:#1a1a1a;stroke-width:0.454545;stroke-linecap:round;stroke-linejoin:round;stroke-dasharray:none;stroke-opacity:1"
           d="M 80.067822,82.251833 80.540338,78.5 109.11917,95 l 3e-5,4 z"
           id="path12586" />
        <path
           style="fill:#b2b2b2;fill-opacity:1;stroke:#666666;stroke-width:0.454545;stroke-linecap:round;stroke-linejoin:round;stroke-dasharray:none;stroke-opacity:1"
           d="m 71.880107,97.5 3e-6,-3.000005 3.464105,1.999985 -3e-6,3.00001 z"
           id="path12588" />
        <path
           style="fill:#b2b2b2;fill-opacity:1;stroke:#666666;stroke-width:0.454545;stroke-linecap:round;stroke-linejoin:round;stroke-dasharray:none;stroke-opacity:1"
           d="M 71.880108,94.5 77.942287,91 c 0.866024,-0.499999 -10e-7,-3 1.73205,-4 l 4.330127,-2.5 3.464102,2 -4.330127,2.5 c -1.732051,1 -0.866026,3.5 -1.732051,4 -0.866026,0.5 -6.062185,3.49999 -6.062185,3.49999 z"
           id="path12590" />
        <path
           style="fill:#b2b2b2;fill-opacity:1;stroke:#666666;stroke-width:0.454545;stroke-linecap:round;stroke-linejoin:round;stroke-dasharray:none;stroke-opacity:1"
           d="m 75.34421,99.5 v -3 L 81.406388,93 c 0.866025,-0.5 0,-3.000001 1.73205,-4 l 4.330128,-2.5 v 3 l -3.004304,1.737919 c -1.54677,0.89477 -0.296449,3.138544 -2.596691,4.47607 z"
           id="path12592" />
        <path
           style="fill:#666666;fill-opacity:1;stroke:#1a1a1a;stroke-width:0.454545;stroke-linecap:round;stroke-linejoin:round;stroke-dasharray:none;stroke-opacity:1"
           d="M 80.540338,78.5 109.11917,95 132.50185,81.5 103.92305,65 Z"
           id="path12604" />
        <path
           style="fill:#b2b2b2;fill-opacity:1;stroke:#666666;stroke-width:0.454545;stroke-linecap:round;stroke-linejoin:round;stroke-dasharray:none;stroke-opacity:1"
           d="m 89.200615,107.5 3e-6,-3 3.464105,1.99998 -3e-6,3.00001 z"
           id="path18363" />
        <path
           style="fill:#b2b2b2;fill-opacity:1;stroke:#666666;stroke-width:0.454545;stroke-linecap:round;stroke-linejoin:round;stroke-dasharray:none;stroke-opacity:1"
           d="m 89.200616,104.5 6.062179,-3.5 c 0.866024,-0.5 -10e-7,-3 1.73205,-4 l 4.330125,-2.5 3.4641,2 -4.33012,2.5 c -1.732054,1 -0.866029,3.5 -1.732054,4 -0.866026,0.5 -6.062185,3.49999 -6.062185,3.49999 z"
           id="path18365" />
        <path
           style="fill:#b2b2b2;fill-opacity:1;stroke:#666666;stroke-width:0.454545;stroke-linecap:round;stroke-linejoin:round;stroke-dasharray:none;stroke-opacity:1"
           d="m 92.664718,109.5 v -3 l 6.062178,-3.5 c 0.866025,-0.5 0,-3.000001 1.732054,-4 l 4.33012,-2.5 v 3 l -3.0043,1.73792 c -1.54677,0.89477 -0.29645,3.13854 -2.596691,4.47607 z"
           id="path18367" />
        <path
           style="fill:#b2b2b2;fill-opacity:1;stroke:#666666;stroke-width:0.454545;stroke-linecap:round;stroke-linejoin:round;stroke-dasharray:none;stroke-opacity:1"
           d="m 86.602536,96.00001 3e-6,-3 3.464106,1.99998 -3e-6,3.00001 z"
           id="path18371" />
        <path
           style="fill:#b2b2b2;fill-opacity:1;stroke:#666666;stroke-width:0.454545;stroke-linecap:round;stroke-linejoin:round;stroke-dasharray:none;stroke-opacity:1"
           d="M 86.602548,93.00001 92.664718,89.5 96.12882,91.5 90.066642,95 Z"
           id="path18373" />
        <path
           style="fill:#b2b2b2;fill-opacity:1;stroke:#666666;stroke-width:0.454545;stroke-linecap:round;stroke-linejoin:round;stroke-dasharray:none;stroke-opacity:1"
           d="m 90.066642,98 v -3 l 6.062178,-3.5 v 3 z"
           id="path18375" />
      </g>
    </g>
  </g>
</svg>
