<?xml version="1.0" encoding="UTF-8" standalone="no"?>
<!-- Created with Inkscape (http://www.inkscape.org/) -->

<svg
   width="32.54623mm"
   height="21.737301mm"
   viewBox="0 0 32.54623 21.737302"
   version="1.1"
   id="svg24917"
   xmlns="http://www.w3.org/2000/svg"
   xmlns:svg="http://www.w3.org/2000/svg">
  <defs
     id="defs24914" />
  <g
     id="layer1"
     transform="translate(-93.466341,6.2367372)">
    <g
       id="g11561"
       transform="matrix(0.33,0,0,0.33,55.176694,-11.121786)">
      <path
         style="fill:#666666;fill-opacity:1;stroke:#1a1a1a;stroke-width:0.454545;stroke-linecap:round;stroke-linejoin:bevel;stroke-dasharray:none;stroke-opacity:1"
         d="M 212.17622,27.5 190.52559,40 168.87495,27.5 190.52559,15.000002 Z"
         id="path2467" />
      <path
         style="fill:#333333;fill-opacity:1;stroke:#1a1a1a;stroke-width:0.454545;stroke-linecap:round;stroke-linejoin:round;stroke-dasharray:none;stroke-opacity:1"
         d="M 168.87495,27.5 190.52559,40 c 0,0 2.25059,5.970575 2.2548,10.698191 C 192.78563,57.789617 187.84982,63.47042 178.40123,58 169.73319,52.981491 166.83968,42.483849 166.81103,35.671273 166.80553,30.943656 168.87495,27.5 168.87495,27.5 Z"
         id="path2469" />
      <path
         id="path2465"
         style="fill:#4d4d4d;fill-opacity:1;stroke:#1a1a1a;stroke-width:0.454545;stroke-linecap:round;stroke-linejoin:round;stroke-dasharray:none;stroke-opacity:1"
         d="m 192.78246,50.602203 c 0.003,3.864342 -1.40909,7.290566 -4.17618,8.777451 l 21.8847,-12.639046 c 2.6032,-1.547948 3.93925,-4.817023 3.93592,-8.566564 C 214.4209,33.321698 212.17622,27.5 212.17622,27.5 L 190.52559,40 c 0,0 2.25256,5.749858 2.25687,10.602203 z" />
      <path
         style="fill:#b2b2b2;fill-opacity:1;stroke:#666666;stroke-width:0.454545;stroke-linecap:round;stroke-linejoin:round;stroke-dasharray:none;stroke-opacity:1"
         d="m 153.71949,74.250005 1.73205,1 v -2.000007 l -1.73205,-1 z"
         id="path6925" />
      <path
         style="fill:#b2b2b2;fill-opacity:1;stroke:#666666;stroke-width:0.454545;stroke-linecap:round;stroke-linejoin:round;stroke-dasharray:none;stroke-opacity:1"
         d="m 155.45154,75.250001 c 0,0 11.25833,-6.499996 13.85641,-8 2.49999,-1.443377 3.4641,-9.999999 6.06218,-11.499993 2.59808,-1.500002 8.0829,-4.666673 12.12435,-7.000005 v -1.999999 l -12.99038,7.5 C 171.90603,55.75 171.04,64.250005 168.44192,65.750006 l -12.99038,7.499995 z"
         id="path6927" />
      <path
         style="fill:#b2b2b2;fill-opacity:1;stroke:#666666;stroke-width:0.454545;stroke-linecap:round;stroke-linejoin:round;stroke-dasharray:none;stroke-opacity:1"
         d="m 155.45154,73.250001 12.99037,-7.499996 c 2.7538,-1.589906 3.46412,-10.000001 6.0622,-11.500003 2.59808,-1.499995 8.66025,-4.999997 12.99038,-7.5 l -1.73205,-1 c 0,0 -10.39231,6.000005 -12.99038,7.5 -2.59808,1.5 -3.56219,10.056621 -6.0622,11.500003 l -12.99037,7.499996 z"
         id="path6929" />
      <path
         style="fill:#b2b2b2;fill-opacity:1;stroke:#666666;stroke-width:0.454545;stroke-linecap:round;stroke-linejoin:round;stroke-dasharray:none;stroke-opacity:1"
         d="m 127.73874,57.250001 12.99037,-7.499997 c 2.75379,-1.589903 17.32051,-2.000001 19.91859,-3.500003 2.59808,-1.499995 8.66026,-4.999997 12.99039,-7.5 l -1.73205,-1 -12.99039,7.5 c -2.59808,1.500001 -17.41859,2.056626 -19.91859,3.500003 l -12.99037,7.499997 z"
         id="path7403" />
      <path
         style="fill:#b2b2b2;fill-opacity:1;stroke:#666666;stroke-width:0.454545;stroke-linecap:round;stroke-linejoin:round;stroke-dasharray:none;stroke-opacity:1"
         d="m 126.00669,58.250009 1.73205,1 v -2.000008 l -1.73205,-1 z"
         id="path7405" />
      <path
         style="fill:#b2b2b2;fill-opacity:1;stroke:#666666;stroke-width:0.454545;stroke-linecap:round;stroke-linejoin:round;stroke-dasharray:none;stroke-opacity:1"
         d="m 127.73874,59.250001 c 0,0 11.25833,-6.499996 13.85641,-8 2.49999,-1.443377 17.3205,-2.000002 19.91858,-3.499996 L 173.63809,40.75 v -1.999999 l -12.99039,7.5 c -2.59807,1.499996 -17.3205,2.000004 -19.91858,3.500005 l -12.99038,7.499995 z"
         id="path7407" />
      <path
         style="fill:#b2b2b2;fill-opacity:1;stroke:#666666;stroke-width:0.454545;stroke-linecap:round;stroke-linejoin:round;stroke-dasharray:none;stroke-opacity:1"
         d="m 141.59516,65.249998 38.97113,-22.499996 -1.73205,-1 -38.97113,22.499997 z"
         id="path7409" />
      <path
         style="fill:#b2b2b2;fill-opacity:1;stroke:#666666;stroke-width:0.454545;stroke-linecap:round;stroke-linejoin:round;stroke-dasharray:none;stroke-opacity:1"
         d="m 139.86309,66.250005 1.73205,1 v -2.000007 l -1.73205,-1 z"
         id="path7411" />
      <path
         style="fill:#b2b2b2;fill-opacity:1;stroke:#666666;stroke-width:0.454545;stroke-linecap:round;stroke-linejoin:round;stroke-dasharray:none;stroke-opacity:1"
         d="m 141.59514,67.250001 38.97115,-22.5 v -1.999999 l -38.97115,22.499999 z"
         id="path7413" />
    </g>
    <path
       d="M 95.966349,10.333634 93.466341,8.8902533 94.212158,8.4596579 q 0.252539,-0.1458072 0.421294,-0.2018511 0.235491,-0.078923 0.496574,-0.079952 0.338443,-0.00246 0.683527,0.099619 0.344865,0.100203 0.67911,0.2931786 0.284793,0.1644243 0.447162,0.3247002 0.162372,0.1602663 0.217257,0.2959605 0.05316,0.1347144 0.02892,0.2452032 -0.02445,0.1086624 -0.133959,0.2210919 -0.107967,0.1116075 -0.304395,0.225012 z m -0.0089,-0.3357489 0.462249,-0.2668791 q 0.21414,-0.1236363 0.289209,-0.2201364 0.07653,-0.097347 0.06534,-0.1873773 Q 96.758487,9.1967228 96.616758,9.0501086 96.474861,8.9016581 96.191772,8.7382142 95.799552,8.5117664 95.477556,8.4554603 95.15534,8.3973275 94.924205,8.4480353 94.757826,8.4850118 94.502336,8.632502 l -0.454865,0.2626173 z"
       id="path65692"
       style="font-size:3.52778px;line-height:1.25;stroke-width:0.523875" />
    <path
       d="m 104.03755,15.286394 0.24293,-0.171814 q 0.2068,0.09722 0.39729,0.127046 0.19028,0.02802 0.41297,-0.01396 0.22105,-0.04297 0.40566,-0.1495 0.16393,-0.09464 0.23323,-0.199584 0.0693,-0.10494 0.0326,-0.196049 -0.0368,-0.09296 -0.1528,-0.159895 -0.11767,-0.06791 -0.26371,-0.08405 -0.14777,-0.01713 -0.3433,0.02693 -0.12634,0.02762 -0.50654,0.152648 -0.38187,0.123987 -0.57485,0.150717 -0.24882,0.03544 -0.46378,-2.9e-5 -0.2152,-0.03722 -0.38744,-0.13667 -0.18929,-0.109286 -0.25996,-0.257529 -0.0724,-0.149213 0.0211,-0.301613 0.0935,-0.152391 0.31204,-0.278586 0.24072,-0.138976 0.51423,-0.192525 0.27332,-0.05534 0.54618,-0.01208 0.27289,0.04326 0.50026,0.166052 l -0.25083,0.172359 q -0.25916,-0.124076 -0.50875,-0.11978 -0.24809,0.004 -0.49768,0.14752 -0.25992,0.150074 -0.26871,0.28313 -0.009,0.131225 0.14618,0.22083 0.13472,0.07781 0.30589,0.0794 0.16975,0.002 0.6103,-0.1456 0.44041,-0.149896 0.63857,-0.185555 0.28965,-0.05108 0.53493,-0.01346 0.24355,0.03663 0.44479,0.152786 0.19951,0.115187 0.27793,0.274715 0.0767,0.158539 -0.0105,0.323077 -0.0874,0.162716 -0.31925,0.296584 -0.2939,0.169676 -0.59217,0.227681 -0.29679,0.05712 -0.60835,0.0089 -0.31176,-0.05039 -0.56835,-0.191714 z"
       id="path65694"
       style="font-size:3.52778px;line-height:1.25;stroke-width:0.523875" />
    <path
       d="m 100.1348,12.040626 -0.293303,-0.16934 0.915143,-0.53065 0.9277,0.53561 q -0.0168,0.234175 -0.14236,0.420884 -0.12726,0.185729 -0.36356,0.322156 -0.319,0.184174 -0.73728,0.24452 -0.41852,0.0585 -0.849867,-0.03708 -0.431352,-0.09556 -0.799701,-0.308231 -0.364947,-0.210697 -0.548988,-0.468731 -0.184269,-0.25987 -0.08969,-0.491723 0.09464,-0.231858 0.418068,-0.418591 0.234819,-0.135576 0.512553,-0.193501 0.277539,-0.05976 0.542205,-0.03143 0.264687,0.02831 0.57319,0.14165 l -0.17657,0.19649 q -0.239687,-0.08215 -0.421232,-0.103371 -0.181497,-0.02124 -0.380703,0.01896 -0.200922,0.0392 -0.364857,0.133828 -0.196425,0.113405 -0.269784,0.236462 -0.07504,0.122092 -0.05108,0.238233 0.02544,0.115291 0.111396,0.221211 0.149181,0.181665 0.420333,0.338214 0.334245,0.192975 0.658281,0.265805 0.325536,0.07198 0.625186,0.025 0.29966,-0.04698 0.51381,-0.170612 0.18608,-0.107435 0.28144,-0.257024 0.0936,-0.150559 0.0914,-0.257583 l -0.46555,-0.268787 z"
       id="path65696"
       style="font-size:3.52778px;line-height:1.25;stroke-width:0.523875" />
  </g>
</svg>
