<?xml version="1.0" encoding="UTF-8" standalone="no"?>
<!-- Created with Inkscape (http://www.inkscape.org/) -->

<svg
   width="70.973961mm"
   height="49.724426mm"
   viewBox="0 0 70.973961 49.724426"
   version="1.1"
   id="svg12618"
   xmlns="http://www.w3.org/2000/svg"
   xmlns:svg="http://www.w3.org/2000/svg">
  <defs
     id="defs12615" />
  <g
     id="layer1"
     transform="translate(-52.02871,-94.64872)">
    <path
       style="fill:none;stroke:#000000;stroke-width:0.396875;stroke-linecap:round;stroke-linejoin:round;stroke-miterlimit:4;stroke-dasharray:none;stroke-opacity:1"
       d="m 72.046939,109.7288 v -2.8125 h 5.625 v 2.8125 z"
       id="path3177" />
    <path
       id="path3179"
       d="m 63.609439,109.7288 v -2.8125 h 5.624999 v 2.8125 z"
       style="fill:none;stroke:#000000;stroke-width:0.396875;stroke-linecap:round;stroke-linejoin:round;stroke-miterlimit:4;stroke-dasharray:none;stroke-opacity:1" />
    <path
       style="fill:none;stroke:#000000;stroke-width:0.396875;stroke-linecap:round;stroke-linejoin:round;stroke-miterlimit:4;stroke-dasharray:none;stroke-opacity:1"
       d="m 55.171939,109.7288 v -2.8125 h 5.625 v 2.8125 z"
       id="path3181" />
    <path
       id="path3183"
       d="m 97.35944,109.7288 v -2.8125 h 5.625 v 2.8125 z"
       style="fill:none;stroke:#000000;stroke-width:0.396875;stroke-linecap:round;stroke-linejoin:round;stroke-miterlimit:4;stroke-dasharray:none;stroke-opacity:1" />
    <path
       style="fill:none;stroke:#000000;stroke-width:0.396875;stroke-linecap:round;stroke-linejoin:round;stroke-miterlimit:4;stroke-dasharray:none;stroke-opacity:1"
       d="m 88.921938,109.7288 v -2.8125 h 5.624999 v 2.8125 z"
       id="path3185" />
    <path
       id="path3187"
       d="m 80.484436,109.7288 v -2.8125 h 5.625002 v 2.8125 z"
       style="fill:none;stroke:#000000;stroke-width:0.396875;stroke-linecap:round;stroke-linejoin:round;stroke-miterlimit:4;stroke-dasharray:none;stroke-opacity:1" />
    <path
       style="fill:none;stroke:#000000;stroke-width:0.396875;stroke-linecap:round;stroke-linejoin:round;stroke-miterlimit:4;stroke-dasharray:none;stroke-opacity:1"
       d="m 105.79694,109.7288 v -2.8125 h 5.625 v 2.8125 z"
       id="path3189" />
    <path
       style="fill:none;stroke:#000000;stroke-width:0.661458;stroke-linecap:round;stroke-linejoin:round;stroke-miterlimit:4;stroke-dasharray:none;stroke-opacity:1"
       d="m 52.359439,109.7288 h 70.312501 v 28.125 H 52.359439 Z"
       id="path3191" />
    <path
       style="fill:none;stroke:#000000;stroke-width:0.661458;stroke-linecap:round;stroke-linejoin:round;stroke-miterlimit:4;stroke-dasharray:none;stroke-opacity:1"
       d="m 52.359439,121.45139 v 4.67982 c 1.294417,0 2.339909,-1.04549 2.339909,-2.33991 0,-1.29441 -1.045492,-2.33991 -2.339909,-2.33991 z"
       id="path3193" />
    <path
       id="path3195"
       style="fill:none;stroke:#000000;stroke-width:0.396875;stroke-linecap:butt;stroke-linejoin:miter;stroke-miterlimit:4;stroke-dasharray:none;stroke-opacity:1"
       d="m 63.609439,123.7913 h -5.625 v 14.0625" />
    <path
       id="path3197"
       d="m 72.046939,140.66628 v -2.81248 h 5.625 v 2.81248 z"
       style="fill:none;stroke:#000000;stroke-width:0.396875;stroke-linecap:round;stroke-linejoin:round;stroke-miterlimit:4;stroke-dasharray:none;stroke-opacity:1" />
    <path
       style="fill:none;stroke:#000000;stroke-width:0.396875;stroke-linecap:round;stroke-linejoin:round;stroke-miterlimit:4;stroke-dasharray:none;stroke-opacity:1"
       d="m 63.609439,140.66628 v -2.81248 h 5.624999 v 2.81248 z"
       id="path3199" />
    <path
       id="path3201"
       d="m 55.171939,140.66628 v -2.81248 h 5.625 v 2.81248 z"
       style="fill:none;stroke:#000000;stroke-width:0.396875;stroke-linecap:round;stroke-linejoin:round;stroke-miterlimit:4;stroke-dasharray:none;stroke-opacity:1" />
    <path
       style="fill:none;stroke:#000000;stroke-width:0.396875;stroke-linecap:round;stroke-linejoin:round;stroke-miterlimit:4;stroke-dasharray:none;stroke-opacity:1"
       d="m 97.35944,140.66628 v -2.81248 h 5.625 v 2.81248 z"
       id="path3203" />
    <path
       id="path3205"
       d="m 88.921938,140.66628 v -2.81248 h 5.624999 v 2.81248 z"
       style="fill:none;stroke:#000000;stroke-width:0.396875;stroke-linecap:round;stroke-linejoin:round;stroke-miterlimit:4;stroke-dasharray:none;stroke-opacity:1" />
    <path
       style="fill:none;stroke:#000000;stroke-width:0.396875;stroke-linecap:round;stroke-linejoin:round;stroke-miterlimit:4;stroke-dasharray:none;stroke-opacity:1"
       d="m 80.484436,140.66628 v -2.81248 h 5.625002 v 2.81248 z"
       id="path3207" />
    <path
       id="path3209"
       d="m 105.79694,140.66628 v -2.81248 h 5.625 v 2.81248 z"
       style="fill:none;stroke:#000000;stroke-width:0.396875;stroke-linecap:round;stroke-linejoin:round;stroke-miterlimit:4;stroke-dasharray:none;stroke-opacity:1" />
    <path
       style="fill:none;stroke:#000000;stroke-width:0.396875;stroke-linecap:round;stroke-linejoin:round;stroke-miterlimit:4;stroke-dasharray:none;stroke-opacity:1"
       d="m 114.23444,140.66628 v -2.81248 h 5.625 v 2.81248 z"
       id="path3211" />
    <path
       id="path3217"
       d="m 114.23444,109.7288 v -2.8125 h 5.625 v 2.8125 z"
       style="fill:none;stroke:#000000;stroke-width:0.396875;stroke-linecap:round;stroke-linejoin:round;stroke-miterlimit:4;stroke-dasharray:none;stroke-opacity:1" />
    <path
       id="path3223"
       d="m 63.609439,131.2913 h 47.812501 v -15 h -47.8125 z"
       style="fill:none;stroke:#000000;stroke-width:0.396875;stroke-linecap:round;stroke-linejoin:round;stroke-miterlimit:4;stroke-dasharray:none;stroke-opacity:1" />
    <path
       id="path3225"
       d="m 91.734438,137.8538 v -6.5625"
       style="fill:none;stroke:#000000;stroke-width:0.396875;stroke-linecap:butt;stroke-linejoin:miter;stroke-miterlimit:4;stroke-dasharray:none;stroke-opacity:1" />
    <path
       id="path3227"
       d="m 111.42194,123.7913 h 5.625 v -14.0625"
       style="fill:none;stroke:#000000;stroke-width:0.396875;stroke-linecap:butt;stroke-linejoin:miter;stroke-miterlimit:4;stroke-dasharray:none;stroke-opacity:1" />
    <path
       id="path3229"
       d="m 91.734438,109.7288 v 6.5625"
       style="fill:none;stroke:#000000;stroke-width:0.396875;stroke-linecap:butt;stroke-linejoin:miter;stroke-miterlimit:4;stroke-dasharray:none;stroke-opacity:1" />
    <path
       id="path3231"
       d="m 111.42194,122.8538 -1.875,0.9375 1.875,0.9375"
       style="fill:none;stroke:#000000;stroke-width:0.396875;stroke-linecap:butt;stroke-linejoin:miter;stroke-miterlimit:4;stroke-dasharray:none;stroke-opacity:1" />
    <path
       id="path3233"
       d="m 66.421939,137.8538 v -6.5625"
       style="fill:none;stroke:#000000;stroke-width:0.396875;stroke-linecap:butt;stroke-linejoin:miter;stroke-miterlimit:4;stroke-dasharray:none;stroke-opacity:1" />
    <path
       id="path3235"
       d="m 74.85944,137.8538 v -6.5625"
       style="fill:none;stroke:#000000;stroke-width:0.396875;stroke-linecap:butt;stroke-linejoin:miter;stroke-miterlimit:4;stroke-dasharray:none;stroke-opacity:1" />
    <path
       id="path3237"
       d="m 83.296939,137.8538 v -6.5625"
       style="fill:none;stroke:#000000;stroke-width:0.396875;stroke-linecap:butt;stroke-linejoin:miter;stroke-miterlimit:4;stroke-dasharray:none;stroke-opacity:1" />
    <path
       id="path3239"
       d="m 100.17194,137.8538 v -6.5625"
       style="fill:none;stroke:#000000;stroke-width:0.396875;stroke-linecap:butt;stroke-linejoin:miter;stroke-miterlimit:4;stroke-dasharray:none;stroke-opacity:1" />
    <path
       id="path3241"
       d="m 108.60944,137.8538 v -6.5625"
       style="fill:none;stroke:#000000;stroke-width:0.396875;stroke-linecap:butt;stroke-linejoin:miter;stroke-miterlimit:4;stroke-dasharray:none;stroke-opacity:1" />
    <path
       id="path3247"
       d="m 66.421939,109.7288 v 6.5625"
       style="fill:none;stroke:#000000;stroke-width:0.396875;stroke-linecap:butt;stroke-linejoin:miter;stroke-miterlimit:4;stroke-dasharray:none;stroke-opacity:1" />
    <path
       id="path3249"
       d="m 74.85944,109.7288 v 6.5625"
       style="fill:none;stroke:#000000;stroke-width:0.396875;stroke-linecap:butt;stroke-linejoin:miter;stroke-miterlimit:4;stroke-dasharray:none;stroke-opacity:1" />
    <path
       id="path3251"
       d="m 83.296939,109.7288 v 6.5625"
       style="fill:none;stroke:#000000;stroke-width:0.396875;stroke-linecap:butt;stroke-linejoin:miter;stroke-miterlimit:4;stroke-dasharray:none;stroke-opacity:1" />
    <path
       id="path3253"
       d="m 100.17194,109.7288 v 6.5625"
       style="fill:none;stroke:#000000;stroke-width:0.396875;stroke-linecap:butt;stroke-linejoin:miter;stroke-miterlimit:4;stroke-dasharray:none;stroke-opacity:1" />
    <path
       id="path3255"
       d="m 108.60944,109.7288 v 6.5625"
       style="fill:none;stroke:#000000;stroke-width:0.396875;stroke-linecap:butt;stroke-linejoin:miter;stroke-miterlimit:4;stroke-dasharray:none;stroke-opacity:1" />
    <text
       xml:space="preserve"
       style="font-style:normal;font-variant:normal;font-weight:normal;font-stretch:normal;font-size:3.175px;line-height:0%;font-family:sans-serif;-inkscape-font-specification:Sans;text-align:center;letter-spacing:0px;word-spacing:0px;writing-mode:lr-tb;text-anchor:middle;fill:#000000;fill-opacity:1;stroke:#000000;stroke-width:0.0529167;stroke-miterlimit:4;stroke-dasharray:none;stroke-opacity:1"
       x="87.502609"
       y="122.46145"
       id="text3285"><tspan
         y="122.46145"
         x="87.502609"
         id="tspan3287"
         style="font-size:3.57187px;line-height:1.25;font-family:sans-serif;stroke-width:0.0529167">Hex edge-triggered</tspan><tspan
         y="126.92628"
         x="87.502609"
         id="tspan3473"
         style="font-size:3.57187px;line-height:1.25;font-family:sans-serif;stroke-width:0.0529167">D-type flip-flops</tspan></text>
    <text
       xml:space="preserve"
       style="font-style:normal;font-variant:normal;font-weight:normal;font-stretch:normal;font-size:3.175px;line-height:0%;font-family:sans-serif;-inkscape-font-specification:Sans;text-align:start;letter-spacing:0px;word-spacing:0px;writing-mode:lr-tb;text-anchor:start;fill:#000000;fill-opacity:1;stroke:#000000;stroke-width:0.0529167;stroke-miterlimit:4;stroke-dasharray:none;stroke-opacity:1"
       x="54.711864"
       y="136.8786"
       id="text3261"><tspan
         id="tspan3263"
         x="54.711864"
         y="136.8786"
         style="font-size:2.64583px;line-height:1.25;font-family:sans-serif;stroke-width:0.0529167">1</tspan></text>
    <text
       id="text3265"
       y="136.86346"
       x="116.31571"
       style="font-style:normal;font-variant:normal;font-weight:normal;font-stretch:normal;font-size:3.175px;line-height:0%;font-family:sans-serif;-inkscape-font-specification:Sans;text-align:start;letter-spacing:0px;word-spacing:0px;writing-mode:lr-tb;text-anchor:start;fill:#000000;fill-opacity:1;stroke:#000000;stroke-width:0.0529167;stroke-miterlimit:4;stroke-dasharray:none;stroke-opacity:1"
       xml:space="preserve"><tspan
         y="136.86346"
         x="116.31571"
         id="tspan3267"
         style="font-size:2.64583px;line-height:1.25;font-family:sans-serif;stroke-width:0.0529167">8</tspan></text>
    <text
       xml:space="preserve"
       style="font-style:normal;font-variant:normal;font-weight:normal;font-stretch:normal;font-size:3.175px;line-height:0%;font-family:sans-serif;-inkscape-font-specification:Sans;text-align:start;letter-spacing:0px;word-spacing:0px;writing-mode:lr-tb;text-anchor:start;fill:#000000;fill-opacity:1;stroke:#000000;stroke-width:0.0529167;stroke-miterlimit:4;stroke-dasharray:none;stroke-opacity:1"
       x="118.6762"
       y="112.58296"
       id="text3269"><tspan
         y="112.58296"
         x="118.6762"
         id="tspan3271"
         style="font-size:2.64583px;line-height:1.25;font-family:sans-serif;stroke-width:0.0529167">9</tspan></text>
    <text
       id="text3273"
       y="112.58295"
       x="56.428978"
       style="font-style:normal;font-variant:normal;font-weight:normal;font-stretch:normal;font-size:3.175px;line-height:0%;font-family:sans-serif;-inkscape-font-specification:Sans;text-align:start;letter-spacing:0px;word-spacing:0px;writing-mode:lr-tb;text-anchor:start;fill:#000000;fill-opacity:1;stroke:#000000;stroke-width:0.0529167;stroke-miterlimit:4;stroke-dasharray:none;stroke-opacity:1"
       xml:space="preserve"><tspan
         y="112.58295"
         x="56.428978"
         id="tspan3275"
         style="font-size:2.64583px;line-height:1.25;font-family:sans-serif;stroke-width:0.0529167">16</tspan></text>
    <text
       xml:space="preserve"
       style="font-style:normal;font-variant:normal;font-weight:normal;font-stretch:normal;font-size:3.175px;line-height:0%;font-family:sans-serif;-inkscape-font-specification:Sans;text-align:start;letter-spacing:0px;word-spacing:0px;writing-mode:lr-tb;text-anchor:start;fill:#000000;fill-opacity:1;stroke:#000000;stroke-width:0.0529167;stroke-miterlimit:4;stroke-dasharray:none;stroke-opacity:1"
       x="55.124279"
       y="105.96748"
       id="text3277"><tspan
         id="tspan3279"
         x="55.124279"
         y="105.96748"
         style="font-size:3.43958px;line-height:1.25;font-family:sans-serif;stroke-width:0.0529167">Vcc</tspan></text>
    <text
       xml:space="preserve"
       style="font-style:normal;font-variant:normal;font-weight:normal;font-stretch:normal;font-size:3.175px;line-height:0%;font-family:sans-serif;-inkscape-font-specification:Sans;text-align:start;letter-spacing:0px;word-spacing:0px;writing-mode:lr-tb;text-anchor:start;fill:#000000;fill-opacity:1;stroke:#000000;stroke-width:0.0529167;stroke-miterlimit:4;stroke-dasharray:none;stroke-opacity:1"
       x="113.22527"
       y="144.15523"
       id="text3281"><tspan
         id="tspan3283"
         x="113.22527"
         y="144.15523"
         style="font-size:3.43958px;line-height:1.25;font-family:sans-serif;stroke-width:0.0529167">GND</tspan></text>
    <text
       xml:space="preserve"
       style="font-style:normal;font-variant:normal;font-weight:normal;font-stretch:normal;font-size:3.175px;line-height:0%;font-family:sans-serif;-inkscape-font-specification:Sans;text-align:start;letter-spacing:0px;word-spacing:0px;writing-mode:lr-tb;text-anchor:start;fill:#000000;fill-opacity:1;stroke:#000000;stroke-width:0.0529167;stroke-miterlimit:4;stroke-dasharray:none;stroke-opacity:1"
       x="64.137001"
       y="144.12863"
       id="text3289"><tspan
         y="144.12863"
         x="64.137001"
         id="tspan3291"
         style="font-size:3.43958px;line-height:1.25;font-family:sans-serif;stroke-width:0.0529167">Q0</tspan></text>
    <text
       id="text3293"
       y="144.15523"
       x="72.609772"
       style="font-style:normal;font-variant:normal;font-weight:normal;font-stretch:normal;font-size:3.175px;line-height:0%;font-family:sans-serif;-inkscape-font-specification:Sans;text-align:start;letter-spacing:0px;word-spacing:0px;writing-mode:lr-tb;text-anchor:start;fill:#000000;fill-opacity:1;stroke:#000000;stroke-width:0.0529167;stroke-miterlimit:4;stroke-dasharray:none;stroke-opacity:1"
       xml:space="preserve"><tspan
         y="144.15523"
         x="72.609772"
         id="tspan3295"
         style="font-size:3.43958px;line-height:1.25;font-family:sans-serif;stroke-width:0.0529167">D0</tspan></text>
    <text
       xml:space="preserve"
       style="font-style:normal;font-variant:normal;font-weight:normal;font-stretch:normal;font-size:3.175px;line-height:0%;font-family:sans-serif;-inkscape-font-specification:Sans;text-align:start;letter-spacing:0px;word-spacing:0px;writing-mode:lr-tb;text-anchor:start;fill:#000000;fill-opacity:1;stroke:#000000;stroke-width:0.0529167;stroke-miterlimit:4;stroke-dasharray:none;stroke-opacity:1"
       x="81.280716"
       y="144.15523"
       id="text3297"><tspan
         y="144.15523"
         x="81.280716"
         id="tspan3299"
         style="font-size:3.43958px;line-height:1.25;font-family:sans-serif;stroke-width:0.0529167">D1</tspan></text>
    <text
       id="text3301"
       y="144.15523"
       x="89.682945"
       style="font-style:normal;font-variant:normal;font-weight:normal;font-stretch:normal;font-size:3.175px;line-height:0%;font-family:sans-serif;-inkscape-font-specification:Sans;text-align:start;letter-spacing:0px;word-spacing:0px;writing-mode:lr-tb;text-anchor:start;fill:#000000;fill-opacity:1;stroke:#000000;stroke-width:0.0529167;stroke-miterlimit:4;stroke-dasharray:none;stroke-opacity:1"
       xml:space="preserve"><tspan
         y="144.15523"
         x="89.682945"
         id="tspan3303"
         style="font-size:3.43958px;line-height:1.25;font-family:sans-serif;stroke-width:0.0529167">Q1</tspan></text>
    <text
       xml:space="preserve"
       style="font-style:normal;font-variant:normal;font-weight:normal;font-stretch:normal;font-size:3.175px;line-height:0%;font-family:sans-serif;-inkscape-font-specification:Sans;text-align:start;letter-spacing:0px;word-spacing:0px;writing-mode:lr-tb;text-anchor:start;fill:#000000;fill-opacity:1;stroke:#000000;stroke-width:0.0529167;stroke-miterlimit:4;stroke-dasharray:none;stroke-opacity:1"
       x="97.930672"
       y="144.15523"
       id="text3305"><tspan
         y="144.15523"
         x="97.930672"
         id="tspan3307"
         style="font-size:3.43958px;line-height:1.25;font-family:sans-serif;stroke-width:0.0529167">D2</tspan></text>
    <text
       id="text3309"
       y="144.15523"
       x="106.3329"
       style="font-style:normal;font-variant:normal;font-weight:normal;font-stretch:normal;font-size:3.175px;line-height:0%;font-family:sans-serif;-inkscape-font-specification:Sans;text-align:start;letter-spacing:0px;word-spacing:0px;writing-mode:lr-tb;text-anchor:start;fill:#000000;fill-opacity:1;stroke:#000000;stroke-width:0.0529167;stroke-miterlimit:4;stroke-dasharray:none;stroke-opacity:1"
       xml:space="preserve"><tspan
         y="144.15523"
         x="106.3329"
         id="tspan3311"
         style="font-size:3.43958px;line-height:1.25;font-family:sans-serif;stroke-width:0.0529167">Q2</tspan></text>
    <text
       id="text3321"
       y="105.96736"
       x="64.123566"
       style="font-style:normal;font-variant:normal;font-weight:normal;font-stretch:normal;font-size:3.175px;line-height:0%;font-family:sans-serif;-inkscape-font-specification:Sans;text-align:start;letter-spacing:0px;word-spacing:0px;writing-mode:lr-tb;text-anchor:start;fill:#000000;fill-opacity:1;stroke:#000000;stroke-width:0.0529167;stroke-miterlimit:4;stroke-dasharray:none;stroke-opacity:1"
       xml:space="preserve"><tspan
         y="105.96736"
         x="64.123566"
         id="tspan3323"
         style="font-size:3.43958px;line-height:1.25;font-family:sans-serif;stroke-width:0.0529167">Q5</tspan></text>
    <text
       id="text3325"
       y="105.96736"
       x="72.596336"
       style="font-style:normal;font-variant:normal;font-weight:normal;font-stretch:normal;font-size:3.175px;line-height:0%;font-family:sans-serif;-inkscape-font-specification:Sans;text-align:start;letter-spacing:0px;word-spacing:0px;writing-mode:lr-tb;text-anchor:start;fill:#000000;fill-opacity:1;stroke:#000000;stroke-width:0.0529167;stroke-miterlimit:4;stroke-dasharray:none;stroke-opacity:1"
       xml:space="preserve"><tspan
         y="105.96736"
         x="72.596336"
         id="tspan3327"
         style="font-size:3.43958px;line-height:1.25;font-family:sans-serif;stroke-width:0.0529167">D5</tspan></text>
    <text
       xml:space="preserve"
       style="font-style:normal;font-variant:normal;font-weight:normal;font-stretch:normal;font-size:3.175px;line-height:0%;font-family:sans-serif;-inkscape-font-specification:Sans;text-align:start;letter-spacing:0px;word-spacing:0px;writing-mode:lr-tb;text-anchor:start;fill:#000000;fill-opacity:1;stroke:#000000;stroke-width:0.0529167;stroke-miterlimit:4;stroke-dasharray:none;stroke-opacity:1"
       x="81.033836"
       y="105.96736"
       id="text3329"><tspan
         y="105.96736"
         x="81.033836"
         id="tspan3331"
         style="font-size:3.43958px;line-height:1.25;font-family:sans-serif;stroke-width:0.0529167">D5</tspan></text>
    <text
       xml:space="preserve"
       style="font-style:normal;font-variant:normal;font-weight:normal;font-stretch:normal;font-size:3.175px;line-height:0%;font-family:sans-serif;-inkscape-font-specification:Sans;text-align:start;letter-spacing:0px;word-spacing:0px;writing-mode:lr-tb;text-anchor:start;fill:#000000;fill-opacity:1;stroke:#000000;stroke-width:0.0529167;stroke-miterlimit:4;stroke-dasharray:none;stroke-opacity:1"
       x="89.436066"
       y="105.96736"
       id="text3333"><tspan
         y="105.96736"
         x="89.436066"
         id="tspan3335"
         style="font-size:3.43958px;line-height:1.25;font-family:sans-serif;stroke-width:0.0529167">Q5</tspan></text>
    <text
       id="text3337"
       y="105.96736"
       x="97.918076"
       style="font-style:normal;font-variant:normal;font-weight:normal;font-stretch:normal;font-size:3.175px;line-height:0%;font-family:sans-serif;-inkscape-font-specification:Sans;text-align:start;letter-spacing:0px;word-spacing:0px;writing-mode:lr-tb;text-anchor:start;fill:#000000;fill-opacity:1;stroke:#000000;stroke-width:0.0529167;stroke-miterlimit:4;stroke-dasharray:none;stroke-opacity:1"
       xml:space="preserve"><tspan
         y="105.96736"
         x="97.918076"
         id="tspan3339"
         style="font-size:3.43958px;line-height:1.25;font-family:sans-serif;stroke-width:0.0529167">D3</tspan></text>
    <text
       id="text3341"
       y="105.96736"
       x="106.3203"
       style="font-style:normal;font-variant:normal;font-weight:normal;font-stretch:normal;font-size:3.175px;line-height:0%;font-family:sans-serif;-inkscape-font-specification:Sans;text-align:start;letter-spacing:0px;word-spacing:0px;writing-mode:lr-tb;text-anchor:start;fill:#000000;fill-opacity:1;stroke:#000000;stroke-width:0.0529167;stroke-miterlimit:4;stroke-dasharray:none;stroke-opacity:1"
       xml:space="preserve"><tspan
         y="105.96736"
         x="106.3203"
         id="tspan3343"
         style="font-size:3.43958px;line-height:1.25;font-family:sans-serif;stroke-width:0.0529167">Q3</tspan></text>
    <text
       id="text3353"
       y="105.96736"
       x="114.64612"
       style="font-style:normal;font-variant:normal;font-weight:normal;font-stretch:normal;font-size:3.175px;line-height:0%;font-family:sans-serif;-inkscape-font-specification:Sans;text-align:start;letter-spacing:0px;word-spacing:0px;writing-mode:lr-tb;text-anchor:start;fill:#000000;fill-opacity:1;stroke:#000000;stroke-width:0.0529167;stroke-miterlimit:4;stroke-dasharray:none;stroke-opacity:1"
       xml:space="preserve"><tspan
         y="105.96736"
         x="114.64612"
         id="tspan3355"
         style="font-size:3.43958px;line-height:1.25;font-family:sans-serif;stroke-width:0.0529167">CP</tspan></text>
    <text
       id="text3365"
       y="100.3538"
       x="80.649826"
       style="font-style:normal;font-variant:normal;font-weight:normal;font-stretch:normal;font-size:3.175px;line-height:0%;font-family:sans-serif;-inkscape-font-specification:Sans;text-align:start;letter-spacing:0px;word-spacing:0px;writing-mode:lr-tb;text-anchor:start;fill:#000000;fill-opacity:1;stroke:none;stroke-width:0.264583"
       xml:space="preserve"><tspan
         y="100.3538"
         x="80.649826"
         id="tspan3367"
         style="font-size:7.9375px;line-height:1.25;font-family:sans-serif;stroke-width:0.264583">174</tspan></text>
    <path
       style="fill:#ffffff;fill-opacity:1;stroke:#000000;stroke-width:0.396875;stroke-linecap:round;stroke-linejoin:round;stroke-miterlimit:4;stroke-dasharray:none;stroke-opacity:1"
       d="m 62.182707,123.7913 c 0,0.39399 0.319387,0.71337 0.713365,0.71337 0.393972,0 0.713367,-0.31938 0.713367,-0.71337 0,-0.39396 -0.319395,-0.71334 -0.713367,-0.71334 -0.393978,0 -0.713365,0.31938 -0.713365,0.71334 z"
       id="path3369" />
    <g
       id="g4751"
       transform="matrix(0.26458333,0,0,0.26458333,46.017581,-70.271184)">
      <text
         xml:space="preserve"
         style="font-style:normal;font-variant:normal;font-weight:normal;font-stretch:normal;line-height:0%;font-family:sans-serif;-inkscape-font-specification:Sans;text-align:start;letter-spacing:0px;word-spacing:0px;writing-mode:lr-tb;text-anchor:start;fill:#000000;fill-opacity:1;stroke:#000000;stroke-width:0.2;stroke-miterlimit:4;stroke-dasharray:none;stroke-opacity:1"
         x="32.054993"
         y="810.43048"
         id="text4742"><tspan
           id="tspan4744"
           x="32.054993"
           y="810.43048"
           style="font-size:13px;line-height:1.25;font-family:sans-serif;stroke-width:0.2">CLR</tspan></text>
      <path
         style="fill:none;stroke:#000000;stroke-width:1px;stroke-linecap:butt;stroke-linejoin:miter;stroke-opacity:1"
         d="M 32.58884,799.44316 H 57.869297"
         id="path4746" />
    </g>
  </g>
</svg>
