<?xml version="1.0" encoding="UTF-8" standalone="no"?>
<!-- Created with Inkscape (http://www.inkscape.org/) -->

<svg
   width="146.88643mm"
   height="97.872505mm"
   viewBox="0 0 146.88643 97.872505"
   version="1.1"
   id="svg88786"
   xmlns="http://www.w3.org/2000/svg"
   xmlns:svg="http://www.w3.org/2000/svg">
  <defs
     id="defs88783" />
  <g
     id="layer1"
     transform="translate(-54.816894,-56.69949)">
    <g
       id="g21528"
       transform="translate(71.953642,129.69946)">
      <path
         style="fill:none;stroke:#000000;stroke-width:0.7;stroke-linecap:butt;stroke-linejoin:miter;stroke-miterlimit:4;stroke-dasharray:none;stroke-opacity:1"
         d="m 22,20 h 6"
         id="path21522" />
      <path
         id="path21524"
         style="fill:#000000;fill-opacity:1;stroke:none;stroke-width:1.04298;stroke-linecap:butt;stroke-linejoin:miter;stroke-miterlimit:4;stroke-dasharray:none;stroke-opacity:1"
         d="m 25,15 h 0.89999 m 0,0 c 0,-0.497031 -0.402929,-0.899964 -0.89999,-0.899964 -0.497017,0 -0.90001,0.402933 -0.90001,0.899964 0,0.497032 0.402929,0.899966 0.899949,0.899966 0.49706,0 0.900051,-0.402934 0.900051,-0.899966 z" />
      <path
         style="fill:none;stroke:#000000;stroke-width:0.4;stroke-linecap:butt;stroke-linejoin:miter;stroke-dasharray:none;stroke-opacity:1"
         d="m 25,15 v 5"
         id="path21526" />
    </g>
    <path
       style="fill:none;stroke:#000000;stroke-width:0.4;stroke-linecap:butt;stroke-linejoin:miter;stroke-dasharray:none;stroke-opacity:1"
       d="m 81.953642,66.69946 v 38.30116"
       id="path21538" />
    <path
       style="fill:none;stroke:#000000;stroke-width:0.4;stroke-linecap:butt;stroke-linejoin:miter;stroke-dasharray:none;stroke-opacity:1"
       d="m 81.953642,106.50851 v 38.19095 h 15"
       id="path21540" />
    <g
       id="g39517"
       transform="translate(51.953642,-96.68746)">
      <g
         id="g21534"
         transform="rotate(90,-33.81846,78.81846)">
        <path
           style="fill:none;stroke:#000000;stroke-width:0.5;stroke-linecap:butt;stroke-linejoin:miter;stroke-miterlimit:4;stroke-dasharray:none;stroke-opacity:1"
           d="M 89,18 V 12"
           id="path21530" />
        <path
           style="fill:none;stroke:#000000;stroke-width:0.5;stroke-linecap:butt;stroke-linejoin:miter;stroke-miterlimit:4;stroke-dasharray:none;stroke-opacity:1"
           d="M 90.5,18 V 12"
           id="path21532" />
      </g>
      <path
         id="path21536"
         style="fill:none;stroke:#000000;stroke-width:0.405334;stroke-linecap:butt;stroke-linejoin:miter;stroke-miterlimit:4;stroke-dasharray:none;stroke-opacity:1"
         d="m 27.251422,199.78627 h 1.9 m -0.949999,0.95 v -1.9" />
      <path
         style="fill:none;stroke:#ffffff;stroke-width:0.4;stroke-linecap:butt;stroke-linejoin:miter;stroke-miterlimit:4;stroke-dasharray:none;stroke-opacity:1"
         d="m 27,202.38692 h 6"
         id="path21542" />
    </g>
    <g
       id="g21564"
       transform="rotate(-90,108.32655,51.372909)">
      <path
         id="path21560"
         style="fill:none;fill-opacity:0.5;stroke:#000000;stroke-width:0.5;stroke-linecap:round;stroke-linejoin:round;stroke-dasharray:none"
         d="m 15.999998,10 c 0,0.552285 -0.447715,1 -1,1 -0.552285,0 -1,-0.447715 -1,-1 0,-0.5522847 0.447715,-1 1,-1 0.552285,0 1,0.4477153 1,1 z" />
    </g>
    <g
       id="g21580"
       transform="rotate(90,61.627091,140.32655)">
      <path
         id="path21576"
         style="fill:none;fill-opacity:0.5;stroke:#000000;stroke-width:0.5;stroke-linecap:round;stroke-linejoin:round;stroke-dasharray:none"
         d="m 16,15 a 1,1 0 0 1 -1,1 1,1 0 0 1 -1,-1 1,1 0 0 1 1,-1 1,1 0 0 1 1,1 z" />
      <path
         style="fill:none;stroke:#000000;stroke-width:0.4;stroke-linecap:butt;stroke-linejoin:miter;stroke-dasharray:none;stroke-opacity:1"
         d="M 15,16 V 45"
         id="path21578" />
    </g>
    <path
       id="path21582"
       style="fill:#000000;fill-opacity:1;stroke:none;stroke-width:1.04298;stroke-linecap:butt;stroke-linejoin:miter;stroke-miterlimit:4;stroke-dasharray:none;stroke-opacity:1"
       d="m 96.953642,121.69946 h 0.89999 m 0,0 c 0,-0.49703 -0.40293,-0.89996 -0.89999,-0.89996 -0.49702,0 -0.90001,0.40293 -0.90001,0.89996 0,0.49703 0.40293,0.89997 0.89995,0.89997 0.49706,0 0.90005,-0.40294 0.90005,-0.89997 z" />
    <g
       aria-label="C2"
       id="text21590"
       style="font-size:3.88056px;line-height:125%;font-family:Sans;-inkscape-font-specification:Sans;letter-spacing:0px;word-spacing:0px;stroke:#000000;stroke-width:0">
      <path
         d="m 105.47904,70.67817 0.36759,0.09285 q -0.11558,0.452859 -0.41686,0.691604 -0.29938,0.236851 -0.73329,0.236851 -0.44907,0 -0.73139,-0.181902 -0.28043,-0.183796 -0.42823,-0.530545 -0.1459,-0.346749 -0.1459,-0.744658 0,-0.43391 0.16485,-0.756027 0.16674,-0.324012 0.47181,-0.490755 0.30696,-0.168637 0.67455,-0.168637 0.41685,0 0.70108,0.212218 0.28422,0.212218 0.39601,0.596863 l -0.36191,0.08527 q -0.0966,-0.303169 -0.28043,-0.44149 -0.1838,-0.138321 -0.46233,-0.138321 -0.32022,0 -0.53623,0.15348 -0.21411,0.153479 -0.30128,0.413067 -0.0872,0.257693 -0.0872,0.53244 0,0.354329 0.10232,0.619601 0.10422,0.263378 0.32212,0.39412 0.2179,0.130741 0.47181,0.130741 0.30885,0 0.52296,-0.178111 0.21412,-0.178112 0.28991,-0.528651 z"
         style="line-height:125%;font-family:sans-serif;-inkscape-font-specification:sans-serif"
         id="path92819" />
      <path
         d="M 107.95365,71.324298 V 71.6521 h -1.83606 q -0.004,-0.123163 0.0398,-0.236851 0.0701,-0.187586 0.22358,-0.369487 0.15538,-0.181901 0.44718,-0.420647 0.45286,-0.371381 0.61202,-0.587389 0.15916,-0.217902 0.15916,-0.411173 0,-0.202744 -0.1459,-0.341064 -0.144,-0.140216 -0.37706,-0.140216 -0.24633,0 -0.39412,0.147795 -0.1478,0.147795 -0.14969,0.409278 l -0.35054,-0.036 q 0.036,-0.392224 0.27096,-0.596863 0.23495,-0.206534 0.63097,-0.206534 0.3998,0 0.63286,0.221692 0.23306,0.221692 0.23306,0.549494 0,0.166742 -0.0682,0.327801 -0.0682,0.161058 -0.22738,0.33917 -0.15727,0.178112 -0.52486,0.488859 -0.30696,0.257694 -0.39412,0.350539 -0.0872,0.09095 -0.144,0.183796 z"
         style="line-height:125%;font-family:sans-serif;-inkscape-font-specification:sans-serif"
         id="path92821" />
    </g>
    <g
       aria-label="R1"
       id="text21598"
       style="font-size:3.88056px;line-height:125%;font-family:Sans;-inkscape-font-specification:Sans;letter-spacing:0px;word-spacing:0px;stroke:#000000;stroke-width:0">
      <path
         d="m 102.95365,118.69946 v -2.77778 h 1.23162 q 0.37138,0 0.56465,0.0758 0.19327,0.0739 0.30885,0.26338 0.11559,0.18948 0.11559,0.41875 0,0.29559 -0.19138,0.49833 -0.19137,0.20275 -0.59118,0.2577 0.1459,0.0701 0.22169,0.13832 0.16106,0.14779 0.30507,0.36949 l 0.48317,0.75602 h -0.46233 l -0.36759,-0.57791 q -0.16106,-0.25012 -0.26527,-0.38275 -0.10422,-0.13264 -0.18759,-0.18569 -0.0815,-0.0531 -0.16674,-0.0739 -0.0625,-0.0133 -0.20464,-0.0133 h -0.42633 v 1.23351 z m 0.36759,-1.55184 h 0.79013 q 0.25201,0 0.39412,-0.0512 0.14211,-0.0531 0.21601,-0.16674 0.0739,-0.11559 0.0739,-0.25012 0,-0.19706 -0.14401,-0.32401 -0.14211,-0.12695 -0.45096,-0.12695 h -0.87919 z"
         style="line-height:125%;font-family:sans-serif;-inkscape-font-specification:sans-serif"
         id="path92741" />
      <path
         d="m 106.89673,118.69946 h -0.34106 v -2.17334 q -0.12316,0.11748 -0.32401,0.23496 -0.19896,0.11748 -0.35812,0.17621 v -0.32969 q 0.28612,-0.13453 0.50023,-0.32591 0.21411,-0.19137 0.30317,-0.37138 h 0.21979 z"
         style="line-height:125%;font-family:sans-serif;-inkscape-font-specification:sans-serif"
         id="path92743" />
    </g>
    <g
       aria-label="100k"
       id="text21626"
       style="font-size:3.175px;line-height:100%;font-family:Sans;-inkscape-font-specification:Sans;letter-spacing:0px;word-spacing:0px;stroke:#000000;stroke-width:0">
      <path
         d="m 141.79081,82.981491 h -0.27906 v -1.778186 q -0.10077,0.09612 -0.2651,0.192236 -0.16278,0.09612 -0.293,0.144178 v -0.269751 q 0.23409,-0.110071 0.40927,-0.266651 0.17519,-0.156579 0.24805,-0.303857 h 0.17984 z"
         style="font-family:sans-serif;-inkscape-font-specification:sans-serif;text-align:end;text-anchor:end"
         id="path92829" />
      <path
         d="m 142.50549,81.860629 q 0,-0.403076 0.0822,-0.648022 0.0837,-0.246497 0.24649,-0.379822 0.16433,-0.133325 0.41238,-0.133325 0.18293,0 0.32091,0.07441 0.13798,0.07286 0.22789,0.21239 0.0899,0.137976 0.14108,0.337964 0.0512,0.198437 0.0512,0.536401 0,0.399976 -0.0822,0.646472 -0.0822,0.244947 -0.24649,0.379822 -0.16278,0.133325 -0.41238,0.133325 -0.32866,0 -0.51625,-0.235644 -0.22479,-0.283704 -0.22479,-0.923975 z m 0.2868,0 q 0,0.559656 0.13023,0.745691 0.13177,0.184485 0.32401,0.184485 0.19224,0 0.32246,-0.186035 0.13178,-0.186035 0.13178,-0.744141 0,-0.561206 -0.13178,-0.745691 -0.13022,-0.184484 -0.32556,-0.184484 -0.19224,0 -0.30696,0.16278 -0.14418,0.20774 -0.14418,0.767395 z"
         style="font-family:sans-serif;-inkscape-font-specification:sans-serif;text-align:end;text-anchor:end"
         id="path92831" />
      <path
         d="m 144.27127,81.860629 q 0,-0.403076 0.0822,-0.648022 0.0837,-0.246497 0.2465,-0.379822 0.16433,-0.133325 0.41237,-0.133325 0.18294,0 0.32091,0.07441 0.13798,0.07286 0.2279,0.21239 0.0899,0.137976 0.14107,0.337964 0.0512,0.198437 0.0512,0.536401 0,0.399976 -0.0822,0.646472 -0.0822,0.244947 -0.2465,0.379822 -0.16278,0.133325 -0.41238,0.133325 -0.32866,0 -0.51624,-0.235644 -0.2248,-0.283704 -0.2248,-0.923975 z m 0.28681,0 q 0,0.559656 0.13022,0.745691 0.13178,0.184485 0.32401,0.184485 0.19224,0 0.32246,-0.186035 0.13178,-0.186035 0.13178,-0.744141 0,-0.561206 -0.13178,-0.745691 -0.13022,-0.184484 -0.32556,-0.184484 -0.19223,0 -0.30695,0.16278 -0.14418,0.20774 -0.14418,0.767395 z"
         style="font-family:sans-serif;-inkscape-font-specification:sans-serif;text-align:end;text-anchor:end"
         id="path92833" />
      <path
         d="m 146.11612,82.981491 v -2.272729 h 0.27906 v 1.296045 l 0.66042,-0.669727 h 0.36122 l -0.62942,0.610815 0.69298,1.035596 h -0.34416 l -0.54416,-0.841809 -0.19688,0.189136 v 0.652673 z"
         style="font-family:sans-serif;-inkscape-font-specification:sans-serif;text-align:end;text-anchor:end"
         id="path92835" />
    </g>
    <g
       aria-label="10µF
25V"
       id="text21636"
       style="font-size:3.175px;line-height:1;stroke-width:0.264583">
      <path
         d="m 70.981915,108.98149 h -0.279052 v -1.77818 q -0.10077,0.0961 -0.265101,0.19223 -0.16278,0.0961 -0.293005,0.14418 v -0.26975 q 0.234094,-0.11007 0.409277,-0.26665 0.175184,-0.15658 0.248047,-0.30386 h 0.179834 z"
         style="-inkscape-font-specification:sans-serif"
         id="path92707" />
      <path
         d="m 71.6966,107.86063 q 0,-0.40308 0.08217,-0.64802 0.08372,-0.2465 0.246496,-0.37982 0.164331,-0.13333 0.412378,-0.13333 0.182935,0 0.320911,0.0744 0.137976,0.0729 0.227893,0.21239 0.08992,0.13798 0.141077,0.33797 0.05116,0.19844 0.05116,0.5364 0,0.39997 -0.08217,0.64647 -0.08217,0.24495 -0.246497,0.37982 -0.16278,0.13333 -0.412378,0.13333 -0.328662,0 -0.516247,-0.23565 -0.224793,-0.2837 -0.224793,-0.92397 z m 0.286805,0 q 0,0.55966 0.130224,0.74569 0.131775,0.18449 0.324011,0.18449 0.192237,0 0.322461,-0.18604 0.131775,-0.18604 0.131775,-0.74414 0,-0.56121 -0.131775,-0.74569 -0.130224,-0.18449 -0.325561,-0.18449 -0.192237,0 -0.306958,0.16278 -0.144177,0.20774 -0.144177,0.7674 z"
         style="-inkscape-font-specification:sans-serif"
         id="path92709" />
      <path
         d="m 74.908807,107.33508 v 1.64641 H 74.65921 v -0.19534 q -0.08061,0.12403 -0.15968,0.17054 -0.108521,0.0636 -0.252698,0.0636 -0.128674,0 -0.227893,-0.0512 -0.07441,-0.0388 -0.164331,-0.15348 v 0.79685 h -0.275952 v -2.27738 h 0.275952 v 0.69763 q 0,0.37982 0.04031,0.49299 0.04031,0.11163 0.130224,0.17674 0.09147,0.0651 0.20929,0.0651 0.124023,0 0.221692,-0.0682 0.09767,-0.0682 0.137976,-0.17519 0.04031,-0.10852 0.04031,-0.48679 v -0.70228 z"
         style="-inkscape-font-specification:sans-serif"
         id="path92711" />
      <path
         d="m 75.420404,108.98149 v -2.27273 h 1.53324 v 0.2682 h -1.232483 v 0.70384 h 1.066602 v 0.2682 h -1.066602 v 1.03249 z"
         style="-inkscape-font-specification:sans-serif"
         id="path92713" />
      <path
         d="m 71.397394,111.88829 v 0.2682 H 69.89516 q -0.0031,-0.10077 0.03256,-0.19379 0.05736,-0.15347 0.182935,-0.3023 0.127124,-0.14883 0.365869,-0.34417 0.37052,-0.30386 0.500744,-0.48059 0.130225,-0.17828 0.130225,-0.33641 0,-0.16588 -0.119373,-0.27905 -0.117822,-0.11473 -0.308508,-0.11473 -0.201538,0 -0.322461,0.12093 -0.120923,0.12092 -0.122473,0.33486 l -0.286804,-0.0295 q 0.02945,-0.32091 0.221692,-0.48834 0.192236,-0.16898 0.516247,-0.16898 0.327112,0 0.517798,0.18138 0.190686,0.18139 0.190686,0.44959 0,0.13642 -0.05581,0.2682 -0.05581,0.13177 -0.186036,0.2775 -0.128674,0.14573 -0.429431,0.39998 -0.251147,0.21084 -0.322461,0.2868 -0.07131,0.0744 -0.117822,0.15038 z"
         style="-inkscape-font-specification:sans-serif"
         id="path92715" />
      <path
         d="m 71.6966,111.56118 0.293006,-0.0248 q 0.03256,0.21394 0.150378,0.32246 0.119373,0.10698 0.286804,0.10698 0.201538,0 0.341065,-0.15193 0.139526,-0.15193 0.139526,-0.40308 0,-0.23874 -0.134875,-0.37672 -0.133326,-0.13798 -0.350367,-0.13798 -0.134875,0 -0.243396,0.062 -0.10852,0.0605 -0.170532,0.15813 l -0.261999,-0.0341 0.220141,-1.16737 h 1.130164 v 0.26665 h -0.906922 l -0.122473,0.61081 q 0.204639,-0.14262 0.429431,-0.14262 0.297657,0 0.502295,0.20619 0.204639,0.20618 0.204639,0.5302 0,0.3085 -0.179834,0.5333 -0.218591,0.27595 -0.596863,0.27595 -0.310058,0 -0.506945,-0.17363 -0.195337,-0.17364 -0.223243,-0.46044 z"
         style="-inkscape-font-specification:sans-serif"
         id="path92717" />
      <path
         d="m 74.225128,112.15649 -0.880566,-2.27273 h 0.325561 l 0.590662,1.65106 q 0.07131,0.19844 0.119372,0.37207 0.05271,-0.18603 0.122474,-0.37207 l 0.613916,-1.65106 h 0.306958 l -0.889869,2.27273 z"
         style="-inkscape-font-specification:sans-serif"
         id="path92719" />
    </g>
    <path
       style="fill:none;stroke:#000000;stroke-width:0.4;stroke-linecap:butt;stroke-linejoin:miter;stroke-dasharray:none;stroke-opacity:1"
       d="m 67.953642,144.69946 h 14"
       id="path21638" />
    <g
       aria-label="R2"
       id="text21648"
       style="font-size:3.88056px;line-height:125%;font-family:Sans;-inkscape-font-specification:Sans;letter-spacing:0px;word-spacing:0px;stroke:#000000;stroke-width:0">
      <path
         d="m 100.95363,131.69946 v -2.77778 h 1.23162 q 0.37139,0 0.56466,0.0758 0.19327,0.0739 0.30885,0.26338 0.11558,0.18948 0.11558,0.41875 0,0.29559 -0.19137,0.49833 -0.19138,0.20275 -0.59118,0.2577 0.1459,0.0701 0.22169,0.13832 0.16106,0.14779 0.30506,0.36949 l 0.48318,0.75602 h -0.46233 l -0.3676,-0.57791 q -0.16105,-0.25012 -0.26527,-0.38275 -0.10421,-0.13264 -0.18758,-0.18569 -0.0815,-0.0531 -0.16675,-0.0739 -0.0625,-0.0133 -0.20464,-0.0133 h -0.42633 v 1.23351 z m 0.36759,-1.55184 h 0.79014 q 0.25201,0 0.39412,-0.0512 0.14211,-0.0531 0.216,-0.16674 0.0739,-0.11559 0.0739,-0.25012 0,-0.19706 -0.144,-0.32401 -0.14211,-0.12695 -0.45097,-0.12695 h -0.87919 z"
         style="line-height:125%;font-family:sans-serif;-inkscape-font-specification:sans-serif"
         id="path92736" />
      <path
         d="m 105.40453,131.37166 v 0.3278 h -1.83607 q -0.004,-0.12316 0.0398,-0.23685 0.0701,-0.18758 0.22359,-0.36948 0.15537,-0.18191 0.44717,-0.42065 0.45286,-0.37138 0.61202,-0.58739 0.15917,-0.2179 0.15917,-0.41117 0,-0.20275 -0.1459,-0.34107 -0.14401,-0.14021 -0.37707,-0.14021 -0.24632,0 -0.39412,0.14779 -0.14779,0.1478 -0.14969,0.40928 l -0.35054,-0.036 q 0.036,-0.39223 0.27096,-0.59687 0.23496,-0.20653 0.63097,-0.20653 0.39981,0 0.63287,0.22169 0.23306,0.22169 0.23306,0.5495 0,0.16674 -0.0682,0.3278 -0.0682,0.16106 -0.22737,0.33917 -0.15727,0.17811 -0.52486,0.48886 -0.30696,0.25769 -0.39412,0.35054 -0.0872,0.0909 -0.14401,0.18379 z"
         style="line-height:125%;font-family:sans-serif;-inkscape-font-specification:sans-serif"
         id="path92738" />
    </g>
    <path
       style="fill:none;stroke:#000000;stroke-width:0.6;stroke-linecap:butt;stroke-linejoin:miter;stroke-dasharray:none;stroke-opacity:1"
       d="m 101.95364,91.69946 h 15 v 16 h -15 z"
       id="path21847" />
    <g
       aria-label="SD8942"
       id="text23427"
       style="font-size:3.88056px;line-height:100%;font-family:Sans;-inkscape-font-specification:Sans;letter-spacing:0px;word-spacing:0px;stroke:#000000;stroke-width:0">
      <path
         d="m 102.6314,88.759647 0.34675,-0.03032 q 0.0246,0.208428 0.11369,0.342959 0.0909,0.132637 0.28043,0.216008 0.18948,0.08148 0.42633,0.08148 0.21032,0 0.37138,-0.06253 0.16106,-0.06253 0.23875,-0.170532 0.0796,-0.109899 0.0796,-0.238746 0,-0.130741 -0.0758,-0.227376 -0.0758,-0.09853 -0.25012,-0.164848 -0.11179,-0.04358 -0.49454,-0.134531 -0.38275,-0.09285 -0.53623,-0.174322 -0.19896,-0.104215 -0.29749,-0.257694 -0.0966,-0.155374 -0.0966,-0.346749 0,-0.210323 0.11937,-0.392225 0.11937,-0.183796 0.34864,-0.278536 0.22928,-0.09474 0.50971,-0.09474 0.30885,0 0.54381,0.100425 0.23685,0.09853 0.3638,0.291799 0.12695,0.193271 0.13642,0.4377 l -0.35243,0.02653 q -0.0284,-0.263378 -0.19327,-0.397909 -0.16295,-0.134532 -0.48317,-0.134532 -0.33349,0 -0.48697,0.123163 -0.15158,0.121267 -0.15158,0.293694 0,0.14969 0.108,0.246325 0.10611,0.09664 0.55328,0.198955 0.44907,0.100424 0.61581,0.176216 0.24254,0.111794 0.35812,0.284221 0.11559,0.170533 0.11559,0.394119 0,0.221693 -0.12696,0.418752 -0.12695,0.195165 -0.36569,0.305064 -0.23685,0.108004 -0.53434,0.108004 -0.37706,0 -0.63286,-0.109899 -0.25391,-0.109899 -0.39981,-0.329696 -0.144,-0.221692 -0.15158,-0.500228 z"
         style="font-family:sans-serif;-inkscape-font-specification:sans-serif"
         id="path92799" />
      <path
         d="m 105.34476,89.6521 v -2.777784 h 0.95688 q 0.32401,0 0.49454,0.03979 0.23874,0.05495 0.40738,0.198954 0.2198,0.185691 0.3278,0.475596 0.1099,0.288011 0.1099,0.659392 0,0.316433 -0.0739,0.560863 -0.0739,0.244429 -0.18949,0.405488 -0.11558,0.159163 -0.2539,0.252009 -0.13643,0.09095 -0.33159,0.13832 -0.19327,0.04737 -0.44528,0.04737 z m 0.36759,-0.327802 h 0.59308 q 0.27474,0 0.43012,-0.05116 0.15726,-0.05116 0.25011,-0.144005 0.13074,-0.130742 0.20274,-0.350539 0.0739,-0.221692 0.0739,-0.53623 0,-0.435805 -0.144,-0.668866 -0.14211,-0.234956 -0.34675,-0.314538 -0.1478,-0.05684 -0.4756,-0.05684 h -0.5836 z"
         style="font-family:sans-serif;-inkscape-font-specification:sans-serif"
         id="path92801" />
      <path
         d="m 108.53372,88.14573 q -0.21222,-0.07769 -0.31454,-0.221692 -0.10232,-0.144005 -0.10232,-0.344855 0,-0.303168 0.2179,-0.509702 0.2179,-0.206534 0.57981,-0.206534 0.3638,0 0.5855,0.212218 0.22169,0.210324 0.22169,0.513492 0,0.19327 -0.10232,0.337276 -0.10043,0.14211 -0.30696,0.219797 0.2558,0.08337 0.38844,0.269062 0.13453,0.185691 0.13453,0.443384 0,0.356224 -0.25201,0.598759 -0.25201,0.242535 -0.66318,0.242535 -0.41118,0 -0.66319,-0.242535 -0.252,-0.24443 -0.252,-0.608233 0,-0.270957 0.13642,-0.452858 0.13832,-0.183796 0.39223,-0.250114 z m -0.0682,-0.577916 q 0,0.19706 0.12695,0.322117 0.12696,0.125057 0.3297,0.125057 0.19706,0 0.32212,-0.123162 0.12695,-0.125057 0.12695,-0.305063 0,-0.187586 -0.13074,-0.314538 -0.12885,-0.128847 -0.32212,-0.128847 -0.19516,0 -0.32401,0.125057 -0.12885,0.125057 -0.12885,0.299379 z m -0.1099,1.282783 q 0,0.1459 0.0682,0.282326 0.0701,0.136426 0.20653,0.212218 0.13643,0.0739 0.2937,0.0739 0.24443,0 0.40359,-0.157269 0.15916,-0.157269 0.15916,-0.399804 0,-0.246325 -0.16485,-0.407383 -0.16295,-0.161058 -0.40927,-0.161058 -0.24064,0 -0.39981,0.159163 -0.15727,0.159164 -0.15727,0.397909 z"
         style="font-family:sans-serif;-inkscape-font-specification:sans-serif"
         id="path92803" />
      <path
         d="m 110.2182,89.009761 0.3278,-0.03032 q 0.0417,0.231166 0.15916,0.33538 0.11748,0.104215 0.30128,0.104215 0.15726,0 0.27474,-0.072 0.11937,-0.072 0.19517,-0.191375 0.0758,-0.121268 0.12695,-0.325907 0.0512,-0.204639 0.0512,-0.416857 0,-0.02274 -0.002,-0.06821 -0.10232,0.162954 -0.28043,0.265273 -0.17621,0.100425 -0.38275,0.100425 -0.34485,0 -0.5836,-0.250115 -0.23874,-0.250114 -0.23874,-0.659392 0,-0.422541 0.24822,-0.680234 0.25011,-0.257694 0.62528,-0.257694 0.27096,0 0.49455,0.1459 0.22548,0.1459 0.34106,0.416857 0.11748,0.269062 0.11748,0.78066 0,0.53244 -0.11558,0.848872 -0.11559,0.314538 -0.34486,0.479386 -0.22738,0.164848 -0.53433,0.164848 -0.32591,0 -0.53244,-0.180007 -0.20654,-0.181901 -0.24822,-0.509702 z m 1.39647,-1.225939 q 0,-0.293694 -0.15727,-0.466122 -0.15538,-0.172427 -0.37517,-0.172427 -0.22738,0 -0.39602,0.185691 -0.16863,0.185691 -0.16863,0.48128 0,0.265273 0.15916,0.432016 0.16106,0.164848 0.39601,0.164848 0.23685,0 0.38844,-0.164848 0.15348,-0.166743 0.15348,-0.460438 z"
         style="font-family:sans-serif;-inkscape-font-specification:sans-serif"
         id="path92805" />
      <path
         d="m 113.41852,89.6521 v -0.665077 h -1.20509 V 88.67438 l 1.26762,-1.800064 h 0.27854 v 1.800064 h 0.37517 v 0.312643 h -0.37517 V 89.6521 Z m 0,-0.97772 v -1.252465 l -0.86971,1.252465 z"
         style="font-family:sans-serif;-inkscape-font-specification:sans-serif"
         id="path92807" />
      <path
         d="M 116.27589,89.324298 V 89.6521 h -1.83607 q -0.004,-0.123163 0.0398,-0.236851 0.0701,-0.187586 0.22359,-0.369487 0.15537,-0.181901 0.44717,-0.420647 0.45286,-0.371381 0.61203,-0.587389 0.15916,-0.217902 0.15916,-0.411173 0,-0.202744 -0.1459,-0.341064 -0.14401,-0.140216 -0.37707,-0.140216 -0.24632,0 -0.39412,0.147795 -0.14779,0.147795 -0.14969,0.409278 l -0.35053,-0.036 q 0.036,-0.392224 0.27095,-0.596863 0.23496,-0.206534 0.63097,-0.206534 0.39981,0 0.63287,0.221692 0.23306,0.221692 0.23306,0.549494 0,0.166742 -0.0682,0.327801 -0.0682,0.161058 -0.22737,0.33917 -0.15727,0.178112 -0.52486,0.488859 -0.30696,0.257694 -0.39412,0.350539 -0.0872,0.09095 -0.14401,0.183796 z"
         style="font-family:sans-serif;-inkscape-font-specification:sans-serif"
         id="path92809" />
    </g>
    <g
       aria-label="BS"
       id="text23431"
       style="font-size:2.46944px;line-height:100%;font-family:Sans;-inkscape-font-specification:Sans;letter-spacing:0px;word-spacing:0px;stroke:#000000;stroke-width:0">
      <path
         d="m 102.96954,94.711548 v -1.767675 h 0.66318 q 0.20257,0 0.32435,0.05426 0.12299,0.05305 0.19172,0.165192 0.0699,0.110932 0.0699,0.232716 0,0.113343 -0.0615,0.213423 -0.0615,0.10008 -0.18569,0.161574 0.16037,0.04703 0.24598,0.160369 0.0868,0.113344 0.0868,0.267684 0,0.124195 -0.0531,0.23151 -0.0518,0.106109 -0.12902,0.163986 -0.0772,0.05788 -0.19413,0.08802 -0.11575,0.02894 -0.28456,0.02894 z m 0.23392,-1.024914 h 0.38223 q 0.15555,0 0.22307,-0.0205 0.0892,-0.02653 0.13384,-0.08802 0.0458,-0.06149 0.0458,-0.15434 0,-0.08802 -0.0422,-0.15434 -0.0422,-0.06752 -0.12058,-0.09164 -0.0784,-0.02532 -0.26889,-0.02532 h -0.35329 z m 0,0.816314 h 0.44011 q 0.11334,0 0.15916,-0.0084 0.0808,-0.01447 0.13505,-0.04823 0.0543,-0.03376 0.0892,-0.09767 0.035,-0.06511 0.035,-0.149517 0,-0.09887 -0.0506,-0.171221 -0.0506,-0.07355 -0.14108,-0.102492 -0.0892,-0.03014 -0.25803,-0.03014 h -0.40876 z"
         style="font-family:sans-serif;-inkscape-font-specification:sans-serif;text-align:end;text-anchor:end"
         id="path92770" />
      <path
         d="m 104.5467,94.143625 0.22066,-0.01929 q 0.0157,0.132636 0.0723,0.218247 0.0579,0.0844 0.17846,0.137459 0.12058,0.05185 0.2713,0.05185 0.13384,0 0.23633,-0.03979 0.10249,-0.03979 0.15193,-0.108521 0.0506,-0.06993 0.0506,-0.151928 0,-0.0832 -0.0482,-0.144694 -0.0482,-0.0627 -0.15916,-0.104903 -0.0711,-0.02773 -0.31471,-0.08561 -0.24357,-0.05908 -0.34124,-0.110932 -0.1266,-0.06632 -0.1893,-0.163986 -0.0615,-0.09887 -0.0615,-0.220658 0,-0.133842 0.076,-0.249597 0.076,-0.116961 0.22186,-0.17725 0.1459,-0.06029 0.32435,-0.06029 0.19655,0 0.34606,0.06391 0.15073,0.0627 0.23151,0.185691 0.0808,0.122989 0.0868,0.278535 l -0.22428,0.01688 q -0.0181,-0.167603 -0.12299,-0.253214 -0.10369,-0.08561 -0.30747,-0.08561 -0.21222,0 -0.30989,0.07837 -0.0965,0.07717 -0.0965,0.186896 0,0.09526 0.0687,0.156752 0.0675,0.0615 0.35209,0.126607 0.28577,0.06391 0.39188,0.112138 0.15434,0.07114 0.22789,0.180867 0.0735,0.10852 0.0735,0.250802 0,0.141077 -0.0808,0.266478 -0.0808,0.124196 -0.23272,0.194131 -0.15072,0.06873 -0.34003,0.06873 -0.23995,0 -0.40273,-0.06994 -0.16157,-0.06994 -0.25442,-0.209806 -0.0916,-0.141076 -0.0965,-0.318326 z"
         style="font-family:sans-serif;-inkscape-font-specification:sans-serif;text-align:end;text-anchor:end"
         id="path92772" />
    </g>
    <g
       aria-label="GND"
       id="text23435"
       style="font-size:2.46944px;line-height:100%;font-family:Sans;-inkscape-font-specification:Sans;letter-spacing:0px;word-spacing:0px;stroke:#000000;stroke-width:0">
      <path
         d="M 103.84891,99.888234 V 99.68084 l 0.74879,-0.0012 v 0.655946 q -0.17243,0.13746 -0.35571,0.20739 -0.18327,0.0687 -0.3762,0.0687 -0.26045,0 -0.47387,-0.11093 -0.21222,-0.11214 -0.32074,-0.32315 -0.10852,-0.21101 -0.10852,-0.471459 0,-0.258037 0.10732,-0.481107 0.10852,-0.224275 0.31109,-0.332795 0.20257,-0.108521 0.46663,-0.108521 0.19172,0 0.34606,0.0627 0.15555,0.06149 0.24357,0.172427 0.088,0.110932 0.13384,0.289387 l -0.21101,0.05788 q -0.0398,-0.135048 -0.0989,-0.212218 -0.0591,-0.07717 -0.16881,-0.122989 -0.10973,-0.04703 -0.24357,-0.04703 -0.16037,0 -0.27733,0.04944 -0.11696,0.04823 -0.18931,0.127813 -0.0711,0.07958 -0.11093,0.174838 -0.0675,0.163986 -0.0675,0.355706 0,0.236333 0.0808,0.395498 0.082,0.15916 0.23754,0.23633 0.15555,0.0772 0.33039,0.0772 0.15193,0 0.29662,-0.0579 0.14469,-0.0591 0.21945,-0.1254 v -0.329176 z"
         style="font-family:sans-serif;-inkscape-font-specification:sans-serif;text-align:end;text-anchor:end"
         id="path92775" />
      <path
         d="m 104.94014,100.58156 v -1.767677 h 0.23995 l 0.92845,1.387857 v -1.387857 h 0.22428 v 1.767677 h -0.23995 l -0.92845,-1.389062 v 1.389062 z"
         style="font-family:sans-serif;-inkscape-font-specification:sans-serif;text-align:end;text-anchor:end"
         id="path92777" />
      <path
         d="m 106.7259,100.58156 v -1.767677 h 0.60892 q 0.20619,0 0.31471,0.02532 0.15193,0.03497 0.25925,0.126607 0.13987,0.118167 0.2086,0.302651 0.0699,0.183279 0.0699,0.419612 0,0.201366 -0.047,0.356916 -0.047,0.15554 -0.12058,0.25803 -0.0736,0.10129 -0.16158,0.16037 -0.0868,0.0579 -0.21101,0.088 -0.12299,0.0301 -0.28336,0.0301 z m 0.23393,-0.2086 h 0.3774 q 0.17484,0 0.27372,-0.0326 0.10008,-0.0326 0.15916,-0.0916 0.0832,-0.0832 0.12902,-0.22307 0.047,-0.141073 0.047,-0.341233 0,-0.27733 -0.0916,-0.425641 -0.0904,-0.149517 -0.22066,-0.200159 -0.094,-0.03617 -0.30265,-0.03617 h -0.37138 z"
         style="font-family:sans-serif;-inkscape-font-specification:sans-serif;text-align:end;text-anchor:end"
         id="path92779" />
    </g>
    <g
       aria-label="FB"
       id="text23439"
       style="font-size:2.46944px;line-height:100%;font-family:Sans;-inkscape-font-specification:Sans;letter-spacing:0px;word-spacing:0px;stroke:#000000;stroke-width:0">
      <path
         d="m 102.95741,106.45303 v -1.76767 h 1.19252 v 0.2086 h -0.9586 v 0.54742 h 0.82958 v 0.2086 h -0.82958 v 0.80305 z"
         style="font-family:sans-serif;-inkscape-font-specification:sans-serif;text-align:end;text-anchor:end"
         id="path92782" />
      <path
         d="m 104.44414,106.45303 v -1.76767 h 0.66318 q 0.20257,0 0.32435,0.0543 0.12299,0.053 0.19172,0.16519 0.0699,0.11093 0.0699,0.23272 0,0.11334 -0.0615,0.21342 -0.0615,0.10008 -0.18569,0.16157 0.16037,0.047 0.24598,0.16037 0.0868,0.11335 0.0868,0.26769 0,0.12419 -0.053,0.23151 -0.0519,0.10611 -0.12902,0.16398 -0.0772,0.0579 -0.19413,0.088 -0.11576,0.0289 -0.28457,0.0289 z m 0.23392,-1.02491 h 0.38223 q 0.15555,0 0.22307,-0.0205 0.0892,-0.0265 0.13385,-0.088 0.0458,-0.0615 0.0458,-0.15434 0,-0.088 -0.0422,-0.15434 -0.0422,-0.0675 -0.12058,-0.0916 -0.0784,-0.0253 -0.26888,-0.0253 h -0.3533 z m 0,0.81631 h 0.44011 q 0.11335,0 0.15916,-0.008 0.0808,-0.0145 0.13505,-0.0482 0.0543,-0.0338 0.0892,-0.0977 0.035,-0.0651 0.035,-0.14951 0,-0.0989 -0.0507,-0.17122 -0.0506,-0.0736 -0.14107,-0.1025 -0.0892,-0.0301 -0.25804,-0.0301 h -0.40876 z"
         style="font-family:sans-serif;-inkscape-font-specification:sans-serif;text-align:end;text-anchor:end"
         id="path92784" />
    </g>
    <g
       aria-label="SW"
       id="text23443"
       style="font-size:2.46944px;line-height:100%;font-family:Sans;-inkscape-font-specification:Sans;letter-spacing:0px;word-spacing:0px;stroke:#000000;stroke-width:0">
      <path
         d="m 112.12168,94.055765 0.22065,-0.01929 q 0.0157,0.132636 0.0724,0.218247 0.0579,0.0844 0.17846,0.137459 0.12058,0.05185 0.2713,0.05185 0.13384,0 0.23633,-0.03979 0.10249,-0.03979 0.15193,-0.108521 0.0506,-0.06994 0.0506,-0.151928 0,-0.0832 -0.0482,-0.144694 -0.0482,-0.0627 -0.15916,-0.104903 -0.0711,-0.02773 -0.31471,-0.08561 -0.24357,-0.05908 -0.34124,-0.110932 -0.1266,-0.06632 -0.1893,-0.163986 -0.0615,-0.09888 -0.0615,-0.220658 0,-0.133842 0.076,-0.249597 0.076,-0.116961 0.22187,-0.17725 0.1459,-0.06029 0.32435,-0.06029 0.19655,0 0.34606,0.06391 0.15073,0.0627 0.23151,0.185691 0.0808,0.122989 0.0868,0.278535 l -0.22428,0.01688 q -0.0181,-0.167604 -0.12299,-0.253214 -0.10369,-0.08561 -0.30747,-0.08561 -0.21222,0 -0.30989,0.07838 -0.0965,0.07717 -0.0965,0.186896 0,0.09526 0.0687,0.156752 0.0675,0.06149 0.35209,0.126607 0.28577,0.06391 0.39188,0.112138 0.15434,0.07114 0.22789,0.180867 0.0735,0.10852 0.0735,0.250802 0,0.141077 -0.0808,0.266478 -0.0808,0.124195 -0.23272,0.194131 -0.15072,0.06873 -0.34003,0.06873 -0.23995,0 -0.40273,-0.06994 -0.16158,-0.06993 -0.25442,-0.209806 -0.0916,-0.141076 -0.0965,-0.318326 z"
         style="font-family:sans-serif;-inkscape-font-specification:sans-serif;text-align:end;text-anchor:end"
         id="path92765" />
      <path
         d="m 114.15704,94.623688 -0.46905,-1.767676 h 0.23995 l 0.26889,1.158756 q 0.0434,0.182073 0.0747,0.361735 0.0675,-0.283359 0.0796,-0.326767 l 0.33641,-1.193724 h 0.28215 l 0.25322,0.89469 q 0.0953,0.332796 0.13745,0.625801 0.0338,-0.167604 0.088,-0.384645 l 0.27733,-1.135846 h 0.23512 l -0.48472,1.767676 h -0.22548 l -0.37259,-1.346858 q -0.047,-0.168809 -0.0555,-0.207394 -0.0277,0.121784 -0.0519,0.207394 l -0.375,1.346858 z"
         style="font-family:sans-serif;-inkscape-font-specification:sans-serif;text-align:end;text-anchor:end"
         id="path92767" />
    </g>
    <g
       aria-label="IN"
       id="text23447"
       style="font-size:2.46944px;line-height:100%;font-family:Sans;-inkscape-font-specification:Sans;letter-spacing:0px;word-spacing:0px;stroke:#000000;stroke-width:0">
      <path
         d="m 113.9092,100.55194 v -1.767674 h 0.23392 v 1.767674 z"
         style="font-family:sans-serif;-inkscape-font-specification:sans-serif;text-align:end;text-anchor:end"
         id="path92760" />
      <path
         d="m 114.55309,100.55194 v -1.767674 h 0.23995 l 0.92845,1.387854 v -1.387854 h 0.22428 v 1.767674 h -0.23995 l -0.92845,-1.389059 v 1.389059 z"
         style="font-family:sans-serif;-inkscape-font-specification:sans-serif;text-align:end;text-anchor:end"
         id="path92762" />
    </g>
    <g
       aria-label="EN"
       id="text23451"
       style="font-size:2.46944px;line-height:100%;font-family:Sans;-inkscape-font-specification:Sans;letter-spacing:0px;word-spacing:0px;stroke:#000000;stroke-width:0">
      <path
         d="m 112.91917,106.41222 v -1.76768 h 1.27813 v 0.2086 h -1.04421 v 0.5414 h 0.97789 v 0.20739 h -0.97789 v 0.60169 h 1.08521 v 0.2086 z"
         style="font-family:sans-serif;-inkscape-font-specification:sans-serif;text-align:end;text-anchor:end"
         id="path92755" />
      <path
         d="m 114.55903,106.41222 v -1.76768 h 0.23995 l 0.92846,1.38786 v -1.38786 h 0.22427 v 1.76768 h -0.23995 l -0.92845,-1.38906 v 1.38906 z"
         style="font-family:sans-serif;-inkscape-font-specification:sans-serif;text-align:end;text-anchor:end"
         id="path92757" />
    </g>
    <path
       style="fill:none;stroke:#000000;stroke-width:0.4;stroke-linecap:butt;stroke-linejoin:miter;stroke-dasharray:none;stroke-opacity:1"
       d="M 101.95364,93.69946 H 91.939369 l 0.01277,-16.99608 16.257153,-0.0039"
       id="path23838" />
    <path
       style="fill:none;stroke:#000000;stroke-width:0.4;stroke-linecap:butt;stroke-linejoin:miter;stroke-dasharray:none;stroke-opacity:1"
       d="m 101.95364,105.69946 h -4.999998 v 16 h 64.999998"
       id="path23840" />
    <path
       style="fill:none;stroke:#000000;stroke-width:0.4;stroke-linecap:butt;stroke-linejoin:miter;stroke-dasharray:none;stroke-opacity:1"
       d="M 101.95364,99.69946 H 89.953642 v 45"
       id="path23842" />
    <path
       style="fill:none;stroke:#000000;stroke-width:0.4;stroke-linecap:butt;stroke-linejoin:miter;stroke-dasharray:none;stroke-opacity:1"
       d="m 131.95364,66.69946 h 5 l -0.002,39 h -19.9982"
       id="path23846" />
    <path
       style="fill:none;stroke:#000000;stroke-width:0.4;stroke-linecap:butt;stroke-linejoin:miter;stroke-dasharray:none;stroke-opacity:1"
       d="m 96.953642,144.69946 v -23"
       id="path26194" />
    <path
       id="path21640"
       d="m 98.453642,137.69946 h -3 v -9 h 3 z"
       style="fill:#ffffff;fill-opacity:1;stroke:#000000;stroke-width:0.5;stroke-linecap:butt;stroke-linejoin:miter;stroke-miterlimit:4;stroke-dasharray:none;stroke-opacity:1" />
    <path
       id="path25416"
       d="m 113.95364,120.19946 v 3 h -9 v -3 z"
       style="fill:#ffffff;fill-opacity:1;stroke:#000000;stroke-width:0.5;stroke-linecap:butt;stroke-linejoin:miter;stroke-miterlimit:4;stroke-dasharray:none;stroke-opacity:1" />
    <path
       id="path25808"
       d="m 138.45364,87.69946 h -3 v -9 h 3 z"
       style="fill:#ffffff;fill-opacity:1;stroke:#000000;stroke-width:0.5;stroke-linecap:butt;stroke-linejoin:miter;stroke-miterlimit:4;stroke-dasharray:none;stroke-opacity:1" />
    <g
       id="g26986"
       transform="translate(19.203642,61.69946)">
      <path
         style="fill:none;stroke:#000000;stroke-width:0.5;stroke-linecap:butt;stroke-linejoin:miter;stroke-miterlimit:4;stroke-dasharray:none;stroke-opacity:1"
         d="M 89,18 V 12"
         id="path26982" />
      <path
         style="fill:none;stroke:#000000;stroke-width:0.5;stroke-linecap:butt;stroke-linejoin:miter;stroke-miterlimit:4;stroke-dasharray:none;stroke-opacity:1"
         d="M 90.5,18 V 12"
         id="path26984" />
    </g>
    <path
       style="fill:none;stroke:#ffffff;stroke-width:0.4;stroke-linecap:butt;stroke-linejoin:miter;stroke-miterlimit:4;stroke-dasharray:none;stroke-opacity:1"
       d="m 108.95364,79.69946 v -6"
       id="path26994" />
    <path
       style="fill:none;stroke:#000000;stroke-width:0.4;stroke-linecap:butt;stroke-linejoin:miter;stroke-dasharray:none;stroke-opacity:1"
       d="m 116.95364,93.69946 h 10.01428 l -0.0128,-16.99608 -17.27036,-0.004"
       id="path27005" />
    <g
       aria-label="1"
       id="text27805"
       style="font-size:2.46944px;line-height:100%;font-family:Sans;-inkscape-font-specification:Sans;letter-spacing:0px;word-spacing:0px;stroke:#000000;stroke-width:0">
      <path
         d="m 100.95365,92.699463 h -0.21704 v -1.383031 q -0.0784,0.07476 -0.20619,0.149517 -0.12661,0.07476 -0.2279,0.112137 V 91.36828 q 0.18208,-0.08561 0.31833,-0.207394 0.13625,-0.121784 0.19293,-0.236333 h 0.13987 z"
         style="font-family:sans-serif;-inkscape-font-specification:sans-serif;text-align:end;text-anchor:end"
         id="path92793" />
    </g>
    <g
       aria-label="3"
       id="text27809"
       style="font-size:2.46944px;line-height:100%;font-family:Sans;-inkscape-font-specification:Sans;letter-spacing:0px;word-spacing:0px;stroke:#000000;stroke-width:0">
      <path
         d="m 99.796093,108.00774 0.217037,-0.0289 q 0.0374,0.18449 0.12661,0.26648 0.0904,0.0808 0.21945,0.0808 0.15314,0 0.25804,-0.10611 0.10611,-0.10611 0.10611,-0.26286 0,-0.14952 -0.0977,-0.24598 -0.0977,-0.0977 -0.24839,-0.0977 -0.0615,0 -0.15313,0.0241 l 0.0241,-0.19052 q 0.0217,0.002 0.035,0.002 0.13866,0 0.2496,-0.0724 0.11093,-0.0724 0.11093,-0.22307 0,-0.11937 -0.0808,-0.19775 -0.0808,-0.0784 -0.2086,-0.0784 -0.12661,0 -0.21101,0.0796 -0.0844,0.0796 -0.10852,0.23874 l -0.217043,-0.0386 q 0.03979,-0.21825 0.180867,-0.33762 0.141076,-0.12058 0.350886,-0.12058 0.14469,0 0.26647,0.0627 0.12179,0.0615 0.18569,0.16881 0.0651,0.10732 0.0651,0.22789 0,0.11455 -0.0615,0.2086 -0.0615,0.094 -0.18207,0.14952 0.15675,0.0362 0.24357,0.15072 0.0868,0.11335 0.0868,0.28457 0,0.23151 -0.16881,0.39308 -0.16881,0.16037 -0.42684,0.16037 -0.23272,0 -0.387059,-0.13866 -0.153134,-0.13867 -0.174838,-0.35933 z"
         style="font-family:sans-serif;-inkscape-font-specification:sans-serif;text-align:end;text-anchor:end"
         id="path92790" />
    </g>
    <g
       aria-label="4"
       id="text27813"
       style="font-size:2.46944px;line-height:100%;font-family:Sans;-inkscape-font-specification:Sans;letter-spacing:0px;word-spacing:0px;stroke:#000000;stroke-width:0">
      <path
         d="m 118.72052,108.46713 v -0.42323 h -0.76688 v -0.19895 l 0.80667,-1.14549 h 0.17725 v 1.14549 h 0.23874 v 0.19895 h -0.23874 v 0.42323 z m 0,-0.62218 v -0.79702 l -0.55345,0.79702 z"
         style="font-family:sans-serif;-inkscape-font-specification:sans-serif;text-align:end;text-anchor:end"
         id="path92787" />
    </g>
    <g
       aria-label="6"
       id="text27817"
       style="font-size:2.46944px;line-height:100%;font-family:Sans;-inkscape-font-specification:Sans;letter-spacing:0px;word-spacing:0px;stroke:#000000;stroke-width:0">
      <path
         d="m 119.08948,91.334512 -0.21583,0.01688 q -0.0289,-0.127813 -0.082,-0.185691 -0.088,-0.09284 -0.21704,-0.09284 -0.10369,0 -0.18207,0.05788 -0.10249,0.07476 -0.16157,0.218246 -0.0591,0.143488 -0.0615,0.40876 0.0784,-0.119372 0.19172,-0.17725 0.11334,-0.05788 0.23754,-0.05788 0.21704,0 0.36897,0.160368 0.15313,0.159164 0.15313,0.412378 0,0.166397 -0.0723,0.309885 -0.0711,0.142283 -0.19655,0.218247 -0.1254,0.07596 -0.28456,0.07596 -0.2713,0 -0.44252,-0.198954 -0.17122,-0.20016 -0.17122,-0.658356 0,-0.512457 0.1893,-0.745173 0.1652,-0.202571 0.44494,-0.202571 0.2086,0 0.34123,0.11696 0.13385,0.116961 0.16037,0.32315 z m -0.88625,0.762053 q 0,0.112138 0.047,0.214629 0.0482,0.102492 0.13384,0.156752 0.0856,0.05305 0.17966,0.05305 0.13746,0 0.23634,-0.110931 0.0989,-0.110932 0.0989,-0.301446 0,-0.183279 -0.0977,-0.288181 -0.0977,-0.106109 -0.24598,-0.106109 -0.1471,0 -0.24959,0.106109 -0.1025,0.104902 -0.1025,0.276123 z"
         style="font-family:sans-serif;-inkscape-font-specification:sans-serif;text-align:end;text-anchor:end"
         id="path92796" />
    </g>
    <path
       style="fill:none;stroke:#000000;stroke-width:0.4;stroke-linecap:butt;stroke-linejoin:miter;stroke-dasharray:none;stroke-opacity:1"
       d="m 116.95364,99.69946 h 15 V 66.69439 l -63.999998,0.0051"
       id="path28225" />
    <path
       id="path28227"
       style="fill:#000000;fill-opacity:1;stroke:none;stroke-width:1.04298;stroke-linecap:butt;stroke-linejoin:miter;stroke-miterlimit:4;stroke-dasharray:none;stroke-opacity:1"
       d="m 81.953642,66.69946 h 0.89999 m 0,0 c 0,-0.49703 -0.40293,-0.89996 -0.89999,-0.89996 -0.49702,0 -0.90001,0.40293 -0.90001,0.89996 0,0.49703 0.40293,0.89997 0.89995,0.89997 0.49706,0 0.90005,-0.40294 0.90005,-0.89997 z" />
    <path
       style="fill:none;stroke:#000000;stroke-width:0.4;stroke-linecap:butt;stroke-linejoin:miter;stroke-dasharray:none;stroke-opacity:1"
       d="M 185.95364,144.69946 H 96.953642"
       id="path29857" />
    <path
       id="path31095"
       style="fill:#000000;fill-opacity:1;stroke:none;stroke-width:1.04298;stroke-linecap:butt;stroke-linejoin:miter;stroke-miterlimit:4;stroke-dasharray:none;stroke-opacity:1"
       d="m 131.95364,66.69946 h 0.89999 m 0,0 c 0,-0.49703 -0.40293,-0.89996 -0.89999,-0.89996 -0.49702,0 -0.90001,0.40293 -0.90001,0.89996 0,0.49703 0.40293,0.89997 0.89995,0.89997 0.49706,0 0.90005,-0.40294 0.90005,-0.89997 z" />
    <path
       id="path31506"
       style="fill:#000000;fill-opacity:1;stroke:none;stroke-width:1.04298;stroke-linecap:butt;stroke-linejoin:miter;stroke-miterlimit:4;stroke-dasharray:none;stroke-opacity:1"
       d="m 89.953642,144.69946 h 0.89999 m 0,0 c 0,-0.49703 -0.40293,-0.89996 -0.89999,-0.89996 -0.49702,0 -0.90001,0.40293 -0.90001,0.89996 0,0.49703 0.40293,0.89997 0.89995,0.89997 0.49706,0 0.90005,-0.40294 0.90005,-0.89997 z" />
    <path
       style="fill:none;stroke:#000000;stroke-width:0.4;stroke-linecap:butt;stroke-linejoin:miter;stroke-dasharray:none;stroke-opacity:1"
       d="m 126.95364,93.69946 h 17.9914 c 0.0108,-2.50244 3.0086,-2.50168 3.0086,0 0,-2.50426 3.00011,-2.50049 3.00011,0 0,-2.50025 2.99291,-2.50072 2.95793,0 h 3.04196"
       id="path21277" />
    <path
       id="path34297"
       style="fill:#000000;fill-opacity:1;stroke:none;stroke-width:1.04298;stroke-linecap:butt;stroke-linejoin:miter;stroke-miterlimit:4;stroke-dasharray:none;stroke-opacity:1"
       d="m 126.95364,93.69946 h 0.89999 m 0,0 c 0,-0.49703 -0.40293,-0.89996 -0.89999,-0.89996 -0.49702,0 -0.90001,0.40293 -0.90001,0.89996 0,0.49703 0.40293,0.89997 0.89995,0.89997 0.49706,0 0.90005,-0.40294 0.90005,-0.89997 z" />
    <path
       style="fill:none;stroke:#000000;stroke-width:0.4;stroke-linecap:butt;stroke-linejoin:miter;stroke-dasharray:none;stroke-opacity:1"
       d="m 161.95364,93.69946 v 39.24965"
       id="path35131" />
    <path
       style="fill:none;stroke:#000000;stroke-width:0.4;stroke-linecap:butt;stroke-linejoin:miter;stroke-dasharray:none;stroke-opacity:1"
       d="m 161.95364,134.42883 v 10.27063"
       id="path35133" />
    <g
       id="g36430"
       transform="translate(51.953642,-86.30054)">
      <g
         id="g35127"
         transform="rotate(90,-2.625,127.625)">
        <path
           style="fill:none;stroke:#000000;stroke-width:0.5;stroke-linecap:butt;stroke-linejoin:miter;stroke-miterlimit:4;stroke-dasharray:none;stroke-opacity:1"
           d="M 89,18 V 12"
           id="path35123" />
        <path
           style="fill:none;stroke:#000000;stroke-width:0.5;stroke-linecap:butt;stroke-linejoin:miter;stroke-miterlimit:4;stroke-dasharray:none;stroke-opacity:1"
           d="M 90.5,18 V 12"
           id="path35125" />
      </g>
      <path
         id="path35129"
         style="fill:none;stroke:#000000;stroke-width:0.405334;stroke-linecap:butt;stroke-linejoin:miter;stroke-miterlimit:4;stroke-dasharray:none;stroke-opacity:1"
         d="m 107.25142,217.39935 h 1.9 m -0.95,0.95 v -1.9" />
      <path
         style="fill:none;stroke:#ffffff;stroke-width:0.4;stroke-linecap:butt;stroke-linejoin:miter;stroke-miterlimit:4;stroke-dasharray:none;stroke-opacity:1"
         d="m 107,220 h 6"
         id="path35135" />
    </g>
    <path
       style="fill:none;stroke:#000000;stroke-width:0.4;stroke-linecap:butt;stroke-linejoin:miter;stroke-dasharray:none;stroke-opacity:1"
       d="m 171.95364,93.69946 v 39.24965"
       id="path36432" />
    <path
       style="fill:none;stroke:#000000;stroke-width:0.4;stroke-linecap:butt;stroke-linejoin:miter;stroke-dasharray:none;stroke-opacity:1"
       d="m 171.95364,134.56414 v 10.27063"
       id="path36434" />
    <g
       id="g36446"
       transform="translate(61.953642,-86.30054)">
      <g
         id="g36440"
         transform="rotate(90,-2.625,127.625)">
        <path
           style="fill:none;stroke:#000000;stroke-width:0.5;stroke-linecap:butt;stroke-linejoin:miter;stroke-miterlimit:4;stroke-dasharray:none;stroke-opacity:1"
           d="M 89,18 V 12"
           id="path36436" />
        <path
           style="fill:none;stroke:#000000;stroke-width:0.5;stroke-linecap:butt;stroke-linejoin:miter;stroke-miterlimit:4;stroke-dasharray:none;stroke-opacity:1"
           d="M 90.5,18 V 12"
           id="path36438" />
      </g>
      <path
         id="path36442"
         style="fill:none;stroke:#000000;stroke-width:0.405334;stroke-linecap:butt;stroke-linejoin:miter;stroke-miterlimit:4;stroke-dasharray:none;stroke-opacity:1"
         d="m 107.25142,217.39935 h 1.9 m -0.95,0.95 v -1.9" />
      <path
         style="fill:none;stroke:#ffffff;stroke-width:0.4;stroke-linecap:butt;stroke-linejoin:miter;stroke-miterlimit:4;stroke-dasharray:none;stroke-opacity:1"
         d="m 107,220 h 6"
         id="path36444" />
    </g>
    <path
       id="path36877"
       style="fill:#000000;fill-opacity:1;stroke:none;stroke-width:1.04298;stroke-linecap:butt;stroke-linejoin:miter;stroke-miterlimit:4;stroke-dasharray:none;stroke-opacity:1"
       d="m 161.95364,121.69946 h 0.89999 m 0,0 c 0,-0.49703 -0.40293,-0.89996 -0.89999,-0.89996 -0.49702,0 -0.90001,0.40293 -0.90001,0.89996 0,0.49703 0.40293,0.89997 0.89995,0.89997 0.49706,0 0.90005,-0.40294 0.90005,-0.89997 z" />
    <path
       id="path37309"
       style="fill:#000000;fill-opacity:1;stroke:none;stroke-width:1.04298;stroke-linecap:butt;stroke-linejoin:miter;stroke-miterlimit:4;stroke-dasharray:none;stroke-opacity:1"
       d="m 161.95364,144.69946 h 0.89999 m 0,0 c 0,-0.49703 -0.40293,-0.89996 -0.89999,-0.89996 -0.49702,0 -0.90001,0.40293 -0.90001,0.89996 0,0.49703 0.40293,0.89997 0.89995,0.89997 0.49706,0 0.90005,-0.40294 0.90005,-0.89997 z" />
    <path
       id="path37311"
       style="fill:#000000;fill-opacity:1;stroke:none;stroke-width:1.04298;stroke-linecap:butt;stroke-linejoin:miter;stroke-miterlimit:4;stroke-dasharray:none;stroke-opacity:1"
       d="m 171.95364,144.69946 h 0.89999 m 0,0 c 0,-0.49703 -0.40293,-0.89996 -0.89999,-0.89996 -0.49702,0 -0.90001,0.40293 -0.90001,0.89996 0,0.49703 0.40293,0.89997 0.89995,0.89997 0.49706,0 0.90005,-0.40294 0.90005,-0.89997 z" />
    <path
       id="path37745"
       style="fill:#000000;fill-opacity:1;stroke:none;stroke-width:1.04298;stroke-linecap:butt;stroke-linejoin:miter;stroke-miterlimit:4;stroke-dasharray:none;stroke-opacity:1"
       d="m 161.95364,93.69946 h 0.89999 m 0,0 c 0,-0.49703 -0.40293,-0.89996 -0.89999,-0.89996 -0.49702,0 -0.90001,0.40293 -0.90001,0.89996 0,0.49703 0.40293,0.89997 0.89995,0.89997 0.49706,0 0.90005,-0.40294 0.90005,-0.89997 z" />
    <path
       id="path37747"
       style="fill:#000000;fill-opacity:1;stroke:none;stroke-width:1.04298;stroke-linecap:butt;stroke-linejoin:miter;stroke-miterlimit:4;stroke-dasharray:none;stroke-opacity:1"
       d="m 171.95364,93.69946 h 0.89999 m 0,0 c 0,-0.49703 -0.40293,-0.89996 -0.89999,-0.89996 -0.49702,0 -0.90001,0.40293 -0.90001,0.89996 0,0.49703 0.40293,0.89997 0.89995,0.89997 0.49706,0 0.90005,-0.40294 0.90005,-0.89997 z" />
    <g
       id="g38185"
       transform="rotate(-90,168.32655,-8.627092)">
      <path
         id="path38183"
         style="fill:none;fill-opacity:0.5;stroke:#000000;stroke-width:0.5;stroke-linecap:round;stroke-linejoin:round;stroke-dasharray:none"
         d="m 15.999998,10 c 0,0.552285 -0.447715,1 -1,1 -0.552285,0 -1,-0.447715 -1,-1 0,-0.5522847 0.447715,-1 1,-1 0.552285,0 1,0.4477153 1,1 z" />
    </g>
    <g
       id="g38189"
       transform="rotate(-90,69.326551,12.372908)">
      <path
         id="path38187"
         style="fill:none;fill-opacity:0.5;stroke:#000000;stroke-width:0.5;stroke-linecap:round;stroke-linejoin:round;stroke-dasharray:none"
         d="m 15.999998,10 c 0,0.552285 -0.447715,1 -1,1 -0.552285,0 -1,-0.447715 -1,-1 0,-0.5522847 0.447715,-1 1,-1 0.552285,0 1,0.4477153 1,1 z" />
    </g>
    <path
       id="path39957"
       style="fill:#000000;fill-opacity:1;stroke:none;stroke-width:1.04298;stroke-linecap:butt;stroke-linejoin:miter;stroke-miterlimit:4;stroke-dasharray:none;stroke-opacity:1"
       d="m 81.953642,144.69946 h 0.89999 m 0,0 c 0,-0.49703 -0.40293,-0.89996 -0.89999,-0.89996 -0.49702,0 -0.90001,0.40293 -0.90001,0.89996 0,0.49703 0.40293,0.89997 0.89995,0.89997 0.49706,0 0.90005,-0.40294 0.90005,-0.89997 z" />
    <g
       aria-label="R3"
       id="text41261"
       style="font-size:3.88056px;line-height:125%;font-family:Sans;-inkscape-font-specification:Sans;letter-spacing:0px;word-spacing:0px;stroke:#000000;stroke-width:0">
      <path
         d="m 140.95364,78.650192 v -2.777783 h 1.23162 q 0.37138,0 0.56465,0.07579 0.19327,0.0739 0.30886,0.263378 0.11558,0.18948 0.11558,0.418752 0,0.295589 -0.19138,0.498333 -0.19137,0.202744 -0.59117,0.257694 0.1459,0.07011 0.22169,0.13832 0.16106,0.147795 0.30506,0.369487 l 0.48318,0.756027 h -0.46234 l -0.36759,-0.577915 q -0.16106,-0.250114 -0.26527,-0.382751 -0.10422,-0.132636 -0.18759,-0.185691 -0.0815,-0.05305 -0.16674,-0.0739 -0.0625,-0.01326 -0.20464,-0.01326 h -0.42633 v 1.233518 z m 0.36759,-1.551845 h 0.79013 q 0.25201,0 0.39412,-0.05116 0.14211,-0.05306 0.21601,-0.166743 0.0739,-0.115583 0.0739,-0.250114 0,-0.19706 -0.14401,-0.324012 -0.14211,-0.126952 -0.45096,-0.126952 h -0.87919 z"
         style="line-height:125%;font-family:sans-serif;-inkscape-font-specification:sans-serif"
         id="path92824" />
      <path
         d="m 143.61394,77.916903 0.34107,-0.04548 q 0.0587,0.289905 0.19895,0.418751 0.14211,0.126952 0.34486,0.126952 0.24064,0 0.40549,-0.166743 0.16674,-0.166742 0.16674,-0.413067 0,-0.234956 -0.15348,-0.38654 -0.15348,-0.153479 -0.39033,-0.153479 -0.0966,0 -0.24064,0.0379 l 0.0379,-0.299379 q 0.0341,0.0038 0.0549,0.0038 0.2179,0 0.39222,-0.113688 0.17432,-0.113688 0.17432,-0.350539 0,-0.187585 -0.12695,-0.310748 -0.12695,-0.123162 -0.3278,-0.123162 -0.19896,0 -0.33159,0.125057 -0.13264,0.125057 -0.17053,0.375171 l -0.34107,-0.06063 q 0.0625,-0.34296 0.28422,-0.530546 0.22169,-0.18948 0.55139,-0.18948 0.22738,0 0.41875,0.09853 0.19138,0.09664 0.2918,0.265272 0.10232,0.168638 0.10232,0.358118 0,0.180007 -0.0966,0.327802 -0.0966,0.147794 -0.28612,0.234955 0.24632,0.05684 0.38275,0.236851 0.13643,0.178112 0.13643,0.447174 0,0.363802 -0.26528,0.617706 -0.26527,0.252009 -0.67076,0.252009 -0.36569,0 -0.60823,-0.217902 -0.24064,-0.217903 -0.27475,-0.564652 z"
         style="line-height:125%;font-family:sans-serif;-inkscape-font-specification:sans-serif"
         id="path92826" />
    </g>
    <g
       aria-label="C1"
       id="text41265"
       style="font-size:3.88056px;line-height:125%;font-family:Sans;-inkscape-font-specification:Sans;letter-spacing:0px;word-spacing:0px;stroke:#000000;stroke-width:0">
      <path
         d="m 74.986835,103.67817 0.367592,0.0928 q -0.115583,0.45285 -0.416857,0.6916 -0.299379,0.23685 -0.733289,0.23685 -0.449069,0 -0.731395,-0.1819 -0.280431,-0.1838 -0.428226,-0.53055 -0.1459,-0.34675 -0.1459,-0.74466 0,-0.43391 0.164848,-0.75602 0.166743,-0.32401 0.471807,-0.49076 0.306958,-0.16863 0.67455,-0.16863 0.416857,0 0.701078,0.21221 0.28422,0.21222 0.396014,0.59687 l -0.361908,0.0853 q -0.09664,-0.30317 -0.280431,-0.44149 -0.183796,-0.13832 -0.462332,-0.13832 -0.320222,0 -0.53623,0.15348 -0.214113,0.15348 -0.301274,0.41307 -0.08716,0.25769 -0.08716,0.53244 0,0.35433 0.10232,0.6196 0.104214,0.26338 0.322116,0.39412 0.217903,0.13074 0.471807,0.13074 0.308853,0 0.522966,-0.17811 0.214113,-0.17811 0.289905,-0.52865 z"
         style="line-height:125%;font-family:sans-serif;-inkscape-font-specification:sans-serif"
         id="path92702" />
      <path
         d="m 76.953642,104.6521 h -0.341065 v -2.17334 q -0.123162,0.11748 -0.324011,0.23495 -0.198955,0.11748 -0.358118,0.17622 v -0.32969 q 0.286115,-0.13454 0.500228,-0.32591 0.214113,-0.19138 0.303169,-0.37138 h 0.219797 z"
         style="line-height:125%;font-family:sans-serif;-inkscape-font-specification:sans-serif"
         id="path92704" />
    </g>
    <g
       aria-label="C3"
       id="text41269"
       style="font-size:3.88056px;line-height:125%;font-family:Sans;-inkscape-font-specification:Sans;letter-spacing:0px;word-spacing:0px;stroke:#000000;stroke-width:0">
      <path
         d="m 154.45061,132.67626 0.36759,0.0928 q -0.11558,0.45286 -0.41685,0.6916 -0.29938,0.23685 -0.73329,0.23685 -0.44907,0 -0.7314,-0.1819 -0.28043,-0.18379 -0.42822,-0.53054 -0.1459,-0.34675 -0.1459,-0.74466 0,-0.43391 0.16484,-0.75603 0.16675,-0.32401 0.47181,-0.49075 0.30696,-0.16864 0.67455,-0.16864 0.41686,0 0.70108,0.21222 0.28422,0.21221 0.39601,0.59686 l -0.36191,0.0853 q -0.0966,-0.30317 -0.28043,-0.44149 -0.18379,-0.13832 -0.46233,-0.13832 -0.32022,0 -0.53623,0.15348 -0.21411,0.15347 -0.30127,0.41306 -0.0872,0.2577 -0.0872,0.53244 0,0.35433 0.10232,0.6196 0.10421,0.26338 0.32211,0.39412 0.21791,0.13074 0.47181,0.13074 0.30885,0 0.52297,-0.17811 0.21411,-0.17811 0.2899,-0.52865 z"
         style="line-height:125%;font-family:sans-serif;-inkscape-font-specification:sans-serif"
         id="path92854" />
      <path
         d="m 155.13464,132.9169 0.34106,-0.0455 q 0.0587,0.2899 0.19895,0.41875 0.14211,0.12695 0.34486,0.12695 0.24064,0 0.40549,-0.16674 0.16674,-0.16674 0.16674,-0.41307 0,-0.23495 -0.15348,-0.38654 -0.15348,-0.15348 -0.39033,-0.15348 -0.0966,0 -0.24064,0.0379 l 0.0379,-0.29938 q 0.0341,0.004 0.0549,0.004 0.2179,0 0.39222,-0.11369 0.17432,-0.11369 0.17432,-0.35054 0,-0.18758 -0.12695,-0.31075 -0.12695,-0.12316 -0.3278,-0.12316 -0.19895,0 -0.33159,0.12506 -0.13264,0.12506 -0.17053,0.37517 l -0.34107,-0.0606 q 0.0625,-0.34296 0.28422,-0.53055 0.22169,-0.18948 0.55139,-0.18948 0.22738,0 0.41875,0.0985 0.19138,0.0966 0.2918,0.26527 0.10232,0.16864 0.10232,0.35812 0,0.18001 -0.0966,0.3278 -0.0966,0.1478 -0.28612,0.23496 0.24633,0.0568 0.38275,0.23685 0.13643,0.17811 0.13643,0.44717 0,0.3638 -0.26528,0.61771 -0.26527,0.25201 -0.67076,0.25201 -0.36569,0 -0.60823,-0.21791 -0.24064,-0.2179 -0.27474,-0.56465 z"
         style="line-height:125%;font-family:sans-serif;-inkscape-font-specification:sans-serif"
         id="path92856" />
    </g>
    <g
       aria-label="C4"
       id="text41273"
       style="font-size:3.88056px;line-height:125%;font-family:Sans;-inkscape-font-specification:Sans;letter-spacing:0px;word-spacing:0px;stroke:#000000;stroke-width:0">
      <path
         d="m 179.04172,132.67817 0.36759,0.0928 q -0.11558,0.45285 -0.41685,0.6916 -0.29938,0.23685 -0.73329,0.23685 -0.44907,0 -0.7314,-0.1819 -0.28043,-0.1838 -0.42822,-0.53055 -0.1459,-0.34675 -0.1459,-0.74466 0,-0.43391 0.16484,-0.75602 0.16675,-0.32401 0.47181,-0.49076 0.30696,-0.16863 0.67455,-0.16863 0.41686,0 0.70108,0.21221 0.28422,0.21222 0.39601,0.59687 l -0.3619,0.0853 q -0.0966,-0.30317 -0.28044,-0.44149 -0.18379,-0.13832 -0.46233,-0.13832 -0.32022,0 -0.53623,0.15348 -0.21411,0.15348 -0.30127,0.41307 -0.0872,0.25769 -0.0872,0.53244 0,0.35433 0.10232,0.6196 0.10421,0.26338 0.32211,0.39412 0.21791,0.13074 0.47181,0.13074 0.30885,0 0.52297,-0.17811 0.21411,-0.17811 0.2899,-0.52865 z"
         style="line-height:125%;font-family:sans-serif;-inkscape-font-specification:sans-serif"
         id="path92868" />
      <path
         d="m 180.81715,133.6521 v -0.66508 h -1.20509 v -0.31264 l 1.26762,-1.80006 h 0.27854 v 1.80006 h 0.37517 v 0.31264 h -0.37517 v 0.66508 z m 0,-0.97772 v -1.25247 l -0.86971,1.25247 z"
         style="line-height:125%;font-family:sans-serif;-inkscape-font-specification:sans-serif"
         id="path92870" />
    </g>
    <g
       aria-label="22n"
       id="text42966"
       style="font-size:3.175px;line-height:100%;font-family:Sans;-inkscape-font-specification:Sans;letter-spacing:0px;word-spacing:0px;stroke:#000000;stroke-width:0">
      <path
         d="m 111.45613,71.431262 v 0.268201 h -1.50223 q -0.003,-0.100769 0.0326,-0.193787 0.0574,-0.153479 0.18294,-0.302307 0.12712,-0.148828 0.36587,-0.344165 0.37052,-0.303857 0.50074,-0.480591 0.13022,-0.178283 0.13022,-0.336413 0,-0.165882 -0.11937,-0.279053 -0.11782,-0.114722 -0.30851,-0.114722 -0.20153,0 -0.32246,0.120923 -0.12092,0.120923 -0.12247,0.334863 l -0.2868,-0.02946 q 0.0295,-0.320911 0.22169,-0.488342 0.19223,-0.168982 0.51625,-0.168982 0.32711,0 0.51779,0.181384 0.19069,0.181384 0.19069,0.449585 0,0.136426 -0.0558,0.268201 -0.0558,0.131774 -0.18604,0.277502 -0.12867,0.145728 -0.42943,0.399976 -0.25115,0.210839 -0.32246,0.286804 -0.0713,0.07441 -0.11782,0.150378 z"
         style="font-family:sans-serif;-inkscape-font-specification:sans-serif;text-align:end;text-anchor:end"
         id="path92812" />
      <path
         d="m 113.22191,71.431262 v 0.268201 h -1.50223 q -0.003,-0.100769 0.0326,-0.193787 0.0574,-0.153479 0.18293,-0.302307 0.12712,-0.148828 0.36587,-0.344165 0.37052,-0.303857 0.50074,-0.480591 0.13023,-0.178283 0.13023,-0.336413 0,-0.165882 -0.11937,-0.279053 -0.11783,-0.114722 -0.30851,-0.114722 -0.20154,0 -0.32246,0.120923 -0.12093,0.120923 -0.12248,0.334863 l -0.2868,-0.02946 q 0.0294,-0.320911 0.22169,-0.488342 0.19224,-0.168982 0.51625,-0.168982 0.32711,0 0.5178,0.181384 0.19068,0.181384 0.19068,0.449585 0,0.136426 -0.0558,0.268201 -0.0558,0.131774 -0.18603,0.277502 -0.12868,0.145728 -0.42943,0.399976 -0.25115,0.210839 -0.32247,0.286804 -0.0713,0.07441 -0.11782,0.150378 z"
         style="font-family:sans-serif;-inkscape-font-specification:sans-serif;text-align:end;text-anchor:end"
         id="path92814" />
      <path
         d="m 113.59863,71.699463 v -1.646411 h 0.25115 v 0.234094 q 0.18139,-0.271301 0.524,-0.271301 0.14883,0 0.27285,0.05426 0.12558,0.05271 0.18759,0.139526 0.062,0.08682 0.0868,0.206189 0.0155,0.07752 0.0155,0.271302 v 1.012341 h -0.27906 v -1.001489 q 0,-0.170533 -0.0326,-0.254248 -0.0326,-0.08527 -0.11627,-0.134876 -0.0822,-0.05116 -0.19379,-0.05116 -0.17828,0 -0.30851,0.113172 -0.12867,0.113171 -0.12867,0.429431 v 0.89917 z"
         style="font-family:sans-serif;-inkscape-font-specification:sans-serif;text-align:end;text-anchor:end"
         id="path92816" />
    </g>
    <g
       aria-label="L1"
       id="text43808"
       style="font-size:3.88056px;line-height:125%;font-family:Sans;-inkscape-font-specification:Sans;letter-spacing:0px;word-spacing:0px;stroke:#000000;stroke-width:0">
      <path
         d="m 147.95364,98.488617 v -2.777784 h 0.36759 v 2.449983 h 1.36805 v 0.327801 z"
         style="line-height:125%;font-family:sans-serif;-inkscape-font-specification:sans-serif"
         id="path92838" />
      <path
         d="m 151.27334,98.488617 h -0.34107 v -2.173341 q -0.12316,0.117478 -0.32401,0.234956 -0.19895,0.117478 -0.35812,0.176217 v -0.329696 q 0.28612,-0.134532 0.50023,-0.325907 0.21411,-0.191375 0.30317,-0.371382 h 0.2198 z"
         style="line-height:125%;font-family:sans-serif;-inkscape-font-specification:sans-serif"
         id="path92840" />
    </g>
    <g
       aria-label="4.7µH"
       id="text43814"
       style="font-size:3.175px;line-height:1;stroke-width:0.264583">
      <path
         d="m 146.93962,101.9722 v -0.54415 h -0.98598 v -0.2558 l 1.03714,-1.472781 h 0.2279 v 1.472781 h 0.30695 v 0.2558 h -0.30695 v 0.54415 z m 0,-0.79995 v -1.02475 l -0.71158,1.02475 z"
         style="-inkscape-font-specification:sans-serif"
         id="path92843" />
      <path
         d="m 147.96747,101.9722 v -0.31781 h 0.31781 v 0.31781 z"
         style="-inkscape-font-specification:sans-serif"
         id="path92845" />
      <path
         d="m 148.71161,99.997125 v -0.2682 h 1.47123 v 0.217041 q -0.21704,0.230994 -0.43098,0.613914 -0.21239,0.38292 -0.32867,0.78755 -0.0837,0.28525 -0.10697,0.62477 h -0.2868 q 0.005,-0.2682 0.10542,-0.64802 0.10077,-0.37983 0.28835,-0.73174 0.18914,-0.35347 0.40153,-0.595315 z"
         style="-inkscape-font-specification:sans-serif"
         id="path92847" />
      <path
         d="m 151.90521,100.32579 v 1.64641 h -0.24959 v -0.19534 q -0.0806,0.12403 -0.15969,0.17053 -0.10852,0.0636 -0.25269,0.0636 -0.12868,0 -0.2279,-0.0512 -0.0744,-0.0388 -0.16433,-0.15348 v 0.79685 h -0.27595 v -2.27738 h 0.27595 v 0.69763 q 0,0.37982 0.0403,0.49299 0.0403,0.11162 0.13023,0.17674 0.0915,0.0651 0.20928,0.0651 0.12403,0 0.2217,-0.0682 0.0977,-0.0682 0.13797,-0.17519 0.0403,-0.10852 0.0403,-0.48679 v -0.70228 z"
         style="-inkscape-font-specification:sans-serif"
         id="path92849" />
      <path
         d="m 152.41061,101.9722 v -2.272731 h 0.30075 v 0.933281 h 1.18133 v -0.933281 h 0.30075 v 2.272731 h -0.30075 v -1.07125 h -1.18133 v 1.07125 z"
         style="-inkscape-font-specification:sans-serif"
         id="path92851" />
    </g>
    <g
       aria-label="22µF"
       id="text44245"
       style="font-size:3.175px;line-height:1;stroke-width:0.264583">
      <path
         d="m 151.39739,137.71329 v 0.2682 h -1.50223 q -0.003,-0.10077 0.0326,-0.19379 0.0574,-0.15347 0.18293,-0.3023 0.12712,-0.14883 0.36587,-0.34417 0.37052,-0.30386 0.50074,-0.48059 0.13023,-0.17828 0.13023,-0.33641 0,-0.16588 -0.11937,-0.27905 -0.11783,-0.11473 -0.30851,-0.11473 -0.20154,0 -0.32246,0.12093 -0.12093,0.12092 -0.12248,0.33486 l -0.2868,-0.0295 q 0.0295,-0.32091 0.22169,-0.48834 0.19224,-0.16898 0.51625,-0.16898 0.32711,0 0.5178,0.18138 0.19068,0.18139 0.19068,0.44959 0,0.13642 -0.0558,0.2682 -0.0558,0.13177 -0.18603,0.2775 -0.12868,0.14573 -0.42943,0.39998 -0.25115,0.21084 -0.32246,0.2868 -0.0713,0.0744 -0.11783,0.15038 z"
         style="-inkscape-font-specification:sans-serif"
         id="path92859" />
      <path
         d="m 153.16318,137.71329 v 0.2682 h -1.50224 q -0.003,-0.10077 0.0326,-0.19379 0.0574,-0.15347 0.18293,-0.3023 0.12713,-0.14883 0.36587,-0.34417 0.37052,-0.30386 0.50075,-0.48059 0.13022,-0.17828 0.13022,-0.33641 0,-0.16588 -0.11937,-0.27905 -0.11782,-0.11473 -0.30851,-0.11473 -0.20154,0 -0.32246,0.12093 -0.12092,0.12092 -0.12247,0.33486 l -0.28681,-0.0295 q 0.0295,-0.32091 0.2217,-0.48834 0.19223,-0.16898 0.51624,-0.16898 0.32711,0 0.5178,0.18138 0.19069,0.18139 0.19069,0.44959 0,0.13642 -0.0558,0.2682 -0.0558,0.13177 -0.18604,0.2775 -0.12867,0.14573 -0.42943,0.39998 -0.25115,0.21084 -0.32246,0.2868 -0.0713,0.0744 -0.11782,0.15038 z"
         style="-inkscape-font-specification:sans-serif"
         id="path92861" />
      <path
         d="m 154.90881,136.33508 v 1.64641 h -0.2496 v -0.19534 q -0.0806,0.12403 -0.15968,0.17054 -0.10852,0.0636 -0.2527,0.0636 -0.12867,0 -0.22789,-0.0512 -0.0744,-0.0388 -0.16433,-0.15348 v 0.79685 h -0.27595 v -2.27738 h 0.27595 v 0.69763 q 0,0.37982 0.0403,0.49299 0.0403,0.11163 0.13022,0.17674 0.0915,0.0651 0.20929,0.0651 0.12402,0 0.22169,-0.0682 0.0977,-0.0682 0.13798,-0.17519 0.0403,-0.10852 0.0403,-0.48679 v -0.70228 z"
         style="-inkscape-font-specification:sans-serif"
         id="path92863" />
      <path
         d="m 155.4204,137.98149 v -2.27273 h 1.53324 v 0.2682 h -1.23248 v 0.70384 h 1.0666 v 0.2682 h -1.0666 v 1.03249 z"
         style="-inkscape-font-specification:sans-serif"
         id="path92865" />
    </g>
    <g
       aria-label="22µF"
       id="text44251"
       style="font-size:3.175px;line-height:1;stroke-width:0.264583">
      <path
         d="m 178.45612,137.71329 v 0.2682 h -1.50223 q -0.003,-0.10077 0.0326,-0.19379 0.0574,-0.15347 0.18293,-0.3023 0.12713,-0.14883 0.36587,-0.34417 0.37052,-0.30386 0.50075,-0.48059 0.13022,-0.17828 0.13022,-0.33641 0,-0.16588 -0.11937,-0.27905 -0.11782,-0.11473 -0.30851,-0.11473 -0.20154,0 -0.32246,0.12093 -0.12092,0.12092 -0.12247,0.33486 l -0.28681,-0.0295 q 0.0295,-0.32091 0.22169,-0.48834 0.19224,-0.16898 0.51625,-0.16898 0.32711,0 0.5178,0.18138 0.19068,0.18139 0.19068,0.44959 0,0.13642 -0.0558,0.2682 -0.0558,0.13177 -0.18603,0.2775 -0.12868,0.14573 -0.42943,0.39998 -0.25115,0.21084 -0.32246,0.2868 -0.0713,0.0744 -0.11783,0.15038 z"
         style="-inkscape-font-specification:sans-serif"
         id="path92873" />
      <path
         d="m 180.22191,137.71329 v 0.2682 h -1.50224 q -0.003,-0.10077 0.0326,-0.19379 0.0574,-0.15347 0.18294,-0.3023 0.12712,-0.14883 0.36586,-0.34417 0.37052,-0.30386 0.50075,-0.48059 0.13022,-0.17828 0.13022,-0.33641 0,-0.16588 -0.11937,-0.27905 -0.11782,-0.11473 -0.30851,-0.11473 -0.20154,0 -0.32246,0.12093 -0.12092,0.12092 -0.12247,0.33486 l -0.28681,-0.0295 q 0.0295,-0.32091 0.2217,-0.48834 0.19223,-0.16898 0.51624,-0.16898 0.32712,0 0.5178,0.18138 0.19069,0.18139 0.19069,0.44959 0,0.13642 -0.0558,0.2682 -0.0558,0.13177 -0.18604,0.2775 -0.12867,0.14573 -0.42943,0.39998 -0.25115,0.21084 -0.32246,0.2868 -0.0713,0.0744 -0.11782,0.15038 z"
         style="-inkscape-font-specification:sans-serif"
         id="path92875" />
      <path
         d="m 181.96754,136.33508 v 1.64641 h -0.2496 v -0.19534 q -0.0806,0.12403 -0.15968,0.17054 -0.10852,0.0636 -0.2527,0.0636 -0.12867,0 -0.22789,-0.0512 -0.0744,-0.0388 -0.16433,-0.15348 v 0.79685 h -0.27595 v -2.27738 h 0.27595 v 0.69763 q 0,0.37982 0.0403,0.49299 0.0403,0.11163 0.13022,0.17674 0.0915,0.0651 0.20929,0.0651 0.12402,0 0.22169,-0.0682 0.0977,-0.0682 0.13798,-0.17519 0.0403,-0.10852 0.0403,-0.48679 v -0.70228 z"
         style="-inkscape-font-specification:sans-serif"
         id="path92877" />
      <path
         d="m 182.47914,137.98149 v -2.27273 h 1.53324 v 0.2682 h -1.23249 v 0.70384 h 1.0666 v 0.2682 h -1.0666 v 1.03249 z"
         style="-inkscape-font-specification:sans-serif"
         id="path92879" />
    </g>
    <g
       aria-label="110k"
       id="text44682"
       style="font-size:3.175px;line-height:100%;font-family:Sans;-inkscape-font-specification:Sans;letter-spacing:0px;word-spacing:0px;stroke:#000000;stroke-width:0">
      <path
         d="m 110.7908,118.66071 h -0.27905 v -1.77818 q -0.10077,0.0961 -0.2651,0.19223 -0.16278,0.0961 -0.29301,0.14418 v -0.26975 q 0.2341,-0.11007 0.40928,-0.26665 0.17518,-0.15658 0.24805,-0.30386 h 0.17983 z"
         style="font-family:sans-serif;-inkscape-font-specification:sans-serif;text-align:end;text-anchor:end"
         id="path92746" />
      <path
         d="m 112.32094,118.66071 h -0.27905 v -1.77818 q -0.10077,0.0961 -0.2651,0.19223 -0.16278,0.0961 -0.29301,0.14418 v -0.26975 q 0.2341,-0.11007 0.40928,-0.26665 0.17518,-0.15658 0.24805,-0.30386 h 0.17983 z"
         style="font-family:sans-serif;-inkscape-font-specification:sans-serif;text-align:end;text-anchor:end"
         id="path92748" />
      <path
         d="m 113.03562,117.53985 q 0,-0.40307 0.0822,-0.64802 0.0837,-0.2465 0.2465,-0.37982 0.16433,-0.13333 0.41237,-0.13333 0.18294,0 0.32092,0.0744 0.13797,0.0729 0.22789,0.21239 0.0899,0.13797 0.14108,0.33796 0.0512,0.19844 0.0512,0.5364 0,0.39998 -0.0822,0.64647 -0.0822,0.24495 -0.2465,0.37983 -0.16278,0.13332 -0.41238,0.13332 -0.32866,0 -0.51624,-0.23564 -0.2248,-0.28371 -0.2248,-0.92398 z m 0.28681,0 q 0,0.55966 0.13022,0.74569 0.13178,0.18449 0.32401,0.18449 0.19224,0 0.32247,-0.18604 0.13177,-0.18603 0.13177,-0.74414 0,-0.5612 -0.13177,-0.74569 -0.13023,-0.18448 -0.32557,-0.18448 -0.19223,0 -0.30695,0.16278 -0.14418,0.20774 -0.14418,0.76739 z"
         style="font-family:sans-serif;-inkscape-font-specification:sans-serif;text-align:end;text-anchor:end"
         id="path92750" />
      <path
         d="m 114.88047,118.66071 v -2.27273 h 0.27906 v 1.29605 l 0.66042,-0.66973 h 0.36122 l -0.62942,0.61082 0.69298,1.03559 h -0.34416 l -0.54416,-0.84181 -0.19688,0.18914 v 0.65267 z"
         style="font-family:sans-serif;-inkscape-font-specification:sans-serif;text-align:end;text-anchor:end"
         id="path92752" />
    </g>
    <g
       aria-label="15k"
       id="text44686"
       style="font-size:3.175px;line-height:100%;font-family:Sans;-inkscape-font-specification:Sans;letter-spacing:0px;word-spacing:0px;stroke:#000000;stroke-width:0">
      <path
         d="m 101.7908,135.98149 h -0.27905 v -1.77818 q -0.10077,0.0961 -0.2651,0.19223 -0.16278,0.0961 -0.293,0.14418 v -0.26975 q 0.23409,-0.11007 0.40927,-0.26665 0.17519,-0.15658 0.24805,-0.30386 h 0.17983 z"
         style="font-family:sans-serif;-inkscape-font-specification:sans-serif;text-align:end;text-anchor:end"
         id="path92729" />
      <path
         d="m 102.50549,135.38618 0.293,-0.0248 q 0.0326,0.21394 0.15038,0.32246 0.11937,0.10698 0.28681,0.10698 0.20153,0 0.34106,-0.15193 0.13953,-0.15193 0.13953,-0.40308 0,-0.23874 -0.13488,-0.37672 -0.13332,-0.13798 -0.35036,-0.13798 -0.13488,0 -0.2434,0.062 -0.10852,0.0605 -0.17053,0.15813 l -0.262,-0.0341 0.22014,-1.16737 h 1.13016 v 0.26665 h -0.90692 l -0.12247,0.61081 q 0.20464,-0.14262 0.42943,-0.14262 0.29766,0 0.50229,0.20619 0.20464,0.20618 0.20464,0.5302 0,0.3085 -0.17983,0.5333 -0.21859,0.27595 -0.59686,0.27595 -0.31006,0 -0.50695,-0.17363 -0.19534,-0.17364 -0.22324,-0.46044 z"
         style="font-family:sans-serif;-inkscape-font-specification:sans-serif;text-align:end;text-anchor:end"
         id="path92731" />
      <path
         d="m 104.35034,135.98149 v -2.27273 h 0.27905 v 1.29605 l 0.66042,-0.66973 h 0.36122 l -0.62942,0.61082 0.69299,1.03559 h -0.34417 l -0.54415,-0.84181 -0.19689,0.18914 v 0.65267 z"
         style="font-family:sans-serif;-inkscape-font-specification:sans-serif;text-align:end;text-anchor:end"
         id="path92733" />
    </g>
    <g
       aria-label="GND"
       id="text16635"
       style="font-size:3.88056px;line-height:125%;font-family:Sans;-inkscape-font-specification:Sans;letter-spacing:0px;word-spacing:0px;stroke:#000000;stroke-width:0">
      <path
         d="m 94.241229,153.43512 v -0.32591 l 1.176673,-0.002 v 1.03078 q -0.270957,0.21601 -0.558967,0.3259 -0.28801,0.10801 -0.591179,0.10801 -0.409278,0 -0.744658,-0.17432 -0.333486,-0.17622 -0.504018,-0.50781 -0.170533,-0.33159 -0.170533,-0.74087 0,-0.40549 0.168638,-0.75603 0.170532,-0.35243 0.488859,-0.52296 0.318328,-0.17054 0.73329,-0.17054 0.301274,0 0.543809,0.0985 0.24443,0.0966 0.38275,0.27096 0.138321,0.17432 0.210324,0.45475 l -0.331591,0.0909 q -0.06253,-0.21221 -0.155374,-0.33348 -0.09285,-0.12127 -0.265273,-0.19327 -0.172427,-0.0739 -0.38275,-0.0739 -0.252009,0 -0.435805,0.0777 -0.183796,0.0758 -0.297485,0.20085 -0.111793,0.12505 -0.174322,0.27474 -0.106109,0.2577 -0.106109,0.55897 0,0.37138 0.126952,0.6215 0.128847,0.25011 0.373277,0.37138 0.244429,0.12127 0.519176,0.12127 0.238745,0 0.466122,-0.0909 0.227377,-0.0928 0.344854,-0.19706 v -0.51728 z"
         style="line-height:125%;font-family:sans-serif;-inkscape-font-specification:sans-serif"
         id="path92722" />
      <path
         d="m 95.956027,154.52463 v -2.77779 h 0.377066 l 1.459,2.18092 v -2.18092 h 0.352433 v 2.77779 H 97.76746 l -1.458999,-2.18282 v 2.18282 z"
         style="line-height:125%;font-family:sans-serif;-inkscape-font-specification:sans-serif"
         id="path92724" />
      <path
         d="m 98.762233,154.52463 v -2.77779 h 0.956876 q 0.324011,0 0.494541,0.0398 0.23875,0.0549 0.40739,0.19896 0.21979,0.18569 0.3278,0.4756 0.1099,0.28801 0.1099,0.65939 0,0.31643 -0.0739,0.56086 -0.0739,0.24443 -0.18948,0.40549 -0.11559,0.15916 -0.25391,0.25201 -0.13642,0.0909 -0.33159,0.13832 -0.19327,0.0474 -0.445276,0.0474 z m 0.367592,-0.3278 h 0.593074 q 0.274746,0 0.430121,-0.0512 0.15727,-0.0512 0.25011,-0.14401 0.13074,-0.13074 0.20275,-0.35054 0.0739,-0.22169 0.0739,-0.53623 0,-0.4358 -0.144,-0.66886 -0.14211,-0.23496 -0.34675,-0.31454 -0.14779,-0.0568 -0.475595,-0.0568 h -0.5836 z"
         style="line-height:125%;font-family:sans-serif;-inkscape-font-specification:sans-serif"
         id="path92726" />
    </g>
    <path
       id="path16649"
       style="fill:#000000;fill-opacity:1;stroke:none;stroke-width:0.264583px;stroke-linecap:butt;stroke-linejoin:miter;stroke-opacity:1"
       d="m 59.953642,56.69973 v 3.99976 l 4.99538,-3.3e-4 c 0.0799,0 0.1022,0.0294 0.11749,0.0917 0.28868,1.30983 1.08788,2.10935 1.88713,2.9086 0.79883,-0.79883 1.5976,-1.5979 1.88667,-2.9065 0.0206,-0.064 0.0525,-0.0938 0.11322,-0.0938 l 5.00011,3.3e-4 v -4 z" />
    <path
       style="fill:#000000;fill-opacity:0.25;stroke:none;stroke-width:0.264583px;stroke-linecap:butt;stroke-linejoin:miter;stroke-opacity:1"
       d="m 72.953642,56.69949 h -12 v 4 h 12 z"
       id="path16651" />
    <g
       aria-label="4.5-16V"
       id="text16655"
       style="font-size:3.175px;line-height:100%;font-family:Sans;-inkscape-font-specification:Sans;letter-spacing:0px;word-spacing:0px;fill:#ffffff;stroke:#000000;stroke-width:0">
      <path
         d="m 62.354699,59.821133 v -0.457337 h -0.930176 v -0.381372 l 0.985986,-1.443323 h 0.36587 v 1.441773 h 0.282153 v 0.382922 h -0.282153 v 0.457337 z m 0,-0.840259 v -0.776697 l -0.522449,0.776697 z"
         style="font-weight:bold;font-family:sans-serif;-inkscape-font-specification:'sans-serif Bold'"
         id="path92678" />
      <path
         d="M 63.359289,59.821133 V 59.3855 h 0.435632 v 0.435633 z"
         style="font-weight:bold;font-family:sans-serif;-inkscape-font-specification:'sans-serif Bold'"
         id="path92680" />
      <path
         d="m 64.154589,59.236672 0.434082,-0.04496 q 0.0186,0.147278 0.110071,0.234094 0.09147,0.08527 0.21084,0.08527 0.136425,0 0.230993,-0.110071 0.09457,-0.111621 0.09457,-0.334863 0,-0.20929 -0.09457,-0.313159 -0.09302,-0.10542 -0.243396,-0.10542 -0.187585,0 -0.336413,0.165881 l -0.353467,-0.05116 0.223242,-1.182874 h 1.151868 v 0.407727 h -0.821655 l -0.06821,0.386023 q 0.145727,-0.07286 0.297656,-0.07286 0.289905,0 0.491443,0.21084 0.201538,0.21084 0.201538,0.547254 0,0.280603 -0.162781,0.500744 -0.221692,0.300757 -0.615466,0.300757 -0.31471,0 -0.513147,-0.168982 -0.198438,-0.168982 -0.237195,-0.454236 z"
         style="font-weight:bold;font-family:sans-serif;-inkscape-font-specification:'sans-serif Bold'"
         id="path92682" />
      <path
         d="m 65.95758,59.214968 v -0.435632 h 0.855761 v 0.435632 z"
         style="font-weight:bold;font-family:sans-serif;-inkscape-font-specification:'sans-serif Bold'"
         id="path92684" />
      <path
         d="m 68.086132,59.821133 h -0.435633 v -1.641761 q -0.238745,0.223243 -0.562756,0.330213 V 58.11426 q 0.170532,-0.05581 0.37052,-0.21084 0.199988,-0.156579 0.274402,-0.364319 h 0.353467 z"
         style="font-weight:bold;font-family:sans-serif;-inkscape-font-specification:'sans-serif Bold'"
         id="path92686" />
      <path
         d="m 70.213134,58.104958 -0.42168,0.04651 q -0.0155,-0.130224 -0.08061,-0.192236 -0.06511,-0.06201 -0.168982,-0.06201 -0.137976,0 -0.234094,0.124024 -0.09457,0.124023 -0.119373,0.516247 0.162781,-0.192236 0.404627,-0.192236 0.272851,0 0.466638,0.207739 0.195337,0.207739 0.195337,0.536401 0,0.348816 -0.204639,0.559656 -0.204639,0.21084 -0.525549,0.21084 -0.344165,0 -0.565857,-0.26665 -0.221692,-0.268201 -0.221692,-0.877466 0,-0.624768 0.230993,-0.90072 0.230994,-0.275953 0.599964,-0.275953 0.258899,0 0.427881,0.145728 0.170532,0.144177 0.217041,0.420129 z m -0.987537,0.95033 q 0,0.21239 0.09767,0.328662 0.09767,0.114722 0.223242,0.114722 0.120923,0 0.201538,-0.09457 0.08061,-0.09457 0.08061,-0.310059 0,-0.221692 -0.08682,-0.324011 -0.08682,-0.10387 -0.217041,-0.10387 -0.125574,0 -0.212391,0.09922 -0.08682,0.09767 -0.08682,0.289905 z"
         style="font-weight:bold;font-family:sans-serif;-inkscape-font-specification:'sans-serif Bold'"
         id="path92688" />
      <path
         d="m 71.178966,59.821133 -0.812353,-2.27273 h 0.497644 l 0.575159,1.682068 0.556555,-1.682068 h 0.486792 l -0.813904,2.27273 z"
         style="font-weight:bold;font-family:sans-serif;-inkscape-font-specification:'sans-serif Bold'"
         id="path92690" />
    </g>
    <g
       aria-label="DC in"
       id="text16659"
       style="font-size:3.88056px;line-height:125%;font-family:Sans;-inkscape-font-specification:Sans;letter-spacing:0px;word-spacing:0px;stroke:#000000;stroke-width:0">
      <path
         d="m 54.816896,68.088394 v -2.777783 h 0.956877 q 0.324011,0 0.494544,0.03979 0.238745,0.05495 0.407383,0.198955 0.219797,0.185691 0.327801,0.475596 0.109898,0.28801 0.109898,0.659392 0,0.316432 -0.0739,0.560862 -0.0739,0.24443 -0.18948,0.405488 -0.115583,0.159164 -0.253904,0.252009 -0.136426,0.09095 -0.331591,0.138321 -0.19327,0.04737 -0.445279,0.04737 z m 0.367592,-0.327801 h 0.593074 q 0.274747,0 0.430121,-0.05116 0.157269,-0.05116 0.250114,-0.144005 0.130742,-0.130741 0.202744,-0.350539 0.0739,-0.221692 0.0739,-0.536229 0,-0.435806 -0.144006,-0.668867 -0.14211,-0.234955 -0.346749,-0.314537 -0.147795,-0.05684 -0.475596,-0.05684 h -0.5836 z"
         style="line-height:125%;font-family:sans-serif;-inkscape-font-specification:sans-serif"
         id="path92693" />
      <path
         d="m 59.601278,67.114465 0.367592,0.09285 q -0.115583,0.452858 -0.416857,0.691604 -0.299379,0.23685 -0.733289,0.23685 -0.449069,0 -0.731395,-0.181901 -0.280431,-0.183796 -0.428226,-0.530545 -0.1459,-0.34675 -0.1459,-0.744658 0,-0.433911 0.164848,-0.756028 0.166743,-0.324011 0.471807,-0.490754 0.306958,-0.168638 0.67455,-0.168638 0.416857,0 0.701078,0.212219 0.28422,0.212218 0.396014,0.596863 l -0.361908,0.08527 q -0.09663,-0.303169 -0.280431,-0.441489 -0.183796,-0.138321 -0.462332,-0.138321 -0.320222,0 -0.53623,0.153479 -0.214113,0.153479 -0.301274,0.413068 -0.08716,0.257693 -0.08716,0.53244 0,0.354328 0.10232,0.619601 0.104214,0.263378 0.322116,0.394119 0.217903,0.130742 0.471807,0.130742 0.308853,0 0.522966,-0.178112 0.214113,-0.178112 0.289905,-0.52865 z"
         style="line-height:125%;font-family:sans-serif;-inkscape-font-specification:sans-serif"
         id="path92695" />
      <path
         d="m 61.458186,65.702835 v -0.392224 h 0.341065 v 0.392224 z m 0,2.385559 v -2.012282 h 0.341065 v 2.012282 z"
         style="line-height:125%;font-family:sans-serif;-inkscape-font-specification:sans-serif"
         id="path92697" />
      <path
         d="m 62.318428,68.088394 v -2.012282 h 0.306958 v 0.286115 q 0.221692,-0.331591 0.640444,-0.331591 0.181901,0 0.333486,0.06632 0.153479,0.06442 0.229271,0.170533 0.07579,0.106109 0.106109,0.252009 0.01895,0.09474 0.01895,0.331591 v 1.237307 H 63.612579 V 66.86435 q 0,-0.208428 -0.03979,-0.310748 -0.03979,-0.104214 -0.142111,-0.164848 -0.100424,-0.06253 -0.23685,-0.06253 -0.217903,0 -0.377067,0.138321 -0.157268,0.13832 -0.157268,0.52486 v 1.098987 z"
         style="line-height:125%;font-family:sans-serif;-inkscape-font-specification:sans-serif"
         id="path92699" />
    </g>
    <path
       id="path16790"
       style="fill:#000000;fill-opacity:1;stroke:none;stroke-width:0.264583px;stroke-linecap:butt;stroke-linejoin:miter;stroke-opacity:1"
       d="m 181.95364,83.69973 v 3.99976 l 2.99538,-3.3e-4 c 0.0799,0 0.1022,0.0294 0.11749,0.0917 0.28868,1.30983 1.08788,2.10935 1.88713,2.9086 0.79883,-0.79883 1.5976,-1.5979 1.88667,-2.9065 0.0206,-0.064 0.0525,-0.0938 0.11322,-0.0938 l 3.00011,3.3e-4 v -4 z" />
    <path
       style="fill:#000000;fill-opacity:0.25;stroke:none;stroke-width:0.264583px;stroke-linecap:butt;stroke-linejoin:miter;stroke-opacity:1"
       d="m 191.95364,83.69949 h -10 v 4 h 10 z"
       id="path16792" />
    <g
       aria-label="5V"
       id="text16796"
       style="font-size:3.175px;line-height:100%;font-family:Sans;-inkscape-font-specification:Sans;letter-spacing:0px;word-spacing:0px;fill:#ffffff;stroke:#000000;stroke-width:0">
      <path
         d="m 185.08399,86.232022 0.43409,-0.04496 q 0.0186,0.147277 0.11007,0.234094 0.0915,0.08527 0.21084,0.08527 0.13642,0 0.23099,-0.110071 0.0946,-0.111621 0.0946,-0.334863 0,-0.20929 -0.0946,-0.313159 -0.093,-0.10542 -0.2434,-0.10542 -0.18758,0 -0.33641,0.165881 l -0.35347,-0.05116 0.22325,-1.182873 h 1.15186 v 0.407727 h -0.82165 l -0.0682,0.386023 q 0.14572,-0.07286 0.29765,-0.07286 0.28991,0 0.49144,0.21084 0.20154,0.21084 0.20154,0.547253 0,0.280603 -0.16278,0.500745 -0.22169,0.300757 -0.61546,0.300757 -0.31471,0 -0.51315,-0.168982 -0.19844,-0.168982 -0.2372,-0.454236 z"
         style="font-weight:bold;font-family:sans-serif;-inkscape-font-specification:'sans-serif Bold'"
         id="path92893" />
      <path
         d="m 187.5195,86.816483 -0.81235,-2.27273 h 0.49764 l 0.57516,1.682068 0.55656,-1.682068 h 0.48679 l -0.8139,2.27273 z"
         style="font-weight:bold;font-family:sans-serif;-inkscape-font-specification:'sans-serif Bold'"
         id="path92895" />
    </g>
    <g
       aria-label="DC out"
       id="text16800"
       style="font-size:3.88056px;line-height:125%;font-family:Sans;-inkscape-font-specification:Sans;letter-spacing:0px;word-spacing:0px;stroke:#000000;stroke-width:0">
      <path
         d="m 189.95365,95.088348 v -2.777783 h 0.95687 q 0.32401,0 0.49455,0.03979 0.23874,0.05495 0.40738,0.198954 0.2198,0.185691 0.3278,0.475596 0.1099,0.28801 0.1099,0.659392 0,0.316433 -0.0739,0.560862 -0.0739,0.24443 -0.18948,0.405489 -0.11558,0.159163 -0.2539,0.252009 -0.13643,0.09095 -0.33159,0.13832 -0.19327,0.04737 -0.44528,0.04737 z m 0.36759,-0.327801 h 0.59307 q 0.27475,0 0.43012,-0.05116 0.15727,-0.05116 0.25012,-0.144005 0.13074,-0.130741 0.20274,-0.350539 0.0739,-0.221692 0.0739,-0.536229 0,-0.435805 -0.14401,-0.668866 -0.14211,-0.234956 -0.34675,-0.314538 -0.14779,-0.05684 -0.47559,-0.05684 h -0.5836 z"
         style="line-height:125%;font-family:sans-serif;-inkscape-font-specification:sans-serif"
         id="path92882" />
      <path
         d="m 194.73803,94.114419 0.36759,0.09284 q -0.11558,0.452859 -0.41686,0.691604 -0.29938,0.236851 -0.73329,0.236851 -0.44907,0 -0.73139,-0.181902 -0.28043,-0.183796 -0.42823,-0.530545 -0.1459,-0.346749 -0.1459,-0.744658 0,-0.433911 0.16485,-0.756027 0.16674,-0.324012 0.47181,-0.490755 0.30696,-0.168637 0.67455,-0.168637 0.41685,0 0.70108,0.212218 0.28422,0.212218 0.39601,0.596863 l -0.36191,0.08527 q -0.0966,-0.303168 -0.28043,-0.441489 -0.1838,-0.138321 -0.46233,-0.138321 -0.32022,0 -0.53623,0.153479 -0.21411,0.15348 -0.30128,0.413068 -0.0872,0.257693 -0.0872,0.53244 0,0.354328 0.10232,0.619601 0.10422,0.263378 0.32212,0.394119 0.2179,0.130742 0.47181,0.130742 0.30885,0 0.52296,-0.178112 0.21412,-0.178111 0.28991,-0.52865 z"
         style="line-height:125%;font-family:sans-serif;-inkscape-font-specification:sans-serif"
         id="path92884" />
      <path
         d="m 196.46609,94.082207 q 0,-0.558967 0.31075,-0.82803 0.25959,-0.223586 0.63286,-0.223586 0.41496,0 0.67834,0.272851 0.26338,0.270957 0.26338,0.750343 0,0.388435 -0.11748,0.612022 -0.11558,0.221692 -0.33917,0.344854 -0.22169,0.123163 -0.48507,0.123163 -0.42254,0 -0.68402,-0.270957 -0.25959,-0.270957 -0.25959,-0.78066 z m 0.35054,0 q 0,0.38654 0.16864,0.57981 0.16863,0.191376 0.42443,0.191376 0.25391,0 0.42254,-0.19327 0.16864,-0.193271 0.16864,-0.589285 0,-0.373276 -0.17053,-0.564651 -0.16864,-0.193271 -0.42065,-0.193271 -0.2558,0 -0.42443,0.191376 -0.16864,0.191375 -0.16864,0.577915 z"
         style="line-height:125%;font-family:sans-serif;-inkscape-font-specification:sans-serif"
         id="path92886" />
      <path
         d="m 200.07001,95.088348 v -0.295589 q -0.23496,0.341065 -0.63855,0.341065 -0.17811,0 -0.33349,-0.06821 -0.15348,-0.06821 -0.22927,-0.170533 -0.0739,-0.104214 -0.10421,-0.253904 -0.0208,-0.100424 -0.0208,-0.318327 v -1.246781 h 0.34107 v 1.11604 q 0,0.267167 0.0208,0.360013 0.0322,0.134531 0.13643,0.212218 0.10421,0.07579 0.25769,0.07579 0.15348,0 0.28801,-0.07769 0.13453,-0.07958 0.18948,-0.214113 0.0568,-0.136426 0.0568,-0.394119 v -1.078144 h 0.34106 v 2.012282 z"
         style="line-height:125%;font-family:sans-serif;-inkscape-font-specification:sans-serif"
         id="path92888" />
      <path
         d="m 201.65406,94.783285 0.0493,0.301274 q -0.14401,0.03032 -0.25769,0.03032 -0.1857,0 -0.28801,-0.05874 -0.10232,-0.05874 -0.14401,-0.153479 -0.0417,-0.09664 -0.0417,-0.403594 v -1.157725 h -0.25011 v -0.265273 h 0.25011 v -0.498334 l 0.33917,-0.204639 v 0.702973 h 0.34296 v 0.265273 h -0.34296 v 1.176673 q 0,0.1459 0.0171,0.187586 0.0189,0.04169 0.0587,0.06632 0.0417,0.02463 0.11747,0.02463 0.0568,0 0.14969,-0.01326 z"
         style="line-height:125%;font-family:sans-serif;-inkscape-font-specification:sans-serif"
         id="path92890" />
    </g>
  </g>
</svg>
