<?xml version="1.0" encoding="UTF-8" standalone="no"?>
<!-- Created with Inkscape (http://www.inkscape.org/) -->

<svg
   width="62.536457mm"
   height="49.544979mm"
   viewBox="0 0 62.536457 49.544979"
   version="1.1"
   id="svg5240"
   xmlns="http://www.w3.org/2000/svg"
   xmlns:svg="http://www.w3.org/2000/svg">
  <defs
     id="defs5237" />
  <g
     id="layer1"
     transform="translate(-434.33414,-415.31302)">
    <path
       id="path5021"
       d="m 454.35237,430.3931 v -2.8125 h 5.625 v 2.8125 z"
       style="fill:none;stroke:#000000;stroke-width:0.396875;stroke-linecap:round;stroke-linejoin:round;stroke-miterlimit:4;stroke-dasharray:none;stroke-opacity:1" />
    <path
       style="fill:none;stroke:#000000;stroke-width:0.396875;stroke-linecap:round;stroke-linejoin:round;stroke-miterlimit:4;stroke-dasharray:none;stroke-opacity:1"
       d="m 445.91487,430.3931 v -2.8125 h 5.625 v 2.8125 z"
       id="path5023" />
    <path
       id="path5025"
       d="m 437.47737,430.3931 v -2.8125 h 5.625 v 2.8125 z"
       style="fill:none;stroke:#000000;stroke-width:0.396875;stroke-linecap:round;stroke-linejoin:round;stroke-miterlimit:4;stroke-dasharray:none;stroke-opacity:1" />
    <path
       style="fill:none;stroke:#000000;stroke-width:0.396875;stroke-linecap:round;stroke-linejoin:round;stroke-miterlimit:4;stroke-dasharray:none;stroke-opacity:1"
       d="m 479.66487,430.3931 v -2.8125 h 5.625 v 2.8125 z"
       id="path5027" />
    <path
       id="path5029"
       d="m 471.22737,430.3931 v -2.8125 h 5.625 v 2.8125 z"
       style="fill:none;stroke:#000000;stroke-width:0.396875;stroke-linecap:round;stroke-linejoin:round;stroke-miterlimit:4;stroke-dasharray:none;stroke-opacity:1" />
    <path
       style="fill:none;stroke:#000000;stroke-width:0.396875;stroke-linecap:round;stroke-linejoin:round;stroke-miterlimit:4;stroke-dasharray:none;stroke-opacity:1"
       d="m 462.78987,430.3931 v -2.8125 h 5.625 v 2.8125 z"
       id="path5031" />
    <path
       id="path5033"
       d="m 488.10237,430.3931 v -2.8125 h 5.625 v 2.8125 z"
       style="fill:none;stroke:#000000;stroke-width:0.396875;stroke-linecap:round;stroke-linejoin:round;stroke-miterlimit:4;stroke-dasharray:none;stroke-opacity:1" />
    <path
       id="path5035"
       d="m 434.66487,430.3931 h 61.875 v 28.125 h -61.875 z"
       style="fill:none;stroke:#000000;stroke-width:0.661458;stroke-linecap:round;stroke-linejoin:round;stroke-miterlimit:4;stroke-dasharray:none;stroke-opacity:1" />
    <path
       id="path5037"
       d="m 434.66487,442.11569 v 4.67982 c 1.29442,0 2.33991,-1.0455 2.33991,-2.33991 0,-1.29442 -1.04549,-2.33991 -2.33991,-2.33991 z"
       style="fill:none;stroke:#000000;stroke-width:0.661458;stroke-linecap:round;stroke-linejoin:round;stroke-miterlimit:4;stroke-dasharray:none;stroke-opacity:1" />
    <path
       style="fill:none;stroke:#000000;stroke-width:0.396875;stroke-linecap:round;stroke-linejoin:round;stroke-miterlimit:4;stroke-dasharray:none;stroke-opacity:1"
       d="m 454.35237,461.3306 v -2.8125 h 5.625 v 2.8125 z"
       id="path5051" />
    <path
       id="path5053"
       d="m 445.91487,461.3306 v -2.8125 h 5.625 v 2.8125 z"
       style="fill:none;stroke:#000000;stroke-width:0.396875;stroke-linecap:round;stroke-linejoin:round;stroke-miterlimit:4;stroke-dasharray:none;stroke-opacity:1" />
    <path
       style="fill:none;stroke:#000000;stroke-width:0.396875;stroke-linecap:round;stroke-linejoin:round;stroke-miterlimit:4;stroke-dasharray:none;stroke-opacity:1"
       d="m 437.47737,461.3306 v -2.8125 h 5.625 v 2.8125 z"
       id="path5055" />
    <path
       id="path5057"
       d="m 479.66487,461.3306 v -2.8125 h 5.625 v 2.8125 z"
       style="fill:none;stroke:#000000;stroke-width:0.396875;stroke-linecap:round;stroke-linejoin:round;stroke-miterlimit:4;stroke-dasharray:none;stroke-opacity:1" />
    <path
       style="fill:none;stroke:#000000;stroke-width:0.396875;stroke-linecap:round;stroke-linejoin:round;stroke-miterlimit:4;stroke-dasharray:none;stroke-opacity:1"
       d="m 471.22737,461.3306 v -2.8125 h 5.625 v 2.8125 z"
       id="path5059" />
    <path
       id="path5061"
       d="m 462.78987,461.3306 v -2.8125 h 5.625 v 2.8125 z"
       style="fill:none;stroke:#000000;stroke-width:0.396875;stroke-linecap:round;stroke-linejoin:round;stroke-miterlimit:4;stroke-dasharray:none;stroke-opacity:1" />
    <path
       style="fill:none;stroke:#000000;stroke-width:0.396875;stroke-linecap:round;stroke-linejoin:round;stroke-miterlimit:4;stroke-dasharray:none;stroke-opacity:1"
       d="m 488.10237,461.3306 v -2.8125 h 5.625 v 2.8125 z"
       id="path5063" />
    <path
       style="fill:none;stroke:#000000;stroke-width:0.396875;stroke-linecap:round;stroke-linejoin:round;stroke-miterlimit:4;stroke-dasharray:none;stroke-opacity:1"
       d="m 454.35237,434.1431 h 5.625 v 7.5 h -5.625 z"
       id="path5556" />
    <path
       id="path5592"
       style="fill:none;stroke:#000000;stroke-width:0.396875;stroke-linecap:butt;stroke-linejoin:miter;stroke-miterlimit:4;stroke-dasharray:none;stroke-opacity:1"
       d="m 457.16487,442.5806 v 0.9375 h -8.4375 v -13.125 m 11.25,7.5 h 5.625 v -7.5 m -11.25,7.5 h -2.8125 v -5.625 h 5.625 v -1.875" />
    <path
       id="path5598"
       d="m 479.66487,434.1431 h 5.62501 v 7.5 h -5.62501 z"
       style="fill:none;stroke:#000000;stroke-width:0.396875;stroke-linecap:round;stroke-linejoin:round;stroke-miterlimit:4;stroke-dasharray:none;stroke-opacity:1" />
    <path
       id="path5604"
       style="fill:none;stroke:#000000;stroke-width:0.396875;stroke-linecap:butt;stroke-linejoin:miter;stroke-miterlimit:4;stroke-dasharray:none;stroke-opacity:1"
       d="m 482.47737,442.5806 v 0.9375 h -8.4375 v -13.125 m 11.25,7.5 h 5.625 v -7.5 m -11.25,7.5 h -2.8125 v -5.625 h 5.625 v -1.875" />
    <path
       style="fill:none;stroke:#000000;stroke-width:0.396875;stroke-linecap:round;stroke-linejoin:round;stroke-miterlimit:4;stroke-dasharray:none;stroke-opacity:1"
       d="m 471.22737,454.7681 h 5.625 v -7.5 h -5.625 z"
       id="path5606" />
    <path
       id="path5612"
       style="fill:none;stroke:#000000;stroke-width:0.396875;stroke-linecap:butt;stroke-linejoin:miter;stroke-miterlimit:4;stroke-dasharray:none;stroke-opacity:1"
       d="m 474.03987,446.3306 v -0.9375 h -8.4375 v 13.125 m 11.25,-7.5 h 5.625 v 7.5 m -11.25,-7.5 h -2.8125 v 5.625 h 5.625 v 1.875" />
    <path
       id="path5614"
       d="m 445.91487,454.7681 h 5.625 v -7.5 h -5.625 z"
       style="fill:none;stroke:#000000;stroke-width:0.396875;stroke-linecap:round;stroke-linejoin:round;stroke-miterlimit:4;stroke-dasharray:none;stroke-opacity:1" />
    <path
       id="path5620"
       style="fill:none;stroke:#000000;stroke-width:0.396875;stroke-linecap:butt;stroke-linejoin:miter;stroke-miterlimit:4;stroke-dasharray:none;stroke-opacity:1"
       d="m 448.72737,446.3306 v -0.9375 h -8.4375 v 13.125 m 11.25,-7.5 h 5.625 v 7.5 m -11.25,-7.5 h -2.8125 v 5.625 h 5.625 v 1.875" />
    <path
       id="path5630"
       d="m 456.69612,436.9556 0.9375,0.9375 -0.9375,0.9375"
       style="fill:none;stroke:#000000;stroke-width:0.396875;stroke-linecap:butt;stroke-linejoin:miter;stroke-miterlimit:4;stroke-dasharray:none;stroke-opacity:1" />
    <path
       style="fill:none;stroke:#000000;stroke-width:0.396875;stroke-linecap:butt;stroke-linejoin:miter;stroke-miterlimit:4;stroke-dasharray:none;stroke-opacity:1"
       d="m 482.00862,436.9556 0.9375,0.9375 -0.9375,0.9375"
       id="path5632" />
    <path
       id="path5634"
       d="m 473.57112,450.0806 0.9375,0.9375 -0.9375,0.93749"
       style="fill:none;stroke:#000000;stroke-width:0.396875;stroke-linecap:butt;stroke-linejoin:miter;stroke-miterlimit:4;stroke-dasharray:none;stroke-opacity:1" />
    <path
       style="fill:none;stroke:#000000;stroke-width:0.396875;stroke-linecap:butt;stroke-linejoin:miter;stroke-miterlimit:4;stroke-dasharray:none;stroke-opacity:1"
       d="m 448.25862,450.0806 0.9375,0.9375 -0.9375,0.93749"
       id="path5636" />
    <text
       xml:space="preserve"
       style="font-style:normal;font-variant:normal;font-weight:normal;font-stretch:normal;font-size:3.175px;line-height:0%;font-family:sans-serif;-inkscape-font-specification:Sans;text-align:start;letter-spacing:0px;word-spacing:0px;writing-mode:lr-tb;text-anchor:start;fill:#000000;fill-opacity:1;stroke:none;stroke-width:0.264583"
       x="458.70358"
       y="421.0181"
       id="text5638"><tspan
         y="421.0181"
         x="458.70358"
         id="tspan5640"
         style="font-size:7.9375px;line-height:1.25;font-family:sans-serif;stroke-width:0.264583">125</tspan></text>
    <text
       id="text5039"
       y="457.55417"
       x="437.0173"
       style="font-style:normal;font-variant:normal;font-weight:normal;font-stretch:normal;font-size:3.175px;line-height:0%;font-family:sans-serif;-inkscape-font-specification:Sans;text-align:start;letter-spacing:0px;word-spacing:0px;writing-mode:lr-tb;text-anchor:start;fill:#000000;fill-opacity:1;stroke:#000000;stroke-width:0.0529167;stroke-miterlimit:4;stroke-dasharray:none;stroke-opacity:1"
       xml:space="preserve"><tspan
         y="457.55417"
         x="437.0173"
         id="tspan5041"
         style="font-size:2.64583px;line-height:1.25;font-family:sans-serif;stroke-width:0.0529167">1</tspan></text>
    <text
       id="text5081"
       y="457.55417"
       x="490.17654"
       style="font-style:normal;font-variant:normal;font-weight:normal;font-stretch:normal;font-size:3.175px;line-height:0%;font-family:sans-serif;-inkscape-font-specification:Sans;text-align:start;letter-spacing:0px;word-spacing:0px;writing-mode:lr-tb;text-anchor:start;fill:#000000;fill-opacity:1;stroke:#000000;stroke-width:0.0529167;stroke-miterlimit:4;stroke-dasharray:none;stroke-opacity:1"
       xml:space="preserve"><tspan
         id="tspan5083"
         x="490.17654"
         y="457.55417"
         style="font-size:2.64583px;line-height:1.25;font-family:sans-serif;stroke-width:0.0529167">7</tspan></text>
    <text
       xml:space="preserve"
       style="font-style:normal;font-variant:normal;font-weight:normal;font-stretch:normal;font-size:3.175px;line-height:0%;font-family:sans-serif;-inkscape-font-specification:Sans;text-align:start;letter-spacing:0px;word-spacing:0px;writing-mode:lr-tb;text-anchor:start;fill:#000000;fill-opacity:1;stroke:#000000;stroke-width:0.0529167;stroke-miterlimit:4;stroke-dasharray:none;stroke-opacity:1"
       x="492.54413"
       y="433.25864"
       id="text5085"><tspan
         id="tspan5087"
         x="492.54413"
         y="433.25864"
         style="font-size:2.64583px;line-height:1.25;font-family:sans-serif;stroke-width:0.0529167">8</tspan></text>
    <text
       id="text5089"
       y="433.25864"
       x="438.73764"
       style="font-style:normal;font-variant:normal;font-weight:normal;font-stretch:normal;font-size:3.175px;line-height:0%;font-family:sans-serif;-inkscape-font-specification:Sans;text-align:start;letter-spacing:0px;word-spacing:0px;writing-mode:lr-tb;text-anchor:start;fill:#000000;fill-opacity:1;stroke:#000000;stroke-width:0.0529167;stroke-miterlimit:4;stroke-dasharray:none;stroke-opacity:1"
       xml:space="preserve"><tspan
         id="tspan5091"
         x="438.73764"
         y="433.25864"
         style="font-size:2.64583px;line-height:1.25;font-family:sans-serif;stroke-width:0.0529167">14</tspan></text>
    <text
       xml:space="preserve"
       style="font-style:normal;font-variant:normal;font-weight:normal;font-stretch:normal;font-size:3.175px;line-height:0%;font-family:sans-serif;-inkscape-font-specification:Sans;text-align:start;letter-spacing:0px;word-spacing:0px;writing-mode:lr-tb;text-anchor:start;fill:#000000;fill-opacity:1;stroke:#000000;stroke-width:0.0529167;stroke-miterlimit:4;stroke-dasharray:none;stroke-opacity:1"
       x="487.0932"
       y="464.78955"
       id="text5151"><tspan
         id="tspan5153"
         x="487.0932"
         y="464.78955"
         style="font-size:3.43958px;line-height:1.25;font-family:sans-serif;stroke-width:0.0529167">GND</tspan></text>
    <text
       id="text8051"
       y="426.56369"
       x="437.42972"
       style="font-style:normal;font-variant:normal;font-weight:normal;font-stretch:normal;font-size:3.175px;line-height:0%;font-family:sans-serif;-inkscape-font-specification:Sans;text-align:start;letter-spacing:0px;word-spacing:0px;writing-mode:lr-tb;text-anchor:start;fill:#000000;fill-opacity:1;stroke:#000000;stroke-width:0.0529167;stroke-miterlimit:4;stroke-dasharray:none;stroke-opacity:1"
       xml:space="preserve"><tspan
         style="font-size:3.43958px;line-height:1.25;font-family:sans-serif;stroke-width:0.0529167"
         y="426.56369"
         x="437.42972"
         id="tspan8053">Vcc</tspan></text>
    <path
       id="path8081"
       d="m 456.4515,442.35646 c 0,0.39398 0.31939,0.71337 0.71337,0.71337 0.39397,0 0.71337,-0.31939 0.71337,-0.71337 0,-0.39397 -0.3194,-0.71336 -0.71337,-0.71336 -0.39398,0 -0.71337,0.31939 -0.71337,0.71336 z"
       style="fill:#ffffff;fill-opacity:1;stroke:#000000;stroke-width:0.396875;stroke-linecap:round;stroke-linejoin:round;stroke-miterlimit:4;stroke-dasharray:none;stroke-opacity:1" />
    <path
       style="fill:#ffffff;fill-opacity:1;stroke:#000000;stroke-width:0.396875;stroke-linecap:round;stroke-linejoin:round;stroke-miterlimit:4;stroke-dasharray:none;stroke-opacity:1"
       d="m 481.764,442.35646 c 0,0.39398 0.31939,0.71337 0.71337,0.71337 0.39397,0 0.71336,-0.31939 0.71336,-0.71337 0,-0.39397 -0.31939,-0.71336 -0.71336,-0.71336 -0.39398,0 -0.71337,0.31939 -0.71337,0.71336 z"
       id="path8083" />
    <path
       id="path8085"
       d="m 473.3265,446.55473 c 0,0.39398 0.31939,0.71337 0.71337,0.71337 0.39397,0 0.71336,-0.31939 0.71336,-0.71337 0,-0.39398 -0.31939,-0.71336 -0.71336,-0.71336 -0.39398,0 -0.71337,0.31938 -0.71337,0.71336 z"
       style="fill:#ffffff;fill-opacity:1;stroke:#000000;stroke-width:0.396875;stroke-linecap:round;stroke-linejoin:round;stroke-miterlimit:4;stroke-dasharray:none;stroke-opacity:1" />
    <path
       style="fill:#ffffff;fill-opacity:1;stroke:#000000;stroke-width:0.396875;stroke-linecap:round;stroke-linejoin:round;stroke-miterlimit:4;stroke-dasharray:none;stroke-opacity:1"
       d="m 448.014,446.55473 c 0,0.39398 0.31939,0.71337 0.71337,0.71337 0.39397,0 0.71336,-0.31939 0.71336,-0.71337 0,-0.39398 -0.31939,-0.71336 -0.71336,-0.71336 -0.39398,0 -0.71337,0.31938 -0.71337,0.71336 z"
       id="path8087" />
  </g>
</svg>
