<?xml version="1.0" encoding="UTF-8" standalone="no"?>
<svg
   xmlns:dc="http://purl.org/dc/elements/1.1/"
   xmlns:cc="http://creativecommons.org/ns#"
   xmlns:rdf="http://www.w3.org/1999/02/22-rdf-syntax-ns#"
   xmlns:svg="http://www.w3.org/2000/svg"
   xmlns="http://www.w3.org/2000/svg"
   version="1.1"
   id="Layer_1"
   x="0px"
   y="0px"
   width="33.506001"
   height="37.999466"
   viewBox="0 0 33.506001 37.999466"
   enable-background="new 0 0 512 512"
   xml:space="preserve"><metadata
   id="metadata23"><rdf:RDF><cc:Work
       rdf:about=""><dc:format>image/svg+xml</dc:format><dc:type
         rdf:resource="http://purl.org/dc/dcmitype/StillImage" /><dc:title></dc:title></cc:Work></rdf:RDF></metadata><defs
   id="defs21">
	

		
	
			
			
			
			
			
		
				
				
			
				
				
				
				
			
				
				
			</defs>
<g
   id="g938"
   transform="matrix(0.07412832,0,0,0.07412832,-1.2053265e-8,-9.2944008)"><polygon
     transform="matrix(1.2460922,0,0,1.2460922,-92.999599,7.9345704e-4)"
     points="107.644,470.877 74.633,100.62 437.367,100.62 404.321,470.819 255.778,512 "
     id="polygon9"
     style="fill:#dab92d;fill-opacity:1" /><polygon
     transform="matrix(1.2460922,0,0,1.2460922,-92.999599,7.9345704e-4)"
     points="256,480.523 376.03,447.246 404.27,130.894 256,130.894 "
     id="polygon11"
     style="fill:#ffd83a;fill-opacity:1" /><path
     id="polygon31"
     d="m 251.01308,219.69336 v 56.44726 0.13868 134.7287 l 58.54875,-5.19301 -4.96672,55.16372 -53.58203,14.16973 v 58.87109 L 354.98662,506.53696 368.63018,354.42188 H 301.32921 V 276.2793 h 74.30307 l 5.04621,-56.58594 z"
     style="fill:#ffffff;stroke-width:1.24609" /><path
     id="polygon15"
     d="m 149.01701,219.69336 v 241.75293 l -6.8403,-1.80727 -4.96886,-54.17758 -49.889989,-4.32863 9.54753,105.40415 103.973539,27.48257 V 219.69336 Z"
     style="fill:#ececec;fill-opacity:1;stroke-width:1.24609" /></g>
</svg>
