<?xml version="1.0" encoding="UTF-8" standalone="no"?>
<svg
   height="38.000004"
   width="40.123398"
   version="1.0"
   viewBox="-133.90245 -160.5565 38.802265 45.758607"
   id="svg119"
   xmlns="http://www.w3.org/2000/svg"
   xmlns:svg="http://www.w3.org/2000/svg">
  <defs
     id="defs5">
    <clipPath
       id="a">
      <path
         d="M 0,-0.1 H 792.1 V 612 H 0 Z"
         id="path2" />
    </clipPath>
  </defs>
  <g
     id="g1263"
     transform="matrix(0.04654485,0.02687268,-0.02687268,0.04654485,-128.47233,-163.7885)">
    <path
       d="m 330.214,605.281 c -69.25,50.75 -161.875,42 -207,-19.625 -45,-61.5 -25.375,-152.5 43.875,-203.125 69.125,-50.75 161.875,-42 206.875,19.5 45.125,61.625 25.5,152.625 -43.75,203.25 z"
       fill-rule="evenodd"
       id="path7"
       style="stroke-width:1.25" />
    <path
       d="m 330.214,605.281 c -69.25,50.75 -161.875,42 -207,-19.625 -45,-61.5 -25.375,-152.5 43.875,-203.125 69.125,-50.75 161.875,-42 206.875,19.5 45.125,61.625 25.5,152.625 -43.75,203.25 z"
       fill="none"
       stroke="#000000"
       stroke-width="5.3775"
       stroke-linejoin="round"
       stroke-miterlimit="10"
       id="path9" />
    <path
       d="m 291.964,45.531 c 86.125,63 110.5,176.125 54.375,252.625 -56,76.5 -171.25,87.375 -257.25,24.375 -86.125,-63 -110.5,-176.25 -54.5,-252.75 56.125,-76.5 171.25,-87.375 257.375,-24.25 z"
       fill-rule="evenodd"
       id="path11"
       style="stroke-width:1.25" />
    <path
       d="m 291.964,45.531 c 86.125,63 110.5,176.125 54.375,252.625 -56,76.5 -171.25,87.375 -257.25,24.375 -86.125,-63 -110.5,-176.25 -54.5,-252.75 56.125,-76.5 171.25,-87.375 257.375,-24.25 z"
       fill="none"
       stroke="#000000"
       stroke-width="8.985"
       stroke-linejoin="round"
       stroke-miterlimit="10"
       id="path13" />
    <path
       d="m 216.589,236.781 c -32.25,-26.5 -34.125,-77.75 -4.125,-114.25 30.125,-36.625 80.625,-44.875 112.875,-18.25 32.375,26.5 34.25,77.625 4.125,114.25 -30,36.625 -80.5,44.75 -112.875,18.25 z"
       fill="#00ff00"
       fill-rule="evenodd"
       id="path15"
       style="stroke-width:1.25" />
    <path
       d="m 216.589,236.781 c -32.25,-26.5 -34.125,-77.75 -4.125,-114.25 30.125,-36.625 80.625,-44.875 112.875,-18.25 32.375,26.5 34.25,77.625 4.125,114.25 -30,36.625 -80.5,44.75 -112.875,18.25 z"
       fill="none"
       id="path17"
       style="stroke-width:1.25" />
    <path
       d="m 189.589,230.156 c -32.375,-26.625 -34.25,-77.75 -4.25,-114.375 30.125,-36.625 80.75,-44.75 113,-18.25 32.375,26.5 34.25,77.75 4.125,114.375 -30,36.625 -80.625,44.75 -112.875,18.25 z"
       fill-rule="evenodd"
       id="path19"
       style="stroke-width:1.25" />
    <path
       d="m 189.589,230.156 c -32.375,-26.625 -34.25,-77.75 -4.25,-114.375 30.125,-36.625 80.75,-44.75 113,-18.25 32.375,26.5 34.25,77.75 4.125,114.375 -30,36.625 -80.625,44.75 -112.875,18.25 z"
       fill="none"
       id="path21"
       style="stroke-width:1.25" />
    <path
       d="m 256.964,310.406 c -52,-34.625 -123.875,-61.5 -154.75,-107.75 -23,-34.375 -49.125,-47.875 -21.625,-81.875 26.25,-32.125 40.875,-66.625 77.375,-72.375 41,5.5 72.875,9.125 99.125,54.75 -3,26.75 6,83.25 -28.75,110.125 l -60.125,33.375"
       fill="none"
       stroke="#0000ff"
       stroke-width="26.9563"
       stroke-linejoin="round"
       stroke-miterlimit="10"
       id="path23" />
    <path
       d="m 168.714,199.281 c -29.75,0 -53.875,-23.625 -53.875,-52.875 0,-29.25 24.125,-52.875 53.875,-52.875 29.75,0 53.875,23.625 53.875,52.875 0,29.25 -24.125,52.875 -53.875,52.875 z"
       fill="#ff3366"
       fill-rule="evenodd"
       id="path25"
       style="stroke-width:1.25" />
    <path
       d="m 168.714,199.281 c -29.75,0 -53.875,-23.625 -53.875,-52.875 0,-29.25 24.125,-52.875 53.875,-52.875 29.75,0 53.875,23.625 53.875,52.875 0,29.25 -24.125,52.875 -53.875,52.875 z"
       fill="none"
       id="path27"
       style="stroke-width:1.25" />
    <path
       d="m 192.714,176.281 c -11.125,9.125 -27.75,7.375 -37.125,-4 -9.375,-11.375 -7.875,-28 3.375,-37.125 11.125,-9.125 27.75,-7.375 37,4 9.375,11.375 7.875,28 -3.25,37.125 z"
       fill="#0000ff"
       fill-rule="evenodd"
       id="path29"
       style="stroke-width:1.25" />
    <path
       d="m 192.714,176.281 c -11.125,9.125 -27.75,7.375 -37.125,-4 -9.375,-11.375 -7.875,-28 3.375,-37.125 11.125,-9.125 27.75,-7.375 37,4 9.375,11.375 7.875,28 -3.25,37.125 z"
       fill="none"
       id="path31"
       style="stroke-width:1.25" />
    <path
       d="m 261.589,313.906 c -52.125,-34.75 -130.875,-34.75 -161.75,-80.875 -23,-34.5 -62.875,-78.875 -35.375,-112.75 25.125,-39.875 57,-67.25 96.875,-67.25 41.125,5.375 83.375,21.25 93.375,53.5 -2.875,26.875 2.625,69.25 -32.125,96.125 l -56.625,45.125"
       fill="none"
       stroke="#0000ff"
       stroke-width="26.9563"
       stroke-linejoin="round"
       stroke-miterlimit="10"
       id="path33" />
    <path
       d="m 284.964,327.406 c -3.625,6.375 -19.125,4.25 -34.5,-4.625 -15.5,-8.875 -25,-21.25 -21.375,-27.625 3.75,-6.25 19.125,-4.25 34.625,4.625 15.375,9 25,21.25 21.25,27.625 z"
       fill="#0000ff"
       fill-rule="evenodd"
       id="path35"
       style="stroke-width:1.25" />
    <path
       d="m 284.964,327.406 c -3.625,6.375 -19.125,4.25 -34.5,-4.625 -15.5,-8.875 -25,-21.25 -21.375,-27.625 3.75,-6.25 19.125,-4.25 34.625,4.625 15.375,9 25,21.25 21.25,27.625 z"
       fill="none"
       id="path37"
       style="stroke-width:1.25" />
    <path
       d="m 736.339,383.656 c 69.125,50.625 88.75,141.75 43.625,203.25 -45.125,61.625 -137.75,70.375 -207,19.75 -69.125,-50.75 -88.75,-141.75 -43.625,-203.25 45.125,-61.625 137.75,-70.5 207,-19.75 z"
       fill-rule="evenodd"
       id="path39"
       style="stroke-width:1.25" />
    <path
       d="m 736.339,383.656 c 69.125,50.625 88.75,141.75 43.625,203.25 -45.125,61.625 -137.75,70.375 -207,19.75 -69.125,-50.75 -88.75,-141.75 -43.625,-203.25 45.125,-61.625 137.75,-70.5 207,-19.75 z"
       fill="none"
       stroke="#000000"
       stroke-width="5.3775"
       stroke-linejoin="round"
       stroke-miterlimit="10"
       id="path41" />
    <path
       d="m 449.339,497.406 c -80,0 -144.75,-51.75 -144.75,-115.75 0,-63.875 64.75,-115.75 144.75,-115.75 80,0 144.75,51.875 144.75,115.75 0,64 -64.75,115.75 -144.75,115.75 z"
       fill="#ffff00"
       fill-rule="evenodd"
       id="path43"
       style="stroke-width:1.25" />
    <path
       d="m 449.339,497.406 c -80,0 -144.75,-51.75 -144.75,-115.75 0,-63.875 64.75,-115.75 144.75,-115.75 80,0 144.75,51.875 144.75,115.75 0,64 -64.75,115.75 -144.75,115.75 z"
       fill="none"
       stroke="#000000"
       stroke-width="10.79"
       stroke-linejoin="round"
       stroke-miterlimit="10"
       id="path45" />
    <path
       d="m 350.089,380.281 c -32,0 -57.875,-26 -57.875,-57.875 0,-32 25.875,-57.875 57.875,-57.875 32,0 58,25.875 58,57.875 0,31.875 -26,57.875 -58,57.875 z"
       fill="#ffffff"
       fill-rule="evenodd"
       id="path47"
       style="stroke-width:1.25" />
    <path
       d="m 350.089,380.281 c -32,0 -57.875,-26 -57.875,-57.875 0,-32 25.875,-57.875 57.875,-57.875 32,0 58,25.875 58,57.875 0,31.875 -26,57.875 -58,57.875 z"
       fill="none"
       stroke="#000000"
       stroke-width="12.5938"
       stroke-linejoin="round"
       stroke-miterlimit="10"
       id="path49" />
    <path
       d="m 804.214,329.531 c -85.5,62.625 -200,51.75 -255.625,-24.25 -55.75,-76 -31.5,-188.375 54,-251.125 85.5,-62.625 200,-51.75 255.625,24.25 55.75,76.125 31.5,188.5 -54,251.125 z"
       fill-rule="evenodd"
       id="path51"
       style="stroke-width:1.25" />
    <path
       d="m 804.214,329.531 c -85.5,62.625 -200,51.75 -255.625,-24.25 -55.75,-76 -31.5,-188.375 54,-251.125 85.5,-62.625 200,-51.75 255.625,24.25 55.75,76.125 31.5,188.5 -54,251.125 z"
       fill="none"
       stroke="#000000"
       stroke-width="8.985"
       stroke-linejoin="round"
       stroke-miterlimit="10"
       id="path53" />
    <path
       d="m 823.089,280.906 c -32.125,26.375 -82.375,18.125 -112.25,-18.25 -29.875,-36.375 -28.125,-87.25 4,-113.625 32.125,-26.375 82.375,-18.25 112.25,18.25 29.875,36.375 28.125,87.25 -4,113.625 z"
       fill="#00ff00"
       fill-rule="evenodd"
       id="path55"
       style="stroke-width:1.25" />
    <path
       d="m 823.089,280.906 c -32.125,26.375 -82.375,18.125 -112.25,-18.25 -29.875,-36.375 -28.125,-87.25 4,-113.625 32.125,-26.375 82.375,-18.25 112.25,18.25 29.875,36.375 28.125,87.25 -4,113.625 z"
       fill="none"
       id="path57"
       style="stroke-width:1.25" />
    <path
       d="m 796.339,280.906 c -32.125,26.375 -82.375,18.125 -112.25,-18.25 -29.875,-36.375 -28.125,-87.25 4,-113.5 32.125,-26.375 82.375,-18.25 112.25,18.125 29.875,36.375 28,87.25 -4,113.625 z"
       fill-rule="evenodd"
       id="path59"
       style="stroke-width:1.25" />
    <path
       d="m 796.339,280.906 c -32.125,26.375 -82.375,18.125 -112.25,-18.25 -29.875,-36.375 -28.125,-87.25 4,-113.5 32.125,-26.375 82.375,-18.25 112.25,18.125 29.875,36.375 28,87.25 -4,113.625 z"
       fill="none"
       id="path61"
       style="stroke-width:1.25" />
    <path
       d="m 832.089,119.031 c -22.5,-72.625 -123.125,-47.75 -160.625,-22.625 -51.75,34.5 -45.25,27.625 -75.875,73.5 -22.875,34.375 -10.5,79.5 16.875,113.25 25.875,32 36.25,17.25 77,11.875 40.75,-5.375 51.875,-6.75 61.75,-38.75 12.375,-40.125 -27.625,-81.625 -62.125,-108.25 l -38.875,-26.875"
       fill="none"
       stroke="#0000ff"
       stroke-width="26.9563"
       stroke-linejoin="round"
       stroke-miterlimit="10"
       id="path63" />
    <path
       d="m 661.464,268.281 c -26.25,0 -47.375,-21.5 -47.375,-48.125 0,-26.625 21.125,-48.125 47.375,-48.125 26.125,0 47.25,21.5 47.25,48.125 0,26.625 -21.125,48.125 -47.25,48.125 z"
       fill="#ff3366"
       fill-rule="evenodd"
       id="path65"
       style="stroke-width:1.25" />
    <path
       d="m 661.464,268.281 c -26.25,0 -47.375,-21.5 -47.375,-48.125 0,-26.625 21.125,-48.125 47.375,-48.125 26.125,0 47.25,21.5 47.25,48.125 0,26.625 -21.125,48.125 -47.25,48.125 z"
       fill="none"
       id="path67"
       style="stroke-width:1.25" />
    <path
       d="m 678.089,247.781 c -11.125,9 -27.625,7.25 -36.875,-4.125 -9.25,-11.25 -7.875,-27.875 3.125,-36.875 11,-9.125 27.625,-7.25 36.875,4 9.25,11.375 7.875,27.875 -3.125,37 z"
       fill="#0000ff"
       fill-rule="evenodd"
       id="path69"
       style="stroke-width:1.25" />
    <path
       d="m 678.089,247.781 c -11.125,9 -27.625,7.25 -36.875,-4.125 -9.25,-11.25 -7.875,-27.875 3.125,-36.875 11,-9.125 27.625,-7.25 36.875,4 9.25,11.375 7.875,27.875 -3.125,37 z"
       fill="none"
       id="path71"
       style="stroke-width:1.25" />
    <path
       d="m 838.964,116.781 c -22.5,-72.625 -145.875,-59.125 -183.375,-34 -51.75,34.5 -44.125,27.75 -74.75,73.625 -22.875,34.25 -2.5,96.125 24.875,129.875 25.875,32 44.75,24.75 85.375,19.375 40.75,-5.375 55,-4.375 65,-36.5 12.375,-40 5,-89.375 -29.625,-116.125 l -76.25,-31.875"
       fill="none"
       stroke="#0000ff"
       stroke-width="26.9563"
       stroke-linejoin="round"
       stroke-miterlimit="10"
       id="path73" />
    <path
       d="m 541.714,380.281 c -32,0 -58,-26 -58,-57.875 0,-32 26,-57.875 58,-57.875 32,0 57.875,25.875 57.875,57.875 0,31.875 -25.875,57.875 -57.875,57.875 z"
       fill="#ffffff"
       fill-rule="evenodd"
       id="path75"
       style="stroke-width:1.25" />
    <path
       d="m 541.714,380.281 c -32,0 -58,-26 -58,-57.875 0,-32 26,-57.875 58,-57.875 32,0 57.875,25.875 57.875,57.875 0,31.875 -25.875,57.875 -57.875,57.875 z"
       fill="none"
       stroke="#000000"
       stroke-width="12.5938"
       stroke-linejoin="round"
       stroke-miterlimit="10"
       id="path77" />
    <path
       d="m 351.839,351.156 c -16,0 -29,-13 -29,-29 0,-16 13,-29 29,-29 16,0 28.875,13 28.875,29 0,16 -12.875,29 -28.875,29 z"
       fill-rule="evenodd"
       id="path79"
       style="stroke-width:1.25" />
    <path
       d="m 351.839,351.156 c -16,0 -29,-13 -29,-29 0,-16 13,-29 29,-29 16,0 28.875,13 28.875,29 0,16 -12.875,29 -28.875,29 z"
       fill="none"
       id="path81"
       style="stroke-width:1.25" />
    <path
       d="m 543.839,347.906 c -16.125,0 -29,-13 -29,-28.875 0,-16 12.875,-28.875 29,-28.875 16,0 28.875,12.875 28.875,28.875 0,15.875 -12.875,28.875 -28.875,28.875 z"
       fill-rule="evenodd"
       id="path83"
       style="stroke-width:1.25" />
    <path
       d="m 543.839,347.906 c -16.125,0 -29,-13 -29,-28.875 0,-16 12.875,-28.875 29,-28.875 16,0 28.875,12.875 28.875,28.875 0,15.875 -12.875,28.875 -28.875,28.875 z"
       fill="none"
       id="path85"
       style="stroke-width:1.25" />
    <path
       d="m 399.964,412.406 c -5.75,39.625 109.375,68.25 95.5,6.75 v -3.375"
       fill="none"
       stroke="#ff3366"
       stroke-width="16.1663"
       stroke-linejoin="round"
       stroke-miterlimit="10"
       id="path87" />
    <path
       d="m 431.339,264.906 c -2.375,-31.5 9.125,-67.25 -5.25,-96.375 l -12.125,-28.875 -15.75,26.5 12.125,2.375 m 56.25,96.375 c 2.375,-31.5 -9.25,-67.25 5.125,-96.375 l 12.125,-28.875 15.75,26.5 -12.125,2.375"
       fill="none"
       stroke="#000000"
       stroke-width="12.5938"
       stroke-linejoin="round"
       stroke-miterlimit="10"
       id="path89" />
    <path
       d="m 176.339,575.781 c -33.25,-27.375 -34.375,-81 -2.5,-120 32,-38.875 84.875,-48.25 118.25,-20.875 33.25,27.375 34.375,81 2.375,119.875 -31.875,39 -84.75,48.375 -118.125,21 z"
       fill="#ff3366"
       fill-rule="evenodd"
       id="path91"
       style="stroke-width:1.25" />
    <path
       d="m 176.339,575.781 c -33.25,-27.375 -34.375,-81 -2.5,-120 32,-38.875 84.875,-48.25 118.25,-20.875 33.25,27.375 34.375,81 2.375,119.875 -31.875,39 -84.75,48.375 -118.125,21 z"
       fill="none"
       id="path93"
       style="stroke-width:1.25" />
    <path
       d="m 419.339,498.656 v 37.375 l 20.5,34 v 0 m 25.125,-71.375 v 37.5 l 20.5,34 v 0"
       fill="none"
       stroke="#000000"
       stroke-width="10.79"
       stroke-linejoin="round"
       stroke-miterlimit="10"
       id="path95" />
    <path
       d="m 215.339,531.406 c -15,-12.25 -12.625,-40 5.375,-61.875 18,-22 44.625,-29.75 59.75,-17.375 14.875,12.25 12.5,40 -5.375,62 -18,21.875 -44.75,29.625 -59.75,17.25 z"
       fill="#0000ff"
       fill-rule="evenodd"
       id="path97"
       style="stroke-width:1.25" />
    <path
       d="m 215.339,531.406 c -15,-12.25 -12.625,-40 5.375,-61.875 18,-22 44.625,-29.75 59.75,-17.375 14.875,12.25 12.5,40 -5.375,62 -18,21.875 -44.75,29.625 -59.75,17.25 z"
       fill="none"
       id="path99"
       style="stroke-width:1.25" />
    <path
       d="m 720.714,575.906 c -33.375,27.375 -86.25,18 -118.25,-21 -31.875,-38.875 -30.75,-92.625 2.5,-119.875 33.375,-27.375 86.25,-18 118.25,20.875 31.875,39 30.75,92.625 -2.5,120 z"
       fill="#ff3366"
       fill-rule="evenodd"
       id="path101"
       style="stroke-width:1.25" />
    <path
       d="m 720.714,575.906 c -33.375,27.375 -86.25,18 -118.25,-21 -31.875,-38.875 -30.75,-92.625 2.5,-119.875 33.375,-27.375 86.25,-18 118.25,20.875 31.875,39 30.75,92.625 -2.5,120 z"
       fill="none"
       id="path103"
       style="stroke-width:1.25" />
    <path
       d="m 677.214,534.906 c -15,12.25 -41.75,4.5 -59.625,-17.25 -18,-21.875 -20.375,-49.625 -5.25,-61.875 14.875,-12.375 41.625,-4.625 59.625,17.25 17.875,21.75 20.25,49.5 5.25,61.875 z"
       fill="#0000ff"
       fill-rule="evenodd"
       id="path105"
       style="stroke-width:1.25" />
    <path
       d="m 677.214,534.906 c -15,12.25 -41.75,4.5 -59.625,-17.25 -18,-21.875 -20.375,-49.625 -5.25,-61.875 14.875,-12.375 41.625,-4.625 59.625,17.25 17.875,21.75 20.25,49.5 5.25,61.875 z"
       fill="none"
       id="path107"
       style="stroke-width:1.25" />
    <path
       d="m 852.964,140.781 c -7.625,5.25 -24.125,-5.375 -37,-23.875 -13,-18.375 -17.25,-37.625 -9.75,-42.875 7.5,-5.25 24.125,5.375 37,23.875 12.875,18.375 17.25,37.625 9.75,42.875 z"
       fill="#0000ff"
       fill-rule="evenodd"
       id="path113"
       style="stroke-width:1.25" />
    <path
       d="m 852.964,140.781 c -7.625,5.25 -24.125,-5.375 -37,-23.875 -13,-18.375 -17.25,-37.625 -9.75,-42.875 7.5,-5.25 24.125,5.375 37,23.875 12.875,18.375 17.25,37.625 9.75,42.875 z"
       fill="none"
       id="path115"
       style="stroke-width:1.25" />
  </g>
</svg>
