<?xml version="1.0" encoding="UTF-8" standalone="no"?>
<svg
   xmlns:dc="http://purl.org/dc/elements/1.1/"
   xmlns:cc="http://creativecommons.org/ns#"
   xmlns:rdf="http://www.w3.org/1999/02/22-rdf-syntax-ns#"
   xmlns:svg="http://www.w3.org/2000/svg"
   xmlns="http://www.w3.org/2000/svg"
   version="1.1"
   height="15"
   width="14.953781"
   id="svg4">
  <metadata
     id="metadata10">
    <rdf:RDF>
      <cc:Work
         rdf:about="">
        <dc:format>image/svg+xml</dc:format>
        <dc:type
           rdf:resource="http://purl.org/dc/dcmitype/StillImage" />
        <dc:title></dc:title>
      </cc:Work>
    </rdf:RDF>
  </metadata>
  <defs
     id="defs8" />
  <path
     style="fill:#00adef;stroke-width:0.999999"
     d="m 0,2.1237513 6.1111365,-0.8322735 0.00266,5.8946858 -6.10822549,0.034785 z m 6.1082254,5.741595 0.00474,5.8998227 L 0.00474342,12.925378 0.00440094,7.8257719 Z M 6.8490383,1.1826018 14.951898,0 V 7.1111936 L 6.8490383,7.1755208 Z M 14.953781,7.9208285 14.951881,15 6.8490209,13.856373 6.8376679,7.9075748 Z"
     id="path2" />
</svg>
