<?xml version="1.0" encoding="UTF-8" standalone="no"?>
<svg
   xmlns:dc="http://purl.org/dc/elements/1.1/"
   xmlns:cc="http://creativecommons.org/ns#"
   xmlns:rdf="http://www.w3.org/1999/02/22-rdf-syntax-ns#"
   xmlns:svg="http://www.w3.org/2000/svg"
   xmlns="http://www.w3.org/2000/svg"
   width="3.9687502mm"
   height="4.0200806mm"
   viewBox="0 0 3.9687503 4.0200805"
   version="1.1"
   id="svg8">
  <defs
     id="defs2" />
  <metadata
     id="metadata5">
    <rdf:RDF>
      <cc:Work
         rdf:about="">
        <dc:format>image/svg+xml</dc:format>
        <dc:type
           rdf:resource="http://purl.org/dc/dcmitype/StillImage" />
        <dc:title></dc:title>
      </cc:Work>
    </rdf:RDF>
  </metadata>
  <g
     id="layer1"
     transform="translate(-95.529912,-96.935038)">
    <g
       id="g957"
       transform="matrix(0.06689274,0,0,0.06689274,89.139655,90.450788)">
      <path
         id="path847"
         style="opacity:1;fill:#aededd;fill-opacity:1;stroke:#000000;stroke-width:5.66929;stroke-linecap:round;stroke-linejoin:round;stroke-opacity:1"
         d="m 373.97461,369.20312 a 99.202772,112.49999 0 0 0 9.98047,49.07813 109.28571,109.28571 0 0 0 -20.0625,63.10742 109.28571,109.28571 0 0 0 109.28515,109.28516 109.28571,109.28571 0 0 0 109.28516,-109.28516 109.28571,109.28571 0 0 0 -20.06055,-63.10742 99.202772,112.49999 0 0 0 9.97852,-49.07813 l -40.4082,20.06446 a 109.28571,109.28571 0 0 0 -58.79493,-17.16406 109.28571,109.28571 0 0 0 -58.79492,17.16406 z"
         transform="scale(0.26458333)" />
      <g
         id="g912"
         transform="translate(0.34666081)">
        <path
           style="fill:none;stroke:#000000;stroke-width:1;stroke-linecap:butt;stroke-linejoin:miter;stroke-miterlimit:4;stroke-dasharray:none;stroke-opacity:1"
           d="m 102.6315,134.43657 h 44.43356"
           id="path898" />
        <path
           id="path907"
           style="opacity:1;fill:#ffffff;fill-opacity:1;stroke:#000000;stroke-width:1;stroke-linecap:round;stroke-linejoin:round;stroke-miterlimit:4;stroke-dasharray:none;stroke-opacity:1"
           d="m 135.76731,134.43657 h 8.01809 v 4.00961 h -8.01809 z m -10.07642,0 h 8.01809 v 12.23059 h -8.01809 z m -10.07642,0 h 8.01809 v 10.15173 h -8.01809 z m -10.07642,0 h 8.01809 v 5.94674 h -8.01809 z" />
      </g>
      <g
         id="g940"
         transform="translate(69.742345,-0.04053154)">
        <g
           id="g918"
           transform="translate(-43.938259,4.6853231)">
          <path
             id="path864"
             style="opacity:1;fill:#ffffff;fill-opacity:1;stroke:#201b1c;stroke-width:1;stroke-linecap:round;stroke-linejoin:round;stroke-miterlimit:4;stroke-dasharray:none;stroke-opacity:1"
             d="m 98.021099,114.75885 a 9.8555641,9.8555641 0 0 1 -9.855564,9.85556 9.8555641,9.8555641 0 0 1 -9.855564,-9.85556 9.8555641,9.8555641 0 0 1 9.855564,-9.85556 9.8555641,9.8555641 0 0 1 9.855564,9.85556 z" />
          <path
             id="path881"
             style="color:#000000;font-style:normal;font-variant:normal;font-weight:normal;font-stretch:normal;font-size:medium;line-height:normal;font-family:sans-serif;font-variant-ligatures:normal;font-variant-position:normal;font-variant-caps:normal;font-variant-numeric:normal;font-variant-alternates:normal;font-variant-east-asian:normal;font-feature-settings:normal;font-variation-settings:normal;text-indent:0;text-align:start;text-decoration:none;text-decoration-line:none;text-decoration-style:solid;text-decoration-color:#000000;letter-spacing:normal;word-spacing:normal;text-transform:none;writing-mode:lr-tb;direction:ltr;text-orientation:mixed;dominant-baseline:auto;baseline-shift:baseline;text-anchor:start;white-space:normal;shape-padding:0;shape-margin:0;inline-size:0;clip-rule:nonzero;display:inline;overflow:visible;visibility:visible;opacity:1;isolation:auto;mix-blend-mode:normal;color-interpolation:sRGB;color-interpolation-filters:linearRGB;solid-color:#000000;solid-opacity:1;vector-effect:none;fill:#000000;fill-opacity:1;fill-rule:nonzero;stroke:none;stroke-width:1;stroke-linecap:butt;stroke-linejoin:miter;stroke-miterlimit:4;stroke-dasharray:none;stroke-dashoffset:0;stroke-opacity:1;color-rendering:auto;image-rendering:auto;shape-rendering:auto;text-rendering:auto;enable-background:accumulate;stop-color:#000000;stop-opacity:1"
             d="m 84.624402,105.55841 -0.462505,0.19172 0.896586,2.16421 c 0.151998,-0.069 0.30625,-0.13297 0.462505,-0.19172 z m 7.082255,0 -0.896588,2.16421 c 0.155726,0.0586 0.309462,0.12239 0.460955,0.1912 l 0.896585,-2.16369 z m -10.334254,2.05466 -0.353467,0.35398 1.656746,1.65675 c 0.114041,-0.12172 0.232101,-0.23961 0.353984,-0.35347 z m 13.584184,0 -1.65623,1.65623 c 0.121708,0.11387 0.239596,0.23176 0.353467,0.35347 l 1.656231,-1.65572 z m -15.800585,3.14296 -0.19172,0.4625 2.16421,0.89659 c 0.05874,-0.15643 0.122684,-0.31085 0.191719,-0.46302 z m 18.019572,0 -2.165244,0.89658 c 0.06902,0.152 0.132966,0.30625 0.191719,0.46251 l 2.164726,-0.89659 z m -18.865517,3.75378 v 0.49971 h 2.342494 c -0.0028,-0.0835 -0.0042,-0.16707 -0.0041,-0.25063 2e-6,-0.0831 0.0013,-0.16609 0.0041,-0.24908 z m 17.367417,0 c 0.0029,0.083 0.0045,0.16603 0.0047,0.24908 1.6e-5,0.0836 -0.0013,0.16711 -0.0041,0.25063 h 2.34301 v -0.49971 z m -14.548982,2.89232 -2.16421,0.89659 0.19172,0.46302 2.164209,-0.89658 c -0.06903,-0.15217 -0.132977,-0.3066 -0.191719,-0.46303 z m 14.073557,0 c -0.05875,0.15626 -0.122695,0.31051 -0.191719,0.46251 l 2.165244,0.8971 0.191201,-0.46302 z" />
          <path
             id="path893"
             style="fill:#ce2229;fill-opacity:1;stroke:none;stroke-width:0.264583px;stroke-linecap:butt;stroke-linejoin:miter;stroke-opacity:1"
             d="m 88.165277,105.4014 -0.967899,7.89048 h 1.936313 z" />
          <circle
             style="opacity:1;fill:#000000;fill-opacity:1;stroke:none;stroke-width:1;stroke-linecap:round;stroke-linejoin:round;stroke-miterlimit:4;stroke-dasharray:none;stroke-opacity:1"
             id="path891"
             cx="88.165535"
             cy="114.75885"
             r="2.1047475" />
        </g>
        <g
           id="g928"
           transform="translate(-21.487619,4.6853231)">
          <path
             id="path920"
             style="opacity:1;fill:#ffffff;fill-opacity:1;stroke:#201b1c;stroke-width:1;stroke-linecap:round;stroke-linejoin:round;stroke-miterlimit:4;stroke-dasharray:none;stroke-opacity:1"
             d="m 98.021099,114.75885 a 9.8555641,9.8555641 0 0 1 -9.855564,9.85556 9.8555641,9.8555641 0 0 1 -9.855564,-9.85556 9.8555641,9.8555641 0 0 1 9.855564,-9.85556 9.8555641,9.8555641 0 0 1 9.855564,9.85556 z" />
          <path
             id="path922"
             style="color:#000000;font-style:normal;font-variant:normal;font-weight:normal;font-stretch:normal;font-size:medium;line-height:normal;font-family:sans-serif;font-variant-ligatures:normal;font-variant-position:normal;font-variant-caps:normal;font-variant-numeric:normal;font-variant-alternates:normal;font-variant-east-asian:normal;font-feature-settings:normal;font-variation-settings:normal;text-indent:0;text-align:start;text-decoration:none;text-decoration-line:none;text-decoration-style:solid;text-decoration-color:#000000;letter-spacing:normal;word-spacing:normal;text-transform:none;writing-mode:lr-tb;direction:ltr;text-orientation:mixed;dominant-baseline:auto;baseline-shift:baseline;text-anchor:start;white-space:normal;shape-padding:0;shape-margin:0;inline-size:0;clip-rule:nonzero;display:inline;overflow:visible;visibility:visible;opacity:1;isolation:auto;mix-blend-mode:normal;color-interpolation:sRGB;color-interpolation-filters:linearRGB;solid-color:#000000;solid-opacity:1;vector-effect:none;fill:#000000;fill-opacity:1;fill-rule:nonzero;stroke:none;stroke-width:1;stroke-linecap:butt;stroke-linejoin:miter;stroke-miterlimit:4;stroke-dasharray:none;stroke-dashoffset:0;stroke-opacity:1;color-rendering:auto;image-rendering:auto;shape-rendering:auto;text-rendering:auto;enable-background:accumulate;stop-color:#000000;stop-opacity:1"
             d="m 84.624402,105.55841 -0.462505,0.19172 0.896586,2.16421 c 0.151998,-0.069 0.30625,-0.13297 0.462505,-0.19172 z m 7.082255,0 -0.896588,2.16421 c 0.155726,0.0586 0.309462,0.12239 0.460955,0.1912 l 0.896585,-2.16369 z m -10.334254,2.05466 -0.353467,0.35398 1.656746,1.65675 c 0.114041,-0.12172 0.232101,-0.23961 0.353984,-0.35347 z m 13.584184,0 -1.65623,1.65623 c 0.121708,0.11387 0.239596,0.23176 0.353467,0.35347 l 1.656231,-1.65572 z m -15.800585,3.14296 -0.19172,0.4625 2.16421,0.89659 c 0.05874,-0.15643 0.122684,-0.31085 0.191719,-0.46302 z m 18.019572,0 -2.165244,0.89658 c 0.06902,0.152 0.132966,0.30625 0.191719,0.46251 l 2.164726,-0.89659 z m -18.865517,3.75378 v 0.49971 h 2.342494 c -0.0028,-0.0835 -0.0042,-0.16707 -0.0041,-0.25063 2e-6,-0.0831 0.0013,-0.16609 0.0041,-0.24908 z m 17.367417,0 c 0.0029,0.083 0.0045,0.16603 0.0047,0.24908 1.6e-5,0.0836 -0.0013,0.16711 -0.0041,0.25063 h 2.34301 v -0.49971 z m -14.548982,2.89232 -2.16421,0.89659 0.19172,0.46302 2.164209,-0.89658 c -0.06903,-0.15217 -0.132977,-0.3066 -0.191719,-0.46303 z m 14.073557,0 c -0.05875,0.15626 -0.122695,0.31051 -0.191719,0.46251 l 2.165244,0.8971 0.191201,-0.46302 z" />
          <path
             id="path924"
             style="fill:#ce2229;fill-opacity:1;stroke:none;stroke-width:0.264583px;stroke-linecap:butt;stroke-linejoin:miter;stroke-opacity:1"
             d="m 88.165277,105.4014 -0.967899,7.89048 h 1.936313 z" />
          <circle
             style="opacity:1;fill:#000000;fill-opacity:1;stroke:none;stroke-width:1;stroke-linecap:round;stroke-linejoin:round;stroke-miterlimit:4;stroke-dasharray:none;stroke-opacity:1"
             id="circle926"
             cx="88.165535"
             cy="114.75885"
             r="2.1047475" />
        </g>
      </g>
    </g>
  </g>
</svg>
