<?xml version="1.0" encoding="UTF-8" standalone="no"?>
<!-- Created with Inkscape (http://www.inkscape.org/) -->

<svg
   width="15"
   height="15"
   id="svg3486"
   version="1.1"
   xmlns:xlink="http://www.w3.org/1999/xlink"
   xmlns="http://www.w3.org/2000/svg"
   xmlns:svg="http://www.w3.org/2000/svg"
   xmlns:rdf="http://www.w3.org/1999/02/22-rdf-syntax-ns#"
   xmlns:cc="http://creativecommons.org/ns#"
   xmlns:dc="http://purl.org/dc/elements/1.1/">
  <defs
     id="defs3488">
    <style
       id="style2">.cls-1{fill:url(#radial-gradient);}.cls-2{fill:none;}.cls-3{fill:url(#radial-gradient-2);}.cls-4{fill:url(#radial-gradient-3);}.cls-5{clip-path:url(#clip-path);}.cls-6{fill:url(#radial-gradient-5);}.cls-7{clip-path:url(#clip-path-2);}.cls-8{fill:url(#radial-gradient-6);}.cls-9{fill:url(#radial-gradient-7);}</style>
    <radialGradient
       id="radial-gradient"
       cx="512.06146"
       cy="512.12115"
       r="444.12234"
       gradientUnits="userSpaceOnUse">
      <stop
         offset="0.99"
         stop-opacity="0.5"
         id="stop4" />
      <stop
         offset="1"
         stop-opacity="0"
         id="stop6" />
    </radialGradient>
    <radialGradient
       id="radial-gradient-2"
       cx="514.5"
       cy="516.5"
       r="496.5"
       gradientUnits="userSpaceOnUse">
      <stop
         offset="0.91341"
         id="stop9" />
      <stop
         offset="1"
         stop-opacity="0"
         id="stop11" />
    </radialGradient>
    <radialGradient
       id="radial-gradient-3"
       cx="512.05908"
       cy="512.12122"
       r="486.27267"
       gradientUnits="userSpaceOnUse">
      <stop
         offset="0.99"
         stop-color="#fff"
         id="stop14" />
      <stop
         offset="0.99505"
         stop-color="#fdfdfd"
         id="stop16" />
      <stop
         offset="0.99687"
         stop-color="#f6f6f6"
         id="stop18" />
      <stop
         offset="0.99817"
         stop-color="#ebebeb"
         id="stop20" />
      <stop
         offset="0.99921"
         stop-color="#dadada"
         id="stop22" />
      <stop
         offset="1"
         stop-color="#c7c7c7"
         id="stop24" />
    </radialGradient>
    <clipPath
       id="clip-path"
       transform="translate(-18 -20)">
      <path
         id="SVGID"
         class="cls-1"
         d="m 67.93793,512.1212 c 0,245.28622 198.83963,444.12116 444.12116,444.12116 245.28153,0 444.12591,-198.83494 444.12591,-444.12116 C 956.185,266.83966 757.34063,68 512.05909,68 266.77755,68 67.93793,266.83966 67.93793,512.1212" />
    </clipPath>
    <radialGradient
       id="radial-gradient-5"
       cx="494.0614"
       cy="492.12119"
       r="444.12238"
       xlink:href="#radial-gradient" />
    <clipPath
       id="clip-path-2"
       transform="translate(-18 -20)">
      <path
         class="cls-2"
         d="m 71.60309,512.1212 c 0,243.262 197.19869,440.456 440.456,440.456 243.25731,0 440.46067,-197.194 440.46067,-440.456 0,-243.25733 -197.20334,-440.45606 -440.46067,-440.45606 -243.25733,0 -440.456,197.19873 -440.456,440.45606"
         id="path30" />
    </clipPath>
    <radialGradient
       id="radial-gradient-6"
       cx="5.2952199"
       cy="1029.3145"
       r="4.6533298"
       gradientTransform="matrix(94.65428,0,0,-94.65428,-7.15418,97921.139)"
       gradientUnits="userSpaceOnUse">
      <stop
         offset="0"
         id="stop33" />
      <stop
         offset="1"
         stop-color="#322f32"
         id="stop35" />
    </radialGradient>
    <radialGradient
       id="radial-gradient-7"
       cx="578.89026"
       cy="473.31943"
       r="353.94183"
       gradientTransform="matrix(0.54283814,0,0,0.59552602,73.798286,3.8703803)"
       gradientUnits="userSpaceOnUse">
      <stop
         offset="0"
         stop-color="#c2c0c2"
         id="stop38" />
      <stop
         offset="1"
         stop-color="#ebebeb"
         id="stop40" />
    </radialGradient>
    <radialGradient
       xlink:href="#linearGradient6062"
       id="radialGradient6078"
       cx="604.57355"
       cy="-19.574995"
       fx="604.57355"
       fy="-19.574995"
       r="94.627533"
       gradientUnits="userSpaceOnUse"
       gradientTransform="matrix(0.18475678,0,0,0.19818494,-349.88821,986.84648)" />
    <linearGradient
       id="linearGradient6062">
      <stop
         style="stop-color:#94ef16;stop-opacity:1"
         offset="0"
         id="stop6064" />
      <stop
         style="stop-color:#557334;stop-opacity:1"
         offset="1"
         id="stop6066" />
    </linearGradient>
    <linearGradient
       xlink:href="#linearGradient3468"
       id="linearGradient6084"
       x1="604.547"
       y1="-104.44051"
       x2="604.547"
       y2="-0.038252577"
       gradientUnits="userSpaceOnUse"
       gradientTransform="matrix(0.1661641,0,0,0.1661641,-338.64757,986.21967)" />
    <linearGradient
       id="linearGradient3468">
      <stop
         id="stop3470"
         offset="0"
         style="stop-color:#fdfdfc;stop-opacity:0.78431374" />
      <stop
         id="stop3472"
         offset="1"
         style="stop-color:#ffffff;stop-opacity:0.05172414" />
    </linearGradient>
    <radialGradient
       xlink:href="#linearGradient6062"
       id="radialGradient6078-3"
       cx="604.57355"
       cy="-19.574995"
       fx="604.57355"
       fy="-19.574995"
       r="94.627533"
       gradientUnits="userSpaceOnUse"
       gradientTransform="matrix(0.18475678,0,0,0.19818494,-349.88821,986.84648)" />
    <style
       id="style2-6">.cls-1{fill:url(#radial-gradient);}.cls-2{fill:none;}.cls-3{fill:url(#radial-gradient-2);}.cls-4{fill:url(#radial-gradient-3);}.cls-5{clip-path:url(#clip-path);}.cls-6{fill:url(#radial-gradient-5);}.cls-7{clip-path:url(#clip-path-2);}.cls-8{fill:url(#radial-gradient-6);}.cls-9{fill:url(#radial-gradient-7);}</style>
    <radialGradient
       id="radial-gradient-26"
       cx="512.06146"
       cy="512.12115"
       r="444.12234"
       gradientUnits="userSpaceOnUse">
      <stop
         offset="0.99"
         stop-opacity="0.5"
         id="stop4-1" />
      <stop
         offset="1"
         stop-opacity="0"
         id="stop6-8" />
    </radialGradient>
    <radialGradient
       id="radial-gradient-2-7"
       cx="514.5"
       cy="516.5"
       r="496.5"
       gradientUnits="userSpaceOnUse">
      <stop
         offset="0.91341"
         id="stop9-9" />
      <stop
         offset="1"
         stop-opacity="0"
         id="stop11-2" />
    </radialGradient>
    <radialGradient
       id="radial-gradient-3-0"
       cx="512.05908"
       cy="512.12122"
       r="486.27267"
       gradientUnits="userSpaceOnUse">
      <stop
         offset="0.99"
         stop-color="#fff"
         id="stop14-2" />
      <stop
         offset="0.99505"
         stop-color="#fdfdfd"
         id="stop16-3" />
      <stop
         offset="0.99687"
         stop-color="#f6f6f6"
         id="stop18-7" />
      <stop
         offset="0.99817"
         stop-color="#ebebeb"
         id="stop20-5" />
      <stop
         offset="0.99921"
         stop-color="#dadada"
         id="stop22-9" />
      <stop
         offset="1"
         stop-color="#c7c7c7"
         id="stop24-2" />
    </radialGradient>
    <clipPath
       id="clip-path-28"
       transform="translate(-18 -20)">
      <path
         id="SVGID-9"
         class="cls-1"
         d="m 67.93793,512.1212 c 0,245.28622 198.83963,444.12116 444.12116,444.12116 245.28153,0 444.12591,-198.83494 444.12591,-444.12116 C 956.185,266.83966 757.34063,68 512.05909,68 266.77755,68 67.93793,266.83966 67.93793,512.1212"
         style="fill:url(#radial-gradient-26)" />
    </clipPath>
    <radialGradient
       id="radial-gradient-5-7"
       cx="494.0614"
       cy="492.12119"
       r="444.12238"
       xlink:href="#radial-gradient-26" />
    <clipPath
       id="clip-path-2-3"
       transform="translate(-18 -20)">
      <path
         class="cls-2"
         d="m 71.60309,512.1212 c 0,243.262 197.19869,440.456 440.456,440.456 243.25731,0 440.46067,-197.194 440.46067,-440.456 0,-243.25733 -197.20334,-440.45606 -440.46067,-440.45606 -243.25733,0 -440.456,197.19873 -440.456,440.45606"
         id="path30-6" />
    </clipPath>
    <radialGradient
       id="radial-gradient-6-1"
       cx="5.2952199"
       cy="1029.3145"
       r="4.6533298"
       gradientTransform="matrix(94.65428,0,0,-94.65428,-7.15418,97921.139)"
       gradientUnits="userSpaceOnUse">
      <stop
         offset="0"
         id="stop33-2" />
      <stop
         offset="1"
         stop-color="#322f32"
         id="stop35-9" />
    </radialGradient>
    <radialGradient
       id="radial-gradient-7-3"
       cx="578.89026"
       cy="473.31943"
       r="353.94183"
       gradientTransform="matrix(0.54283814,0,0,0.59552602,73.798286,3.8703803)"
       gradientUnits="userSpaceOnUse">
      <stop
         offset="0"
         stop-color="#c2c0c2"
         id="stop38-1" />
      <stop
         offset="1"
         stop-color="#ebebeb"
         id="stop40-9" />
    </radialGradient>
    <radialGradient
       xlink:href="#linearGradient6062"
       id="radialGradient6078-4"
       cx="604.57355"
       cy="-19.574995"
       fx="604.57355"
       fy="-19.574995"
       r="94.627533"
       gradientUnits="userSpaceOnUse"
       gradientTransform="matrix(0.18475678,0,0,0.19818494,-349.88821,986.84648)" />
    <radialGradient
       xlink:href="#linearGradient6062"
       id="radialGradient6078-3-0"
       cx="604.57355"
       cy="-19.574995"
       fx="604.57355"
       fy="-19.574995"
       r="94.627533"
       gradientUnits="userSpaceOnUse"
       gradientTransform="matrix(0.18475678,0,0,0.19818494,-349.88821,986.84648)" />
  </defs>
  <metadata
     id="metadata3491">
    <rdf:RDF>
      <cc:Work
         rdf:about="">
        <dc:format>image/svg+xml</dc:format>
        <dc:type
           rdf:resource="http://purl.org/dc/dcmitype/StillImage" />
      </cc:Work>
    </rdf:RDF>
  </metadata>
  <g
     id="layer1"
     transform="translate(-91.038045,-110.59091)">
    <g
       id="g4040-4"
       transform="matrix(0.51437507,0,0,0.51437507,707.34173,-688.45681)">
      <path
         id="path3171-7-3-3-8-7-3"
         d="m -1168.9985,1568.015 c 0,8.0524 -6.5282,14.5806 -14.5809,14.5806 -8.0528,0 -14.5807,-6.5281 -14.5807,-14.5806 0,-8.053 6.5278,-14.581 14.5806,-14.581 8.0527,0 14.581,6.528 14.581,14.581 z"
         style="fill:#0087ed;fill-opacity:1" />
      <g
         id="g3771-4-3-2-7-3-0"
         transform="matrix(0.16330129,0,0,0.16330188,-1191.4349,1558.3587)"
         style="fill:#ffffff;fill-opacity:1;fill-rule:nonzero;stroke:none">
        <g
           style="fill:#ffffff;fill-opacity:1"
           id="g3773-2-4-4-8-7-0">
          <path
             style="fill:#ffffff;fill-opacity:1"
             d="M 86.068,0 C 61.466,0 56.851,35.041 70.691,35.041 84.529,35.041 110.671,0 86.068,0 Z"
             id="path3775-2-1-8-4-2-1" />
          <path
             style="fill:#ffffff;fill-opacity:1"
             d="M 45.217,30.699 C 52.586,31.149 60.671,2.577 46.821,4.374 32.976,6.171 37.845,30.249 45.217,30.699 Z"
             id="path3777-5-3-1-3-8-4" />
          <path
             style="fill:#ffffff;fill-opacity:1"
             d="M 11.445,48.453 C 16.686,46.146 12.12,23.581 3.208,29.735 -5.7,35.89 6.204,50.759 11.445,48.453 Z"
             id="path3779-7-3-0-1-51-7" />
          <path
             style="fill:#ffffff;fill-opacity:1"
             d="M 26.212,36.642 C 32.451,35.37 32.793,9.778 21.667,14.369 10.539,18.961 19.978,37.916 26.212,36.642 Z"
             id="path3781-4-7-1-9-3-0" />
          <path
             style="fill:#ffffff;fill-opacity:1"
             id="path3783-2-0-7-8-2-1"
             d="m 58.791,93.913 c 1.107,8.454 -6.202,12.629 -13.36,7.179 C 22.644,83.743 83.16,75.088 79.171,51.386 75.86,31.712 15.495,37.769 8.621,68.553 3.968,89.374 27.774,118.26 52.614,118.26 c 12.22,0 26.315,-11.034 28.952,-25.012 C 83.58,82.589 57.867,86.86 58.791,93.913 Z" />
        </g>
      </g>
    </g>
  </g>
</svg>
