<?xml version="1.0" encoding="UTF-8" standalone="no"?>
<!-- Created with Inkscape (http://www.inkscape.org/) -->

<svg
   width="11.308914mm"
   height="10.054167mm"
   viewBox="0 0 11.308914 10.054167"
   version="1.1"
   id="svg8471"
   xmlns:xlink="http://www.w3.org/1999/xlink"
   xmlns="http://www.w3.org/2000/svg"
   xmlns:svg="http://www.w3.org/2000/svg">
  <defs
     id="defs8468">
    <radialGradient
       xlink:href="#linearGradient6062"
       id="radialGradient6078"
       cx="604.57355"
       cy="-19.574995"
       fx="604.57355"
       fy="-19.574995"
       r="94.627533"
       gradientUnits="userSpaceOnUse"
       gradientTransform="matrix(0.18475678,0,0,0.19818494,-349.88821,986.84648)" />
    <linearGradient
       id="linearGradient6062">
      <stop
         style="stop-color:#94ef16;stop-opacity:1"
         offset="0"
         id="stop6064" />
      <stop
         style="stop-color:#557334;stop-opacity:1"
         offset="1"
         id="stop6066" />
    </linearGradient>
    <linearGradient
       xlink:href="#linearGradient3468"
       id="linearGradient6084"
       x1="604.547"
       y1="-104.44051"
       x2="604.547"
       y2="-0.038252577"
       gradientUnits="userSpaceOnUse"
       gradientTransform="matrix(0.1661641,0,0,0.1661641,-338.64757,986.21967)" />
    <linearGradient
       id="linearGradient3468">
      <stop
         id="stop3470"
         offset="0"
         style="stop-color:#fdfdfc;stop-opacity:0.78431374" />
      <stop
         id="stop3472"
         offset="1"
         style="stop-color:#ffffff;stop-opacity:0.05172414" />
    </linearGradient>
    <radialGradient
       xlink:href="#linearGradient6062"
       id="radialGradient6078-6"
       cx="604.57355"
       cy="-19.574995"
       fx="604.57355"
       fy="-19.574995"
       r="94.627533"
       gradientUnits="userSpaceOnUse"
       gradientTransform="matrix(0.18475678,0,0,0.19818494,-349.88821,986.84648)" />
    <linearGradient
       xlink:href="#linearGradient3468"
       id="linearGradient6084-9"
       x1="604.547"
       y1="-104.44051"
       x2="604.547"
       y2="-0.038252577"
       gradientUnits="userSpaceOnUse"
       gradientTransform="matrix(0.1661641,0,0,0.1661641,-338.64757,986.21967)" />
  </defs>
  <g
     id="layer1"
     transform="translate(-62.140953,-66.873438)">
    <g
       id="g49824"
       transform="matrix(0.19810958,0,0,0.19810958,49.830235,53.625169)">
      <path
         style="fill:#6e6651;fill-opacity:1;stroke:none;stroke-width:0.264583px;stroke-linecap:butt;stroke-linejoin:miter;stroke-opacity:1"
         d="m 73.355728,72.760416 c 12.08349,15.824887 33.879322,3.529991 36.049482,-5.886979 2.3681,14.275517 2.0876,35.718563 -17.264066,37.107813 C 76.636711,105.09431 64.75677,90.752082 64.75677,90.752082 74.749739,96.130771 73.274889,79.53541 73.355728,72.760416 Z"
         id="path8600" />
      <path
         style="fill:#c67d31;fill-opacity:1;stroke:none;stroke-width:0.264583px;stroke-linecap:butt;stroke-linejoin:miter;stroke-opacity:1"
         d="m 96.477381,96.943159 c 5.612059,5.500441 9.077939,8.576361 16.098469,12.298351 l 1.42816,-1.35316 c -6.5881,-6.88906 -10.40476,-8.886162 -15.601552,-12.285619 -0.394109,0.481597 -1.121187,0.963627 -1.925077,1.340428 z"
         id="path9308" />
      <path
         style="fill:#000000;fill-opacity:1;stroke:none;stroke-width:0.264583px;stroke-linecap:butt;stroke-linejoin:miter;stroke-opacity:1"
         d="m 88.79696,97.262721 c 6.055339,0.337248 7.720919,-1.158576 9.135188,-2.128133 -0.154042,-0.284322 -0.454235,-0.508443 -0.809743,-0.912059 1.229031,0.407201 1.865119,1.190668 2.187957,2.157747 -0.363449,-0.328016 -0.535822,-0.53547 -0.907904,-0.777545 -0.830561,1.100694 -5.137476,3.437684 -9.605498,1.65999 z"
         id="path9993" />
      <circle
         style="fill:#e9e9e9;fill-opacity:1;stroke:none;stroke-width:0.239516;stroke-linecap:round;stroke-linejoin:round"
         id="path11969"
         cx="90.480759"
         cy="84.026199"
         r="6.9456673" />
      <circle
         style="fill:#e9e9e9;fill-opacity:1;stroke:none;stroke-width:0.155645;stroke-linecap:round;stroke-linejoin:round"
         id="circle12051"
         cx="77.992592"
         cy="85.148727"
         r="4.5135145" />
      <path
         id="circle12053"
         style="fill:#465154;fill-opacity:1;stroke:none;stroke-width:0.11371;stroke-linecap:round;stroke-linejoin:round"
         d="m 91.743754,81.851335 a 3.297438,3.297438 0 0 0 -0.33228,0.01913 2.15152,2.15152 0 0 1 0.325043,1.136365 2.15152,2.15152 0 0 1 -2.15129,2.151808 2.15152,2.15152 0 0 1 -1.122928,-0.317812 3.297438,3.297438 0 0 0 -0.01601,0.307993 3.297438,3.297438 0 0 0 3.297473,3.297473 3.297438,3.297438 0 0 0 3.297473,-3.297473 3.297438,3.297438 0 0 0 -3.297473,-3.297472 z" />
      <path
         id="circle12165"
         style="fill:#000000;fill-opacity:1;stroke:none;stroke-width:0.044355;stroke-linecap:round;stroke-linejoin:round"
         d="m 91.743754,83.862581 a 1.2862349,1.2862349 0 0 0 -0.192239,0.01447 2.15152,2.15152 0 0 1 -1.081069,1.08934 1.2862349,1.2862349 0 0 0 -0.01291,0.182419 1.2862349,1.2862349 0 0 0 1.286227,1.286224 1.2862349,1.2862349 0 0 0 1.286227,-1.286224 1.2862349,1.2862349 0 0 0 -1.286227,-1.286227 z" />
      <path
         id="path12199"
         style="fill:#465154;fill-opacity:1;stroke:none;stroke-width:0.0695571;stroke-linecap:round;stroke-linejoin:round"
         d="m 78.898952,83.780687 a 2.0170635,2.0170635 0 0 0 -0.203258,0.0117 1.3160983,1.3160983 0 0 1 0.198831,0.695121 1.3160983,1.3160983 0 0 1 -1.315957,1.316275 1.3160983,1.3160983 0 0 1 -0.686903,-0.194408 2.0170635,2.0170635 0 0 0 -0.0098,0.188402 2.0170635,2.0170635 0 0 0 2.017085,2.017084 2.0170635,2.0170635 0 0 0 2.017085,-2.017084 2.0170635,2.0170635 0 0 0 -2.017085,-2.017085 z" />
      <path
         id="path12201"
         style="fill:#000000;fill-opacity:1;stroke:none;stroke-width:0.0271322;stroke-linecap:round;stroke-linejoin:round"
         d="m 78.898952,85.010979 a 0.78679797,0.78679797 0 0 0 -0.117594,0.0089 1.3160983,1.3160983 0 0 1 -0.661296,0.666356 0.78679797,0.78679797 0 0 0 -0.0079,0.111587 0.78679797,0.78679797 0 0 0 0.786793,0.786792 0.78679797,0.78679797 0 0 0 0.786793,-0.786792 0.78679797,0.78679797 0 0 0 -0.786793,-0.786793 z" />
      <ellipse
         style="fill:#000000;fill-opacity:1;stroke:none;stroke-width:0.228291;stroke-linecap:round;stroke-linejoin:round"
         id="circle12205"
         cx="6.9134002"
         cy="112.51874"
         rx="5.4957304"
         ry="7.9746552"
         transform="rotate(-33.911215)" />
      <circle
         style="fill:#e9e9e9;fill-opacity:1;stroke:none;stroke-width:0.0806367;stroke-linecap:round;stroke-linejoin:round"
         id="circle12207"
         cx="65.916901"
         cy="85.601334"
         r="2.3383653" />
      <path
         style="fill:#404040;fill-opacity:1;stroke:none;stroke-width:0.264583px;stroke-linecap:butt;stroke-linejoin:miter;stroke-opacity:1"
         d="m 113.18864,108.3945 c 1.18658,-1.25587 3.25433,-0.45611 4.02833,0.70417 1.39871,2.09677 1.03368,4.2587 1.13056,5.25384 0.0812,0.83377 0.40971,2.3252 0.87756,3.27146 -2.45653,-0.93491 -6.51022,-3.32379 -7.02977,-6.45548 -0.29748,-1.79317 0.55523,-2.31032 0.99332,-2.77399 z"
         id="path12278" />
    </g>
  </g>
</svg>
