<?xml version="1.0" encoding="UTF-8" standalone="no"?>
<!-- Created with Inkscape (http://www.inkscape.org/) -->

<svg
   width="56.886433mm"
   height="50.308784mm"
   viewBox="0 0 56.886433 50.308784"
   version="1.1"
   id="svg88786"
   xmlns="http://www.w3.org/2000/svg"
   xmlns:svg="http://www.w3.org/2000/svg">
  <defs
     id="defs88783" />
  <g
     id="layer1"
     transform="translate(-97.404241,-80.557472)">
    <g
       id="g12160"
       transform="rotate(90,81.273629,58.267362)">
      <path
         style="fill:none;stroke:#000000;stroke-width:0.4;stroke-linecap:butt;stroke-linejoin:miter;stroke-dasharray:none;stroke-opacity:1"
         d="m 105,29.000002 v -14 L 124,15"
         id="path12156" />
      <path
         id="path12158"
         d="m 119,13.5 v 3 h -9 v -2.999997 z"
         style="fill:#ffffff;fill-opacity:1;stroke:#000000;stroke-width:0.5;stroke-linecap:butt;stroke-linejoin:miter;stroke-miterlimit:4;stroke-dasharray:none;stroke-opacity:1" />
    </g>
    <g
       id="g12168"
       transform="translate(99.540989,105.99373)">
      <path
         style="fill:none;stroke:#000000;stroke-width:0.7;stroke-linecap:butt;stroke-linejoin:miter;stroke-miterlimit:4;stroke-dasharray:none;stroke-opacity:1"
         d="m 22,20 h 6"
         id="path12162" />
      <path
         id="path12164"
         style="fill:#000000;fill-opacity:1;stroke:none;stroke-width:1.04298;stroke-linecap:butt;stroke-linejoin:miter;stroke-miterlimit:4;stroke-dasharray:none;stroke-opacity:1"
         d="m 25,15 h 0.89999 m 0,0 c 0,-0.497031 -0.402929,-0.899964 -0.89999,-0.899964 -0.497017,0 -0.90001,0.402933 -0.90001,0.899964 0,0.497032 0.402929,0.899966 0.899949,0.899966 0.49706,0 0.900051,-0.402934 0.900051,-0.899966 z" />
      <path
         style="fill:none;stroke:#000000;stroke-width:0.4;stroke-linecap:butt;stroke-linejoin:miter;stroke-dasharray:none;stroke-opacity:1"
         d="m 25,15 v 5"
         id="path12166" />
    </g>
    <g
       id="g12380"
       transform="translate(69.540987,61.993734)">
      <path
         id="path12186"
         d="m 52.000002,51.999999 h 6 l -3,-6 z"
         style="fill:none;stroke:#000000;stroke-width:0.5;stroke-linecap:butt;stroke-linejoin:miter;stroke-miterlimit:4;stroke-dasharray:none;stroke-opacity:1" />
      <path
         id="path12188"
         d="m 58.000002,44.500349 v 1.49965 h -6 v 1.50036"
         style="fill:none;stroke:#000000;stroke-width:0.5;stroke-linecap:butt;stroke-linejoin:miter;stroke-miterlimit:4;stroke-dasharray:none;stroke-opacity:1" />
    </g>
    <path
       style="fill:none;stroke:#000000;stroke-width:0.4;stroke-linecap:butt;stroke-linejoin:miter;stroke-dasharray:none;stroke-opacity:1"
       d="m 138.54099,120.99373 h -14 l 0,-20"
       id="path12190" />
    <g
       aria-label="DC out"
       id="text12198"
       style="font-size:3.88056px;line-height:125%;font-family:Sans;-inkscape-font-specification:Sans;letter-spacing:0px;word-spacing:0px;stroke:#000000;stroke-width:0">
      <path
         d="m 142.54099,102.38263 v -2.777784 h 0.95687 q 0.32401,0 0.49455,0.03979 0.23874,0.05495 0.40738,0.198954 0.2198,0.185689 0.3278,0.475599 0.1099,0.28801 0.1099,0.65939 0,0.31643 -0.0739,0.56086 -0.0739,0.24443 -0.18948,0.40549 -0.11558,0.15916 -0.2539,0.25201 -0.13643,0.091 -0.33159,0.13832 -0.19327,0.0474 -0.44528,0.0474 z m 0.36759,-0.3278 h 0.59307 q 0.27475,0 0.43012,-0.0512 0.15727,-0.0512 0.25012,-0.14401 0.13074,-0.13074 0.20274,-0.35054 0.0739,-0.22169 0.0739,-0.53623 0,-0.4358 -0.14401,-0.66886 -0.14211,-0.23496 -0.34675,-0.314539 -0.14779,-0.05684 -0.47559,-0.05684 h -0.5836 z"
         style="line-height:125%;font-family:sans-serif;-inkscape-font-specification:sans-serif"
         id="path89089" />
      <path
         d="m 147.32537,101.4087 0.36759,0.0928 q -0.11558,0.45285 -0.41686,0.6916 -0.29938,0.23685 -0.73329,0.23685 -0.44906,0 -0.73139,-0.1819 -0.28043,-0.1838 -0.42823,-0.53055 -0.1459,-0.34675 -0.1459,-0.74466 0,-0.43391 0.16485,-0.75602 0.16674,-0.324014 0.47181,-0.490757 0.30696,-0.168637 0.67455,-0.168637 0.41686,0 0.70108,0.212218 0.28422,0.212218 0.39601,0.596866 l -0.36191,0.0853 q -0.0966,-0.30317 -0.28043,-0.44149 -0.18379,-0.138317 -0.46233,-0.138317 -0.32022,0 -0.53623,0.153477 -0.21411,0.15348 -0.30127,0.41307 -0.0872,0.25769 -0.0872,0.53244 0,0.35433 0.10232,0.6196 0.10422,0.26338 0.32212,0.39412 0.2179,0.13074 0.47181,0.13074 0.30885,0 0.52296,-0.17811 0.21412,-0.17811 0.28991,-0.52865 z"
         style="line-height:125%;font-family:sans-serif;-inkscape-font-specification:sans-serif"
         id="path89091" />
      <path
         d="m 149.05343,101.37649 q 0,-0.55897 0.31075,-0.82803 0.25959,-0.22359 0.63286,-0.22359 0.41497,0 0.67834,0.27285 0.26338,0.27096 0.26338,0.75035 0,0.38843 -0.11748,0.61202 -0.11558,0.22169 -0.33917,0.34485 -0.22169,0.12316 -0.48507,0.12316 -0.42254,0 -0.68402,-0.27095 -0.25959,-0.27096 -0.25959,-0.78066 z m 0.35054,0 q 0,0.38654 0.16864,0.57981 0.16863,0.19137 0.42443,0.19137 0.25391,0 0.42254,-0.19327 0.16864,-0.19327 0.16864,-0.58928 0,-0.37328 -0.17053,-0.56465 -0.16864,-0.19327 -0.42065,-0.19327 -0.2558,0 -0.42443,0.19137 -0.16864,0.19138 -0.16864,0.57792 z"
         style="line-height:125%;font-family:sans-serif;-inkscape-font-specification:sans-serif"
         id="path89093" />
      <path
         d="m 152.65735,102.38263 v -0.29559 q -0.23496,0.34106 -0.63855,0.34106 -0.17811,0 -0.33349,-0.0682 -0.15348,-0.0682 -0.22927,-0.17053 -0.0739,-0.10421 -0.10421,-0.2539 -0.0208,-0.10043 -0.0208,-0.31833 v -1.24678 h 0.34107 v 1.11604 q 0,0.26716 0.0208,0.36001 0.0322,0.13453 0.13643,0.21222 0.10421,0.0758 0.25769,0.0758 0.15348,0 0.28801,-0.0777 0.13453,-0.0796 0.18948,-0.21411 0.0568,-0.13643 0.0568,-0.39412 v -1.07814 h 0.34106 v 2.01228 z"
         style="line-height:125%;font-family:sans-serif;-inkscape-font-specification:sans-serif"
         id="path89095" />
      <path
         d="m 154.24141,102.07757 0.0493,0.30127 q -0.144,0.0303 -0.25769,0.0303 -0.18569,0 -0.28801,-0.0587 -0.10232,-0.0587 -0.14401,-0.15348 -0.0417,-0.0966 -0.0417,-0.40359 v -1.15773 h -0.25012 v -0.26527 h 0.25012 v -0.498337 l 0.33917,-0.204639 v 0.702976 h 0.34296 v 0.26527 h -0.34296 v 1.17667 q 0,0.1459 0.0171,0.18759 0.0189,0.0417 0.0587,0.0663 0.0417,0.0246 0.11748,0.0246 0.0568,0 0.14969,-0.0133 z"
         style="line-height:125%;font-family:sans-serif;-inkscape-font-specification:sans-serif"
         id="path89097" />
    </g>
    <path
       id="path12200"
       style="fill:none;fill-opacity:0.5;stroke:#000000;stroke-width:0.5;stroke-linecap:round;stroke-linejoin:round;stroke-dasharray:none"
       d="m 109.54099,80.993734 c 0.55229,0 1,0.447715 1,1 0,0.552285 -0.44771,1 -1,1 -0.55228,0 -1,-0.447715 -1,-1 0,-0.552285 0.44772,-1 1,-1 z" />
    <g
       id="g12210"
       transform="rotate(-90,114.76736,20.226372)">
      <path
         id="path12206"
         style="fill:none;fill-opacity:0.5;stroke:#000000;stroke-width:0.5;stroke-linecap:round;stroke-linejoin:round;stroke-dasharray:none"
         d="m 15,15 c 0,0.552285 -0.447715,1 -1,1 -0.552285,0 -1,-0.447715 -1,-1 0,-0.552285 0.447715,-1 1,-1 0.552285,0 1,0.447715 1,1 z" />
      <path
         style="fill:none;stroke:#000000;stroke-width:0.4;stroke-linecap:butt;stroke-linejoin:miter;stroke-dasharray:none;stroke-opacity:1"
         d="M 14,16 V 30"
         id="path12208" />
    </g>
    <path
       id="path12212"
       style="fill:none;fill-opacity:0.5;stroke:#000000;stroke-width:0.5;stroke-linecap:round;stroke-linejoin:round;stroke-dasharray:none"
       d="m 139.54099,121.99373 a 1,1 0 0 1 -1,-1 1,1 0 0 1 1,-1 1,1 0 0 1 1,1 1,1 0 0 1 -1,1 z" />
    <g
       id="g12220"
       transform="rotate(90,34.273628,120.26736)">
      <path
         id="path12216"
         style="fill:none;fill-opacity:0.5;stroke:#000000;stroke-width:0.5;stroke-linecap:round;stroke-linejoin:round;stroke-dasharray:none"
         d="m 16,15 a 1,1 0 0 1 -1,1 1,1 0 0 1 -1,-1 1,1 0 0 1 1,-1 1,1 0 0 1 1,1 z" />
      <path
         style="fill:none;stroke:#000000;stroke-width:0.4;stroke-linecap:butt;stroke-linejoin:miter;stroke-dasharray:none;stroke-opacity:1"
         d="M 15,16 V 30"
         id="path12218" />
    </g>
    <path
       id="path12224"
       style="fill:#000000;fill-opacity:1;stroke:none;stroke-width:1.04298;stroke-linecap:butt;stroke-linejoin:miter;stroke-miterlimit:4;stroke-dasharray:none;stroke-opacity:1"
       d="m 124.54099,100.99373 h 0.89999 m 0,0 c 0,-0.49703 -0.40293,-0.89996 -0.89999,-0.89996 -0.49702,0 -0.90001,0.40293 -0.90001,0.89996 0,0.49703 0.40293,0.89997 0.89995,0.89997 0.49706,0 0.90005,-0.40294 0.90005,-0.89997 z" />
    <g
       aria-label="Dz"
       id="text12234"
       style="font-size:3.88056px;line-height:125%;font-family:Sans;-inkscape-font-specification:Sans;letter-spacing:0px;word-spacing:0px;stroke:#000000;stroke-width:0">
      <path
         d="m 115.18105,112.77151 v -2.77779 h 0.95687 q 0.32402,0 0.49455,0.0398 0.23874,0.0549 0.40738,0.19896 0.2198,0.18569 0.3278,0.4756 0.1099,0.28801 0.1099,0.65939 0,0.31643 -0.0739,0.56086 -0.0739,0.24443 -0.18948,0.40549 -0.11558,0.15916 -0.2539,0.25201 -0.13643,0.091 -0.33159,0.13832 -0.19327,0.0474 -0.44528,0.0474 z m 0.36759,-0.3278 h 0.59307 q 0.27475,0 0.43012,-0.0512 0.15727,-0.0512 0.25012,-0.14401 0.13074,-0.13074 0.20274,-0.35054 0.0739,-0.22169 0.0739,-0.53623 0,-0.4358 -0.14401,-0.66886 -0.14211,-0.23496 -0.34674,-0.31454 -0.1478,-0.0568 -0.4756,-0.0568 h -0.5836 z"
         style="line-height:125%;font-family:sans-serif;-inkscape-font-specification:sans-serif"
         id="path89084" />
      <path
         d="m 117.75988,112.77151 v -0.27664 l 1.28088,-1.47037 q -0.2179,0.0114 -0.38464,0.0114 h -0.82045 v -0.27665 h 1.64469 v 0.22549 l -1.08951,1.27709 -0.21033,0.23307 q 0.22927,-0.0171 0.43012,-0.0171 h 0.93035 v 0.2937 z"
         style="line-height:125%;font-family:sans-serif;-inkscape-font-specification:sans-serif"
         id="path89086" />
    </g>
    <g
       aria-label="Rs"
       id="text12238"
       style="font-size:3.88056px;line-height:125%;font-family:Sans;-inkscape-font-specification:Sans;letter-spacing:0px;word-spacing:0px;stroke:#000000;stroke-width:0">
      <path
         d="m 116.25305,92.771515 v -2.777784 h 1.23162 q 0.37138,0 0.56465,0.07579 0.19327,0.0739 0.30885,0.263378 0.11559,0.189481 0.11559,0.418752 0,0.29559 -0.19138,0.498334 -0.19137,0.202744 -0.59118,0.257693 0.1459,0.07011 0.2217,0.138321 0.16105,0.147795 0.30506,0.369487 l 0.48317,0.756027 h -0.46233 l -0.36759,-0.577916 q -0.16106,-0.250114 -0.26527,-0.38275 -0.10422,-0.132636 -0.18759,-0.185691 -0.0815,-0.05305 -0.16674,-0.0739 -0.0625,-0.01326 -0.20464,-0.01326 h -0.42633 v 1.233518 z m 0.36759,-1.551845 h 0.79013 q 0.25201,0 0.39412,-0.05116 0.14211,-0.05305 0.21601,-0.166743 0.0739,-0.115583 0.0739,-0.250114 0,-0.19706 -0.14401,-0.324011 -0.14211,-0.126952 -0.45096,-0.126952 h -0.87919 z"
         style="line-height:125%;font-family:sans-serif;-inkscape-font-specification:sans-serif"
         id="path89079" />
      <path
         d="m 118.86977,92.170862 0.33728,-0.05306 q 0.0284,0.202744 0.15727,0.310748 0.13074,0.108004 0.3638,0.108004 0.23495,0 0.34864,-0.09474 0.11369,-0.09663 0.11369,-0.225482 0,-0.115583 -0.10042,-0.181901 -0.0701,-0.04547 -0.34865,-0.115583 -0.37517,-0.09474 -0.52107,-0.162953 -0.144,-0.07011 -0.2198,-0.191376 -0.0739,-0.123162 -0.0739,-0.270957 0,-0.134531 0.0606,-0.248219 0.0625,-0.115583 0.16864,-0.191375 0.0796,-0.05874 0.216,-0.09853 0.13833,-0.04169 0.29559,-0.04169 0.23685,0 0.41497,0.06821 0.18,0.06821 0.26527,0.185691 0.0853,0.115583 0.11748,0.310748 l -0.33349,0.04548 q -0.0227,-0.155374 -0.13263,-0.242535 -0.10801,-0.08716 -0.30696,-0.08716 -0.23496,0 -0.33538,0.07769 -0.10043,0.07769 -0.10043,0.181901 0,0.06632 0.0417,0.119373 0.0417,0.05495 0.13074,0.09095 0.0512,0.01895 0.30127,0.08716 0.36191,0.09664 0.50402,0.159163 0.14401,0.06063 0.22548,0.178112 0.0815,0.117478 0.0815,0.2918 0,0.170532 -0.10043,0.322117 -0.0985,0.149689 -0.28611,0.233061 -0.18759,0.08148 -0.42444,0.08148 -0.39222,0 -0.59876,-0.162953 -0.20463,-0.162953 -0.26148,-0.483175 z"
         style="line-height:125%;font-family:sans-serif;-inkscape-font-specification:sans-serif"
         id="path89081" />
    </g>
    <g
       aria-label="DC in"
       id="text13135"
       style="font-size:3.88056px;line-height:125%;font-family:Sans;-inkscape-font-specification:Sans;letter-spacing:0px;word-spacing:0px;stroke:#000000;stroke-width:0">
      <path
         d="m 97.404245,83.382629 v -2.777783 h 0.956877 q 0.324011,0 0.494544,0.03979 0.238745,0.05495 0.407383,0.198954 0.219797,0.185691 0.327801,0.475596 0.109898,0.28801 0.109898,0.659392 0,0.316433 -0.0739,0.560862 -0.0739,0.24443 -0.18948,0.405489 -0.115584,0.159163 -0.253904,0.252009 -0.136426,0.09095 -0.331591,0.13832 -0.19327,0.04737 -0.445279,0.04737 z m 0.367592,-0.327801 h 0.593074 q 0.274747,0 0.430121,-0.05116 0.157269,-0.05116 0.250114,-0.144005 0.130742,-0.130741 0.202744,-0.350539 0.0739,-0.221692 0.0739,-0.536229 0,-0.435805 -0.144005,-0.668866 -0.14211,-0.234956 -0.346749,-0.314538 -0.147795,-0.05684 -0.475596,-0.05684 h -0.5836 z"
         style="line-height:125%;font-family:sans-serif;-inkscape-font-specification:sans-serif"
         id="path89070" />
      <path
         d="m 102.18863,82.4087 0.36759,0.09284 q -0.11558,0.452859 -0.41686,0.691604 -0.29938,0.236851 -0.73329,0.236851 -0.44907,0 -0.73139,-0.181902 -0.28043,-0.183796 -0.42823,-0.530545 -0.1459,-0.346749 -0.1459,-0.744658 0,-0.433911 0.16485,-0.756027 0.16674,-0.324012 0.47181,-0.490755 0.30695,-0.168637 0.67455,-0.168637 0.41685,0 0.70107,0.212218 0.28423,0.212218 0.39602,0.596863 l -0.36191,0.08527 q -0.0966,-0.303168 -0.28043,-0.441489 -0.1838,-0.138321 -0.46233,-0.138321 -0.32022,0 -0.53623,0.153479 -0.21411,0.15348 -0.30128,0.413068 -0.0872,0.257693 -0.0872,0.53244 0,0.354328 0.10232,0.619601 0.10422,0.263378 0.32212,0.394119 0.2179,0.130742 0.47181,0.130742 0.30885,0 0.52296,-0.178112 0.21411,-0.178111 0.28991,-0.52865 z"
         style="line-height:125%;font-family:sans-serif;-inkscape-font-specification:sans-serif"
         id="path89072" />
      <path
         d="m 104.04554,80.99707 v -0.392224 h 0.34106 v 0.392224 z m 0,2.385559 v -2.012282 h 0.34106 v 2.012282 z"
         style="line-height:125%;font-family:sans-serif;-inkscape-font-specification:sans-serif"
         id="path89074" />
      <path
         d="m 104.90578,83.382629 v -2.012282 h 0.30696 v 0.286115 q 0.22169,-0.33159 0.64044,-0.33159 0.1819,0 0.33348,0.06632 0.15348,0.06442 0.22928,0.170532 0.0758,0.106109 0.10611,0.252009 0.0189,0.09474 0.0189,0.331591 v 1.237307 h -0.34106 v -1.224043 q 0,-0.208429 -0.0398,-0.310748 -0.0398,-0.104215 -0.14211,-0.164848 -0.10043,-0.06253 -0.23685,-0.06253 -0.21791,0 -0.37707,0.138321 -0.15727,0.138321 -0.15727,0.524861 v 1.098986 z"
         style="line-height:125%;font-family:sans-serif;-inkscape-font-specification:sans-serif"
         id="path89076" />
    </g>
    <g
       aria-label="GND"
       id="text4477"
       style="font-size:3.88056px;line-height:125%;font-family:Sans;-inkscape-font-specification:Sans;letter-spacing:0px;word-spacing:0px;stroke:#000000;stroke-width:0">
      <path
         d="m 121.82858,129.72938 v -0.32591 l 1.17667,-0.002 v 1.03077 q -0.27096,0.21601 -0.55897,0.32591 -0.28801,0.108 -0.59118,0.108 -0.40927,0 -0.74465,-0.17432 -0.33349,-0.17622 -0.50402,-0.50781 -0.17053,-0.33159 -0.17053,-0.74086 0,-0.40549 0.16863,-0.75603 0.17054,-0.35244 0.48886,-0.52297 0.31833,-0.17053 0.73329,-0.17053 0.30128,0 0.54381,0.0985 0.24443,0.0966 0.38275,0.27096 0.13832,0.17432 0.21033,0.45475 l -0.3316,0.0909 q -0.0625,-0.21222 -0.15537,-0.33349 -0.0928,-0.12126 -0.26527,-0.19327 -0.17243,-0.0739 -0.38275,-0.0739 -0.25201,0 -0.43581,0.0777 -0.18379,0.0758 -0.29748,0.20085 -0.1118,0.12506 -0.17432,0.27475 -0.10611,0.25769 -0.10611,0.55897 0,0.37138 0.12695,0.62149 0.12885,0.25012 0.37328,0.37139 0.24443,0.12126 0.51917,0.12126 0.23875,0 0.46612,-0.0909 0.22738,-0.0928 0.34486,-0.19706 v -0.51728 z"
         style="line-height:125%;font-family:sans-serif;-inkscape-font-specification:sans-serif"
         id="path89100" />
      <path
         d="m 123.54338,130.81889 v -2.77778 h 0.37706 l 1.459,2.18092 v -2.18092 h 0.35244 v 2.77778 h -0.37707 l -1.459,-2.18281 v 2.18281 z"
         style="line-height:125%;font-family:sans-serif;-inkscape-font-specification:sans-serif"
         id="path89102" />
      <path
         d="m 126.34958,130.81889 v -2.77778 h 0.95688 q 0.32401,0 0.49454,0.0398 0.23875,0.0549 0.40738,0.19896 0.2198,0.18569 0.32781,0.47559 0.10989,0.28801 0.10989,0.65939 0,0.31644 -0.0739,0.56087 -0.0739,0.24443 -0.18948,0.40548 -0.11559,0.15917 -0.25391,0.25201 -0.13642,0.091 -0.33159,0.13832 -0.19327,0.0474 -0.44528,0.0474 z m 0.36759,-0.3278 h 0.59308 q 0.27474,0 0.43012,-0.0512 0.15727,-0.0512 0.25011,-0.144 0.13074,-0.13074 0.20275,-0.35054 0.0739,-0.22169 0.0739,-0.53623 0,-0.43581 -0.144,-0.66887 -0.14211,-0.23495 -0.34675,-0.31453 -0.1478,-0.0568 -0.4756,-0.0568 h -0.5836 z"
         style="line-height:125%;font-family:sans-serif;-inkscape-font-specification:sans-serif"
         id="path89104" />
    </g>
  </g>
</svg>
