<?xml version="1.0" encoding="UTF-8" standalone="no"?>
<!-- Created with Inkscape (http://www.inkscape.org/) -->

<svg
   width="10.054167mm"
   height="10.054167mm"
   viewBox="0 0 10.054167 10.054167"
   version="1.1"
   id="svg50648"
   xmlns="http://www.w3.org/2000/svg"
   xmlns:svg="http://www.w3.org/2000/svg">
  <defs
     id="defs50645" />
  <g
     id="layer1"
     transform="translate(-131.7029,-30.625982)">
    <g
       id="g71990"
       transform="matrix(0.24080851,0,0,0.24080851,99.987718,23.250985)">
      <rect
         style="fill:#29afae;fill-opacity:1;stroke:none;stroke-width:0.25;stroke-linecap:round;stroke-linejoin:round"
         id="rect51848"
         width="41.751709"
         height="41.751709"
         x="131.7029"
         y="30.625982" />
      <rect
         style="fill:#00292b;fill-opacity:1;stroke:none;stroke-width:0.215334;stroke-linecap:round;stroke-linejoin:round"
         id="rect51948"
         width="35.962303"
         height="35.962303"
         x="134.59761"
         y="33.520687" />
      <path
         id="path52414"
         style="color:#000000;fill:#29afae;fill-opacity:1;stroke-width:0.250221;stroke-linecap:round;stroke-linejoin:round;-inkscape-stroke:none"
         d="m 142.07965,37.232279 c -0.13736,-6.7e-5 -0.27553,0.01201 -0.41237,0.03617 -1.1299,0.199258 -1.95371,1.180693 -1.95389,2.328024 v 23.807335 c 5.3e-4,1.81983 1.97045,2.957184 3.54655,2.047419 l 20.61735,-11.903148 c 1.57628,-0.910119 1.57628,-3.185239 0,-4.095358 L 143.25994,37.549056 c -0.36107,-0.208351 -0.7682,-0.316574 -1.18029,-0.316777 z" />
      <path
         id="rect53099"
         style="fill:#29afae;fill-opacity:1;stroke:none;stroke-width:5.94603;stroke-linecap:round;stroke-linejoin:round;stroke-miterlimit:4;stroke-dasharray:none;stroke-opacity:0.579946"
         d="m 159.12255,37.396116 c -0.9591,0 -1.73116,0.772578 -1.73116,1.731677 v 4.42712 l 8.05273,4.649329 v -9.076449 c 0,-0.959099 -0.77205,-1.731677 -1.73115,-1.731677 z" />
      <g
         id="g54608"
         transform="translate(45.942281,-0.00162203)"
         style="fill:#00292b;fill-opacity:1">
        <rect
           style="fill:#00292b;fill-opacity:1;stroke:none;stroke-width:5.09553;stroke-linecap:round;stroke-linejoin:round;stroke-miterlimit:4;stroke-dasharray:none;stroke-opacity:0.579946"
           id="rect53437"
           width="3.6397059"
           height="3.6397059"
           x="113.08112"
           y="39.013096"
           rx="0.8000235"
           ry="0.8000235" />
        <path
           id="path53776"
           style="fill:#00292b;fill-opacity:1;stroke:none;stroke-width:0.264583px;stroke-linecap:butt;stroke-linejoin:miter;stroke-opacity:1"
           d="m 117.86981,39.149589 -0.70539,0.671277 v 2.024682 l 0.70539,0.670761 z" />
      </g>
      <path
         id="path55398"
         style="fill:#29afae;fill-opacity:1;stroke:none;stroke-width:5.94603;stroke-linecap:round;stroke-linejoin:round;stroke-miterlimit:4;stroke-dasharray:none;stroke-opacity:0.579946"
         d="m 159.12255,65.633723 c -0.9591,0 -1.73116,-0.772578 -1.73116,-1.731677 v -4.42712 l 8.05273,-4.649329 v 9.076449 c 0,0.959099 -0.77205,1.731677 -1.73115,1.731677 z" />
      <path
         id="path54632"
         style="fill:#00292b;fill-opacity:1;stroke:none;stroke-width:4.99999;stroke-linecap:round;stroke-linejoin:round;stroke-miterlimit:4;stroke-dasharray:none;stroke-opacity:0.579946"
         d="m 163.97186,58.058398 c -0.0322,2.65e-4 -0.066,0.0051 -0.10077,0.01447 l -2.89543,0.775664 c -0.22278,0.05969 -0.40204,0.287263 -0.40204,0.510047 v 3.495911 a 1.1621686,0.65145784 0 0 0 -0.74517,-0.151413 1.1621686,0.65145784 0 0 0 -1.16221,0.651123 1.1621686,0.65145784 0 0 0 1.16221,0.65164 1.1621686,0.65145784 0 0 0 1.1622,-0.649057 l 0.001,-5.16e-4 V 60.6138 l 2.86339,-0.767395 v 2.025197 a 1.1621686,0.65145784 0 0 0 -0.74311,-0.150378 1.1621686,0.65145784 0 0 0 -1.1622,0.65164 1.1621686,0.65145784 0 0 0 1.1622,0.651639 1.1621686,0.65145784 0 0 0 1.16221,-0.651639 1.1621686,0.65145784 0 0 0 -10e-4,-0.02274 V 58.36742 c 0,-0.187973 -0.12755,-0.311084 -0.30127,-0.309026 z" />
    </g>
  </g>
</svg>
