<?xml version="1.0" encoding="UTF-8" standalone="no"?>
<!-- Created with Inkscape (http://www.inkscape.org/) -->

<svg
   width="31.893999"
   height="31.893999"
   viewBox="0 0 8.4386206 8.4386206"
   version="1.1"
   id="svg1"
   xml:space="preserve"
   inkscape:version="1.4 (e7c3feb100, 2024-10-09)"
   sodipodi:docname="preview.svg"
   xmlns:inkscape="http://www.inkscape.org/namespaces/inkscape"
   xmlns:sodipodi="http://sodipodi.sourceforge.net/DTD/sodipodi-0.dtd"
   xmlns="http://www.w3.org/2000/svg"
   xmlns:svg="http://www.w3.org/2000/svg"><sodipodi:namedview
     id="namedview1"
     pagecolor="#ffffff"
     bordercolor="#666666"
     borderopacity="1.0"
     inkscape:showpageshadow="2"
     inkscape:pageopacity="0.0"
     inkscape:pagecheckerboard="0"
     inkscape:deskcolor="#d1d1d1"
     inkscape:document-units="mm"
     showgrid="true"
     inkscape:zoom="30.55982"
     inkscape:cx="20.631666"
     inkscape:cy="15.11789"
     inkscape:window-width="3440"
     inkscape:window-height="1325"
     inkscape:window-x="0"
     inkscape:window-y="0"
     inkscape:window-maximized="1"
     inkscape:current-layer="layer1"><inkscape:grid
       id="grid1"
       units="px"
       originx="-118.01822"
       originy="-87.0625"
       spacingx="0.26458332"
       spacingy="0.26458332"
       empcolor="#0099e5"
       empopacity="0.30196078"
       color="#0099e5"
       opacity="0.14901961"
       empspacing="5"
       enabled="true"
       visible="true" /></sodipodi:namedview><defs
     id="defs1" /><g
     inkscape:label="Layer 1"
     inkscape:groupmode="layer"
     id="layer1"
     transform="translate(-118.01823,-87.0625)"><text
       xml:space="preserve"
       style="font-size:10.5833px;line-height:1.25;font-family:sans-serif;text-align:center;text-anchor:middle;stroke-width:0.264583"
       x="95.028915"
       y="108.29279"
       id="text1"><tspan
         sodipodi:role="line"
         id="tspan1"
         style="stroke-width:0.264583"
         x="95.028915"
         y="108.29279"></tspan></text><g
       id="g7"><path
         style="fill:#ffffff;fill-opacity:1;stroke:none;stroke-width:0.264583px;stroke-linecap:butt;stroke-linejoin:miter;stroke-opacity:1"
         d="m 118.26875,91.281245 c 0,0 1.5875,-2.645833 3.96875,-2.645833 2.38125,0 3.96875,2.645833 3.96875,2.645833 0,0 -1.5875,2.645833 -3.96875,2.645833 -2.38125,0 -3.96875,-2.645833 -3.96875,-2.645833 z"
         id="path7"
         sodipodi:nodetypes="cscsc" /><path
         style="fill:none;fill-opacity:0.499518;stroke:#b9c5cc;stroke-width:0.501063;stroke-linecap:round;stroke-linejoin:round;stroke-opacity:1"
         d="m 126.20629,91.281543 c 0,0 -1.32291,2.645833 -3.96874,2.645833 -2.64584,0 -3.96875,-2.645833 -3.96875,-2.645833"
         id="path3" /><circle
         style="fill:#a88a76;fill-opacity:1;stroke-width:0.25;stroke-linecap:round;stroke-linejoin:round;stroke-opacity:0.5"
         id="path2"
         cx="122.23754"
         cy="91.01696"
         r="2.2489583" /><g
         id="g6"
         style="fill:#737374;fill-opacity:0.25"
         transform="translate(3.5297569e-5,1.3232136)"><path
           style="fill:#737374;fill-opacity:0.25;stroke-linecap:round;stroke-linejoin:round"
           d="m 122.23828,87.0625 c -2.81286,0 -4.19336,2.783203 -4.19336,2.783203 -0.0619,0.123522 -0.0121,0.273804 0.11133,0.335938 0.12352,0.06186 0.27381,0.01205 0.33594,-0.111329 0,0 1.26727,-1.699483 3.74609,-1.699483 2.47881,0 3.74414,1.699483 3.74414,1.699483 0.0621,0.123383 0.21242,0.173186 0.33594,0.111329 0.12338,-0.06213 0.17319,-0.212416 0.11133,-0.335938 0,0 -1.37856,-2.783203 -4.19141,-2.783203 z"
           id="path6"
           sodipodi:nodetypes="scccscccs" /></g><g
         id="path1"
         style="fill:#737374;fill-opacity:1"
         transform="translate(3.5297569e-5,1.3232136)"><path
           style="fill:#737374;fill-opacity:1;stroke-linecap:round;stroke-linejoin:round"
           d="m 122.23828,87.0625 c -2.81286,0 -4.19336,2.783203 -4.19336,2.783203 -0.0619,0.123522 -0.0121,0.273804 0.11133,0.335938 0.12352,0.06186 0.27381,0.01205 0.33594,-0.111329 0,0 1.26727,-2.22865 3.74609,-2.22865 2.47881,0 3.74414,2.22865 3.74414,2.22865 0.0621,0.123383 0.21242,0.173186 0.33594,0.111329 0.12338,-0.06213 0.17319,-0.212416 0.11133,-0.335938 0,0 -1.37856,-2.783203 -4.19141,-2.783203 z"
           id="path5"
           sodipodi:nodetypes="scccscccs" /></g><circle
         style="fill:#373738;fill-opacity:1;stroke-width:0.25;stroke-linecap:round;stroke-linejoin:round;stroke-opacity:0.5"
         id="circle6"
         cx="122.23754"
         cy="91.01696"
         r="1.0583353" /><circle
         style="fill:#ffffff;fill-opacity:0.25;stroke-width:0.25;stroke-linecap:round;stroke-linejoin:round;stroke-opacity:0.5"
         id="circle7"
         cx="123.82504"
         cy="91.01696"
         r="0.51446629" /></g></g></svg>
