<?xml version="1.0" encoding="UTF-8" standalone="no"?>
<!-- Created with Inkscape (http://www.inkscape.org/) -->

<svg
   width="84.551575mm"
   height="65.513779mm"
   viewBox="0 0 84.551576 65.513779"
   version="1.1"
   id="svg1522"
   xmlns="http://www.w3.org/2000/svg"
   xmlns:svg="http://www.w3.org/2000/svg">
  <defs
     id="defs1519" />
  <g
     id="layer1"
     transform="translate(-27.734123,-67.304104)">
    <g
       id="g56506"
       transform="matrix(1.5,0,0,1.5,15.006242,-158.36578)">
      <g
         aria-label="Emitter"
         transform="matrix(0.8660254,0.5,-1,0.57735027,0,0)"
         id="text16684"
         style="font-size:3.52778px;line-height:1.25;stroke-width:0.529166">
        <path
           d="m 206.71816,148.3233 v -2.52525 h 1.8259 v 0.298 h -1.49173 v 0.77342 h 1.39699 v 0.29628 h -1.39699 v 0.85955 h 1.55029 v 0.298 z"
           id="path2872" />
        <path
           d="m 209.02465,148.3233 v -1.82934 h 0.27733 v 0.25666 q 0.0861,-0.13436 0.2291,-0.21532 0.14297,-0.0827 0.32556,-0.0827 0.20326,0 0.33245,0.0844 0.13091,0.0844 0.18431,0.23599 0.21705,-0.32039 0.565,-0.32039 0.27216,0 0.41858,0.15158 0.14642,0.14986 0.14642,0.46337 v 1.25573 h -0.30834 v -1.15238 q 0,-0.18604 -0.031,-0.267 -0.0293,-0.0827 -0.10852,-0.13263 -0.0792,-0.05 -0.18603,-0.05 -0.19293,0 -0.3204,0.12919 -0.12746,0.12747 -0.12746,0.40997 v 1.06281 h -0.31006 v -1.18856 q 0,-0.2067 -0.0758,-0.31005 -0.0758,-0.10336 -0.24804,-0.10336 -0.13092,0 -0.24288,0.0689 -0.11025,0.0689 -0.1602,0.20154 -0.0499,0.13264 -0.0499,0.38241 v 0.94912 z"
           id="path2874" />
        <path
           d="m 211.96504,146.15461 v -0.35656 h 0.31006 v 0.35656 z m 0,2.16869 v -1.82934 h 0.31006 v 1.82934 z"
           id="path2876" />
        <path
           d="m 213.42404,148.04597 0.0448,0.27389 q -0.13091,0.0276 -0.23426,0.0276 -0.16881,0 -0.26183,-0.0534 -0.093,-0.0534 -0.13091,-0.13953 -0.0379,-0.0879 -0.0379,-0.3669 v -1.05248 h -0.22738 V 146.494 h 0.22738 v -0.45303 l 0.30834,-0.18604 v 0.63907 h 0.31178 v 0.24115 h -0.31178 v 1.06971 q 0,0.13263 0.0155,0.17053 0.0172,0.0379 0.0534,0.0603 0.0379,0.0224 0.1068,0.0224 0.0517,0 0.13608,-0.0121 z"
           id="path2878" />
        <path
           d="m 214.40417,148.04597 0.0448,0.27389 q -0.13091,0.0276 -0.23426,0.0276 -0.16881,0 -0.26183,-0.0534 -0.093,-0.0534 -0.13091,-0.13953 -0.0379,-0.0879 -0.0379,-0.3669 v -1.05248 h -0.22738 V 146.494 h 0.22738 v -0.45303 l 0.30834,-0.18604 v 0.63907 h 0.31178 v 0.24115 h -0.31178 v 1.06971 q 0,0.13263 0.0155,0.17053 0.0172,0.0379 0.0534,0.0603 0.0379,0.0224 0.1068,0.0224 0.0517,0 0.13608,-0.0121 z"
           id="path2880" />
        <path
           d="m 215.95963,147.73419 0.32039,0.0396 q -0.0758,0.28078 -0.28077,0.4358 -0.20499,0.15503 -0.52366,0.15503 -0.40135,0 -0.63734,-0.24632 -0.23427,-0.24805 -0.23427,-0.69419 0,-0.46164 0.23772,-0.71658 0.23771,-0.25493 0.61667,-0.25493 0.3669,0 0.59944,0.24976 0.23255,0.24977 0.23255,0.7028 0,0.0276 -0.002,0.0827 h -1.36426 q 0.0172,0.30144 0.17053,0.46164 0.15331,0.1602 0.38241,0.1602 0.17053,0 0.29111,-0.0896 0.12058,-0.0896 0.1912,-0.28594 z m -1.01803,-0.50126 h 1.02147 q -0.0207,-0.23082 -0.11713,-0.34623 -0.14814,-0.17915 -0.38413,-0.17915 -0.21359,0 -0.36001,0.14297 -0.14469,0.14298 -0.1602,0.38241 z"
           id="path2882" />
        <path
           d="m 216.66588,148.3233 v -1.82934 h 0.27905 v 0.27733 q 0.1068,-0.19465 0.19637,-0.25666 0.0913,-0.062 0.19981,-0.062 0.15676,0 0.31868,0.0999 l -0.1068,0.28767 q -0.11369,-0.0672 -0.22738,-0.0672 -0.10163,0 -0.18259,0.062 -0.081,0.0603 -0.11541,0.16881 -0.0517,0.16537 -0.0517,0.36174 v 0.95773 z"
           id="path2884" />
      </g>
      <g
         aria-label="Gate"
         transform="matrix(0.8660254,-0.5,1,0.57735027,0,0)"
         id="text16688"
         style="font-size:3.52778px;line-height:1.25;stroke-width:0.529166">
        <path
           d="m -159.68902,171.57121 v -0.29628 l 1.0697,-0.002 V 172.21 q -0.24632,0.19637 -0.50815,0.29627 -0.26183,0.0982 -0.53744,0.0982 -0.37207,0 -0.67696,-0.15847 -0.30317,-0.1602 -0.4582,-0.46165 -0.15502,-0.30144 -0.15502,-0.67351 0,-0.36863 0.1533,-0.6873 0.15503,-0.3204 0.44442,-0.47542 0.28939,-0.15503 0.66663,-0.15503 0.27388,0 0.49437,0.0896 0.22221,0.0879 0.34795,0.24632 0.12575,0.15848 0.19121,0.41341 l -0.30145,0.0827 q -0.0568,-0.19293 -0.14125,-0.30317 -0.0844,-0.11024 -0.24116,-0.1757 -0.15675,-0.0672 -0.34795,-0.0672 -0.2291,0 -0.39619,0.0706 -0.16709,0.0689 -0.27044,0.18259 -0.10163,0.11369 -0.15847,0.24977 -0.0965,0.23427 -0.0965,0.50815 0,0.33762 0.11542,0.565 0.11713,0.22738 0.33934,0.33762 0.22221,0.11024 0.47198,0.11024 0.21704,0 0.42374,-0.0827 0.20671,-0.0844 0.31351,-0.17914 v -0.47026 z"
           id="path2863" />
        <path
           d="m -156.97256,172.33602 q -0.17226,0.14642 -0.33245,0.20671 -0.15848,0.0603 -0.34107,0.0603 -0.30144,0 -0.46336,-0.14642 -0.16192,-0.14814 -0.16192,-0.37724 0,-0.13436 0.0603,-0.2446 0.062,-0.11197 0.16019,-0.17914 0.0999,-0.0672 0.22393,-0.10164 0.0913,-0.0241 0.27561,-0.0465 0.37552,-0.0448 0.55294,-0.1068 0.002,-0.0637 0.002,-0.081 0,-0.18948 -0.0879,-0.267 -0.11885,-0.10507 -0.35312,-0.10507 -0.21876,0 -0.32384,0.0775 -0.10335,0.0758 -0.15331,0.27044 l -0.30316,-0.0413 q 0.0413,-0.19465 0.13608,-0.3135 0.0947,-0.12058 0.27388,-0.18432 0.17915,-0.0654 0.41514,-0.0654 0.23426,0 0.38068,0.0551 0.14642,0.0551 0.21532,0.13953 0.0689,0.0827 0.0965,0.21015 0.0155,0.0792 0.0155,0.28594 v 0.41341 q 0,0.43236 0.0189,0.54777 0.0207,0.11369 0.0792,0.21877 h -0.32384 q -0.0482,-0.0965 -0.062,-0.22566 z m -0.0258,-0.69246 q -0.16881,0.0689 -0.50643,0.11713 -0.1912,0.0276 -0.27044,0.062 -0.0792,0.0344 -0.1223,0.10163 -0.0431,0.0655 -0.0431,0.14642 0,0.12402 0.093,0.20671 0.0947,0.0827 0.27561,0.0827 0.17915,0 0.31867,-0.0775 0.13953,-0.0792 0.20499,-0.21532 0.0499,-0.10507 0.0499,-0.31005 z"
           id="path2865" />
        <path
           d="m -155.52734,172.28435 0.0448,0.27388 q -0.13091,0.0276 -0.23426,0.0276 -0.16881,0 -0.26183,-0.0534 -0.093,-0.0534 -0.13092,-0.13952 -0.0379,-0.0878 -0.0379,-0.36691 v -1.05247 h -0.22738 v -0.24116 h 0.22738 v -0.45303 l 0.30833,-0.18604 v 0.63907 h 0.31179 v 0.24116 h -0.31179 v 1.0697 q 0,0.13264 0.0155,0.17053 0.0172,0.0379 0.0534,0.0603 0.0379,0.0224 0.10679,0.0224 0.0517,0 0.13609,-0.0121 z"
           id="path2867" />
        <path
           d="m -153.97188,171.97256 0.32039,0.0396 q -0.0758,0.28078 -0.28077,0.43581 -0.20499,0.15503 -0.52366,0.15503 -0.40135,0 -0.63734,-0.24633 -0.23427,-0.24804 -0.23427,-0.69418 0,-0.46165 0.23771,-0.71658 0.23772,-0.25494 0.61668,-0.25494 0.3669,0 0.59944,0.24977 0.23255,0.24977 0.23255,0.7028 0,0.0276 -0.002,0.0827 h -1.36426 q 0.0172,0.30145 0.17053,0.46164 0.15331,0.1602 0.3824,0.1602 0.17054,0 0.29112,-0.0896 0.12057,-0.0896 0.1912,-0.28595 z m -1.01803,-0.50126 h 1.02147 q -0.0207,-0.23082 -0.11713,-0.34623 -0.14814,-0.17914 -0.38413,-0.17914 -0.21359,0 -0.36001,0.14297 -0.1447,0.14297 -0.1602,0.3824 z"
           id="path2869" />
      </g>
      <g
         aria-label="Collector"
         transform="matrix(0.8660254,0.5,-1,0.57735027,0,0)"
         id="text16692"
         style="font-size:3.52778px;line-height:1.25;stroke-width:0.529166">
        <path
           d="m 207.21584,125.78728 0.33417,0.0844 q -0.10507,0.41169 -0.37896,0.62873 -0.27216,0.21532 -0.66662,0.21532 -0.40825,0 -0.66491,-0.16536 -0.25493,-0.16709 -0.38929,-0.48232 -0.13264,-0.31522 -0.13264,-0.67696 0,-0.39446 0.14986,-0.68729 0.15159,-0.29456 0.42892,-0.44615 0.27905,-0.1533 0.61323,-0.1533 0.37896,0 0.63734,0.19292 0.25838,0.19293 0.36001,0.54261 l -0.32901,0.0775 q -0.0879,-0.27561 -0.25493,-0.40135 -0.16709,-0.12575 -0.4203,-0.12575 -0.29112,0 -0.48749,0.13953 -0.19464,0.13952 -0.27388,0.37551 -0.0792,0.23427 -0.0792,0.48404 0,0.32212 0.093,0.56327 0.0947,0.23944 0.29283,0.35829 0.1981,0.11886 0.42892,0.11886 0.28077,0 0.47542,-0.16192 0.19465,-0.16192 0.26355,-0.48059 z"
           id="path2887" />
        <path
           d="m 207.80667,125.758 q 0,-0.50816 0.2825,-0.75276 0.23599,-0.20326 0.57533,-0.20326 0.37724,0 0.61668,0.24805 0.23943,0.24632 0.23943,0.68213 0,0.35312 -0.1068,0.55638 -0.10507,0.20154 -0.30833,0.3135 -0.20154,0.11197 -0.44098,0.11197 -0.38412,0 -0.62184,-0.24632 -0.23599,-0.24633 -0.23599,-0.70969 z m 0.31868,0 q 0,0.35139 0.1533,0.52709 0.15331,0.17398 0.38585,0.17398 0.23083,0 0.38413,-0.1757 0.15331,-0.1757 0.15331,-0.53571 0,-0.33934 -0.15503,-0.51332 -0.15331,-0.1757 -0.38241,-0.1757 -0.23254,0 -0.38585,0.17398 -0.1533,0.17398 -0.1533,0.52538 z"
           id="path2889" />
        <path
           d="m 209.87718,126.67267 v -2.52526 h 0.31006 v 2.52526 z"
           id="path2891" />
        <path
           d="m 210.66094,126.67267 v -2.52526 h 0.31006 v 2.52526 z"
           id="path2893" />
        <path
           d="m 212.70388,126.08356 0.32039,0.0396 q -0.0758,0.28077 -0.28077,0.4358 -0.20498,0.15503 -0.52366,0.15503 -0.40135,0 -0.63734,-0.24632 -0.23427,-0.24805 -0.23427,-0.69419 0,-0.46165 0.23772,-0.71658 0.23771,-0.25494 0.61667,-0.25494 0.3669,0 0.59945,0.24977 0.23254,0.24977 0.23254,0.7028 0,0.0276 -0.002,0.0827 h -1.36426 q 0.0172,0.30145 0.17053,0.46165 0.15331,0.16019 0.38241,0.16019 0.17053,0 0.29111,-0.0896 0.12058,-0.0896 0.1912,-0.28594 z m -1.01803,-0.50126 h 1.02148 q -0.0207,-0.23083 -0.11714,-0.34624 -0.14814,-0.17914 -0.38413,-0.17914 -0.21359,0 -0.36001,0.14297 -0.14469,0.14297 -0.1602,0.38241 z"
           id="path2895" />
        <path
           d="m 214.6073,126.0026 0.30489,0.0396 q -0.0499,0.31522 -0.25666,0.49437 -0.20498,0.17742 -0.50471,0.17742 -0.37551,0 -0.60461,-0.2446 -0.22738,-0.24633 -0.22738,-0.70452 0,-0.29628 0.0982,-0.51849 0.0982,-0.22221 0.298,-0.33245 0.20154,-0.11197 0.43752,-0.11197 0.29801,0 0.48749,0.15158 0.18948,0.14987 0.24288,0.4272 l -0.30145,0.0465 q -0.0431,-0.18432 -0.15331,-0.27733 -0.10852,-0.093 -0.26355,-0.093 -0.23426,0 -0.38068,0.16881 -0.14642,0.16708 -0.14642,0.53054 0,0.36863 0.14125,0.53572 0.14125,0.16708 0.36863,0.16708 0.18259,0 0.30489,-0.11196 0.1223,-0.11197 0.15503,-0.34451 z"
           id="path2897" />
        <path
           d="m 215.85442,126.39534 0.0448,0.27388 q -0.13091,0.0276 -0.23427,0.0276 -0.16881,0 -0.26182,-0.0534 -0.093,-0.0534 -0.13092,-0.13953 -0.0379,-0.0879 -0.0379,-0.3669 v -1.05248 h -0.22738 v -0.24116 h 0.22738 v -0.45303 l 0.30833,-0.18603 v 0.63906 h 0.31178 v 0.24116 h -0.31178 v 1.0697 q 0,0.13264 0.0155,0.17053 0.0172,0.0379 0.0534,0.0603 0.0379,0.0224 0.1068,0.0224 0.0517,0 0.13608,-0.0121 z"
           id="path2899" />
        <path
           d="m 216.04218,125.758 q 0,-0.50816 0.2825,-0.75276 0.23599,-0.20326 0.57533,-0.20326 0.37724,0 0.61667,0.24805 0.23944,0.24632 0.23944,0.68213 0,0.35312 -0.1068,0.55638 -0.10508,0.20154 -0.30834,0.3135 -0.20154,0.11197 -0.44097,0.11197 -0.38413,0 -0.62184,-0.24632 -0.23599,-0.24633 -0.23599,-0.70969 z m 0.31867,0 q 0,0.35139 0.15331,0.52709 0.15331,0.17398 0.38585,0.17398 0.23082,0 0.38413,-0.1757 0.15331,-0.1757 0.15331,-0.53571 0,-0.33934 -0.15503,-0.51332 -0.15331,-0.1757 -0.38241,-0.1757 -0.23254,0 -0.38585,0.17398 -0.15331,0.17398 -0.15331,0.52538 z"
           id="path2901" />
        <path
           d="m 218.11613,126.67267 v -1.82935 h 0.27905 v 0.27733 q 0.1068,-0.19465 0.19637,-0.25666 0.0913,-0.062 0.19982,-0.062 0.15675,0 0.31867,0.0999 l -0.1068,0.28766 q -0.11369,-0.0672 -0.22737,-0.0672 -0.10163,0 -0.18259,0.062 -0.081,0.0603 -0.11542,0.16881 -0.0517,0.16536 -0.0517,0.36173 v 0.95774 z"
           id="path2903" />
      </g>
      <g
         id="g4168"
         transform="matrix(1,0.57735027,-0.8660254,0.5,19.789074,103.42523)">
        <circle
           style="fill:none;stroke:#000000;stroke-width:0.5;stroke-linecap:round;stroke-linejoin:round;stroke-dasharray:none;stroke-opacity:1"
           id="circle3214"
           cx="83.375336"
           cy="65"
           r="5.6246567" />
        <path
           style="fill:none;stroke:#000000;stroke-width:0.4;stroke-linecap:butt;stroke-linejoin:miter;stroke-dasharray:none;stroke-opacity:1"
           d="m 82,61 v 8"
           id="path3216" />
        <path
           style="fill:none;stroke:#000000;stroke-width:0.4;stroke-linecap:butt;stroke-linejoin:miter;stroke-dasharray:none;stroke-opacity:1"
           d="m 82,63 3,-3.000001 V 56"
           id="path3218" />
        <path
           style="fill:none;stroke:#000000;stroke-width:0.4;stroke-linecap:butt;stroke-linejoin:miter;stroke-dasharray:none;stroke-opacity:1"
           d="m 82,67 3,3 v 4"
           id="path3220" />
        <path
           style="fill:none;stroke:#000000;stroke-width:0.4;stroke-linecap:butt;stroke-linejoin:miter;stroke-dasharray:none;stroke-opacity:1"
           d="m 81,62 v 6 h -6"
           id="path3224" />
        <path
           style="fill:#000000;fill-opacity:1;stroke:none;stroke-width:0.264583px;stroke-linecap:butt;stroke-linejoin:miter;stroke-opacity:1"
           d="M 83.980335,67.565304 82.566574,68.979972 82,67 Z"
           id="path3875" />
      </g>
      <g
         id="g56445">
        <path
           style="fill:#9b5461;fill-opacity:1;stroke:#9a2339;stroke-width:0.35;stroke-linecap:round;stroke-linejoin:bevel;stroke-dasharray:none;stroke-opacity:1"
           d="m 8.660254,165 8.66026,5 -6e-6,7 -8.6602538,-5 z"
           id="path27340" />
        <path
           style="fill:#b2717d;fill-opacity:1;stroke:#9a2339;stroke-width:0.35;stroke-linecap:round;stroke-linejoin:bevel;stroke-dasharray:none;stroke-opacity:1"
           d="m 38.971143,157.5 v 7 l -21.650635,12.5 -0.04775,-7.14808 z"
           id="path27342" />
        <path
           style="fill:#c4929b;fill-opacity:1;stroke:#9a2339;stroke-width:0.35;stroke-linecap:round;stroke-linejoin:round;stroke-dasharray:none;stroke-opacity:1"
           d="m 8.660254,165 21.650635,-12.5 8.660255,5 -21.65063,12.5 z"
           id="path27344" />
        <path
           style="fill:#76d0e0;fill-opacity:1;stroke:#23889a;stroke-width:0.35;stroke-linecap:round;stroke-linejoin:round;stroke-dasharray:none;stroke-opacity:1"
           d="m 9.5262794,164.5 6.9281996,-4 8.660258,5 -6.928204,4 z"
           id="path27346" />
        <path
           style="fill:#df7789;fill-opacity:1;stroke:#9a2339;stroke-width:0.35;stroke-linecap:round;stroke-linejoin:round;stroke-dasharray:none;stroke-opacity:1"
           d="m 12.990375,162.5 2.598081,-1.5 8.660255,5 -2.598076,1.5 z"
           id="path47792" />
        <path
           style="fill:#76d0e0;fill-opacity:1;stroke:#23889a;stroke-width:0.35;stroke-linecap:round;stroke-linejoin:round;stroke-dasharray:none;stroke-opacity:1"
           d="m 22.516655,157 6.928199,-4 8.660264,5 -6.928203,4 z"
           id="path27348" />
        <path
           style="fill:#df7789;fill-opacity:1;stroke:#9a2339;stroke-width:0.35;stroke-linecap:round;stroke-linejoin:round;stroke-dasharray:none;stroke-opacity:1"
           d="m 23.38268,156.5 2.598081,-1.5 8.660255,5 -2.598076,1.5 z"
           id="path48305" />
        <path
           style="fill:#808080;fill-opacity:1;stroke:#595959;stroke-width:0.35;stroke-linecap:round;stroke-linejoin:round;stroke-dasharray:none;stroke-opacity:1"
           d="m 24.248712,155 7.794228,4.5 v 1 L 24.248712,156 Z"
           id="path42136" />
        <path
           style="fill:#acaa44;fill-opacity:1;stroke:#878636;stroke-width:0.35;stroke-linecap:round;stroke-linejoin:round;stroke-dasharray:none;stroke-opacity:1"
           d="m 16.454485,160.5 6.928201,4 v 1 l -6.928201,-4 z"
           id="path27368" />
        <path
           id="path35774"
           style="fill:#b2b2b2;fill-opacity:1;stroke:#595959;stroke-width:0.35;stroke-linecap:round;stroke-linejoin:bevel;stroke-dasharray:none;stroke-opacity:1"
           d="m 27.713003,152.99928 -16.454354,9.5005 7.79391,4.50022 3.464101,-2 -6.928331,-4.0005 9.526797,-5.50001 6.927814,4.00051 3.464491,-2.00051 z" />
        <path
           style="fill:#4cc2d7;fill-opacity:1;stroke:#23889a;stroke-width:0.35;stroke-linecap:round;stroke-linejoin:bevel;stroke-dasharray:none;stroke-opacity:1"
           d="m 38.105114,158 4e-6,2 c 0,4 -6.928203,8 -6.928203,4 v -2 z"
           id="path27360" />
        <path
           style="fill:#4cc2d7;fill-opacity:1;stroke:#23889a;stroke-width:0.35;stroke-linecap:round;stroke-linejoin:bevel;stroke-dasharray:none;stroke-opacity:1"
           d="m 25.114737,165.5 v 2 c 0,4 -6.928204,8 -6.928204,4 v -2 z"
           id="path27366" />
        <path
           style="fill:#cfce87;fill-opacity:1;stroke:#878636;stroke-width:0.35;stroke-linecap:round;stroke-linejoin:round;stroke-dasharray:none;stroke-opacity:1"
           d="m 16.454485,160.5 7.794231,-4.5 6.9282,4 -7.79423,4.5 z"
           id="path27372" />
        <g
           aria-label="n"
           transform="skewY(-30)"
           id="text27384"
           style="font-size:3.52778px;line-height:1.25;fill:#134953;stroke-width:0.529166">
          <path
             d="M 19.175305,182.93535 V 181.106 h 0.279052 v 0.26011 q 0.201539,-0.30145 0.582222,-0.30145 0.165365,0 0.303169,0.0603 0.139526,0.0586 0.208428,0.15503 0.0689,0.0965 0.09646,0.2291 0.01722,0.0861 0.01722,0.30144 v 1.12483 h -0.310059 v -1.11277 q 0,-0.18948 -0.03617,-0.2825 -0.03617,-0.0947 -0.129191,-0.14986 -0.09129,-0.0568 -0.215319,-0.0568 -0.198093,0 -0.342787,0.12574 -0.142972,0.12575 -0.142972,0.47715 v 0.99908 z"
             id="path2837" />
        </g>
        <path
           style="fill:#c1bf62;fill-opacity:1;stroke:#878636;stroke-width:0.35;stroke-linecap:round;stroke-linejoin:bevel;stroke-dasharray:none;stroke-opacity:1;paint-order:normal"
           d="m 31.176916,160 v 1 l -7.79423,4.5 v -1 z"
           id="path27386" />
        <path
           id="path27390"
           style="fill:#b2b2b2;fill-opacity:1;stroke:#595959;stroke-width:0.35;stroke-linecap:round;stroke-linejoin:round;stroke-dasharray:none;stroke-opacity:1"
           d="m 16.900017,156.19069 c 0.3317,-3.5e-4 0.86196,-0.16698 0.86231,-0.49909 v 8 c -3.5e-4,0.33211 -0.53061,0.49874 -0.86231,0.49909 -0.33171,3.6e-4 -0.86162,-0.16514 -0.86126,-0.49725 l -10e-6,-8 c -3.5e-4,0.33211 0.52956,0.4976 0.86127,0.49725 z" />
        <path
           style="fill:#b2b2b2;fill-opacity:1;stroke:#595959;stroke-width:0.35;stroke-linecap:round;stroke-linejoin:round;stroke-dasharray:none;stroke-opacity:1"
           d="m 16.035047,155.69435 c 3.6e-4,-0.33212 0.53062,-0.49874 0.86233,-0.49909 0.3317,-3.6e-4 0.86161,0.16513 0.86125,0.49725 -3.5e-4,0.33211 -0.53061,0.49874 -0.86231,0.49909 -0.33171,3.5e-4 -0.86162,-0.16514 -0.86127,-0.49725 z"
           id="path27392" />
        <path
           style="fill:#808080;fill-opacity:1;stroke:#595959;stroke-width:0.35;stroke-linecap:round;stroke-linejoin:round;stroke-dasharray:none;stroke-opacity:1"
           d="m 33.774991,167.5 2.598076,1.5 v 3 l -2.598076,-1.5 z"
           id="path55800" />
        <path
           style="fill:#4cc2d7;fill-opacity:1;stroke:#23889a;stroke-width:0.35;stroke-linecap:round;stroke-linejoin:round;stroke-dasharray:none;stroke-opacity:1"
           d="m 38.971143,164.5 v 2 L 17.320508,179 v -2 z"
           id="path45950" />
        <path
           style="fill:#2cadc4;fill-opacity:1;stroke:#23889a;stroke-width:0.35;stroke-linecap:round;stroke-linejoin:round;stroke-dasharray:none;stroke-opacity:1"
           d="m 8.6602546,172 8.6602534,5 1e-6,2 -8.6602533,-5 z"
           id="path45186" />
        <path
           style="fill:#999999;fill-opacity:1;stroke:#595959;stroke-width:0.35;stroke-linecap:round;stroke-linejoin:round;stroke-dasharray:none;stroke-opacity:1"
           d="m 38.971143,166.5 v 4 l -2.598076,1.5 v -3 l -19.052559,11 v -1 z"
           id="path29935" />
        <path
           style="fill:#808080;fill-opacity:1;stroke:#595959;stroke-width:0.35;stroke-linecap:round;stroke-linejoin:round;stroke-dasharray:none;stroke-opacity:1"
           d="m 8.6602546,174 8.6602534,5 v 1 l -8.6602534,-5 z"
           id="path29937" />
        <path
           style="fill:#999999;fill-opacity:1;stroke:#595959;stroke-width:0.35;stroke-linecap:round;stroke-linejoin:round;stroke-dasharray:none;stroke-opacity:1"
           d="m 22.51666,165 v 1 l -3.464101,2 v -1 z"
           id="path38064" />
        <path
           style="fill:#808080;fill-opacity:1;stroke:#595959;stroke-width:0.35;stroke-linecap:round;stroke-linejoin:round;stroke-dasharray:none;stroke-opacity:1"
           d="m 11.258331,162.5 7.794228,4.5 v 1 l -7.794228,-4.5 z"
           id="path38066" />
        <path
           style="fill:#808080;fill-opacity:1;stroke:#595959;stroke-width:0.35;stroke-linecap:round;stroke-linejoin:round;stroke-dasharray:none;stroke-opacity:1"
           d="m 19.918583,159.5 3.464102,2 v 1 l -3.464102,-2 z"
           id="path40600" />
        <path
           style="fill:#b2b2b2;fill-opacity:1;stroke:#595959;stroke-width:0.35;stroke-linecap:round;stroke-linejoin:bevel;stroke-dasharray:none;stroke-opacity:1"
           d="m 19.918585,159.5 4.330125,-2.5 3.464099,2 -4.330124,2.5 z"
           id="path40602" />
        <path
           style="fill:#999999;fill-opacity:1;stroke:#595959;stroke-width:0.35;stroke-linecap:round;stroke-linejoin:round;stroke-dasharray:none;stroke-opacity:1"
           d="m 27.712812,159 v 1 l -4.330127,2.5 v -1 z"
           id="path40604" />
        <path
           style="fill:#999999;fill-opacity:1;stroke:#595959;stroke-width:0.35;stroke-linecap:round;stroke-linejoin:round;stroke-dasharray:none;stroke-opacity:1"
           d="m 35.507041,157.5 v 1 l -3.464101,2 v -1 z"
           id="path42134" />
        <path
           id="path44418"
           style="fill:#b2b2b2;fill-opacity:1;stroke:#595959;stroke-width:0.35;stroke-linecap:round;stroke-linejoin:round;stroke-dasharray:none;stroke-opacity:1"
           d="m 23.819486,151.61702 c 0.3317,-3.5e-4 0.86196,-0.16698 0.86231,-0.49909 v 8 c -3.5e-4,0.33211 -0.53061,0.49874 -0.86231,0.49909 -0.33171,3.6e-4 -0.86162,-0.16514 -0.86126,-0.49725 l -10e-6,-8 c -3.5e-4,0.33211 0.52956,0.4976 0.86127,0.49725 z" />
        <path
           style="fill:#b2b2b2;fill-opacity:1;stroke:#595959;stroke-width:0.35;stroke-linecap:round;stroke-linejoin:round;stroke-dasharray:none;stroke-opacity:1"
           d="m 22.954516,151.12068 c 3.6e-4,-0.33212 0.53062,-0.49874 0.86233,-0.49909 0.3317,-3.6e-4 0.86161,0.16513 0.86125,0.49725 -3.5e-4,0.33211 -0.53061,0.49874 -0.86231,0.49909 -0.33171,3.5e-4 -0.86162,-0.16514 -0.86127,-0.49725 z"
           id="path44420" />
        <path
           style="fill:#d64d66;fill-opacity:1;stroke:#9a2339;stroke-width:0.35;stroke-linecap:round;stroke-linejoin:bevel;stroke-dasharray:none;stroke-opacity:1"
           d="m 24.248711,166 v 1 c 0,3 -2.598076,4.5 -2.598076,1.5 v -1 z"
           id="path45184" />
        <path
           style="fill:#d64d66;fill-opacity:1;stroke:#9a2339;stroke-width:0.35;stroke-linecap:round;stroke-linejoin:bevel;stroke-dasharray:none;stroke-opacity:1"
           d="m 34.641016,160 v 1 c 0,3 -2.598076,4.5 -2.598076,1.5 v -1 z"
           id="path48307" />
        <g
           aria-label="p+"
           transform="skewY(-30)"
           id="text51835"
           style="font-size:1.54373px;line-height:1.25;fill:#53131f;stroke-width:0.231558">
          <path
             d="m 22.163487,181.93423 v -1.1073 h 0.123619 v 0.10402 q 0.04372,-0.061 0.09874,-0.0912 0.05503,-0.0309 0.133418,-0.0309 0.102513,0 0.180905,0.0528 0.07839,0.0528 0.118343,0.14924 0.03995,0.0957 0.03995,0.21031 0,0.12286 -0.04447,0.22161 -0.04372,0.098 -0.128141,0.15075 -0.08367,0.052 -0.176383,0.052 -0.06784,0 -0.122112,-0.0286 -0.05352,-0.0286 -0.08819,-0.0724 v 0.3897 z m 0.122865,-0.70252 q 0,0.15452 0.06256,0.22839 0.06256,0.0739 0.151508,0.0739 0.09045,0 0.154524,-0.0761 0.06482,-0.0769 0.06482,-0.23744 0,-0.15301 -0.06332,-0.22914 -0.06256,-0.0761 -0.150002,-0.0761 -0.08668,0 -0.15377,0.0814 -0.06633,0.0807 -0.06633,0.23518 z"
             id="path2840" />
          <path
             d="m 23.306963,181.4488 v -0.30302 h -0.300756 v -0.12663 h 0.300756 v -0.30076 h 0.128142 v 0.30076 h 0.300756 v 0.12663 h -0.300756 v 0.30302 z"
             id="path2842" />
        </g>
        <g
           aria-label="n"
           transform="skewY(-30)"
           id="text51839"
           style="font-size:3.52778px;line-height:1.25;fill:#134953;stroke-width:0.529166">
          <path
             d="M 35.629788,182.93535 V 181.106 h 0.279053 v 0.26011 q 0.201538,-0.30145 0.582221,-0.30145 0.165365,0 0.303169,0.0603 0.139526,0.0586 0.208428,0.15503 0.0689,0.0965 0.09646,0.2291 0.01722,0.0861 0.01722,0.30144 v 1.12483 H 36.80628 v -1.11277 q 0,-0.18948 -0.03617,-0.2825 -0.03617,-0.0947 -0.129191,-0.14986 -0.09129,-0.0568 -0.215319,-0.0568 -0.198093,0 -0.342787,0.12574 -0.142972,0.12575 -0.142972,0.47715 v 0.99908 z"
             id="path2855" />
        </g>
        <g
           aria-label="p-"
           transform="skewY(-30)"
           id="text51843"
           style="font-size:2.5494px;line-height:1.25;fill:#53131f;stroke-width:0.382408">
          <path
             d="m 27.112401,184.16367 v -1.82865 h 0.204151 v 0.17179 q 0.0722,-0.10083 0.163072,-0.15062 0.09087,-0.051 0.220334,-0.051 0.169296,0 0.298757,0.0871 0.129462,0.0871 0.195438,0.24647 0.06598,0.15809 0.06598,0.34731 0,0.2029 -0.07344,0.36598 -0.0722,0.16182 -0.21162,0.24896 -0.138176,0.0859 -0.291289,0.0859 -0.112034,0 -0.201662,-0.0473 -0.08838,-0.0473 -0.145644,-0.1195 v 0.64357 z m 0.202906,-1.16017 q 0,0.25518 0.10332,0.37718 0.103321,0.12199 0.25021,0.12199 0.149379,0 0.255189,-0.12573 0.107055,-0.12697 0.107055,-0.39212 0,-0.2527 -0.104565,-0.37842 -0.103321,-0.12573 -0.24772,-0.12573 -0.143155,0 -0.253945,0.13444 -0.109544,0.1332 -0.109544,0.38839 z"
             id="path2845" />
          <path
             d="m 28.443118,183.10931 v -0.22532 h 0.688387 v 0.22532 z"
             id="path2847" />
        </g>
        <g
           aria-label="p+"
           transform="skewY(-30)"
           id="text51847"
           style="font-size:1.54373px;line-height:1.25;fill:#53131f;stroke-width:0.231558">
          <path
             d="m 32.555792,181.93423 v -1.1073 h 0.123619 v 0.10402 q 0.04372,-0.061 0.09875,-0.0912 0.05503,-0.0309 0.133418,-0.0309 0.102513,0 0.180906,0.0528 0.07839,0.0528 0.118342,0.14924 0.03995,0.0957 0.03995,0.21031 0,0.12286 -0.04447,0.22161 -0.04372,0.098 -0.128142,0.15075 -0.08367,0.052 -0.176383,0.052 -0.06784,0 -0.122112,-0.0286 -0.05352,-0.0286 -0.08819,-0.0724 v 0.3897 z m 0.122866,-0.70252 q 0,0.15452 0.06256,0.22839 0.06256,0.0739 0.151509,0.0739 0.09045,0 0.154523,-0.0761 0.06482,-0.0769 0.06482,-0.23744 0,-0.15301 -0.06332,-0.22914 -0.06256,-0.0761 -0.150001,-0.0761 -0.08668,0 -0.15377,0.0814 -0.06633,0.0807 -0.06633,0.23518 z"
             id="path2850" />
          <path
             d="m 33.699268,181.4488 v -0.30302 h -0.300756 v -0.12663 h 0.300756 v -0.30076 h 0.128142 v 0.30076 h 0.300756 v 0.12663 H 33.82741 v 0.30302 z"
             id="path2852" />
        </g>
        <g
           aria-label="n+"
           transform="skewY(-30)"
           id="text51851"
           style="font-size:2.21272px;line-height:1.25;fill:#134953;stroke-width:0.331908">
          <path
             d="m 27.018937,188.6515 v -1.14741 h 0.17503 v 0.16314 q 0.12641,-0.18907 0.365185,-0.18907 0.103721,0 0.190156,0.0378 0.08751,0.0367 0.130732,0.0972 0.04322,0.0605 0.0605,0.1437 0.0108,0.054 0.0108,0.18907 v 0.70552 h -0.194477 v -0.69795 q 0,-0.11885 -0.02269,-0.17719 -0.02269,-0.0594 -0.08103,-0.094 -0.05726,-0.0357 -0.135054,-0.0357 -0.12425,0 -0.215006,0.0789 -0.08967,0.0789 -0.08967,0.29928 v 0.62664 z"
             id="path2858" />
          <path
             d="m 28.657949,188.39544 v -0.43433 h -0.431091 v -0.18151 h 0.431091 v -0.43109 h 0.183673 v 0.43109 h 0.431092 v 0.18151 h -0.431092 v 0.43433 z"
             id="path2860" />
        </g>
        <path
           id="path55806"
           style="fill:#b2b2b2;fill-opacity:1;stroke:#595959;stroke-width:0.35;stroke-linecap:round;stroke-linejoin:round;stroke-dasharray:none;stroke-opacity:1"
           d="m 41.167727,156.08526 3.13e-4,14.71244 c 8.01e-4,0.73867 -0.529737,0.98587 -0.861445,0.98551 -0.3317,-3.5e-4 -0.801104,-0.25335 -0.970955,-0.3516 -0.327889,-0.18966 -2.063001,-1.28039 -2.063001,-1.28039 -0.287789,-0.16575 -0.166159,-0.70716 0,-0.99425 0.16616,-0.28709 0.575714,-0.6634 0.863514,-0.49765 l 1.308479,0.81485 8.24e-4,-13.56919 c 0.565173,0.14084 1.141138,0.27747 1.722271,0.18028 z" />
        <path
           style="fill:#b2b2b2;fill-opacity:1;stroke:#595959;stroke-width:0.35;stroke-linecap:round;stroke-linejoin:round;stroke-dasharray:none;stroke-opacity:1"
           d="m 39.444343,155.89961 c 3.6e-4,-0.33212 0.53062,-0.49874 0.86233,-0.49909 0.3317,-3.6e-4 0.86161,0.16513 0.86125,0.49725 -3.5e-4,0.33211 -0.53061,0.49874 -0.86231,0.49909 -0.33171,3.5e-4 -0.86162,-0.16514 -0.86127,-0.49725 z"
           id="path55804" />
      </g>
    </g>
  </g>
</svg>
