<?xml version="1.0" encoding="UTF-8" standalone="no"?>
<svg
   width="40.328335"
   height="38"
   viewBox="0 0 25.810134 24.32"
   version="1.1"
   id="svg12"
   xmlns="http://www.w3.org/2000/svg"
   xmlns:svg="http://www.w3.org/2000/svg">
  <defs
     id="defs9">
    <linearGradient
       id="e399c19f-b68f-429d-b176-18c2117ff73c"
       x1="-1032.172"
       x2="-1059.213"
       y1="145.312"
       y2="65.426003"
       gradientTransform="matrix(1,0,0,-1,1075,158)"
       gradientUnits="userSpaceOnUse">
      <stop
         offset="0"
         stop-color="#114a8b"
         id="stop1" />
      <stop
         offset="1"
         stop-color="#0669bc"
         id="stop2" />
    </linearGradient>
    <linearGradient
       id="ac2a6fc2-ca48-4327-9a3c-d4dcc3256e15"
       x1="-1023.725"
       x2="-1029.98"
       y1="108.083"
       y2="105.968"
       gradientTransform="matrix(1,0,0,-1,1075,158)"
       gradientUnits="userSpaceOnUse">
      <stop
         offset="0"
         stop-opacity=".3"
         id="stop3" />
      <stop
         offset=".071"
         stop-opacity=".2"
         id="stop4" />
      <stop
         offset=".321"
         stop-opacity=".1"
         id="stop5" />
      <stop
         offset=".623"
         stop-opacity=".05"
         id="stop6" />
      <stop
         offset="1"
         stop-opacity="0"
         id="stop7" />
    </linearGradient>
    <linearGradient
       id="a7fee970-a784-4bb1-af8d-63d18e5f7db9"
       x1="-1027.165"
       x2="-997.48199"
       y1="147.642"
       y2="68.560997"
       gradientTransform="matrix(1,0,0,-1,1075,158)"
       gradientUnits="userSpaceOnUse">
      <stop
         offset="0"
         stop-color="#3ccbf4"
         id="stop8" />
      <stop
         offset="1"
         stop-color="#2892df"
         id="stop9" />
    </linearGradient>
  </defs>
  <g
     id="g12"
     transform="matrix(0.2933195,0,0,0.2933195,-1.17431,-1.9191895)">
    <path
       fill="url(#e399c19f-b68f-429d-b176-18c2117ff73c)"
       d="m 33.338,6.544 h 26.038 l -27.03,80.087 a 4.152,4.152 0 0 1 -3.933,2.824 H 8.149 A 4.145,4.145 0 0 1 4.221,83.985 L 29.404,9.368 a 4.152,4.152 0 0 1 3.934,-2.825 z"
       id="path9"
       style="fill:url(#e399c19f-b68f-429d-b176-18c2117ff73c)" />
    <path
       fill="#0078d4"
       d="M 71.175,60.261 H 29.885 A 1.911,1.911 0 0 0 28.58,63.57 l 26.532,24.764 a 4.171,4.171 0 0 0 2.846,1.121 h 23.38 z"
       id="path10" />
    <path
       fill="url(#ac2a6fc2-ca48-4327-9a3c-d4dcc3256e15)"
       d="M 33.338,6.544 A 4.118,4.118 0 0 0 29.395,9.423 L 4.252,83.917 a 4.14,4.14 0 0 0 3.908,5.538 h 20.787 a 4.443,4.443 0 0 0 3.41,-2.9 l 5.014,-14.777 17.91,16.705 a 4.237,4.237 0 0 0 2.666,0.972 H 81.24 L 71.024,60.261 41.243,60.268 59.47,6.544 Z"
       id="path11"
       style="fill:url(#ac2a6fc2-ca48-4327-9a3c-d4dcc3256e15)" />
    <path
       fill="url(#a7fee970-a784-4bb1-af8d-63d18e5f7db9)"
       d="M 66.595,9.364 A 4.145,4.145 0 0 0 62.667,6.544 H 33.648 a 4.146,4.146 0 0 1 3.928,2.82 l 25.184,74.62 a 4.146,4.146 0 0 1 -3.928,5.472 h 29.02 a 4.146,4.146 0 0 0 3.927,-5.472 z"
       id="path12"
       style="fill:url(#a7fee970-a784-4bb1-af8d-63d18e5f7db9)" />
  </g>
  <path
     style="fill:#36aaf2;fill-opacity:1;stroke:none;stroke-width:0.128693px;stroke-linecap:butt;stroke-linejoin:miter;stroke-opacity:1"
     d="m -34.800158,17.750224 v 24.32 l 6.318522,-3.648 v -17.024 z"
     id="path4029" />
  <path
     style="fill:#227eb7;fill-opacity:1;stroke:none;stroke-width:0.128693px;stroke-linecap:butt;stroke-linejoin:miter;stroke-opacity:1"
     d="m -34.800158,17.750224 -18.955562,16.780799 2.527408,2.432001 16.428154,-11.9168 z"
     id="path4031" />
  <path
     style="fill:#0884d0;fill-opacity:1;stroke:none;stroke-width:0.128693px;stroke-linecap:butt;stroke-linejoin:miter;stroke-opacity:1"
     d="m -34.800157,42.070224 -18.955562,-16.7808 2.527408,-2.432 16.428154,11.9168 z"
     id="path4039" />
</svg>
