<?xml version="1.0" encoding="UTF-8" standalone="no"?>
<svg
   id="f861199a-9921-482a-87ea-8504385ff0cd"
   width="14.932516"
   height="15"
   viewBox="0 0 14.932516 15"
   version="1.1"
   xmlns="http://www.w3.org/2000/svg"
   xmlns:svg="http://www.w3.org/2000/svg"
   xmlns:rdf="http://www.w3.org/1999/02/22-rdf-syntax-ns#"
   xmlns:cc="http://creativecommons.org/ns#"
   xmlns:dc="http://purl.org/dc/elements/1.1/">
  <defs
     id="defs4">
    <linearGradient
       id="f13c7428-fd1f-409a-aa83-518164fbbc0c"
       x1="9"
       y1="7.1100001"
       x2="9"
       y2="14.2"
       gradientUnits="userSpaceOnUse">
      <stop
         offset="0"
         stop-color="#a67af4"
         id="stop1" />
      <stop
         offset="1"
         stop-color="#552f99"
         id="stop2" />
    </linearGradient>
    <linearGradient
       id="a6b01360-3b65-4cb5-8c1b-eed2f64af70c"
       x1="8.8000002"
       y1="3.3099999"
       x2="9.3199997"
       y2="9.75"
       gradientUnits="userSpaceOnUse">
      <stop
         offset="0"
         stop-color="#a67af4"
         id="stop3" />
      <stop
         offset="1"
         stop-color="#552f99"
         id="stop4" />
    </linearGradient>
  </defs>
  <title
     id="title4">Icon-identity-235</title>
  <g
     id="g14"
     transform="matrix(0.88926123,0,0,0.88926123,-0.53709291,-0.50732672)"
     style="stroke-width:1.12453">
    <path
       d="m 2.15,11.75 a 7.34,7.34 0 0 1 1,-7.2 1.94,1.94 0 0 1 -0.7,-0.83 8.48,8.48 0 0 0 -1.17,8.6 3.1,3.1 0 0 1 0.87,-0.57 z M 5.94,1.14 A 3.14,3.14 0 0 1 6.56,2.04 7.5,7.5 0 0 1 9,1.61 7.33,7.33 0 0 1 13.33,3 2.15,2.15 0 0 1 13.88,2.31 v 0 L 14,2.22 A 8.44,8.44 0 0 0 5.94,1.14 Z m 9.91,5.12 a 7.32,7.32 0 0 1 -1,7.19 2,2 0 0 1 0.43,0.4 1.94,1.94 0 0 1 0.27,0.43 8.48,8.48 0 0 0 1.17,-8.6 3.13,3.13 0 0 1 -0.87,0.58 z M 11.44,16 A 7.25,7.25 0 0 1 9,16.39 v 0 A 7.32,7.32 0 0 1 4.67,15 2.05,2.05 0 0 1 4.12,15.69 v 0 L 4,15.78 A 8.48,8.48 0 0 0 12.09,16.87 3.13,3.13 0 0 1 11.44,16 Z"
       fill="#0078d4"
       id="path4"
       style="stroke-width:1.12453" />
    <path
       d="m 5.18,1.87 a 2.09,2.09 0 1 1 -3,0 2.09,2.09 0 0 1 3,0 z"
       fill="#32bedd"
       id="path5"
       style="stroke-width:1.12453" />
    <path
       d="m 4.42,4.07 a 1,1 0 0 0 0,-1.45 1,1 0 0 0 -1.42,0 1,1 0 0 0 0,1.45 v 0 a 1,1 0 0 0 1.44,0"
       fill="#ffffff"
       id="path6"
       style="stroke-width:0.147525" />
    <path
       d="m 13.18,1.87 a 2.09,2.09 0 1 1 0,3 2.09,2.09 0 0 1 0,-2.95 z"
       fill="#32bedd"
       id="path7"
       style="stroke-width:1.12453" />
    <path
       d="m 15.38,2.62 a 1,1 0 1 0 0,1.45 v 0 a 1,1 0 0 0 0,-1.45"
       fill="#ffffff"
       id="path8"
       style="stroke-width:0.147525" />
    <path
       d="m 12.82,16.13 a 2.09,2.09 0 1 1 3,0 2.09,2.09 0 0 1 -3,0 z"
       fill="#32bedd"
       id="path9"
       style="stroke-width:1.12453" />
    <path
       d="m 13.58,13.93 a 1,1 0 0 0 0,1.45 1,1 0 0 0 1.44,0 1,1 0 0 0 0,-1.45 v 0 a 1,1 0 0 0 -1.44,0"
       fill="#ffffff"
       id="path10"
       style="stroke-width:0.147525" />
    <path
       d="m 4.82,16.13 a 2.09,2.09 0 1 1 0,-2.95 2.09,2.09 0 0 1 0,2.95 z"
       fill="#32bedd"
       id="path11"
       style="stroke-width:1.12453" />
    <path
       d="m 2.62,15.38 a 1,1 0 1 0 0,-1.45 v 0 a 1,1 0 0 0 0,1.45"
       fill="#ffffff"
       id="path12"
       style="stroke-width:0.147525" />
    <path
       d="m 12.51,12.92 a 0.76,0.76 0 0 0 0.76,-0.76 V 12.07 C 13,9.69 11.61,7.74 9,7.74 6.39,7.74 5,9.39 4.74,12.08 a 0.76,0.76 0 0 0 0.68,0.84 z"
       fill="url(#f13c7428-fd1f-409a-aa83-518164fbbc0c)"
       id="path13"
       style="fill:url(#f13c7428-fd1f-409a-aa83-518164fbbc0c);stroke-width:1.12453" />
    <path
       d="M 9,8.31 A 2.41,2.41 0 0 1 7.7,7.93 L 9,11.28 10.27,8 A 2.37,2.37 0 0 1 9,8.31 Z"
       fill="#ffffff"
       opacity="0.8"
       id="path14"
       style="stroke-width:0.147525" />
    <circle
       cx="9.0100002"
       cy="5.9200001"
       r="2.3900001"
       fill="url(#a6b01360-3b65-4cb5-8c1b-eed2f64af70c)"
       id="circle14"
       style="fill:url(#a6b01360-3b65-4cb5-8c1b-eed2f64af70c);stroke-width:1.12453" />
  </g>
  <metadata
     id="metadata14">
    <rdf:RDF>
      <cc:Work
         rdf:about="">
        <dc:title>Icon-identity-235</dc:title>
      </cc:Work>
    </rdf:RDF>
  </metadata>
</svg>
