<?xml version="1.0" encoding="UTF-8" standalone="no"?>
<!-- Created with Inkscape (http://www.inkscape.org/) -->

<svg
   width="37.584915"
   height="38"
   viewBox="0 0 9.9443422 10.054167"
   version="1.1"
   id="svg476"
   xmlns:xlink="http://www.w3.org/1999/xlink"
   xmlns="http://www.w3.org/2000/svg"
   xmlns:svg="http://www.w3.org/2000/svg">
  <defs
     id="defs473">
    <linearGradient
       xlink:href="#linearGradient4689"
       id="linearGradient1478"
       gradientUnits="userSpaceOnUse"
       gradientTransform="matrix(0.14883897,0,0,0.15027592,55.577879,71.387315)"
       x1="26.648937"
       y1="20.603781"
       x2="135.66525"
       y2="114.39767" />
    <linearGradient
       id="linearGradient4689">
      <stop
         style="stop-color:#5a9fd4;stop-opacity:1;"
         offset="0"
         id="stop4691" />
      <stop
         style="stop-color:#306998;stop-opacity:1;"
         offset="1"
         id="stop4693" />
    </linearGradient>
    <linearGradient
       xlink:href="#linearGradient4671"
       id="linearGradient1475"
       gradientUnits="userSpaceOnUse"
       gradientTransform="matrix(0.14883897,0,0,0.15027592,55.577879,71.387315)"
       x1="150.96111"
       y1="192.35176"
       x2="112.03144"
       y2="137.27299" />
    <linearGradient
       id="linearGradient4671">
      <stop
         style="stop-color:#ffd43b;stop-opacity:1;"
         offset="0"
         id="stop4673" />
      <stop
         style="stop-color:#ffe873;stop-opacity:1"
         offset="1"
         id="stop4675" />
    </linearGradient>
  </defs>
  <g
     id="layer1"
     transform="translate(-59.544279,-74.483567)">
    <g
       id="g640"
       transform="matrix(0.33811137,0,0,0.33811137,39.411681,49.299826)"
       style="stroke-width:2.95761">
      <path
         style="fill:url(#linearGradient1478);fill-opacity:1;stroke-width:0.782532"
         d="m 74.074874,74.48381 c -1.212758,0.0056 -2.370915,0.109066 -3.389974,0.289388 -3.00202,0.530359 -3.54707,1.640444 -3.54707,3.68763 v 2.703711 h 7.09414 v 0.901237 h -7.09414 -2.66237 c -2.061755,0 -3.867086,1.239234 -4.431771,3.59668 -0.651356,2.70218 -0.680247,4.388385 0,7.209896 0.504277,2.100223 1.708559,3.596679 3.770313,3.596679 h 2.439127 v -3.241146 c 0,-2.341536 2.025953,-4.406965 4.431771,-4.406966 h 7.085872 c 1.972456,0 3.547071,-1.624056 3.547071,-3.604948 v -6.755143 c 0,-1.922552 -1.621891,-3.366764 -3.547071,-3.68763 -1.218667,-0.202862 -2.48314,-0.295023 -3.695898,-0.289388 z m -3.836458,2.174545 c 0.732776,0 1.331185,0.608183 1.331185,1.355989 -1e-6,0.745156 -0.598409,1.347721 -1.331185,1.347721 -0.735403,0 -1.331185,-0.602566 -1.331185,-1.347721 0,-0.747806 0.595782,-1.355989 1.331185,-1.355989 z"
         id="path1948" />
      <path
         style="fill:url(#linearGradient1475);fill-opacity:1;stroke-width:0.782532"
         d="m 82.202543,82.065776 v 3.150195 c 0,2.442304 -2.070601,4.497917 -4.431771,4.497917 H 70.6849 c -1.940939,0 -3.54707,1.661182 -3.54707,3.604948 v 6.755144 c 0,1.92255 1.671793,3.05338 3.54707,3.60495 2.245606,0.66029 4.399025,0.77963 7.085872,0 1.785979,-0.5171 3.547071,-1.55777 3.547071,-3.60495 V 97.370268 H 74.23197 v -0.901237 h 7.085873 3.547071 c 2.061755,0 2.83005,-1.438118 3.547068,-3.596679 0.740656,-2.222206 0.709141,-4.359216 0,-7.209896 -0.509529,-2.05249 -1.482691,-3.59668 -3.547068,-3.59668 z m -3.985286,17.106966 c 0.735403,10e-7 1.331185,0.602567 1.331185,1.347718 -10e-7,0.74781 -0.595782,1.35599 -1.331185,1.35599 -0.732777,0 -1.331185,-0.60818 -1.331185,-1.35599 0,-0.745151 0.598407,-1.347718 1.331185,-1.347718 z"
         id="path1950" />
    </g>
  </g>
</svg>
