[
  {
    "docID":"contact",
    "title":"maas.hu - Contact"
  },
  {
    "docID":"downloads",
    "title":"maas.hu - Downloads"
  },
  {
    "docID":"electronics",
    "title":"maas.hu - Electronics"
  },
  {
    "docID":"electronicsbasics",
    "title":"maas.hu - Electronics - Basics"
  },
  {
    "docID":"electronicscatalogue",
    "title":"maas.hu - Electronics - Catalogues"
  },
  {
    "docID":"electronicscatalogue74x",
    "title":"maas.hu - Electronics - Catalogue - 74x"
  },
  {
    "docID":"electronicscataloguediodes",
    "title":"maas.hu - Electronics - Catalogue - Diodes"
  },
  {
    "docID":"electronicscataloguelogic",
    "title":"maas.hu - Electronics - Catalogue - Logic Families"
  },
  {
    "docID":"electronicscataloguetransistors",
    "title":"maas.hu - Electronics - Catalogue - Transistors"
  },
  {
    "docID":"electronicscircuits",
    "title":"maas.hu - Electronics - Circuits"
  },
  {
    "docID":"electronicscircuitschristmas",
    "title":"maas.hu - Electronics - Circuits - Christmas Lights"
  },
  {
    "docID":"electronicscircuitspower",
    "title":"maas.hu - Electronics - Circuits - Power Supplies, Voltage Regulators"
  },
  {
    "docID":"electronicscircuitsgates",
    "title":"maas.hu - Electronics - Circuits - Prototype Logic Gates"
  },
  {
    "docID":"multimedia",
    "title":"maas.hu - Computer Graphics and Multimedia"
  },
  {
    "docID":"multimediaimagemagick",
    "title":"maas.hu - ImageMagick"
  },
  {
    "docID":"multimediablender",
    "title":"maas.hu - Blender"
  },
  {
    "docID":"multimediagimp",
    "title":"maas.hu - GIMP"
  },
  {
    "docID":"multimediainkscape",
    "title":"maas.hu - Inkscape"
  },
  {
    "docID":"multimediaavidemux",
    "title":"maas.hu - Avidemux"
  },
  {
    "docID":"multimediablender_ve",
    "title":"maas.hu - Blender - Video Editing"
  },
  {
    "docID":"multimediaobs",
    "title":"maas.hu - OBS Studio"
  },
  {
    "docID":"multimediaogg",
    "title":"maas.hu - OGG Vorbis"
  },
  {
    "docID":"multimediavsdc",
    "title":"maas.hu - VSDC"
  },
  {
    "docID":"prog",
    "title":"maas.hu - Programming"
  },
  {
    "docID":"progbash",
    "title":"maas.hu - Bash, KSH"
  },
  {
    "docID":"progjavascript",
    "title":"maas.hu - JavaScript"
  },
  {
    "docID":"progjavascriptbasics",
    "title":"maas.hu - JavaScript - Basics"
  },
  {
    "docID":"progjavascriptnodejs",
    "title":"maas.hu - JavaScript - Node.js"
  },
  {
    "docID":"progjavascriptexpress",
    "title":"maas.hu - JavaScript - Express"
  },
  {
    "docID":"proghtml",
    "title":"maas.hu - HTML/CSS"
  },
  {
    "docID":"progmarkdown",
    "title":"maas.hu - MarkDown"
  },
  {
    "docID":"progpascal",
    "title":"maas.hu - Pascal"
  },
  {
    "docID":"progphp",
    "title":"maas.hu - PHP"
  },
  {
    "docID":"prograku",
    "title":"maas.hu - Raku"
  },
  {
    "docID":"prograkuaix",
    "title":"maas.hu - Raku - AIX"
  },
  {
    "docID":"progvscode",
    "title":"maas.hu - Visual Studio Code"
  },
  {
    "docID":"progwebtools",
    "title":"maas.hu - Web Tools"
  },
  {
    "docID":"sysadmin",
    "title":"maas.hu - System Administration"
  },
  {
    "docID":"sysadminaix",
    "title":"maas.hu - System Administration - AIX"
  },
  {
    "docID":"sysadminazure",
    "title":"maas.hu - System Administration - Azure"
  },
  {
    "docID":"sysadminazuregovernance",
    "title":"maas.hu - System Administration - Azure Identities and Governance"
  },
  {
    "docID":"sysadminazurenetwork",
    "title":"maas.hu - System Administration - Azure Networking"
  },
  {
    "docID":"sysadminazurestorage",
    "title":"maas.hu - System Administration - Azure Storage"
  },
  {
    "docID":"sysadminazurevms",
    "title":"maas.hu - System Administration - Azure Virtual Machines"
  },
  {
    "docID":"sysadminazurepaas",
    "title":"maas.hu - System Administration - Azure PaaS Compute Options"
  },
  {
    "docID":"sysadminazurebackup",
    "title":"maas.hu - System Administration - Azure Backup and Data Protection"
  },
  {
    "docID":"sysadminazuremonitoring",
    "title":"maas.hu - System Administration - Azure Monitoring and Logging"
  },
  {
    "docID":"sysadminazureaz104ms",
    "title":"maas.hu - System Administration - Azure AZ-104 Practice Questions - Microsoft ESI Portal"
  },
  {
    "docID":"sysadminazureaz104et",
    "title":"maas.hu - System Administration - Azure AZ-104 Practice Questions - ExamTopics"
  },
  {
    "docID":"sysadminlinux",
    "title":"maas.hu - System Administration - Linux"
  },
  {
    "docID":"sysadminlinuxbasics",
    "title":"maas.hu - System Administration - Linux - Basics"
  },
  {
    "docID":"sysadminlinuxstorage",
    "title":"maas.hu - System Administration - Linux - Storage"
  },
  {
    "docID":"sysadminlinuxnetwork",
    "title":"maas.hu - System Administration - Linux - Networking and Security"
  },
  {
    "docID":"sysadminlinuxcentos",
    "title":"maas.hu - System Administration - Linux - CentOS"
  },
  {
    "docID":"sysadminlinuxopensuse",
    "title":"maas.hu - System Administration - Linux - openSUSE"
  },
  {
    "docID":"sysadminlinuxmageia",
    "title":"maas.hu - System Administration - Linux - Mageia"
  },
  {
    "docID":"sysadminwindows",
    "title":"maas.hu - System Administration - Windows"
  },
  {
    "docID":"sysadminpowervm",
    "title":"maas.hu - System Administration - IBM PowerVM"
  },
  {
    "docID":"sysadminvmwesxi",
    "title":"maas.hu - System Administration - VMware ESXi"
  },
  {
    "docID":"sysadminhyperv",
    "title":"maas.hu - System Administration - Microsoft Hyper-V"
  },
  {
    "docID":"sysadminxen",
    "title":"maas.hu - System Administration - Xen"
  },
  {
    "docID":"sysadminvirtualbox",
    "title":"maas.hu - System Administration - Oracle VM VirtualBox"
  },
  {
    "docID":"sysadminvmwwp",
    "title":"maas.hu - System Administration - VMware Workstation Player"
  },
  {
    "docID":"sysadminqemu",
    "title":"maas.hu - System Administration - QEMU"
  },
  {
    "docID":"sysadminkvm",
    "title":"maas.hu - System Administration - KVM"
  },
  {
    "docID":"sysadmindocker",
    "title":"maas.hu - System Administration - Docker"
  },
  {
    "docID":"sysadminwpar",
    "title":"maas.hu - System Administration - IBM AIX WPAR"
  },
  {
    "docID":"sysadminzone",
    "title":"maas.hu - System Administration - Solaris/OpenIndiana Zone"
  },
  {
    "docID":"sysadminansible",
    "title":"maas.hu - System Administration - Ansible"
  },
  {
    "docID":"sysadmingit",
    "title":"maas.hu - System Administration - Git"
  },
  {
    "docID":"sysadmingitbasics",
    "title":"maas.hu - System Administration - Git - Basics"
  },
  {
    "docID":"sysadmingitgitlab",
    "title":"maas.hu - System Administration - Git - GitLab"
  },
  {
    "docID":"sysadmingitgitlab_cicd",
    "title":"maas.hu - System Administration - Git - GitLab CI/CD"
  },
  {
    "docID":"sysadminterraform",
    "title":"maas.hu - System Administration - Terraform"
  },
  {
    "docID":"sysadminstatsd",
    "title":"maas.hu - System Administration - StatsD, Graphite, Grafana"
  },
  {
    "docID":"sysadmincommvault",
    "title":"maas.hu - System Administration - Commvault"
  },
  {
    "docID":"sysadminnetworker",
    "title":"maas.hu - System Administration - Dell EMC NetWorker"
  },
  {
    "docID":"sysadminsp",
    "title":"maas.hu - System Administration - IBM Spectrum Protect"
  },
  {
    "docID":"linguistics",
    "title":"maas.hu - Linguistics"
  },
  {
    "docID":"linguisticsrusyn",
    "title":"maas.hu - Rusyn"
  },
  {
    "docID":"linguisticsfinnish",
    "title":"maas.hu - Finnish"
  },
  {
    "docID":"linguisticsfinnishdictionary",
    "title":"maas.hu - Finn-Magyar Szótár"
  },
  {
    "docID":"sitemap",
    "title":"maas.hu - Site Map"
  },
  {
    "docID":"start",
    "title":"maas.hu - Home"
  }
]