<?xml version="1.0" encoding="UTF-8" standalone="no"?>
<!-- Created with Inkscape (http://www.inkscape.org/) -->

<svg
   width="26.125017mm"
   height="17.910818mm"
   viewBox="0 0 26.125018 17.910818"
   version="1.1"
   id="svg24917"
   xmlns="http://www.w3.org/2000/svg"
   xmlns:svg="http://www.w3.org/2000/svg">
  <defs
     id="defs24914" />
  <g
     id="layer1"
     transform="translate(-164.2016,-118.24042)">
    <g
       id="g24382"
       transform="matrix(0.366663,0,0,0.366663,140.34535,94.490653)">
      <path
         style="fill:#b2b2b2;fill-opacity:1;stroke:#666666;stroke-width:0.454545;stroke-linecap:round;stroke-linejoin:round;stroke-dasharray:none;stroke-opacity:1"
         d="m 101.32497,75.5 10.39231,-6 h 5.19615 L 135.09996,80 v 3 l -10.3923,6 z"
         id="path20805" />
      <path
         style="fill:#b2b2b2;fill-opacity:1;stroke:#666666;stroke-width:0.454545;stroke-linecap:round;stroke-linejoin:round;stroke-dasharray:none;stroke-opacity:1"
         d="m 124.70766,92 v -3 l 10.3923,-6 v 3 z"
         id="path20809" />
      <path
         style="fill:#333333;fill-opacity:1;stroke:#1a1a1a;stroke-width:0.454545;stroke-linecap:round;stroke-linejoin:round;stroke-dasharray:none;stroke-opacity:1"
         d="M 80.540368,88.5 80.067822,82.251833 109.1192,99 v 6 z"
         id="path12580" />
      <path
         style="fill:#4d4d4d;fill-opacity:1;stroke:#1a1a1a;stroke-width:0.454545;stroke-linecap:round;stroke-linejoin:round;stroke-dasharray:none;stroke-opacity:1"
         d="M 109.1192,99 133.03277,85.204887 132.50192,91.5 109.1192,105 Z"
         id="path12582" />
      <path
         style="fill:#4d4d4d;fill-opacity:1;stroke:#1a1a1a;stroke-width:0.454545;stroke-linecap:round;stroke-linejoin:round;stroke-dasharray:none;stroke-opacity:1"
         d="m 109.11917,95 23.38272,-13.5 0.53088,3.704887 L 109.1192,99 Z"
         id="path12584" />
      <path
         style="fill:#333333;fill-opacity:1;stroke:#1a1a1a;stroke-width:0.454545;stroke-linecap:round;stroke-linejoin:round;stroke-dasharray:none;stroke-opacity:1"
         d="M 80.067822,82.251833 80.540338,78.5 109.11917,95 l 3e-5,4 z"
         id="path12586" />
      <path
         style="fill:#b2b2b2;fill-opacity:1;stroke:#666666;stroke-width:0.454545;stroke-linecap:round;stroke-linejoin:round;stroke-dasharray:none;stroke-opacity:1"
         d="m 71.880107,97.5 3e-6,-3.000005 3.464105,1.999985 -3e-6,3.00001 z"
         id="path12588" />
      <path
         style="fill:#b2b2b2;fill-opacity:1;stroke:#666666;stroke-width:0.454545;stroke-linecap:round;stroke-linejoin:round;stroke-dasharray:none;stroke-opacity:1"
         d="M 71.880108,94.5 77.942287,91 c 0.866024,-0.499999 -10e-7,-3 1.73205,-4 l 4.330127,-2.5 3.464102,2 -4.330127,2.5 c -1.732051,1 -0.866026,3.5 -1.732051,4 -0.866026,0.5 -6.062185,3.49999 -6.062185,3.49999 z"
         id="path12590" />
      <path
         style="fill:#b2b2b2;fill-opacity:1;stroke:#666666;stroke-width:0.454545;stroke-linecap:round;stroke-linejoin:round;stroke-dasharray:none;stroke-opacity:1"
         d="m 75.34421,99.5 v -3 L 81.406388,93 c 0.866025,-0.5 0,-3.000001 1.73205,-4 l 4.330128,-2.5 v 3 l -3.004304,1.737919 c -1.54677,0.89477 -0.296449,3.138544 -2.596691,4.47607 z"
         id="path12592" />
      <path
         style="fill:#666666;fill-opacity:1;stroke:#1a1a1a;stroke-width:0.454545;stroke-linecap:round;stroke-linejoin:round;stroke-dasharray:none;stroke-opacity:1"
         d="M 80.540338,78.5 109.11917,95 132.50185,81.5 103.92305,65 Z"
         id="path12604" />
      <path
         style="fill:#b2b2b2;fill-opacity:1;stroke:#666666;stroke-width:0.454545;stroke-linecap:round;stroke-linejoin:round;stroke-dasharray:none;stroke-opacity:1"
         d="m 89.200615,107.5 3e-6,-3 3.464105,1.99998 -3e-6,3.00001 z"
         id="path18363" />
      <path
         style="fill:#b2b2b2;fill-opacity:1;stroke:#666666;stroke-width:0.454545;stroke-linecap:round;stroke-linejoin:round;stroke-dasharray:none;stroke-opacity:1"
         d="m 89.200616,104.5 6.062179,-3.5 c 0.866024,-0.5 -10e-7,-3 1.73205,-4 l 4.330125,-2.5 3.4641,2 -4.33012,2.5 c -1.732054,1 -0.866029,3.5 -1.732054,4 -0.866026,0.5 -6.062185,3.49999 -6.062185,3.49999 z"
         id="path18365" />
      <path
         style="fill:#b2b2b2;fill-opacity:1;stroke:#666666;stroke-width:0.454545;stroke-linecap:round;stroke-linejoin:round;stroke-dasharray:none;stroke-opacity:1"
         d="m 92.664718,109.5 v -3 l 6.062178,-3.5 c 0.866025,-0.5 0,-3.000001 1.732054,-4 l 4.33012,-2.5 v 3 l -3.0043,1.73792 c -1.54677,0.89477 -0.29645,3.13854 -2.596691,4.47607 z"
         id="path18367" />
      <path
         style="fill:#b2b2b2;fill-opacity:1;stroke:#666666;stroke-width:0.454545;stroke-linecap:round;stroke-linejoin:round;stroke-dasharray:none;stroke-opacity:1"
         d="m 86.602536,96.00001 3e-6,-3 3.464106,1.99998 -3e-6,3.00001 z"
         id="path18371" />
      <path
         style="fill:#b2b2b2;fill-opacity:1;stroke:#666666;stroke-width:0.454545;stroke-linecap:round;stroke-linejoin:round;stroke-dasharray:none;stroke-opacity:1"
         d="M 86.602548,93.00001 92.664718,89.5 96.12882,91.5 90.066642,95 Z"
         id="path18373" />
      <path
         style="fill:#b2b2b2;fill-opacity:1;stroke:#666666;stroke-width:0.454545;stroke-linecap:round;stroke-linejoin:round;stroke-dasharray:none;stroke-opacity:1"
         d="m 90.066642,98 v -3 l 6.062178,-3.5 v 3 z"
         id="path18375" />
    </g>
    <g
       aria-label="C"
       transform="matrix(0.63507895,-0.366663,0.733326,0.42338593,-23.898157,101.58274)"
       id="g20787"
       style="font-size:3.52778px;line-height:1.25;stroke-width:0.529166">
      <path
         d="m 140.96987,169.36859 0.33417,0.0844 q -0.10507,0.41169 -0.37896,0.62873 -0.27216,0.21532 -0.66662,0.21532 -0.40825,0 -0.66491,-0.16537 -0.25494,-0.16709 -0.38929,-0.48231 -0.13264,-0.31523 -0.13264,-0.67696 0,-0.39447 0.14986,-0.6873 0.15159,-0.29456 0.42892,-0.44614 0.27905,-0.15331 0.61322,-0.15331 0.37896,0 0.63735,0.19293 0.25838,0.19292 0.36001,0.5426 l -0.32901,0.0775 q -0.0879,-0.27561 -0.25493,-0.40136 -0.16709,-0.12574 -0.42031,-0.12574 -0.29111,0 -0.48748,0.13952 -0.19465,0.13953 -0.27388,0.37552 -0.0792,0.23426 -0.0792,0.48403 0,0.32212 0.093,0.56328 0.0947,0.23943 0.29283,0.35829 0.19809,0.11885 0.42892,0.11885 0.28077,0 0.47542,-0.16192 0.19465,-0.16192 0.26355,-0.48059 z"
         id="path20785" />
    </g>
    <g
       aria-label="E"
       transform="matrix(0.63507895,-0.366663,0.733326,0.42338593,-32.016216,107.41037)"
       id="g20791"
       style="font-size:3.52778px;line-height:1.25;stroke-width:0.529166">
      <path
         d="m 121.64127,173.22781 v -2.52525 h 1.8259 v 0.298 h -1.49173 v 0.77342 h 1.39699 v 0.29628 h -1.39699 v 0.85955 h 1.55029 v 0.298 z"
         id="path20789" />
    </g>
    <g
       aria-label="B"
       transform="matrix(0.63507895,-0.366663,0.733326,0.42338593,-33.715772,106.04665)"
       id="g20795"
       style="font-size:3.52778px;line-height:1.25;stroke-width:0.529166">
      <path
         d="m 121.34195,167.33006 v -2.52525 h 0.94741 q 0.28938,0 0.46336,0.0775 0.1757,0.0758 0.27389,0.23599 0.0999,0.15847 0.0999,0.33245 0,0.16192 -0.0879,0.30489 -0.0879,0.14297 -0.26528,0.23082 0.2291,0.0672 0.3514,0.2291 0.12403,0.16192 0.12403,0.38241 0,0.17742 -0.0758,0.33073 -0.0741,0.15158 -0.18431,0.23427 -0.11024,0.0827 -0.27733,0.12574 -0.16536,0.0413 -0.40652,0.0413 z m 0.33418,-1.46416 h 0.54605 q 0.22221,0 0.31867,-0.0293 0.12747,-0.0379 0.1912,-0.12574 0.0655,-0.0879 0.0655,-0.22049 0,-0.12575 -0.0603,-0.22049 -0.0603,-0.0965 -0.17226,-0.13091 -0.11196,-0.0362 -0.38412,-0.0362 h -0.50471 z m 0,1.16616 h 0.62873 q 0.16192,0 0.22738,-0.0121 0.11541,-0.0207 0.19292,-0.0689 0.0775,-0.0482 0.12747,-0.13952 0.0499,-0.093 0.0499,-0.2136 0,-0.14125 -0.0723,-0.2446 -0.0724,-0.10508 -0.20154,-0.14642 -0.12747,-0.0431 -0.36863,-0.0431 h -0.58394 z"
         id="path20793" />
    </g>
    <g
       aria-label="C"
       transform="matrix(0.4763092,-0.27499725,0.5499945,0.31753946,11.883625,116.69913)"
       id="g20799"
       style="font-size:3.52778px;line-height:1.25;stroke-width:0.529166">
      <path
         d="m 140.84972,169.30656 0.45432,0.14643 c -0.07,0.27446 -0.19637,0.48404 -0.37896,0.62873 -0.18144,0.14355 -0.40365,0.21532 -0.66662,0.21532 -0.27217,0 -0.4938,-0.0551 -0.66491,-0.16537 -0.16996,-0.11139 -0.29972,-0.27216 -0.38929,-0.48231 -0.0884,-0.21015 -0.13264,-0.43581 -0.13264,-0.67696 0,-0.26298 0.0499,-0.49208 0.14986,-0.6873 0.10106,-0.19637 0.24403,-0.34509 0.42892,-0.44614 0.18603,-0.10221 0.39044,-0.15331 0.61322,-0.15331 0.25264,0 0.46509,0.0643 0.63735,0.19293 0.17225,0.12861 0.29226,0.30948 0.36001,0.5426 l -0.443,0.15677 c -0.0491,-0.15389 -0.12026,-0.26595 -0.21352,-0.33616 -0.0933,-0.0702 -0.21065,-0.10532 -0.35204,-0.10532 -0.16255,0 -0.29865,0.0389 -0.4083,0.11686 -0.10868,0.0779 -0.18515,0.18275 -0.22939,0.31452 -0.0442,0.13081 -0.0663,0.26594 -0.0663,0.40541 0,0.17986 0.026,0.33712 0.0779,0.47178 0.0529,0.13369 0.13463,0.23372 0.24526,0.30009 0.11061,0.0664 0.23036,0.0996 0.35925,0.0996 0.15678,0 0.28951,-0.0452 0.3982,-0.13562 0.10869,-0.0904 0.18227,-0.22459 0.22074,-0.40253 z"
         id="path20797" />
    </g>
  </g>
</svg>
