<?xml version="1.0" encoding="UTF-8" standalone="no"?>
<svg
   width="33.073238"
   height="38"
   viewBox="0 0 8.7506277 10.054165"
   version="1.1"
   id="svg871"
   xmlns="http://www.w3.org/2000/svg"
   xmlns:svg="http://www.w3.org/2000/svg"
   xmlns:rdf="http://www.w3.org/1999/02/22-rdf-syntax-ns#"
   xmlns:cc="http://creativecommons.org/ns#"
   xmlns:dc="http://purl.org/dc/elements/1.1/">
  <defs
     id="defs865">
    <linearGradient
       id="linearGradient3468">
      <stop
         id="stop3470"
         offset="0"
         style="stop-color:#fdfdfc;stop-opacity:0.78431374" />
      <stop
         id="stop3472"
         offset="1"
         style="stop-color:#ffffff;stop-opacity:0.05172414" />
    </linearGradient>
  </defs>
  <metadata
     id="metadata868">
    <rdf:RDF>
      <cc:Work
         rdf:about="">
        <dc:format>image/svg+xml</dc:format>
        <dc:type
           rdf:resource="http://purl.org/dc/dcmitype/StillImage" />
      </cc:Work>
    </rdf:RDF>
  </metadata>
  <g
     id="layer1"
     transform="translate(132.15341,61.009926)">
    <g
       id="g11160"
       transform="matrix(0.32432842,0,0,0.32432842,-89.292303,-41.222673)">
      <path
         style="fill:#b6c6d2;fill-opacity:1;stroke:#3e5668;stroke-width:1;stroke-linecap:round;stroke-linejoin:round;stroke-miterlimit:4;stroke-dasharray:none;stroke-opacity:1"
         d="m -131.65341,-53.009933 12.99038,7.5 12.99038,-7.5 -12.99038,-7.5 z"
         id="path54" />
      <path
         style="fill:#5c809b;fill-opacity:1;stroke:#3e5668;stroke-width:1;stroke-linecap:round;stroke-linejoin:round;stroke-miterlimit:4;stroke-dasharray:none;stroke-opacity:1"
         d="m -131.65341,-53.009933 v 15 l 12.99038,7.5 v -15 z"
         id="path56" />
      <path
         style="fill:#92aabc;fill-opacity:1;stroke:#3e5668;stroke-width:1;stroke-linecap:round;stroke-linejoin:round;stroke-miterlimit:4;stroke-dasharray:none;stroke-opacity:1"
         d="m -118.66303,-30.509933 v -15 l 12.99038,-7.5 v 15 z"
         id="path58" />
      <g
         id="g29941"
         transform="matrix(0.27552163,0.18121113,0,0.27552163,-79.133401,-0.47777779)">
        <path
           id="path29937"
           style="fill:#c1003f;fill-opacity:1;stroke:none;stroke-width:0.0700968px;stroke-linecap:butt;stroke-linejoin:miter;stroke-opacity:1"
           d="m -171.06159,-55.509933 c 3.54638,2.922188 -1.5223,4.728526 0.52486,7.635388 a 12.639324,12.639324 0 0 1 1.85631,-0.282616 12.639324,12.639324 0 0 1 2.00641,0.0056 c -3.0576,-2.921019 0.49137,-5.12271 -4.38759,-7.358365 z m 7.80675,0.164577 c 2.17072,4.080504 -3.2792,3.782499 -2.4232,7.315783 a 12.639324,12.639324 0 0 1 3.67739,1.199047 c -1.75082,-3.902291 2.40972,-4.56945 -1.25419,-8.51483 z m -15.14788,2.580537 c 4.40467,1.345654 0.38487,4.967608 3.4273,6.86632 a 12.639324,12.639324 0 0 1 3.50287,-1.723265 c -4.02972,-1.516977 -1.53934,-4.943652 -6.93017,-5.143055 z m 22.3165,0.568407 c 0.4448,4.609471 -4.49661,2.230134 -5.04207,5.852055 a 12.639324,12.639324 0 0 1 2.94195,2.481638 c -0.11539,-4.260053 3.97339,-3.291718 2.10012,-8.333693 z m -26.01111,4.274769 c -0.53819,0.03977 -1.18072,0.186906 -1.97097,0.480511 4.56208,-0.440217 2.27876,4.395142 5.74269,5.023427 a 12.639324,12.639324 0 0 1 2.61542,-2.923671 c -3.61775,0.111317 -3.48482,-2.79492 -6.38714,-2.580267 z m 31.43572,1.349545 c -1.35393,4.431749 -5.01254,0.334119 -6.90143,3.483277 a 12.639324,12.639324 0 0 1 1.78674,3.374814 c 1.53073,-3.926259 4.91649,-1.500249 5.11469,-6.858091 z m -33.80529,4.66136 c -0.76493,0.06662 -1.64848,0.463984 -2.82219,1.553951 4.01855,-2.137752 3.79039,3.11572 7.15727,2.458176 a 12.639324,12.639324 0 0 1 1.31662,-3.694799 c -2.71144,1.194413 -3.85449,-0.473844 -5.6517,-0.317328 z" />
        <path
           id="path29939"
           style="color:#000000;font-style:normal;font-variant:normal;font-weight:normal;font-stretch:normal;font-size:medium;line-height:normal;font-family:sans-serif;font-variant-ligatures:normal;font-variant-position:normal;font-variant-caps:normal;font-variant-numeric:normal;font-variant-alternates:normal;font-variant-east-asian:normal;font-feature-settings:normal;font-variation-settings:normal;text-indent:0;text-align:start;text-decoration:none;text-decoration-line:none;text-decoration-style:solid;text-decoration-color:#000000;letter-spacing:normal;word-spacing:normal;text-transform:none;writing-mode:lr-tb;direction:ltr;text-orientation:mixed;dominant-baseline:auto;baseline-shift:baseline;text-anchor:start;white-space:normal;shape-padding:0;shape-margin:0;inline-size:0;clip-rule:nonzero;display:inline;overflow:visible;visibility:visible;isolation:auto;mix-blend-mode:normal;color-interpolation:sRGB;color-interpolation-filters:linearRGB;solid-color:#000000;solid-opacity:1;vector-effect:none;fill:#4a3c7b;fill-opacity:1;fill-rule:nonzero;stroke:none;stroke-width:1.88976;stroke-linecap:round;stroke-linejoin:round;stroke-miterlimit:4;stroke-dasharray:none;stroke-dashoffset:0;stroke-opacity:1;color-rendering:auto;image-rendering:auto;shape-rendering:auto;text-rendering:auto;enable-background:accumulate;stop-color:#000000"
           d="m 110.52344,91.544922 c -29.260349,0.02041 -55.7275,2.698416 -74.941409,7.027344 -9.606954,2.164464 -17.392994,4.730154 -22.861328,7.640624 -2.7341479,1.45524 -4.89454,2.99322 -6.408203,4.6582 -1.513663,1.66499 -2.3907006,3.50239 -2.390625,5.42579 -3.78e-5,1.92756 0.8788784,3.76372 2.3984375,5.43164 1.5195969,1.6679 3.6851455,3.2086 6.4296875,4.66601 5.489121,2.91483 13.309231,5.48914 22.949219,7.6543 19.279975,4.33032 45.831538,6.99803 75.156251,6.99805 1.11742,-1.6e-4 2.23467,-0.006 3.35156,-0.0137 0.0265,-1.7e-4 0.0477,1.9e-4 0.0723,0 a 0.94567759,0.94567759 0 0 0 0.0527,-1.89062 c -19.494159,-1.31353 -36.047164,-4.27563 -47.650389,-8.20117 -5.801651,-1.96278 -10.360065,-4.17318 -13.40625,-6.47461 -3.046186,-2.30144 -4.509577,-4.6149 -4.509766,-6.85742 -7.6e-5,-2.7183 2.159377,-5.53485 6.503906,-8.23047 4.344567,-2.69562 10.751527,-5.18627 18.697266,-7.27149 15.891477,-4.170423 37.939973,-6.76951 62.296873,-6.769529 8.32339,-1.2e-5 16.60529,0.31487 24.59571,0.923828 a 0.94596642,0.94596642 0 0 0 0.18554,-1.882813 c -0.0113,-0.0014 -0.0277,0.0014 -0.0391,0 v -0.0078 c -0.0888,-0.0068 -0.18462,-9.45e-4 -0.27344,-0.0078 -15.37202,-1.837655 -32.47649,-2.818306 -49.8789,-2.818359 z"
           transform="matrix(0.26458333,0,0,0.26458333,-188.98272,-62.52584)" />
      </g>
    </g>
  </g>
</svg>
