<?xml version="1.0" encoding="UTF-8" standalone="no"?>
<svg
   id="ea317b31-b31a-44fd-a7c4-260774575363"
   width="15.378324"
   height="15"
   viewBox="0 0 15.378324 15"
   version="1.1"
   xmlns:xlink="http://www.w3.org/1999/xlink"
   xmlns="http://www.w3.org/2000/svg"
   xmlns:svg="http://www.w3.org/2000/svg"
   xmlns:rdf="http://www.w3.org/1999/02/22-rdf-syntax-ns#"
   xmlns:cc="http://creativecommons.org/ns#"
   xmlns:dc="http://purl.org/dc/elements/1.1/">
  <defs
     id="defs18">
    <linearGradient
       id="a3aecb5c-11f5-4ece-99f7-9672f3236156"
       x1="15.35"
       y1="13.41"
       x2="15.37"
       y2="13.41"
       gradientUnits="userSpaceOnUse">
      <stop
         offset="0"
         stop-color="#0078d4"
         id="stop1" />
      <stop
         offset="0.14"
         stop-color="#1782da"
         id="stop2" />
      <stop
         offset="0.37"
         stop-color="#368fe3"
         id="stop3" />
      <stop
         offset="0.59"
         stop-color="#4c98ea"
         id="stop4" />
      <stop
         offset="0.8"
         stop-color="#599eee"
         id="stop5" />
      <stop
         offset="0.99"
         stop-color="#5ea0ef"
         id="stop6" />
    </linearGradient>
    <linearGradient
       id="b4dfb3ab-25fe-416c-a6fa-f33fcfbf22dc"
       x1="5.5100002"
       y1="802.5"
       x2="12.94"
       y2="810.58002"
       gradientTransform="matrix(1,0,0,1.59,0,-1278.76)"
       gradientUnits="userSpaceOnUse">
      <stop
         offset="0"
         stop-color="#0078d4"
         id="stop7" />
      <stop
         offset="0.02"
         stop-color="#0d7ed8"
         id="stop8" />
      <stop
         offset="0.08"
         stop-color="#2b8ae0"
         id="stop9" />
      <stop
         offset="0.15"
         stop-color="#4194e7"
         id="stop10" />
      <stop
         offset="0.22"
         stop-color="#519beb"
         id="stop11" />
      <stop
         offset="0.29"
         stop-color="#5b9fee"
         id="stop12" />
      <stop
         offset="0.4"
         stop-color="#5ea0ef"
         id="stop13" />
      <stop
         offset="0.55"
         stop-color="#5b9fee"
         id="stop14" />
      <stop
         offset="0.68"
         stop-color="#509aeb"
         id="stop15" />
      <stop
         offset="0.8"
         stop-color="#3f92e6"
         id="stop16" />
      <stop
         offset="0.91"
         stop-color="#2688df"
         id="stop17" />
      <stop
         offset="0.99"
         stop-color="#127fd9"
         id="stop18" />
    </linearGradient>
    <linearGradient
       xlink:href="#a3aecb5c-11f5-4ece-99f7-9672f3236156"
       id="linearGradient23"
       gradientUnits="userSpaceOnUse"
       x1="15.35"
       y1="13.41"
       x2="15.37"
       y2="13.41" />
    <linearGradient
       xlink:href="#a3aecb5c-11f5-4ece-99f7-9672f3236156"
       id="linearGradient24"
       gradientUnits="userSpaceOnUse"
       x1="15.35"
       y1="13.41"
       x2="15.37"
       y2="13.41" />
  </defs>
  <title
     id="title18">Icon-compute-32</title>
  <g
     id="g23"
     transform="matrix(1.0224949,0,0,1.0224949,-1.4928426,-1.9529651)"
     style="stroke-width:0.978001">
    <ellipse
       cx="8.96"
       cy="11.82"
       rx="7.5"
       ry="3.0799999"
       fill="#76bc2d"
       id="ellipse18"
       style="stroke-width:0.978001" />
    <ellipse
       cx="9.1499996"
       cy="11.79"
       rx="2.49"
       ry="0.68000001"
       fill="#5e9624"
       id="ellipse19"
       style="stroke-width:0.978001" />
    <path
       d="M 15.35,13.4 Z"
       fill="url(#a3aecb5c-11f5-4ece-99f7-9672f3236156)"
       id="path19"
       style="fill:url(#linearGradient23);stroke-width:0.978001" />
    <ellipse
       cx="8.96"
       cy="4.9899998"
       rx="7.5"
       ry="3.0799999"
       fill="url(#b4dfb3ab-25fe-416c-a6fa-f33fcfbf22dc)"
       id="ellipse20"
       style="fill:url(#b4dfb3ab-25fe-416c-a6fa-f33fcfbf22dc);stroke-width:0.978001" />
    <ellipse
       cx="9.1499996"
       cy="4.9499998"
       rx="2.49"
       ry="0.68000001"
       fill="#005ba1"
       id="ellipse21"
       style="stroke-width:0.978001" />
    <path
       d="m 9,14.84 c 4.15,0 7.5,-1.38 7.5,-3.08 v 0 1.82 0 c -0.14,1.65 -3.44,3 -7.5,3 -4.06,0 -7.5,-1.38 -7.5,-3.08 v -1.74 c -0.04,1.7 3.32,3.08 7.5,3.08 z"
       fill="#5e9624"
       id="path21"
       style="stroke-width:0.978001" />
    <path
       d="M 15.35,13.4 Z"
       fill="url(#a3aecb5c-11f5-4ece-99f7-9672f3236156)"
       id="path22"
       style="fill:url(#linearGradient24);stroke-width:0.978001" />
    <path
       d="m 9,8 c 4.15,0 7.5,-1.38 7.5,-3.08 v 0 1.82 0 c -0.14,1.65 -3.44,3 -7.5,3 C 4.94,9.74 1.5,8.36 1.5,6.66 V 4.92 C 1.46,6.62 4.82,8 9,8 Z"
       fill="#0078d4"
       id="path23"
       style="stroke-width:0.978001" />
  </g>
  <metadata
     id="metadata24">
    <rdf:RDF>
      <cc:Work
         rdf:about="">
        <dc:title>Icon-compute-32</dc:title>
      </cc:Work>
    </rdf:RDF>
  </metadata>
</svg>
