<?xml version="1.0" encoding="UTF-8" standalone="no"?>
<svg
   xmlns:dc="http://purl.org/dc/elements/1.1/"
   xmlns:cc="http://creativecommons.org/ns#"
   xmlns:rdf="http://www.w3.org/1999/02/22-rdf-syntax-ns#"
   xmlns:svg="http://www.w3.org/2000/svg"
   xmlns="http://www.w3.org/2000/svg"
   width="39.490757"
   height="38"
   viewBox="0 0 10.448596 10.054167"
   version="1.1"
   id="svg3450">
  <defs
     id="defs3444" />
  <metadata
     id="metadata3447">
    <rdf:RDF>
      <cc:Work
         rdf:about="">
        <dc:format>image/svg+xml</dc:format>
        <dc:type
           rdf:resource="http://purl.org/dc/dcmitype/StillImage" />
        <dc:title></dc:title>
      </cc:Work>
    </rdf:RDF>
  </metadata>
  <g
     id="layer1"
     transform="translate(-34.641017,-92.5)">
    <g
       id="g4044"
       transform="matrix(0.20108333,0,0,0.20108333,27.675286,73.899792)">
      <path
         style="fill:#36aaf2;fill-opacity:1;stroke:none;stroke-width:0.264583px;stroke-linecap:butt;stroke-linejoin:miter;stroke-opacity:1"
         d="M 73.612157,92.499999 V 142.5 L 86.60254,135 v -35 z"
         id="path4029" />
      <path
         style="fill:#227eb7;fill-opacity:1;stroke:none;stroke-width:0.264583px;stroke-linecap:butt;stroke-linejoin:miter;stroke-opacity:1"
         d="M 73.612157,92.499999 34.641017,127 l 5.196152,5 33.774988,-24.5 z"
         id="path4031" />
      <path
         style="fill:#0884d0;fill-opacity:1;stroke:none;stroke-width:0.264583px;stroke-linecap:butt;stroke-linejoin:miter;stroke-opacity:1"
         d="m 73.612159,142.5 -38.97114,-34.5 5.196152,-5 33.774988,24.5 z"
         id="path4039" />
    </g>
  </g>
</svg>
