<?xml version="1.0" encoding="UTF-8" standalone="no"?>
<!-- Created with Inkscape (http://www.inkscape.org/) -->

<svg
   width="46.078075mm"
   height="26.635473mm"
   viewBox="0 0 46.078076 26.635473"
   version="1.1"
   id="svg10588"
   xmlns="http://www.w3.org/2000/svg"
   xmlns:svg="http://www.w3.org/2000/svg">
  <defs
     id="defs10585" />
  <g
     id="layer1"
     transform="translate(7.8030449,-108.62162)">
    <g
       id="g25697"
       transform="matrix(0.82450675,0,0,0.82414559,-218.89076,67.11224)"
       style="stroke-width:1.33442">
      <g
         id="g3772"
         transform="translate(49.363448,-9.5)"
         style="stroke-width:1.33442">
        <path
           id="path1586"
           style="fill:#b2b2b2;fill-opacity:1;stroke:#666666;stroke-width:0.266885;stroke-linecap:round;stroke-linejoin:round;stroke-dasharray:none;stroke-opacity:1"
           d="m 249.41527,60.999894 -6.92826,4.000273 12.99042,7.4998 6.92826,-3.999755 v -2.000395 l -9.52604,-5.499923 z m 4.47259,5.305103 c 0.76382,-10e-7 1.52788,0.147323 2.03709,0.441316 0.0935,0.054 0.17846,0.1127 0.25476,0.1757 -0.0764,0.06307 -0.16116,0.122167 -0.25476,0.176217 -1.01841,0.587979 -3.05523,0.587988 -4.07366,0 -0.0936,-0.05405 -0.17836,-0.113147 -0.25476,-0.176217 0.0763,-0.063 0.16126,-0.1217 0.25476,-0.1757 0.50922,-0.293992 1.27275,-0.441316 2.03657,-0.441316 z" />
        <path
           style="fill:#b2b2b2;fill-opacity:1;stroke:#666666;stroke-width:0.266885;stroke-linecap:round;stroke-linejoin:round;stroke-dasharray:none;stroke-opacity:1"
           d="m 255.47749,74.5 6.9282,-4 1e-5,-4 v 2 l -6.9282,4 z"
           id="path1596" />
        <path
           id="path3747"
           style="fill:#999999;fill-opacity:1;stroke:#666666;stroke-width:0.266885;stroke-linecap:butt;stroke-linejoin:miter;stroke-dasharray:none;stroke-opacity:1"
           d="m 253.88786,64.305119 c -0.76382,0 -1.52787,0.146806 -2.03708,0.4408 -0.92502,0.534056 -1.00957,1.55305 -0.25425,2.176094 0.0763,-0.063 0.16126,-0.1217 0.25476,-0.1757 0.50922,-0.293992 1.27275,-0.441316 2.03657,-0.441316 0.76382,-10e-7 1.52788,0.147323 2.03709,0.441316 0.0935,0.054 0.17846,0.1127 0.25476,0.1757 0.755,-0.623064 0.66962,-1.642104 -0.25528,-2.176094 -0.50921,-0.293994 -1.27275,-0.4408 -2.03657,-0.4408 z m -2.13837,2.730066 c 0.008,0.005 0.0151,0.01006 0.0227,0.01499 -0.008,-0.0049 -0.0153,-0.01002 -0.0227,-0.01499 z" />
      </g>
      <path
         style="fill:#666666;fill-opacity:1;stroke:#000000;stroke-width:0.266885;stroke-linecap:round;stroke-linejoin:round;stroke-dasharray:none;stroke-opacity:1"
         d="m 278.86018,58 12.99038,-7.5 12.99038,7.5 -12.99038,7.5 z"
         id="path1588" />
      <path
         style="fill:#4d4d4d;fill-opacity:1;stroke:#000000;stroke-width:0.266885;stroke-linecap:round;stroke-linejoin:round;stroke-dasharray:none;stroke-opacity:1"
         d="M 291.85056,70.5 305.13808,62.837987 304.84094,58 l -12.99038,7.5 -0.10448,2.842742 z"
         id="path1598" />
      <path
         style="fill:#4d4d4d;fill-opacity:1;stroke:#000000;stroke-width:0.266885;stroke-linecap:round;stroke-linejoin:round;stroke-dasharray:none;stroke-opacity:1"
         d="M 291.85056,72.5 304.84094,65 305.13808,62.838 291.85056,70.5 Z"
         id="path1719" />
      <path
         style="fill:#333333;fill-opacity:1;stroke:#000000;stroke-width:0.266885;stroke-linecap:round;stroke-linejoin:round;stroke-dasharray:none;stroke-opacity:1"
         d="m 278.86018,58 12.99038,7.5 -0.10448,2.843 -13.087,-7.465732 z"
         id="path1721" />
      <path
         style="fill:#333333;fill-opacity:1;stroke:#000000;stroke-width:0.266885;stroke-linecap:round;stroke-linejoin:round;stroke-dasharray:none;stroke-opacity:1"
         d="m 278.65908,60.877 13.087,7.466 0.045,1.154602 -13.09,-7.562602 z"
         id="path1723" />
      <path
         style="fill:#333333;fill-opacity:1;stroke:#000000;stroke-width:0.266885;stroke-linecap:round;stroke-linejoin:round;stroke-dasharray:none;stroke-opacity:1"
         d="m 278.70108,61.935082 13.09,7.562918 0.0595,3.002 -12.9904,-7.5 z"
         id="path1725" />
      <g
         id="g3280"
         style="stroke-width:1.33442">
        <path
           style="fill:#b2b2b2;fill-opacity:1;stroke:#666666;stroke-width:0.266885;stroke-linecap:round;stroke-linejoin:round;stroke-dasharray:none;stroke-opacity:1"
           d="m 288.64753,66.653867 -8.03796,4.68732 -0.0174,0.658813 -12.12389,7.127 0.86555,0.5 12.12435,-7.126999 0.5701,0.322999 8.66,-5.000186 z"
           id="path3247" />
        <path
           style="fill:#b2b2b2;fill-opacity:1;stroke:#666666;stroke-width:0.266885;stroke-linecap:round;stroke-linejoin:round;stroke-dasharray:none;stroke-opacity:1"
           d="M 268.46833,79.126966 268.46787,80 l 0.86602,0.5 4.4e-4,-0.873 z"
           id="path3249" />
        <path
           style="fill:#b2b2b2;fill-opacity:1;stroke:#666666;stroke-width:0.266885;stroke-linecap:round;stroke-linejoin:round;stroke-dasharray:none;stroke-opacity:1"
           d="m 269.33389,80.5 -10e-6,-0.873 12.12435,-7.127002 1.24645,-0.05223 7.98365,-4.624772 v 1.001673 l -7.98365,4.623097 -1.24645,0.05223 z"
           id="path3251" />
      </g>
      <g
         id="g3288"
         transform="translate(-8.6602489,-5)"
         style="stroke-width:1.33442">
        <path
           style="fill:#b2b2b2;fill-opacity:1;stroke:#666666;stroke-width:0.266885;stroke-linecap:round;stroke-linejoin:round;stroke-dasharray:none;stroke-opacity:1"
           d="m 288.64753,66.653867 -8.03796,4.68732 -0.0174,0.658813 -12.12389,7.127 0.86555,0.5 12.12435,-7.126999 0.5701,0.322999 8.66,-5.000186 z"
           id="path3282" />
        <path
           style="fill:#b2b2b2;fill-opacity:1;stroke:#666666;stroke-width:0.266885;stroke-linecap:round;stroke-linejoin:round;stroke-dasharray:none;stroke-opacity:1"
           d="M 268.46833,79.126966 268.46787,80 l 0.86602,0.5 4.4e-4,-0.873 z"
           id="path3284" />
        <path
           style="fill:#b2b2b2;fill-opacity:1;stroke:#666666;stroke-width:0.266885;stroke-linecap:round;stroke-linejoin:round;stroke-dasharray:none;stroke-opacity:1"
           d="m 269.33389,80.5 -10e-6,-0.873 12.12435,-7.127002 1.24645,-0.05223 7.98365,-4.624772 v 1.001673 l -7.98365,4.623097 -1.24645,0.05223 z"
           id="path3286" />
      </g>
      <g
         id="g3296"
         transform="translate(-4.3301218,-2.5)"
         style="stroke-width:1.33442">
        <path
           style="fill:#b2b2b2;fill-opacity:1;stroke:#666666;stroke-width:0.266885;stroke-linecap:round;stroke-linejoin:round;stroke-dasharray:none;stroke-opacity:1"
           d="m 288.64753,66.653867 -8.03796,4.68732 -0.0174,0.658813 -12.12389,7.127 0.86555,0.5 12.12435,-7.126999 0.5701,0.322999 8.66,-5.000186 z"
           id="path3290" />
        <path
           style="fill:#b2b2b2;fill-opacity:1;stroke:#666666;stroke-width:0.266885;stroke-linecap:round;stroke-linejoin:round;stroke-dasharray:none;stroke-opacity:1"
           d="M 268.46833,79.126966 268.46787,80 l 0.86602,0.5 4.4e-4,-0.873 z"
           id="path3292" />
        <path
           style="fill:#b2b2b2;fill-opacity:1;stroke:#666666;stroke-width:0.266885;stroke-linecap:round;stroke-linejoin:round;stroke-dasharray:none;stroke-opacity:1"
           d="m 269.33389,80.5 -10e-6,-0.873 12.12435,-7.127002 1.24645,-0.05223 7.98365,-4.624772 v 1.001673 l -7.98365,4.623097 -1.24645,0.05223 z"
           id="path3294" />
      </g>
      <g
         aria-label="B"
         transform="matrix(0.8660254,-0.5,1,0.57735027,52.85726,-44.522871)"
         id="g25653"
         style="font-size:3.52778px;line-height:1.25;stroke-width:0.706131">
        <path
           d="m -3.4534273,208.67572 v -2.52526 h 0.9474019 q 0.2893882,0 0.4633656,0.0775 0.1757,0.0758 0.2738853,0.23599 0.099908,0.15847 0.099908,0.33245 0,0.16192 -0.08785,0.30489 -0.08785,0.14297 -0.2652725,0.23082 0.229099,0.0672 0.3514,0.2291 0.1240235,0.16192 0.1240235,0.38241 0,0.17742 -0.075792,0.33073 -0.07407,0.15158 -0.1843127,0.23426 -0.1102431,0.0827 -0.2773304,0.12575 -0.1653647,0.0413 -0.4065215,0.0413 z m 0.3341745,-1.46417 h 0.546048 q 0.2222088,0 0.3186715,-0.0293 0.1274686,-0.0379 0.1912029,-0.12575 0.065457,-0.0879 0.065457,-0.22048 0,-0.12575 -0.060289,-0.22049 -0.060289,-0.0965 -0.1722549,-0.13091 -0.1119657,-0.0362 -0.3841284,-0.0362 h -0.5047068 z m 0,1.16617 h 0.6287303 q 0.1619196,0 0.2273765,-0.0121 0.1154107,-0.0207 0.1929254,-0.0689 0.077515,-0.0482 0.1274686,-0.13953 0.049954,-0.093 0.049954,-0.21359 0,-0.14125 -0.072347,-0.2446 -0.072347,-0.10508 -0.2015382,-0.14642 -0.1274686,-0.0431 -0.3686255,-0.0431 h -0.583944 z"
           id="path25651"
           style="stroke-width:0.706131" />
      </g>
      <g
         aria-label="C"
         transform="matrix(0.8660254,-0.5,1,0.57735027,39.796651,-69.980591)"
         id="g25657"
         style="font-size:3.52778px;line-height:1.25;stroke-width:0.706131">
        <path
           d="m -19.717965,240.69928 0.334174,0.0844 q -0.105075,0.41168 -0.37896,0.62873 -0.272163,0.21531 -0.666627,0.21531 -0.408244,0 -0.664904,-0.16536 -0.254937,-0.16709 -0.389296,-0.48231 -0.132636,-0.31523 -0.132636,-0.67697 0,-0.39446 0.149862,-0.68729 0.151584,-0.29456 0.428914,-0.44614 0.279053,-0.15331 0.613228,-0.15331 0.378961,0 0.637343,0.19293 0.258382,0.19292 0.360013,0.5426 l -0.329007,0.0775 q -0.08785,-0.2756 -0.254937,-0.40135 -0.167088,-0.12575 -0.420302,-0.12575 -0.291111,0 -0.487482,0.13953 -0.194648,0.13953 -0.273885,0.37552 -0.07924,0.23426 -0.07924,0.48403 0,0.32212 0.09302,0.56328 0.09474,0.23943 0.292834,0.35829 0.198093,0.11885 0.428914,0.11885 0.280776,0 0.475424,-0.16192 0.194648,-0.16192 0.26355,-0.48059 z"
           id="path25655"
           style="stroke-width:0.706131" />
      </g>
      <g
         aria-label="E"
         transform="matrix(0.8660254,-0.5,1,0.57735027,51.095485,-45.514643)"
         id="g25661"
         style="font-size:3.52778px;line-height:1.25;stroke-width:0.706131">
        <path
           d="m -3.4422303,219.06802 v -2.52525 h 1.8259018 v 0.298 h -1.4917273 v 0.77342 h 1.3969871 v 0.29628 h -1.3969871 v 0.85955 h 1.550294 v 0.298 z"
           id="path25659"
           style="stroke-width:0.706131" />
      </g>
      <g
         aria-label="C"
         transform="matrix(0.62212647,-0.35918488,0.71836977,0.41475098,148.91351,-41.305696)"
         id="g25665"
         style="font-size:3.52778px;line-height:1.25;stroke-width:0.982964">
        <path
           d="m -19.717965,240.69928 0.334174,0.0844 q -0.105075,0.41168 -0.37896,0.62873 -0.272163,0.21531 -0.666627,0.21531 -0.408244,0 -0.664904,-0.16536 -0.254937,-0.16709 -0.389296,-0.48231 -0.132636,-0.31523 -0.132636,-0.67697 0,-0.39446 0.149862,-0.68729 0.151584,-0.29456 0.428914,-0.44614 0.279053,-0.15331 0.613228,-0.15331 0.378961,0 0.637343,0.19293 0.258382,0.19292 0.360013,0.5426 l -0.329007,0.0775 q -0.08785,-0.2756 -0.254937,-0.40135 -0.167088,-0.12575 -0.420302,-0.12575 -0.291111,0 -0.487482,0.13953 -0.194648,0.13953 -0.273885,0.37552 -0.07924,0.23426 -0.07924,0.48403 0,0.32212 0.09302,0.56328 0.09474,0.23943 0.292834,0.35829 0.198093,0.11885 0.428914,0.11885 0.280776,0 0.475424,-0.16192 0.194648,-0.16192 0.26355,-0.48059 z"
           id="path25663"
           style="stroke-width:0.982964" />
      </g>
    </g>
  </g>
</svg>
