<?xml version="1.0" encoding="UTF-8" standalone="no"?>
<!-- Created with Inkscape (http://www.inkscape.org/) -->

<svg
   width="62.536438mm"
   height="49.544857mm"
   viewBox="0 0 62.536438 49.544856"
   version="1.1"
   id="svg5240"
   xmlns="http://www.w3.org/2000/svg"
   xmlns:svg="http://www.w3.org/2000/svg">
  <defs
     id="defs5237" />
  <g
     id="layer1"
     transform="translate(-462.34322,-489.10373)">
    <path
       style="fill:none;stroke:#000000;stroke-width:0.396875;stroke-linecap:round;stroke-linejoin:round;stroke-miterlimit:4;stroke-dasharray:none;stroke-opacity:1"
       d="m 482.36145,504.18382 v -2.8125 h 5.625 v 2.8125 z"
       id="path4981" />
    <path
       id="path4983"
       d="m 473.92395,504.18382 v -2.8125 h 5.625 v 2.8125 z"
       style="fill:none;stroke:#000000;stroke-width:0.396875;stroke-linecap:round;stroke-linejoin:round;stroke-miterlimit:4;stroke-dasharray:none;stroke-opacity:1" />
    <path
       style="fill:none;stroke:#000000;stroke-width:0.396875;stroke-linecap:round;stroke-linejoin:round;stroke-miterlimit:4;stroke-dasharray:none;stroke-opacity:1"
       d="m 465.48645,504.18382 v -2.8125 h 5.625 v 2.8125 z"
       id="path4985" />
    <path
       id="path4987"
       d="m 507.67395,504.18382 v -2.8125 h 5.62497 v 2.8125 z"
       style="fill:none;stroke:#000000;stroke-width:0.396875;stroke-linecap:round;stroke-linejoin:round;stroke-miterlimit:4;stroke-dasharray:none;stroke-opacity:1" />
    <path
       style="fill:none;stroke:#000000;stroke-width:0.396875;stroke-linecap:round;stroke-linejoin:round;stroke-miterlimit:4;stroke-dasharray:none;stroke-opacity:1"
       d="m 499.23645,504.18382 v -2.8125 h 5.625 v 2.8125 z"
       id="path4989" />
    <path
       id="path4991"
       d="m 490.79894,504.18382 v -2.8125 h 5.62501 v 2.8125 z"
       style="fill:none;stroke:#000000;stroke-width:0.396875;stroke-linecap:round;stroke-linejoin:round;stroke-miterlimit:4;stroke-dasharray:none;stroke-opacity:1" />
    <path
       style="fill:none;stroke:#000000;stroke-width:0.396875;stroke-linecap:round;stroke-linejoin:round;stroke-miterlimit:4;stroke-dasharray:none;stroke-opacity:1"
       d="m 516.11144,504.18382 v -2.8125 h 5.62499 v 2.8125 z"
       id="path4993" />
    <path
       style="fill:none;stroke:#000000;stroke-width:0.661458;stroke-linecap:round;stroke-linejoin:round;stroke-miterlimit:4;stroke-dasharray:none;stroke-opacity:1"
       d="m 462.67395,504.18382 h 61.87498 v 28.125 h -61.87498 z"
       id="path4995" />
    <path
       style="fill:none;stroke:#000000;stroke-width:0.661458;stroke-linecap:round;stroke-linejoin:round;stroke-miterlimit:4;stroke-dasharray:none;stroke-opacity:1"
       d="m 462.67395,515.90641 v 4.67982 c 1.29441,0 2.33991,-1.04549 2.33991,-2.33991 0,-1.29442 -1.0455,-2.33991 -2.33991,-2.33991 z"
       id="path4997" />
    <path
       id="path4999"
       d="m 482.36145,535.12132 v -2.8125 h 5.625 v 2.8125 z"
       style="fill:none;stroke:#000000;stroke-width:0.396875;stroke-linecap:round;stroke-linejoin:round;stroke-miterlimit:4;stroke-dasharray:none;stroke-opacity:1" />
    <path
       style="fill:none;stroke:#000000;stroke-width:0.396875;stroke-linecap:round;stroke-linejoin:round;stroke-miterlimit:4;stroke-dasharray:none;stroke-opacity:1"
       d="m 473.92395,535.12132 v -2.8125 h 5.625 v 2.8125 z"
       id="path5001" />
    <path
       id="path5003"
       d="m 465.48645,535.12132 v -2.8125 h 5.625 v 2.8125 z"
       style="fill:none;stroke:#000000;stroke-width:0.396875;stroke-linecap:round;stroke-linejoin:round;stroke-miterlimit:4;stroke-dasharray:none;stroke-opacity:1" />
    <path
       style="fill:none;stroke:#000000;stroke-width:0.396875;stroke-linecap:round;stroke-linejoin:round;stroke-miterlimit:4;stroke-dasharray:none;stroke-opacity:1"
       d="m 507.67395,535.12132 v -2.8125 h 5.62497 v 2.8125 z"
       id="path5005" />
    <path
       id="path5007"
       d="m 499.23645,535.12132 v -2.8125 h 5.625 v 2.8125 z"
       style="fill:none;stroke:#000000;stroke-width:0.396875;stroke-linecap:round;stroke-linejoin:round;stroke-miterlimit:4;stroke-dasharray:none;stroke-opacity:1" />
    <path
       style="fill:none;stroke:#000000;stroke-width:0.396875;stroke-linecap:round;stroke-linejoin:round;stroke-miterlimit:4;stroke-dasharray:none;stroke-opacity:1"
       d="m 490.79894,535.12132 v -2.8125 h 5.62501 v 2.8125 z"
       id="path5009" />
    <path
       id="path5011"
       d="m 516.11144,535.12132 v -2.8125 h 5.62499 v 2.8125 z"
       style="fill:none;stroke:#000000;stroke-width:0.396875;stroke-linecap:round;stroke-linejoin:round;stroke-miterlimit:4;stroke-dasharray:none;stroke-opacity:1" />
    <path
       id="path5422"
       d="m 477.67395,507.93382 h 5.625 v 7.5 h -5.625 z"
       style="fill:none;stroke:#000000;stroke-width:0.396875;stroke-linecap:round;stroke-linejoin:round;stroke-miterlimit:4;stroke-dasharray:none;stroke-opacity:1" />
    <path
       d="m 483.34662,511.73687 h 1.87498 v -7.5 m -7.5,7.5 h -1.87499 v -5.625 h 0.9375 v -1.875"
       style="fill:none;stroke:#000000;stroke-width:0.396875;stroke-linecap:butt;stroke-linejoin:miter;stroke-miterlimit:4;stroke-dasharray:none;stroke-opacity:1"
       id="path5424" />
    <path
       style="fill:none;stroke:#000000;stroke-width:0.396875;stroke-linecap:round;stroke-linejoin:round;stroke-miterlimit:4;stroke-dasharray:none;stroke-opacity:1"
       d="m 494.54895,507.93382 h 5.625 v 7.5 h -5.625 z"
       id="path5510" />
    <path
       id="path5512"
       style="fill:none;stroke:#000000;stroke-width:0.396875;stroke-linecap:butt;stroke-linejoin:miter;stroke-miterlimit:4;stroke-dasharray:none;stroke-opacity:1"
       d="m 500.22162,511.73687 h 1.87498 v -7.5 m -7.5,7.5 h -1.875 v -5.625 h 0.9375 v -1.875" />
    <path
       id="path5516"
       d="m 511.42395,507.93382 h 5.62499 v 7.5 h -5.62499 z"
       style="fill:none;stroke:#000000;stroke-width:0.396875;stroke-linecap:round;stroke-linejoin:round;stroke-miterlimit:4;stroke-dasharray:none;stroke-opacity:1" />
    <path
       d="m 517.09662,511.73687 h 1.875 v -7.5 m -7.50002,7.5 h -1.875 v -5.625 h 0.9375 v -1.875"
       style="fill:none;stroke:#000000;stroke-width:0.396875;stroke-linecap:butt;stroke-linejoin:miter;stroke-miterlimit:4;stroke-dasharray:none;stroke-opacity:1"
       id="path5518" />
    <path
       style="fill:none;stroke:#000000;stroke-width:0.396875;stroke-linecap:round;stroke-linejoin:round;stroke-miterlimit:4;stroke-dasharray:none;stroke-opacity:1"
       d="m 502.98644,528.55882 h 5.625 v -7.5 h -5.62499 z"
       id="path5522" />
    <path
       id="path5524"
       style="fill:none;stroke:#000000;stroke-width:0.396875;stroke-linecap:butt;stroke-linejoin:miter;stroke-miterlimit:4;stroke-dasharray:none;stroke-opacity:1"
       d="m 508.65912,524.86187 h 1.875 v 7.5 m -7.50002,-7.5 h -1.875 v 5.625 h 0.93751 v 1.875" />
    <path
       id="path5528"
       d="m 486.11145,528.55882 h 5.62499 v -7.5 h -5.62499 z"
       style="fill:none;stroke:#000000;stroke-width:0.396875;stroke-linecap:round;stroke-linejoin:round;stroke-miterlimit:4;stroke-dasharray:none;stroke-opacity:1" />
    <path
       d="m 491.78412,524.86187 h 1.875 v 7.5 m -7.50002,-7.5 h -1.875 v 5.625 h 0.9375 v 1.875"
       style="fill:none;stroke:#000000;stroke-width:0.396875;stroke-linecap:butt;stroke-linejoin:miter;stroke-miterlimit:4;stroke-dasharray:none;stroke-opacity:1"
       id="path5530" />
    <path
       style="fill:none;stroke:#000000;stroke-width:0.396875;stroke-linecap:round;stroke-linejoin:round;stroke-miterlimit:4;stroke-dasharray:none;stroke-opacity:1"
       d="m 469.23645,528.55882 h 5.62499 v -7.5 h -5.62499 z"
       id="path5534" />
    <path
       id="path5536"
       style="fill:none;stroke:#000000;stroke-width:0.396875;stroke-linecap:butt;stroke-linejoin:miter;stroke-miterlimit:4;stroke-dasharray:none;stroke-opacity:1"
       d="m 474.90912,524.86187 h 1.875 v 7.5 m -7.50002,-7.5 h -1.875 v 5.625 h 0.9375 v 1.875" />
    <text
       id="text5642"
       y="494.80881"
       x="489.22217"
       style="font-style:normal;font-variant:normal;font-weight:normal;font-stretch:normal;font-size:3.175px;line-height:0%;font-family:sans-serif;-inkscape-font-specification:Sans;text-align:start;letter-spacing:0px;word-spacing:0px;writing-mode:lr-tb;text-anchor:start;fill:#000000;fill-opacity:1;stroke:none;stroke-width:0.264583"
       xml:space="preserve"><tspan
         id="tspan5644"
         x="489.22217"
         y="494.80881"
         style="font-size:7.9375px;line-height:1.25;font-family:sans-serif;stroke-width:0.264583">04</tspan></text>
    <text
       xml:space="preserve"
       style="font-style:normal;font-variant:normal;font-weight:normal;font-stretch:normal;font-size:3.175px;line-height:0%;font-family:sans-serif;-inkscape-font-specification:Sans;text-align:start;letter-spacing:0px;word-spacing:0px;writing-mode:lr-tb;text-anchor:start;fill:#000000;fill-opacity:1;stroke:#000000;stroke-width:0.0529167;stroke-miterlimit:4;stroke-dasharray:none;stroke-opacity:1"
       x="518.18561"
       y="531.34479"
       id="text5093"><tspan
         y="531.34479"
         x="518.18561"
         id="tspan5095"
         style="font-size:2.64583px;line-height:1.25;font-family:sans-serif;stroke-width:0.0529167">7</tspan></text>
    <text
       id="text5097"
       y="507.04913"
       x="520.55322"
       style="font-style:normal;font-variant:normal;font-weight:normal;font-stretch:normal;font-size:3.175px;line-height:0%;font-family:sans-serif;-inkscape-font-specification:Sans;text-align:start;letter-spacing:0px;word-spacing:0px;writing-mode:lr-tb;text-anchor:start;fill:#000000;fill-opacity:1;stroke:#000000;stroke-width:0.0529167;stroke-miterlimit:4;stroke-dasharray:none;stroke-opacity:1"
       xml:space="preserve"><tspan
         y="507.04913"
         x="520.55322"
         id="tspan5099"
         style="font-size:2.64583px;line-height:1.25;font-family:sans-serif;stroke-width:0.0529167">8</tspan></text>
    <text
       xml:space="preserve"
       style="font-style:normal;font-variant:normal;font-weight:normal;font-stretch:normal;font-size:3.175px;line-height:0%;font-family:sans-serif;-inkscape-font-specification:Sans;text-align:start;letter-spacing:0px;word-spacing:0px;writing-mode:lr-tb;text-anchor:start;fill:#000000;fill-opacity:1;stroke:#000000;stroke-width:0.0529167;stroke-miterlimit:4;stroke-dasharray:none;stroke-opacity:1"
       x="466.7467"
       y="507.04913"
       id="text5101"><tspan
         y="507.04913"
         x="466.7467"
         id="tspan5103"
         style="font-size:2.64583px;line-height:1.25;font-family:sans-serif;stroke-width:0.0529167">14</tspan></text>
    <text
       xml:space="preserve"
       style="font-style:normal;font-variant:normal;font-weight:normal;font-stretch:normal;font-size:3.175px;line-height:0%;font-family:sans-serif;-inkscape-font-specification:Sans;text-align:start;letter-spacing:0px;word-spacing:0px;writing-mode:lr-tb;text-anchor:start;fill:#000000;fill-opacity:1;stroke:#000000;stroke-width:0.0529167;stroke-miterlimit:4;stroke-dasharray:none;stroke-opacity:1"
       x="465.02637"
       y="531.34479"
       id="text5105"><tspan
         id="tspan5107"
         x="465.02637"
         y="531.34479"
         style="font-size:2.64583px;line-height:1.25;font-family:sans-serif;stroke-width:0.0529167">1</tspan></text>
    <text
       id="text5155"
       y="538.58014"
       x="515.10229"
       style="font-style:normal;font-variant:normal;font-weight:normal;font-stretch:normal;font-size:3.175px;line-height:0%;font-family:sans-serif;-inkscape-font-specification:Sans;text-align:start;letter-spacing:0px;word-spacing:0px;writing-mode:lr-tb;text-anchor:start;fill:#000000;fill-opacity:1;stroke:#000000;stroke-width:0.0529167;stroke-miterlimit:4;stroke-dasharray:none;stroke-opacity:1"
       xml:space="preserve"><tspan
         y="538.58014"
         x="515.10229"
         id="tspan5157"
         style="font-size:3.43958px;line-height:1.25;font-family:sans-serif;stroke-width:0.0529167">GND</tspan></text>
    <text
       id="text5428"
       y="513.44836"
       x="479.38766"
       style="font-style:normal;font-variant:normal;font-weight:normal;font-stretch:normal;font-size:3.175px;line-height:0%;font-family:sans-serif;-inkscape-font-specification:Sans;text-align:start;letter-spacing:0px;word-spacing:0px;writing-mode:lr-tb;text-anchor:start;fill:#000000;fill-opacity:1;stroke:none;stroke-width:0.264583"
       xml:space="preserve"><tspan
         id="tspan5430"
         x="479.38766"
         y="513.44836"
         style="font-size:4.7625px;line-height:1.25;font-family:sans-serif;stroke-width:0.264583">1</tspan></text>
    <text
       xml:space="preserve"
       style="font-style:normal;font-variant:normal;font-weight:normal;font-stretch:normal;font-size:3.175px;line-height:0%;font-family:sans-serif;-inkscape-font-specification:Sans;text-align:start;letter-spacing:0px;word-spacing:0px;writing-mode:lr-tb;text-anchor:start;fill:#000000;fill-opacity:1;stroke:none;stroke-width:0.264583"
       x="496.26266"
       y="513.44836"
       id="text5482"><tspan
         y="513.44836"
         x="496.26266"
         id="tspan5484"
         style="font-size:4.7625px;line-height:1.25;font-family:sans-serif;stroke-width:0.264583">1</tspan></text>
    <text
       id="text5540"
       y="513.44836"
       x="513.13763"
       style="font-style:normal;font-variant:normal;font-weight:normal;font-stretch:normal;font-size:3.175px;line-height:0%;font-family:sans-serif;-inkscape-font-specification:Sans;text-align:start;letter-spacing:0px;word-spacing:0px;writing-mode:lr-tb;text-anchor:start;fill:#000000;fill-opacity:1;stroke:none;stroke-width:0.264583"
       xml:space="preserve"><tspan
         id="tspan5542"
         x="513.13763"
         y="513.44836"
         style="font-size:4.7625px;line-height:1.25;font-family:sans-serif;stroke-width:0.264583">1</tspan></text>
    <text
       xml:space="preserve"
       style="font-style:normal;font-variant:normal;font-weight:normal;font-stretch:normal;font-size:3.175px;line-height:0%;font-family:sans-serif;-inkscape-font-specification:Sans;text-align:start;letter-spacing:0px;word-spacing:0px;writing-mode:lr-tb;text-anchor:start;fill:#000000;fill-opacity:1;stroke:none;stroke-width:0.264583"
       x="504.70016"
       y="526.57343"
       id="text5544"><tspan
         y="526.57343"
         x="504.70016"
         id="tspan5546"
         style="font-size:4.7625px;line-height:1.25;font-family:sans-serif;stroke-width:0.264583">1</tspan></text>
    <text
       id="text5548"
       y="526.57343"
       x="487.82516"
       style="font-style:normal;font-variant:normal;font-weight:normal;font-stretch:normal;font-size:3.175px;line-height:0%;font-family:sans-serif;-inkscape-font-specification:Sans;text-align:start;letter-spacing:0px;word-spacing:0px;writing-mode:lr-tb;text-anchor:start;fill:#000000;fill-opacity:1;stroke:none;stroke-width:0.264583"
       xml:space="preserve"><tspan
         id="tspan5550"
         x="487.82516"
         y="526.57343"
         style="font-size:4.7625px;line-height:1.25;font-family:sans-serif;stroke-width:0.264583">1</tspan></text>
    <text
       xml:space="preserve"
       style="font-style:normal;font-variant:normal;font-weight:normal;font-stretch:normal;font-size:3.175px;line-height:0%;font-family:sans-serif;-inkscape-font-specification:Sans;text-align:start;letter-spacing:0px;word-spacing:0px;writing-mode:lr-tb;text-anchor:start;fill:#000000;fill-opacity:1;stroke:none;stroke-width:0.264583"
       x="470.95016"
       y="526.57343"
       id="text5552"><tspan
         y="526.57343"
         x="470.95016"
         id="tspan5554"
         style="font-size:4.7625px;line-height:1.25;font-family:sans-serif;stroke-width:0.264583">1</tspan></text>
    <text
       xml:space="preserve"
       style="font-style:normal;font-variant:normal;font-weight:normal;font-stretch:normal;font-size:3.175px;line-height:0%;font-family:sans-serif;-inkscape-font-specification:Sans;text-align:start;letter-spacing:0px;word-spacing:0px;writing-mode:lr-tb;text-anchor:start;fill:#000000;fill-opacity:1;stroke:#000000;stroke-width:0.0529167;stroke-miterlimit:4;stroke-dasharray:none;stroke-opacity:1"
       x="465.43878"
       y="500.34549"
       id="text8304"><tspan
         id="tspan8306"
         x="465.43878"
         y="500.34549"
         style="font-size:3.43958px;line-height:1.25;font-family:sans-serif;stroke-width:0.0529167">Vcc</tspan></text>
    <path
       style="fill:#ffffff;fill-opacity:1;stroke:#000000;stroke-width:0.396875;stroke-linecap:round;stroke-linejoin:round;stroke-miterlimit:4;stroke-dasharray:none;stroke-opacity:1"
       d="m 483.29895,511.68382 c 0,0.39397 0.31939,0.71336 0.71336,0.71336 0.39398,0 0.71337,-0.31939 0.71337,-0.71336 0,-0.39398 -0.31939,-0.71337 -0.71337,-0.71337 -0.39397,0 -0.71336,0.31939 -0.71336,0.71337 z"
       id="path8358" />
    <path
       id="path8360"
       d="m 500.17395,511.68382 c 0,0.39397 0.31938,0.71336 0.71336,0.71336 0.39397,0 0.71337,-0.31939 0.71337,-0.71336 0,-0.39398 -0.3194,-0.71337 -0.71337,-0.71337 -0.39398,0 -0.71336,0.31939 -0.71336,0.71337 z"
       style="fill:#ffffff;fill-opacity:1;stroke:#000000;stroke-width:0.396875;stroke-linecap:round;stroke-linejoin:round;stroke-miterlimit:4;stroke-dasharray:none;stroke-opacity:1" />
    <path
       style="fill:#ffffff;fill-opacity:1;stroke:#000000;stroke-width:0.396875;stroke-linecap:round;stroke-linejoin:round;stroke-miterlimit:4;stroke-dasharray:none;stroke-opacity:1"
       d="m 517.04895,511.68382 c 0,0.39397 0.31938,0.71336 0.71336,0.71336 0.39397,0 0.71337,-0.31939 0.71337,-0.71336 0,-0.39398 -0.3194,-0.71337 -0.71337,-0.71337 -0.39398,0 -0.71336,0.31939 -0.71336,0.71337 z"
       id="path8362" />
    <path
       id="path8364"
       d="m 508.61145,524.80882 c 0,0.39397 0.31939,0.71336 0.71336,0.71336 0.39398,0 0.71337,-0.31939 0.71337,-0.71336 0,-0.39398 -0.31939,-0.71337 -0.71337,-0.71337 -0.39397,0 -0.71336,0.31939 -0.71336,0.71337 z"
       style="fill:#ffffff;fill-opacity:1;stroke:#000000;stroke-width:0.396875;stroke-linecap:round;stroke-linejoin:round;stroke-miterlimit:4;stroke-dasharray:none;stroke-opacity:1" />
    <path
       style="fill:#ffffff;fill-opacity:1;stroke:#000000;stroke-width:0.396875;stroke-linecap:round;stroke-linejoin:round;stroke-miterlimit:4;stroke-dasharray:none;stroke-opacity:1"
       d="m 491.73645,524.80882 c 0,0.39397 0.31938,0.71336 0.71336,0.71336 0.39398,0 0.71337,-0.31939 0.71337,-0.71336 0,-0.39398 -0.31939,-0.71337 -0.71337,-0.71337 -0.39398,0 -0.71336,0.31939 -0.71336,0.71337 z"
       id="path8366" />
    <path
       id="path8368"
       d="m 474.86145,524.80882 c 0,0.39397 0.31938,0.71336 0.71336,0.71336 0.39397,0 0.71337,-0.31939 0.71337,-0.71336 0,-0.39398 -0.3194,-0.71337 -0.71337,-0.71337 -0.39398,0 -0.71336,0.31939 -0.71336,0.71337 z"
       style="fill:#ffffff;fill-opacity:1;stroke:#000000;stroke-width:0.396875;stroke-linecap:round;stroke-linejoin:round;stroke-miterlimit:4;stroke-dasharray:none;stroke-opacity:1" />
  </g>
</svg>
