<?xml version="1.0" encoding="UTF-8" standalone="no"?>
<svg
   id="a1606a52-fb14-4637-87de-4d524bba1829"
   width="25.044744"
   height="15"
   viewBox="0 0 25.044745 15"
   version="1.1"
   xmlns="http://www.w3.org/2000/svg"
   xmlns:svg="http://www.w3.org/2000/svg"
   xmlns:rdf="http://www.w3.org/1999/02/22-rdf-syntax-ns#"
   xmlns:cc="http://creativecommons.org/ns#"
   xmlns:dc="http://purl.org/dc/elements/1.1/">
  <defs
     id="defs6">
    <linearGradient
       id="f020fb7e-2243-4501-8153-5d69bd3c34f7"
       x1="9.8800001"
       y1="8.5900002"
       x2="11.52"
       y2="10.23"
       gradientTransform="rotate(-0.08,-285.46385,-1454.0802)"
       gradientUnits="userSpaceOnUse">
      <stop
         offset="0"
         stop-color="#86d633"
         id="stop1" />
      <stop
         offset="1"
         stop-color="#5e9624"
         id="stop2" />
    </linearGradient>
    <linearGradient
       id="b3c2bc94-8c7c-48a2-9719-6ee899a43a97"
       x1="6.1799998"
       y1="8.5900002"
       x2="7.8099999"
       y2="10.23"
       gradientUnits="userSpaceOnUse">
      <stop
         offset="0"
         stop-color="#86d633"
         id="stop3" />
      <stop
         offset="1"
         stop-color="#5e9624"
         id="stop4" />
    </linearGradient>
    <linearGradient
       id="e900c35d-0958-4d4f-b28f-302eeaaf52f5"
       x1="2.48"
       y1="8.5900002"
       x2="4.1100001"
       y2="10.23"
       gradientUnits="userSpaceOnUse">
      <stop
         offset="0"
         stop-color="#86d633"
         id="stop5" />
      <stop
         offset="1"
         stop-color="#5e9624"
         id="stop6" />
    </linearGradient>
  </defs>
  <title
     id="title6">Icon-networking-61</title>
  <g
     id="g11"
     transform="matrix(1.390909,0,0,1.390909,0.00596068,-5.0170599)"
     style="stroke-width:0.718952">
    <circle
       cx="12.74"
       cy="8.9899998"
       r="1.16"
       fill="url(#f020fb7e-2243-4501-8153-5d69bd3c34f7)"
       id="circle6"
       style="fill:url(#f020fb7e-2243-4501-8153-5d69bd3c34f7);stroke-width:0.718952" />
    <circle
       cx="9.04"
       cy="9"
       r="1.16"
       fill="url(#b3c2bc94-8c7c-48a2-9719-6ee899a43a97)"
       id="circle7"
       style="fill:url(#b3c2bc94-8c7c-48a2-9719-6ee899a43a97);stroke-width:0.718952" />
    <circle
       cx="5.3400002"
       cy="9"
       r="1.16"
       fill="url(#e900c35d-0958-4d4f-b28f-302eeaaf52f5)"
       id="circle8"
       style="fill:url(#e900c35d-0958-4d4f-b28f-302eeaaf52f5);stroke-width:0.718952" />
    <path
       d="m 2.61,7.28 h 0.94 a 0.3,0.3 0 0 1 0.3,0.3 v 6.94 a 0.6,0.6 0 0 1 -0.6,0.6 H 2.31 V 7.58 a 0.3,0.3 0 0 1 0.3,-0.3 z"
       transform="rotate(134.92,3.0767566,11.200059)"
       fill="#50e6ff"
       id="path8"
       style="stroke-width:0.718952" />
    <path
       d="M 2.56,2.91 H 3.5 a 0.3,0.3 0 0 1 0.3,0.3 v 7.43 H 2.86 a 0.6,0.6 0 0 1 -0.6,-0.6 V 3.21 a 0.3,0.3 0 0 1 0.3,-0.3 z"
       transform="rotate(44.92,3.0235191,6.7657382)"
       fill="#1490df"
       id="path9"
       style="stroke-width:0.718952" />
    <path
       d="m 14.15,7.28 h 0.94 a 0.6,0.6 0 0 1 0.6,0.6 v 6.94 a 0.3,0.3 0 0 1 -0.3,0.3 h -0.94 a 0.3,0.3 0 0 1 -0.3,-0.3 z"
       transform="rotate(45.08,14.930414,11.202239)"
       fill="#50e6ff"
       id="path10"
       style="stroke-width:0.718952" />
    <path
       d="m 14.81,2.91 h 0.94 v 7.43 a 0.3,0.3 0 0 1 -0.3,0.3 H 14.5 a 0.3,0.3 0 0 1 -0.3,-0.3 V 3.51 a 0.6,0.6 0 0 1 0.6,-0.6 z"
       transform="rotate(135.08,14.975369,6.7703496)"
       fill="#1490df"
       id="path11"
       style="stroke-width:0.718952" />
  </g>
  <metadata
     id="metadata11">
    <rdf:RDF>
      <cc:Work
         rdf:about="">
        <dc:title>Icon-networking-61</dc:title>
      </cc:Work>
    </rdf:RDF>
  </metadata>
</svg>
