<?xml version="1.0" encoding="UTF-8" standalone="no"?>
<!-- Created with Inkscape (http://www.inkscape.org/) -->

<svg
   width="54.638386mm"
   height="70.42643mm"
   viewBox="0 0 54.638386 70.42643"
   version="1.1"
   id="svg37530"
   xmlns="http://www.w3.org/2000/svg"
   xmlns:svg="http://www.w3.org/2000/svg">
  <defs
     id="defs37527" />
  <g
     id="layer1"
     transform="translate(17.787999,-87.278329)">
    <g
       aria-label="GND"
       id="text7173"
       style="font-size:3.88056px;line-height:100%;font-family:Sans;-inkscape-font-specification:Sans;letter-spacing:0px;word-spacing:0px;stroke:#000000;stroke-width:0">
      <path
         d="m 15.099249,156.56787 v -0.32591 l 1.176674,-0.002 v 1.03077 q -0.270957,0.21601 -0.558967,0.32591 -0.288011,0.108 -0.591179,0.108 -0.409278,0 -0.744659,-0.17432 -0.333485,-0.17622 -0.504018,-0.50781 -0.170532,-0.33159 -0.170532,-0.74087 0,-0.40549 0.168638,-0.75603 0.170532,-0.35243 0.488859,-0.52296 0.318327,-0.17053 0.73329,-0.17053 0.301274,0 0.543809,0.0985 0.244429,0.0966 0.38275,0.27095 0.138321,0.17432 0.210323,0.45476 l -0.33159,0.0909 q -0.06253,-0.21222 -0.155374,-0.33349 -0.09285,-0.12127 -0.265273,-0.19327 -0.172427,-0.0739 -0.382751,-0.0739 -0.252009,0 -0.435805,0.0777 -0.183796,0.0758 -0.297484,0.20085 -0.111793,0.12506 -0.174322,0.27475 -0.106109,0.25769 -0.106109,0.55896 0,0.37139 0.126952,0.6215 0.128847,0.25011 0.373276,0.37138 0.24443,0.12127 0.519177,0.12127 0.238745,0 0.466122,-0.091 0.227376,-0.0928 0.344854,-0.19706 v -0.51728 z"
         style="font-family:sans-serif;-inkscape-font-specification:sans-serif"
         id="path135061" />
      <path
         d="m 16.814048,157.65738 v -2.77778 h 0.377066 l 1.458999,2.18092 v -2.18092 h 0.352434 v 2.77778 h -0.377066 l -1.459,-2.18282 v 2.18282 z"
         style="font-family:sans-serif;-inkscape-font-specification:sans-serif"
         id="path135063" />
      <path
         d="m 19.620253,157.65738 v -2.77778 h 0.956877 q 0.324011,0 0.494544,0.0398 0.238745,0.055 0.407383,0.19895 0.219797,0.18569 0.327801,0.4756 0.109899,0.28801 0.109899,0.65939 0,0.31643 -0.0739,0.56086 -0.0739,0.24443 -0.18948,0.40549 -0.115583,0.15916 -0.253904,0.25201 -0.136426,0.0909 -0.331591,0.13832 -0.19327,0.0474 -0.445279,0.0474 z m 0.367592,-0.3278 h 0.593074 q 0.274747,0 0.430121,-0.0512 0.157269,-0.0512 0.250114,-0.14401 0.130742,-0.13074 0.202744,-0.35054 0.0739,-0.22169 0.0739,-0.53623 0,-0.4358 -0.144005,-0.66886 -0.142111,-0.23496 -0.34675,-0.31454 -0.147795,-0.0568 -0.475596,-0.0568 h -0.5836 z"
         style="font-family:sans-serif;-inkscape-font-specification:sans-serif"
         id="path135065" />
    </g>
    <path
       style="fill:none;stroke:#000000;stroke-width:0.7;stroke-linecap:butt;stroke-linejoin:miter;stroke-miterlimit:4;stroke-dasharray:none;stroke-opacity:1"
       d="m 14.81168,152.83222 h 6"
       id="path7175" />
    <path
       id="path7177"
       style="fill:#000000;fill-opacity:1;stroke:none;stroke-width:1.04298;stroke-linecap:butt;stroke-linejoin:miter;stroke-miterlimit:4;stroke-dasharray:none;stroke-opacity:1"
       d="m 17.81168,132.83222 h 0.89999 m 0,0 c 0,-0.49703 -0.40293,-0.89996 -0.89999,-0.89996 -0.49702,0 -0.90001,0.40293 -0.90001,0.89996 0,0.49703 0.40293,0.89997 0.89995,0.89997 0.49706,0 0.90005,-0.40294 0.90005,-0.89997 z" />
    <path
       id="path7185"
       style="fill:none;fill-opacity:0.5;stroke:#000000;stroke-width:0.5;stroke-linecap:round;stroke-linejoin:round;stroke-dasharray:none"
       d="m 17.81168,91.83222 a 1,1 0 0 1 1,1 1,1 0 0 1 -1,1 1,1 0 0 1 -1,-1 1,1 0 0 1 1,-1 z" />
    <path
       id="path7189"
       style="fill:none;fill-opacity:0.5;stroke:#000000;stroke-width:0.5;stroke-linecap:round;stroke-linejoin:round;stroke-dasharray:none"
       d="m 27.81168,131.83222 a 1,1 0 0 1 1,1 1,1 0 0 1 -1,1 1,1 0 0 1 -1,-1 1,1 0 0 1 1,-1 z" />
    <path
       style="fill:none;stroke:#000000;stroke-width:0.4;stroke-linecap:butt;stroke-linejoin:miter;stroke-dasharray:none;stroke-opacity:1"
       d="m 17.81168,132.83222 h 9"
       id="path7191" />
    <g
       aria-label="+VCC"
       id="text7197"
       style="font-size:3.88056px;line-height:100%;font-family:Sans;-inkscape-font-specification:Sans;letter-spacing:0px;word-spacing:0px;stroke:#000000;stroke-width:0">
      <path
         d="m 14.633811,89.607045 v -0.761711 h -0.756027 v -0.318327 h 0.756027 V 87.77098 h 0.322117 v 0.756027 h 0.756027 v 0.318327 h -0.756027 v 0.761711 z"
         style="font-family:sans-serif;-inkscape-font-specification:sans-serif"
         id="path135035" />
      <path
         d="m 17.021265,90.056114 -1.076249,-2.777783 h 0.397909 l 0.721921,2.017967 q 0.08716,0.242535 0.1459,0.454753 0.06442,-0.227377 0.149689,-0.454753 l 0.750343,-2.017967 h 0.375171 l -1.087618,2.777783 z"
         style="font-family:sans-serif;-inkscape-font-specification:sans-serif"
         id="path135037" />
      <path
         d="m 19.99914,90.199172 0.238935,0.06035 q -0.07513,0.294358 -0.270957,0.449543 -0.194597,0.153953 -0.476638,0.153953 -0.291895,0 -0.475407,-0.118236 -0.18228,-0.119468 -0.278347,-0.344855 -0.09483,-0.225387 -0.09483,-0.484027 0,-0.282042 0.107152,-0.491418 0.108382,-0.210607 0.306674,-0.31899 0.199523,-0.109615 0.438458,-0.109615 0.270957,0 0.4557,0.137942 0.184743,0.137942 0.257409,0.387961 l -0.23524,0.05542 q -0.06281,-0.197059 -0.18228,-0.286968 -0.119467,-0.08991 -0.300516,-0.08991 -0.208144,0 -0.348549,0.09976 -0.139174,0.09976 -0.195828,0.268494 -0.05665,0.167501 -0.05665,0.346086 0,0.230314 0.06651,0.402741 0.06774,0.171195 0.209376,0.256177 0.141636,0.08498 0.306674,0.08498 0.200754,0 0.339928,-0.115772 0.139173,-0.115773 0.188438,-0.343623 z"
         style="font-size:65%;baseline-shift:sub"
         id="path135039" />
      <path
         d="m 21.82071,90.199172 0.238935,0.06035 q -0.07513,0.294358 -0.270957,0.449543 -0.194596,0.153953 -0.476638,0.153953 -0.291895,0 -0.475406,-0.118236 -0.182281,-0.119468 -0.278347,-0.344855 -0.09483,-0.225387 -0.09483,-0.484027 0,-0.282042 0.107151,-0.491418 0.108383,-0.210607 0.306674,-0.31899 0.199523,-0.109615 0.438458,-0.109615 0.270957,0 0.4557,0.137942 0.184744,0.137942 0.25741,0.387961 l -0.23524,0.05542 q -0.06281,-0.197059 -0.182281,-0.286968 -0.119467,-0.08991 -0.300516,-0.08991 -0.208144,0 -0.348549,0.09976 -0.139173,0.09976 -0.195828,0.268494 -0.05665,0.167501 -0.05665,0.346086 0,0.230314 0.06651,0.402741 0.06774,0.171195 0.209376,0.256177 0.141637,0.08498 0.306674,0.08498 0.200755,0 0.339928,-0.115772 0.139173,-0.115773 0.188438,-0.343623 z"
         style="font-size:65%;baseline-shift:sub"
         id="path135041" />
    </g>
    <g
       aria-label="Out"
       id="text7201"
       style="font-size:3.88056px;line-height:100%;font-family:Sans;-inkscape-font-specification:Sans;letter-spacing:0px;word-spacing:0px;stroke:#000000;stroke-width:0">
      <path
         d="m 30.811643,132.86916 q 0,-0.69161 0.371382,-1.08194 0.371382,-0.39222 0.958771,-0.39222 0.384646,0 0.693499,0.18379 0.308853,0.1838 0.469911,0.5135 0.162954,0.3278 0.162954,0.74465 0,0.42255 -0.170533,0.75603 -0.170532,0.33349 -0.483175,0.50591 -0.312643,0.17054 -0.674551,0.17054 -0.392224,0 -0.701077,-0.18948 -0.308853,-0.18948 -0.468017,-0.51729 -0.159164,-0.3278 -0.159164,-0.69349 z m 0.378961,0.006 q 0,0.50212 0.269063,0.79203 0.270957,0.28801 0.67834,0.28801 0.414962,0 0.682129,-0.2918 0.269063,-0.2918 0.269063,-0.82803 0,-0.33917 -0.115583,-0.59118 -0.113689,-0.2539 -0.335381,-0.39222 -0.219797,-0.14022 -0.494544,-0.14022 -0.39033,0 -0.672656,0.26906 -0.280431,0.26717 -0.280431,0.89435 z"
         style="font-family:sans-serif;-inkscape-font-specification:sans-serif"
         id="path135054" />
      <path
         d="m 35.217064,134.22205 v -0.29559 q -0.234956,0.34106 -0.638549,0.34106 -0.178112,0 -0.333486,-0.0682 -0.153479,-0.0682 -0.229271,-0.17053 -0.0739,-0.10422 -0.104214,-0.25391 -0.02084,-0.10042 -0.02084,-0.31833 v -1.24678 h 0.341065 v 1.11604 q 0,0.26717 0.02084,0.36002 0.03221,0.13453 0.136426,0.21221 0.104214,0.0758 0.257693,0.0758 0.153479,0 0.28801,-0.0777 0.134531,-0.0796 0.189481,-0.21411 0.05684,-0.13643 0.05684,-0.39412 v -1.07815 h 0.341065 v 2.01229 z"
         style="font-family:sans-serif;-inkscape-font-specification:sans-serif"
         id="path135056" />
      <path
         d="m 36.801121,133.91698 0.04926,0.30128 q -0.144005,0.0303 -0.257694,0.0303 -0.185691,0 -0.28801,-0.0587 -0.102319,-0.0587 -0.144005,-0.15347 -0.04169,-0.0966 -0.04169,-0.4036 v -1.15772 h -0.250114 v -0.26528 h 0.250114 v -0.49833 l 0.33917,-0.20464 v 0.70297 h 0.34296 v 0.26528 h -0.34296 v 1.17667 q 0,0.1459 0.01705,0.18759 0.01895,0.0417 0.05874,0.0663 0.04169,0.0246 0.117478,0.0246 0.05684,0 0.14969,-0.0133 z"
         style="font-family:sans-serif;-inkscape-font-specification:sans-serif"
         id="path135058" />
    </g>
    <g
       aria-label="A"
       id="text7205"
       style="font-size:3.88056px;line-height:100%;font-family:Sans;-inkscape-font-specification:Sans;letter-spacing:0px;word-spacing:0px;stroke:#000000;stroke-width:0">
      <path
         d="m -17.787999,109.22111 1.066775,-2.77779 h 0.396014 l 1.136883,2.77779 h -0.418752 l -0.324011,-0.8413 h -1.161515 l -0.305064,0.8413 z m 0.801503,-1.14067 h 0.941718 l -0.289906,-0.7693 q -0.132636,-0.35053 -0.197059,-0.57602 -0.05306,0.26717 -0.14969,0.53055 z"
         style="font-family:sans-serif;-inkscape-font-specification:sans-serif"
         id="path135104" />
    </g>
    <path
       style="fill:none;stroke:#000000;stroke-width:0.4;stroke-linecap:butt;stroke-linejoin:miter;stroke-dasharray:none;stroke-opacity:1"
       d="m 17.81168,132.83222 v 20"
       id="path7207" />
    <path
       id="path7209"
       d="m 19.31168,146.83222 h -3 v -9 h 3 z"
       style="fill:#ffffff;fill-opacity:1;stroke:#000000;stroke-width:0.5;stroke-linecap:butt;stroke-linejoin:miter;stroke-miterlimit:4;stroke-dasharray:none;stroke-opacity:1" />
    <path
       id="path7213"
       style="fill:none;fill-opacity:0.5;stroke:#000000;stroke-width:0.5;stroke-linecap:round;stroke-linejoin:round;stroke-dasharray:none"
       d="m -12.18832,106.83222 a 1,1 0 0 1 1,1 1,1 0 0 1 -1,1 1,1 0 0 1 -1,-1 1,1 0 0 1 1,-1 z" />
    <g
       aria-label="10k"
       id="text7217"
       style="font-size:3.175px;line-height:100%;font-family:Sans;-inkscape-font-specification:Sans;letter-spacing:0px;word-spacing:0px;stroke:#000000;stroke-width:0">
      <path
         d="M 1.6488504,103.79346 H 1.3697977 v -1.77819 q -0.1007691,0.0961 -0.2651001,0.19224 -0.1627808,0.0961 -0.29300541,0.14417 v -0.26975 q 0.23409421,-0.11007 0.40927731,-0.26665 0.1751831,-0.15658 0.2480469,-0.30385 h 0.179834 z"
         style="font-family:sans-serif;-inkscape-font-specification:sans-serif"
         id="path135092" />
      <path
         d="m 2.3635354,102.6726 q 0,-0.40308 0.082166,-0.64803 0.083716,-0.24649 0.2464965,-0.37982 0.1643311,-0.13332 0.412378,-0.13332 0.1829345,0 0.3209106,0.0744 0.1379761,0.0729 0.2278931,0.21239 0.089917,0.13798 0.1410766,0.33796 0.05116,0.19844 0.05116,0.53641 0,0.39997 -0.082165,0.64647 -0.082166,0.24494 -0.2464966,0.37982 -0.1627808,0.13332 -0.4123779,0.13332 -0.3286621,0 -0.5162476,-0.23564 -0.2247925,-0.2837 -0.2247925,-0.92397 z m 0.2868042,0 q 0,0.55965 0.1302246,0.74569 0.1317749,0.18448 0.3240113,0.18448 0.1922363,0 0.3224609,-0.18603 0.1317749,-0.18604 0.1317749,-0.74414 0,-0.56121 -0.1317749,-0.7457 -0.1302246,-0.18448 -0.3255615,-0.18448 -0.1922364,0 -0.306958,0.16278 -0.1441773,0.20774 -0.1441773,0.7674 z"
         style="font-family:sans-serif;-inkscape-font-specification:sans-serif"
         id="path135094" />
      <path
         d="m 4.208384,103.79346 v -2.27273 h 0.2790528 v 1.29604 l 0.6604248,-0.66972 h 0.3612182 l -0.6294189,0.61081 0.6929809,1.0356 h -0.344165 l -0.5441528,-0.84181 -0.1968872,0.18913 v 0.65268 z"
         style="font-family:sans-serif;-inkscape-font-specification:sans-serif"
         id="path135096" />
    </g>
    <g
       aria-label="R1"
       id="text7221"
       style="font-size:3.88056px;line-height:100%;font-family:Sans;-inkscape-font-specification:Sans;letter-spacing:0px;word-spacing:0px;stroke:#000000;stroke-width:0">
      <path
         d="m -5.1883103,103.83222 v -2.77778 h 1.231623 q 0.3713817,0 0.5646518,0.0758 0.1932701,0.0739 0.3088531,0.26338 0.1155831,0.18948 0.1155831,0.41875 0,0.29559 -0.1913752,0.49833 -0.1913753,0.20275 -0.5911791,0.2577 0.1459,0.0701 0.2216922,0.13832 0.1610583,0.14779 0.3050635,0.36948 l 0.4831752,0.75603 h -0.4623324 l -0.3675921,-0.57791 q -0.1610583,-0.25012 -0.2652726,-0.38275 -0.1042143,-0.13264 -0.1875857,-0.18569 -0.081477,-0.0531 -0.1667428,-0.0739 -0.062528,-0.0133 -0.2046389,-0.0133 h -0.426331 v 1.23352 z m 0.3675921,-1.55184 h 0.7901335 q 0.252009,0 0.3941194,-0.0512 0.1421103,-0.0531 0.2160077,-0.16675 0.073897,-0.11558 0.073897,-0.25011 0,-0.19706 -0.1440052,-0.32401 -0.1421103,-0.12695 -0.4509635,-0.12695 h -0.8791893 z"
         style="font-family:sans-serif;-inkscape-font-specification:sans-serif"
         id="path135099" />
      <path
         d="m -1.2452218,103.83222 h -0.3410649 v -2.17334 q -0.1231623,0.11748 -0.3240116,0.23496 -0.1989545,0.11747 -0.358118,0.17621 v -0.32969 q 0.2861155,-0.13453 0.5002284,-0.32591 0.2141129,-0.19137 0.3031687,-0.37138 h 0.2197974 z"
         style="font-family:sans-serif;-inkscape-font-specification:sans-serif"
         id="path135101" />
    </g>
    <g
       aria-label="T1"
       id="text7225"
       style="font-size:3.88056px;line-height:100%;font-family:Sans;-inkscape-font-specification:Sans;letter-spacing:0px;word-spacing:0px;stroke:#000000;stroke-width:0">
      <path
         d="m 24.726879,108.83222 v -2.44998 h -0.915191 v -0.3278 h 2.201763 v 0.3278 h -0.91898 v 2.44998 z"
         style="font-family:sans-serif;-inkscape-font-specification:sans-serif"
         id="path135049" />
      <path
         d="m 27.536874,108.83222 h -0.341065 v -2.17334 q -0.123162,0.11748 -0.324011,0.23496 -0.198955,0.11747 -0.358118,0.17621 v -0.32969 q 0.286115,-0.13453 0.500228,-0.32591 0.214113,-0.19137 0.303169,-0.37138 h 0.219797 z"
         style="font-family:sans-serif;-inkscape-font-specification:sans-serif"
         id="path135051" />
    </g>
    <g
       aria-label="R3"
       id="text7229"
       style="font-size:3.88056px;line-height:100%;font-family:Sans;-inkscape-font-specification:Sans;letter-spacing:0px;word-spacing:0px;stroke:#000000;stroke-width:0">
      <path
         d="m 9.3323806,141.62137 v -2.77779 h 1.2316234 q 0.371381,0 0.564651,0.0758 0.19327,0.0739 0.308854,0.26337 0.115583,0.18949 0.115583,0.41876 0,0.29559 -0.191376,0.49833 -0.191375,0.20274 -0.591179,0.25769 0.1459,0.0701 0.221692,0.13832 0.161059,0.1478 0.305064,0.36949 l 0.483175,0.75603 h -0.462332 l -0.367592,-0.57792 q -0.161059,-0.25011 -0.265273,-0.38275 -0.104214,-0.13263 -0.187586,-0.18569 -0.08148,-0.053 -0.166742,-0.0739 -0.06253,-0.0133 -0.204639,-0.0133 H 9.6999727 v 1.23352 z m 0.3675921,-1.55185 h 0.7901333 q 0.252009,0 0.39412,-0.0512 0.14211,-0.0531 0.216007,-0.16674 0.0739,-0.11558 0.0739,-0.25011 0,-0.19706 -0.144005,-0.32401 -0.142111,-0.12696 -0.450964,-0.12696 H 9.6999727 Z"
         style="font-family:sans-serif;-inkscape-font-specification:sans-serif"
         id="path135075" />
      <path
         d="m 11.992686,140.88808 0.341065,-0.0455 q 0.05874,0.28991 0.198955,0.41876 0.14211,0.12695 0.344854,0.12695 0.24064,0 0.405488,-0.16675 0.166743,-0.16674 0.166743,-0.41306 0,-0.23496 -0.153479,-0.38654 -0.153479,-0.15348 -0.39033,-0.15348 -0.09663,0 -0.24064,0.0379 l 0.0379,-0.29938 q 0.03411,0.004 0.05495,0.004 0.217903,0 0.392225,-0.11368 0.174322,-0.11369 0.174322,-0.35054 0,-0.18759 -0.126952,-0.31075 -0.126952,-0.12316 -0.327801,-0.12316 -0.198955,0 -0.331591,0.12505 -0.132636,0.12506 -0.170532,0.37518 l -0.341065,-0.0606 q 0.06253,-0.34296 0.284221,-0.53054 0.221692,-0.18948 0.551388,-0.18948 0.227376,0 0.418751,0.0985 0.191376,0.0966 0.2918,0.26527 0.10232,0.16864 0.10232,0.35812 0,0.18 -0.09664,0.3278 -0.09663,0.14779 -0.286116,0.23495 0.246325,0.0568 0.382751,0.23685 0.136426,0.17812 0.136426,0.44718 0,0.3638 -0.265273,0.6177 -0.265273,0.25201 -0.670761,0.25201 -0.365697,0 -0.608232,-0.2179 -0.24064,-0.2179 -0.274747,-0.56465 z"
         style="font-family:sans-serif;-inkscape-font-specification:sans-serif"
         id="path135077" />
    </g>
    <g
       aria-label="10k"
       id="text7233"
       style="font-size:3.175px;line-height:100%;font-family:Sans;-inkscape-font-specification:Sans;letter-spacing:0px;word-spacing:0px;stroke:#000000;stroke-width:0">
      <path
         d="M 9.8878639,145.79346 H 9.6088112 v -1.77819 q -0.1007691,0.0961 -0.2651001,0.19224 -0.1627808,0.0961 -0.2930054,0.14417 v -0.26975 q 0.2340942,-0.11007 0.4092774,-0.26665 0.1751831,-0.15658 0.2480468,-0.30385 h 0.179834 z"
         style="font-family:sans-serif;-inkscape-font-specification:sans-serif"
         id="path135068" />
      <path
         d="m 10.602549,144.6726 q 0,-0.40308 0.08216,-0.64803 0.08372,-0.24649 0.246497,-0.37982 0.164331,-0.13332 0.412378,-0.13332 0.182935,0 0.320911,0.0744 0.137976,0.0729 0.227893,0.21239 0.08992,0.13798 0.141076,0.33796 0.05116,0.19844 0.05116,0.53641 0,0.39997 -0.08217,0.64647 -0.08216,0.24494 -0.246496,0.37982 -0.162781,0.13332 -0.412378,0.13332 -0.328662,0 -0.516248,-0.23564 -0.224792,-0.2837 -0.224792,-0.92397 z m 0.286804,0 q 0,0.55965 0.130225,0.74569 0.131775,0.18448 0.324011,0.18448 0.192236,0 0.322461,-0.18603 0.131775,-0.18604 0.131775,-0.74414 0,-0.56121 -0.131775,-0.7457 -0.130225,-0.18448 -0.325562,-0.18448 -0.192236,0 -0.306958,0.16278 -0.144177,0.20774 -0.144177,0.7674 z"
         style="font-family:sans-serif;-inkscape-font-specification:sans-serif"
         id="path135070" />
      <path
         d="m 12.447398,145.79346 v -2.27273 h 0.279052 v 1.29604 l 0.660425,-0.66972 h 0.361218 l -0.629419,0.61081 0.692981,1.0356 H 13.46749 l -0.544153,-0.84181 -0.196887,0.18913 v 0.65268 z"
         style="font-family:sans-serif;-inkscape-font-specification:sans-serif"
         id="path135072" />
    </g>
    <path
       style="fill:#000000;fill-opacity:1;stroke:none;stroke-width:0.264583px;stroke-linecap:butt;stroke-linejoin:miter;stroke-opacity:1"
       d="m 24.81168,90.83222 c -2,0 -3,1 -4,2 1,1 2,2 4,2 h 7 v -4 z"
       id="path7239" />
    <path
       style="fill:#000000;fill-opacity:0.25;stroke:none;stroke-width:0.264583px;stroke-linecap:butt;stroke-linejoin:miter;stroke-opacity:1"
       d="m 23.81168,91.83222 1,-1 h 6 v 4 h -6 l -1,-1 z"
       id="path7241" />
    <g
       aria-label="5V"
       id="text7245"
       style="font-size:3.175px;line-height:100%;font-family:Sans;-inkscape-font-specification:Sans;letter-spacing:0px;word-spacing:0px;fill:#ffffff;stroke:#000000;stroke-width:0">
      <path
         d="m 25.442014,93.364735 0.434082,-0.04496 q 0.0186,0.147278 0.110071,0.234094 0.09147,0.08527 0.21084,0.08527 0.136426,0 0.230994,-0.110071 0.09457,-0.111621 0.09457,-0.334863 0,-0.209289 -0.09457,-0.313159 -0.09302,-0.10542 -0.243396,-0.10542 -0.187586,0 -0.336414,0.165881 l -0.353467,-0.05116 0.223242,-1.182874 h 1.151868 v 0.407727 h -0.821655 l -0.06821,0.386023 q 0.145727,-0.07286 0.297656,-0.07286 0.289905,0 0.491443,0.21084 0.201538,0.21084 0.201538,0.547254 0,0.280603 -0.162781,0.500744 -0.221691,0.300757 -0.615466,0.300757 -0.314709,0 -0.513147,-0.168982 -0.198437,-0.168982 -0.237195,-0.454236 z"
         style="font-weight:bold;font-family:sans-serif;-inkscape-font-specification:'sans-serif Bold'"
         id="path135044" />
      <path
         d="m 27.877525,93.949196 -0.812354,-2.27273 h 0.497644 l 0.575159,1.682068 0.556555,-1.682068 h 0.486792 l -0.813904,2.27273 z"
         style="font-weight:bold;font-family:sans-serif;-inkscape-font-specification:'sans-serif Bold'"
         id="path135046" />
    </g>
    <g
       aria-label="B"
       id="text7265"
       style="font-size:3.88056px;line-height:100%;font-family:Sans;-inkscape-font-specification:Sans;letter-spacing:0px;word-spacing:0px;stroke:#000000;stroke-width:0">
      <path
         d="m -17.285874,124.22111 v -2.77779 h 1.042142 q 0.318327,0 0.509703,0.0853 0.19327,0.0834 0.301274,0.25959 0.109898,0.17432 0.109898,0.3657 0,0.17811 -0.09663,0.33538 -0.09663,0.15726 -0.2918,0.2539 0.252009,0.0739 0.38654,0.25201 0.136426,0.17811 0.136426,0.42065 0,0.19516 -0.08337,0.3638 -0.08148,0.16674 -0.202744,0.25769 -0.121268,0.0909 -0.305064,0.13832 -0.181901,0.0455 -0.447174,0.0455 z m 0.367592,-1.61059 h 0.600653 q 0.24443,0 0.350539,-0.0322 0.140215,-0.0417 0.210323,-0.13832 0.072,-0.0966 0.072,-0.24253 0,-0.13832 -0.06632,-0.24254 -0.06632,-0.10611 -0.18948,-0.144 -0.123162,-0.0398 -0.422542,-0.0398 h -0.555177 z m 0,1.28279 h 0.691603 q 0.178112,0 0.250115,-0.0133 0.126952,-0.0227 0.212218,-0.0758 0.08527,-0.053 0.140215,-0.15348 0.05495,-0.10232 0.05495,-0.23495 0,-0.15538 -0.07958,-0.26907 -0.07958,-0.11558 -0.221692,-0.16106 -0.140216,-0.0474 -0.405488,-0.0474 h -0.642339 z"
         style="font-family:sans-serif;-inkscape-font-specification:sans-serif"
         id="path135107" />
    </g>
    <path
       id="path7267"
       style="fill:none;fill-opacity:0.5;stroke:#000000;stroke-width:0.5;stroke-linecap:round;stroke-linejoin:round;stroke-dasharray:none"
       d="m -12.18832,121.83222 a 1,1 0 0 1 1,1 1,1 0 0 1 -1,1 1,1 0 0 1 -1,-1 1,1 0 0 1 1,-1 z" />
    <g
       aria-label="10k"
       id="text7271"
       style="font-size:3.175px;line-height:100%;font-family:Sans;-inkscape-font-specification:Sans;letter-spacing:0px;word-spacing:0px;stroke:#000000;stroke-width:0">
      <path
         d="M 1.6488504,118.79346 H 1.3697977 v -1.77819 q -0.1007691,0.0961 -0.2651001,0.19224 -0.1627808,0.0961 -0.29300541,0.14417 v -0.26975 q 0.23409421,-0.11007 0.40927731,-0.26665 0.1751831,-0.15658 0.2480469,-0.30385 h 0.179834 z"
         style="font-family:sans-serif;-inkscape-font-specification:sans-serif"
         id="path135080" />
      <path
         d="m 2.3635354,117.6726 q 0,-0.40308 0.082166,-0.64803 0.083716,-0.24649 0.2464965,-0.37982 0.1643311,-0.13332 0.412378,-0.13332 0.1829345,0 0.3209106,0.0744 0.1379761,0.0729 0.2278931,0.21239 0.089917,0.13798 0.1410766,0.33796 0.05116,0.19844 0.05116,0.53641 0,0.39997 -0.082165,0.64647 -0.082166,0.24494 -0.2464966,0.37982 -0.1627808,0.13332 -0.4123779,0.13332 -0.3286621,0 -0.5162476,-0.23564 -0.2247925,-0.2837 -0.2247925,-0.92397 z m 0.2868042,0 q 0,0.55965 0.1302246,0.74569 0.1317749,0.18448 0.3240113,0.18448 0.1922363,0 0.3224609,-0.18603 0.1317749,-0.18604 0.1317749,-0.74414 0,-0.56121 -0.1317749,-0.7457 -0.1302246,-0.18448 -0.3255615,-0.18448 -0.1922364,0 -0.306958,0.16278 -0.1441773,0.20774 -0.1441773,0.7674 z"
         style="font-family:sans-serif;-inkscape-font-specification:sans-serif"
         id="path135082" />
      <path
         d="m 4.208384,118.79346 v -2.27273 h 0.2790528 v 1.29604 l 0.6604248,-0.66972 h 0.3612182 l -0.6294189,0.61081 0.6929809,1.0356 h -0.344165 l -0.5441528,-0.84181 -0.1968872,0.18913 v 0.65268 z"
         style="font-family:sans-serif;-inkscape-font-specification:sans-serif"
         id="path135084" />
    </g>
    <g
       aria-label="R2"
       id="text7275"
       style="font-size:3.88056px;line-height:100%;font-family:Sans;-inkscape-font-specification:Sans;letter-spacing:0px;word-spacing:0px;stroke:#000000;stroke-width:0">
      <path
         d="m -5.1883103,118.83222 v -2.77778 h 1.231623 q 0.3713817,0 0.5646518,0.0758 0.1932701,0.0739 0.3088531,0.26338 0.1155831,0.18948 0.1155831,0.41875 0,0.29559 -0.1913752,0.49833 -0.1913753,0.20275 -0.5911791,0.2577 0.1459,0.0701 0.2216922,0.13832 0.1610583,0.14779 0.3050635,0.36948 l 0.4831752,0.75603 h -0.4623324 l -0.3675921,-0.57791 q -0.1610583,-0.25012 -0.2652726,-0.38275 -0.1042143,-0.13264 -0.1875857,-0.18569 -0.081477,-0.0531 -0.1667428,-0.0739 -0.062528,-0.0133 -0.2046389,-0.0133 h -0.426331 v 1.23352 z m 0.3675921,-1.55184 h 0.7901335 q 0.252009,0 0.3941194,-0.0512 0.1421103,-0.0531 0.2160077,-0.16675 0.073897,-0.11558 0.073897,-0.25011 0,-0.19706 -0.1440052,-0.32401 -0.1421103,-0.12695 -0.4509635,-0.12695 h -0.8791893 z"
         style="font-family:sans-serif;-inkscape-font-specification:sans-serif"
         id="path135087" />
      <path
         d="m -0.73741419,118.50442 v 0.3278 H -2.5734799 q -0.00379,-0.12316 0.039791,-0.23685 0.070108,-0.18758 0.2235869,-0.36949 0.155374,-0.1819 0.4471739,-0.42064 0.4528584,-0.37138 0.6120219,-0.58739 0.1591636,-0.2179 0.1591636,-0.41117 0,-0.20275 -0.1458999,-0.34107 -0.1440052,-0.14021 -0.3770661,-0.14021 -0.2463246,0 -0.3941194,0.14779 -0.1477948,0.14779 -0.1496896,0.40928 l -0.3505388,-0.036 q 0.036001,-0.39223 0.270957,-0.59687 0.2349558,-0.20653 0.63097,-0.20653 0.3998038,0 0.63286473,0.22169 0.23306097,0.22169 0.23306097,0.5495 0,0.16674 -0.068213,0.3278 -0.068213,0.16105 -0.22737653,0.33917 -0.1572688,0.17811 -0.5248609,0.48886 -0.3069584,0.25769 -0.3941194,0.35053 -0.087161,0.091 -0.1440051,0.1838 z"
         style="font-family:sans-serif;-inkscape-font-specification:sans-serif"
         id="path135089" />
    </g>
    <text
       id="text7279"
       y="123.83222"
       x="23.720737"
       style="font-style:normal;font-variant:normal;font-weight:normal;font-stretch:normal;font-size:3.88056px;line-height:100%;font-family:Sans;-inkscape-font-specification:Sans;text-align:start;letter-spacing:0px;word-spacing:0px;writing-mode:lr-tb;text-anchor:start;fill:#000000;fill-opacity:1;stroke:#000000;stroke-width:0;stroke-miterlimit:4;stroke-dasharray:none;stroke-opacity:1"
       xml:space="preserve"><tspan
         style="font-style:normal;font-variant:normal;font-weight:normal;font-stretch:normal;font-size:3.88056px;font-family:sans-serif;-inkscape-font-specification:sans-serif;text-align:start;writing-mode:lr-tb;text-anchor:start;stroke-width:0;stroke-miterlimit:4;stroke-dasharray:none"
         y="123.83222"
         x="23.720737"
         id="tspan7277">T2</tspan></text>
    <circle
       style="fill:none;stroke:#000000;stroke-width:0.5;stroke-linecap:round;stroke-linejoin:round;stroke-dasharray:none;stroke-opacity:1"
       id="circle10377"
       cx="16.187046"
       cy="-107.83222"
       r="5.6246567"
       transform="scale(1,-1)" />
    <path
       style="fill:none;stroke:#000000;stroke-width:0.4;stroke-linecap:butt;stroke-linejoin:miter;stroke-dasharray:none;stroke-opacity:1"
       d="m 13.81168,111.83222 v -8"
       id="path10379" />
    <path
       style="fill:none;stroke:#000000;stroke-width:0.4;stroke-linecap:butt;stroke-linejoin:miter;stroke-dasharray:none;stroke-opacity:1"
       d="m 13.81168,107.83222 h -25"
       id="path10381" />
    <path
       style="fill:none;stroke:#000000;stroke-width:0.4;stroke-linecap:butt;stroke-linejoin:miter;stroke-dasharray:none;stroke-opacity:1"
       d="m 13.81168,109.83222 4,3 v 3"
       id="path10383" />
    <path
       style="fill:none;stroke:#000000;stroke-width:0.4;stroke-linecap:butt;stroke-linejoin:miter;stroke-dasharray:none;stroke-opacity:1"
       d="m 13.81168,105.83222 4,-3 v -9"
       id="path10385" />
    <path
       style="fill:#000000;fill-opacity:1;stroke:none;stroke-width:0.264583px;stroke-linecap:butt;stroke-linejoin:miter;stroke-opacity:1"
       d="m 15.8705,105.55053 -1.19889,-1.60083 -0.84159,1.87963 z"
       id="path10387" />
    <path
       id="path7169"
       d="m 3.81168,106.33222 v 3 h -9 v -3 z"
       style="fill:#ffffff;fill-opacity:1;stroke:#000000;stroke-width:0.5;stroke-linecap:butt;stroke-linejoin:miter;stroke-miterlimit:4;stroke-dasharray:none;stroke-opacity:1" />
    <circle
       style="fill:none;stroke:#000000;stroke-width:0.5;stroke-linecap:round;stroke-linejoin:round;stroke-dasharray:none;stroke-opacity:1"
       id="circle10391"
       cx="16.187046"
       cy="-122.83222"
       r="5.6246567"
       transform="scale(1,-1)" />
    <path
       style="fill:none;stroke:#000000;stroke-width:0.4;stroke-linecap:butt;stroke-linejoin:miter;stroke-dasharray:none;stroke-opacity:1"
       d="m 13.81168,126.83222 v -8"
       id="path10393" />
    <path
       style="fill:none;stroke:#000000;stroke-width:0.4;stroke-linecap:butt;stroke-linejoin:miter;stroke-dasharray:none;stroke-opacity:1"
       d="m 13.81168,122.83222 h -25"
       id="path10395" />
    <path
       style="fill:none;stroke:#000000;stroke-width:0.4;stroke-linecap:butt;stroke-linejoin:miter;stroke-dasharray:none;stroke-opacity:1"
       d="m 13.81168,124.83222 4,3 v 5"
       id="path10397" />
    <path
       style="fill:none;stroke:#000000;stroke-width:0.4;stroke-linecap:butt;stroke-linejoin:miter;stroke-dasharray:none;stroke-opacity:1"
       d="m 13.81168,120.83222 4,-3 v -3"
       id="path10399" />
    <path
       style="fill:#000000;fill-opacity:1;stroke:none;stroke-width:0.264583px;stroke-linecap:butt;stroke-linejoin:miter;stroke-opacity:1"
       d="m 15.8705,120.55053 -1.19889,-1.60083 -0.84159,1.87963 z"
       id="path10401" />
    <path
       id="path7261"
       d="m 3.81168,121.33222 v 3 h -9 v -3 z"
       style="fill:#ffffff;fill-opacity:1;stroke:#000000;stroke-width:0.5;stroke-linecap:butt;stroke-linejoin:miter;stroke-miterlimit:4;stroke-dasharray:none;stroke-opacity:1" />
  </g>
</svg>
