1317400825.556342 0.0000000 0.0000000 0.0000000 0.0000000 0.0000000 0.0000000 1.0000000
1317400825.971968 -0.0033968 -0.0001741 0.0370046 0.0010042 -0.0152473 -0.0008456 0.9998829
1317400826.387216 -0.0118402 -0.0006191 0.0866076 0.0021729 -0.0452643 -0.0001094 0.9989727
1317400826.802217 -0.0302833 -0.0023476 0.1495635 0.0041478 -0.0914129 -0.0035259 0.9957982
1317400827.217091 -0.0612594 -0.0041620 0.2202425 0.0047285 -0.1520784 -0.0076308 0.9883277
1317400827.528093 -0.0924789 -0.0048484 0.2736986 0.0048358 -0.2047798 -0.0117234 0.9787259
1317400827.735467 -0.1173722 -0.0049801 0.3096894 0.0048629 -0.2433046 -0.0100040 0.9698861
1317400827.942844 -0.1463240 -0.0059454 0.3445843 0.0033792 -0.2869151 -0.0082116 0.9579148
1317400828.149971 -0.1832583 -0.0067370 0.3772433 0.0024020 -0.3361388 -0.0127581 0.9417230
1317400828.460968 -0.2483135 -0.0072665 0.4251569 -0.0002241 -0.4149663 -0.0075405 0.9098055
1317400828.668343 -0.3012194 -0.0070804 0.4535112 -0.0030591 -0.4674672 -0.0063173 0.8839825
1317400829.083220 -0.4315061 -0.0060568 0.4964684 -0.0073465 -0.5705522 -0.0071968 0.8211969
1317400829.394596 -0.5488904 -0.0057464 0.5142844 -0.0125678 -0.6367682 -0.0063698 0.7709266
1317400829.706600 -0.6820682 -0.0032037 0.5163012 -0.0098251 -0.6851219 -0.0083736 0.7283140
1317400829.914845 -0.7787139 -0.0017658 0.5123148 -0.0082053 -0.7087944 -0.0060588 0.7053413
1317400830.123230 -0.8824412 -0.0003650 0.5040674 -0.0062700 -0.7253544 -0.0049781 0.6883290
1317400830.331972 -0.9936761 0.0015610 0.4930848 -0.0063265 -0.7352865 -0.0045291 0.6777118
1317400830.540596 -1.1113706 0.0018890 0.4794597 -0.0064037 -0.7407880 -0.0063921 0.6716780
1317400830.749224 -1.2358141 0.0036391 0.4658009 -0.0075909 -0.7426977 -0.0061560 0.6695556
1317400830.957847 -1.3659358 0.0048250 0.4524462 -0.0097733 -0.7418680 -0.0074068 0.6704339
1317400831.166352 -1.5009478 0.0062525 0.4381190 -0.0075048 -0.7407693 -0.0079616 0.6716704
1317400831.374721 -1.6442467 0.0089101 0.4239360 -0.0083161 -0.7396724 -0.0089022 0.6728568
1317400831.687226 -1.8706334 0.0124326 0.4018911 -0.0089425 -0.7377868 -0.0117250 0.6748727
1317400831.999472 -2.1071563 0.0163337 0.3803874 -0.0082587 -0.7361590 -0.0116618 0.6766577
1317400832.207601 -2.2701528 0.0192363 0.3667380 -0.0106586 -0.7354332 -0.0118127 0.6774104
1317400832.415720 -2.4329145 0.0213375 0.3526365 -0.0073749 -0.7351409 -0.0067670 0.6778405
1317400832.727720 -2.6873364 0.0234687 0.3314958 -0.0099747 -0.7353815 -0.0066473 0.6775473
1317400832.935600 -2.8586049 0.0247766 0.3159926 -0.0130513 -0.7354704 -0.0127042 0.6773121
1317400833.247473 -3.1154668 0.0285566 0.2932095 -0.0103515 -0.7359151 -0.0112734 0.6769007
1317400833.455347 -3.2875359 0.0310528 0.2772692 -0.0106229 -0.7358782 -0.0136046 0.6768939
1317400833.663347 -3.4558911 0.0328963 0.2626783 -0.0079557 -0.7357754 -0.0117226 0.6770774
1317400833.975222 -3.7106240 0.0358127 0.2400619 -0.0076312 -0.7352787 -0.0112955 0.6776277
1317400834.287100 -3.9623866 0.0396287 0.2196194 -0.0124584 -0.7350072 -0.0160039 0.6777559
1317400834.599101 -4.2149453 0.0449556 0.1980346 -0.0092645 -0.7347995 -0.0128357 0.6780996
1317400835.014849 -4.5481701 0.0474809 0.1686104 -0.0053308 -0.7355980 -0.0098332 0.6773260
1317400835.430598 -4.8803725 0.0498820 0.1403810 -0.0126080 -0.7378827 -0.0107485 0.6747256
1317400835.846347 -5.2022414 0.0527280 0.1066536 -0.0048445 -0.7395336 -0.0118235 0.6729984
1317400836.365974 -5.5906916 0.0565178 0.0673956 -0.0058397 -0.7410582 -0.0136837 0.6712759
1317400836.677723 -5.8194470 0.0592235 0.0434901 -0.0092942 -0.7413435 -0.0166685 0.6708544
1317400837.405475 -6.3215280 0.0640763 -0.0079120 -0.0045867 -0.7391363 -0.0141431 0.6733918
1317400837.717724 -6.5122561 0.0658049 -0.0243403 -0.0065107 -0.7317240 -0.0151231 0.6814022
1317400838.447475 -6.8980227 0.0718541 -0.0182123 -0.0067127 -0.6762367 -0.0171639 0.7364538
1317400839.073976 -7.1552882 0.0725110 0.0618246 -0.0115660 -0.5666865 -0.0068028 0.8238242
1317400839.491479 -7.3012710 0.0753553 0.1604831 -0.0152509 -0.4726073 0.0005502 0.8811410
1317400839.908486 -7.4202986 0.0759922 0.2854381 -0.0073847 -0.3734113 0.0078581 0.9276032
1317400840.221225 -7.4986873 0.0768575 0.4046848 0.0001490 -0.2899162 0.0076367 0.9570215
1317400840.429478 -7.5451651 0.0757469 0.4991777 0.0011891 -0.2354973 0.0056555 0.9718578
1317400840.637476 -7.5866570 0.0746567 0.6032274 0.0027433 -0.1894478 -0.0001005 0.9818869
1317400840.845106 -7.6234879 0.0727050 0.7176528 0.0012227 -0.1545565 -0.0027380 0.9879794
1317400841.052480 -7.6554217 0.0717289 0.8405886 -0.0006900 -0.1312200 -0.0023401 0.9913503
1317400841.259982 -7.6872778 0.0712283 0.9714856 -0.0024091 -0.1139919 -0.0056505 0.9934627
1317400841.467354 -7.7157521 0.0706939 1.1091493 -0.0028392 -0.1008126 -0.0069488 0.9948771
1317400841.674854 -7.7417607 0.0705112 1.2530247 -0.0030290 -0.0864027 -0.0072423 0.9962294
1317400841.882481 -7.7648010 0.0691076 1.4033092 -0.0019375 -0.0727878 -0.0083493 0.9973106
1317400842.193853 -7.7944813 0.0668779 1.6412147 0.0037753 -0.0584235 -0.0082669 0.9982505
1317400842.401486 -7.8141866 0.0644314 1.8048415 -0.0033451 -0.0524428 -0.0112399 0.9985551
1317400842.712730 -7.8387771 0.0621671 2.0491383 -0.0042491 -0.0472537 -0.0108248 0.9988152
1317400843.024236 -7.8610420 0.0609712 2.2928474 -0.0073761 -0.0430146 -0.0083179 0.9990126
1317400843.335727 -7.8821645 0.0587855 2.5308089 0.0018691 -0.0399034 -0.0098495 0.9991533
1317400843.543352 -7.8951664 0.0558335 2.6882925 0.0030648 -0.0381737 -0.0109347 0.9992066
1317400843.854854 -7.9146476 0.0517893 2.9277453 -0.0021885 -0.0346832 -0.0129813 0.9993116
1317400844.166478 -7.9305053 0.0477705 3.1628399 -0.0014808 -0.0330136 -0.0104166 0.9993995
1317400844.374104 -7.9401455 0.0462183 3.3199549 -0.0008426 -0.0324583 -0.0087979 0.9994340
1317400844.685727 -7.9573445 0.0431609 3.5600376 -0.0007819 -0.0328086 -0.0101999 0.9994093
1317400844.997227 -7.9760313 0.0400421 3.8066280 -0.0007176 -0.0368995 -0.0115619 0.9992518
1317400845.204854 -7.9908257 0.0377987 3.9725976 0.0036178 -0.0393762 -0.0122332 0.9991430
1317400845.516479 -8.0137186 0.0332024 4.2248802 0.0032086 -0.0424509 -0.0114049 0.9990283
1317400845.828235 -8.0369225 0.0299010 4.4805098 -0.0017858 -0.0445928 -0.0102219 0.9989514
1317400846.139985 -8.0611315 0.0275643 4.7434382 -0.0021385 -0.0423567 -0.0117057 0.9990317
1317400846.451733 -8.0818310 0.0245240 5.0081820 -0.0002770 -0.0398878 -0.0080260 0.9991719
1317400846.763485 -8.1023636 0.0211504 5.2725959 -0.0029237 -0.0385989 -0.0054030 0.9992359
1317400847.075356 -8.1230946 0.0166687 5.5303664 0.0043033 -0.0373791 -0.0081423 0.9992587
1317400847.387108 -8.1434145 0.0106957 5.7866402 0.0049088 -0.0364164 -0.0090407 0.9992837
1317400847.698859 -8.1621714 0.0045587 6.0382605 -0.0026937 -0.0387087 -0.0069061 0.9992231
1317400848.010732 -8.1822567 0.0003425 6.2842855 0.0009770 -0.0425250 -0.0045149 0.9990847
1317400848.322482 -8.2058401 -0.0055378 6.5234146 0.0063103 -0.0479534 -0.0066435 0.9988075
1317400848.634357 -8.2330942 -0.0115568 6.7599654 0.0028364 -0.0532276 -0.0122918 0.9985027
1317400848.842107 -8.2510529 -0.0139885 6.9164972 -0.0015555 -0.0579670 -0.0124024 0.9982402
1317400849.050107 -8.2714376 -0.0158805 7.0689874 -0.0038804 -0.0640888 -0.0109133 0.9978770
1317400849.257859 -8.2945318 -0.0177120 7.2188439 -0.0030203 -0.0702569 -0.0136831 0.9974305
1317400849.569731 -8.3307953 -0.0205760 7.4397941 0.0009795 -0.0789904 -0.0147090 0.9967664
1317400849.777606 -8.3566341 -0.0214660 7.5858774 -0.0032767 -0.0845585 -0.0158314 0.9962873
1317400850.089359 -8.3966475 -0.0239064 7.8008065 0.0010615 -0.0957513 -0.0133196 0.9953156
1317400850.400984 -8.4431343 -0.0271648 8.0124502 -0.0025823 -0.1117609 -0.0114553 0.9936658
1317400850.712609 -8.4977894 -0.0290769 8.2174902 -0.0055210 -0.1291730 -0.0138795 0.9915096
1317400851.128110 -8.5802326 -0.0307961 8.4847317 -0.0045361 -0.1538614 -0.0125481 0.9880024
1317400851.335885 -8.6263933 -0.0313066 8.6173964 -0.0062957 -0.1666147 -0.0109837 0.9859408
1317400851.751610 -8.7269058 -0.0335475 8.8782501 0.0030351 -0.1849727 -0.0075539 0.9827099
1317400851.959482 -8.7813702 -0.0362214 9.0088072 0.0022930 -0.1932676 -0.0100494 0.9810919
1317400852.271236 -8.8680153 -0.0381818 9.2055502 -0.0077021 -0.2041558 -0.0142728 0.9788041
1317400852.479242 -8.9282131 -0.0381876 9.3335600 -0.0016057 -0.2100811 -0.0171812 0.9775317
1317400852.687234 -8.9875889 -0.0385982 9.4624109 0.0020921 -0.2147570 -0.0144467 0.9765584
1317400852.895117 -9.0510817 -0.0401928 9.5927305 -0.0019981 -0.2200195 -0.0181664 0.9753243
1317400853.206859 -9.1462460 -0.0428403 9.7854309 0.0050994 -0.2280518 -0.0155916 0.9735108
1317400853.414735 -9.2125864 -0.0449949 9.9133043 0.0040833 -0.2326919 -0.0174454 0.9723855
1317400853.726359 -9.3132515 -0.0485422 10.1035023 0.0031415 -0.2398336 -0.0176612 0.9706483
1317400853.934239 -9.3802795 -0.0506836 10.2278833 0.0028777 -0.2444520 -0.0162992 0.9695202
1317400854.142111 -9.4489012 -0.0525808 10.3503160 0.0030578 -0.2490767 -0.0173235 0.9683240
1317400854.453861 -9.5500822 -0.0575442 10.5280771 0.0079285 -0.2560623 -0.0144803 0.9665193
1317400854.765735 -9.6539974 -0.0612421 10.7038250 -0.0030024 -0.2609357 -0.0159530 0.9652197
1317400855.077486 -9.7510109 -0.0620559 10.8684216 -0.0039364 -0.2660819 -0.0126635 0.9638592
1317400855.389238 -9.8438339 -0.0639193 11.0212288 -0.0024882 -0.2704685 -0.0101379 0.9626722
1317400855.804861 -9.9572468 -0.0652730 11.2032232 -0.0043969 -0.2753917 -0.0079706 0.9612890
1317400856.220363 -10.0542116 -0.0682802 11.3519344 0.0003557 -0.2807486 -0.0056944 0.9597644
1317400856.531987 -10.1181974 -0.0693951 11.4466419 -0.0013922 -0.2891133 -0.0055312 0.9572779
1317400856.843489 -10.1766777 -0.0697244 11.5268135 -0.0077617 -0.2992149 -0.0100777 0.9541010
1317400857.258487 -10.2421360 -0.0701680 11.6111555 -0.0111999 -0.3239926 -0.0058149 0.9459754
1317400857.673238 -10.3013067 -0.0707870 11.6703463 -0.0043796 -0.3644552 -0.0050401 0.9311970
1317400857.984489 -10.3465834 -0.0705530 11.7048054 0.0009707 -0.3958406 -0.0105601 0.9182580
1317400858.399238 -10.4101143 -0.0701576 11.7483330 -0.0030892 -0.4460928 -0.0113586 0.8949093
1317400858.814115 -10.4797020 -0.0701704 11.7798653 -0.0049185 -0.4994550 -0.0193185 0.8661104
1317400859.229115 -10.5559130 -0.0702261 11.8040810 -0.0027638 -0.5578712 -0.0186470 0.8297135
1317400859.643740 -10.6586094 -0.0684162 11.8195295 -0.0015608 -0.6293072 -0.0164005 0.7769821
1317400859.954741 -10.7525759 -0.0662303 11.8184462 -0.0028256 -0.6863847 -0.0158975 0.7270594
1317400860.162238 -10.8221407 -0.0644762 11.8120041 -0.0070335 -0.7245533 -0.0152910 0.6890132
1317400860.369742 -10.8948832 -0.0624043 11.7962580 -0.0103652 -0.7604356 -0.0144847 0.6491690
1317400860.681246 -11.0157890 -0.0564430 11.7557316 -0.0137883 -0.8080851 -0.0126129 0.5887693
1317400860.888864 -11.0999918 -0.0544422 11.7168036 -0.0176838 -0.8357978 -0.0103037 0.5486557
1317400861.096741 -11.1866894 -0.0513880 11.6666574 -0.0202480 -0.8594851 -0.0088498 0.5106830
1317400861.409116 -11.3242283 -0.0469107 11.5710993 0.0196526 0.8837152 0.0088206 -0.4675292
1317400861.721990 -11.4740438 -0.0423818 11.4563971 0.0187502 0.8956029 0.0093244 -0.4443612
1317400862.034745 -11.6362648 -0.0375977 11.3260155 0.0199528 0.9022281 0.0099363 -0.4306828
1317400862.243244 -11.7503395 -0.0331878 11.2311363 0.0199133 0.9049879 0.0102234 -0.4248480
1317400862.555743 -11.9308996 -0.0278335 11.0788813 0.0208518 0.9068096 0.0105019 -0.4208935
1317400862.868121 -12.1222334 -0.0215126 10.9148130 0.0208754 0.9073323 0.0091129 -0.4197967
1317400863.180492 -12.3253975 -0.0147067 10.7404509 0.0215968 0.9079203 0.0119311 -0.4184160
1317400863.596619 -12.6068344 -0.0054587 10.4981050 0.0225514 0.9086812 0.0094655 -0.4167737
1317400864.012616 -12.9024582 0.0022572 10.2407227 0.0198082 0.9096835 0.0045592 -0.4148044
1317400864.324492 -13.1337490 0.0069783 10.0378876 0.0187430 0.9096637 0.0069994 -0.4148635
1317400864.636246 -13.3670816 0.0116294 9.8335495 0.0210258 0.9097539 0.0088784 -0.4145201
1317400864.948005 -13.6004982 0.0168868 9.6273975 0.0208874 0.9098092 0.0099139 -0.4143821
1317400865.363756 -13.9130659 0.0240695 9.3529987 0.0213571 0.9103088 0.0104542 -0.4132462
1317400865.675500 -14.1445570 0.0309304 9.1493387 0.0215890 0.9110963 0.0095887 -0.4115161
1317400866.090993 -14.4492130 0.0378458 8.8775291 0.0190899 0.9114910 0.0100825 -0.4107530
1317400866.402784 -14.6780767 0.0421084 8.6719360 0.0167425 0.9105795 0.0097623 -0.4128793
1317400866.610622 -14.8317261 0.0460389 8.5386353 0.0183475 0.9100139 0.0100453 -0.4140497
1317400866.922248 -15.0630188 0.0518985 8.3365355 0.0234425 0.9092178 0.0152580 -0.4153801
1317400867.129868 -15.2150421 0.0578100 8.2041798 0.0210748 0.9093426 0.0111618 -0.4153640
1317400867.337494 -15.3676376 0.0627055 8.0712051 0.0219103 0.9093520 0.0124985 -0.4152622
1317400867.545132 -15.5175533 0.0675356 7.9407382 0.0225796 0.9095678 0.0118202 -0.4147732
1317400867.752752 -15.6661673 0.0719673 7.8100586 0.0222168 0.9098907 0.0116881 -0.4140878
1317400868.167882 -15.9619360 0.0825145 7.5491071 0.0248581 0.9104586 0.0135973 -0.4126286
1317400868.583125 -16.2511730 0.0914971 7.2910495 0.0216653 0.9102492 0.0130849 -0.4132866
1317400869.102272 -16.6071281 0.1023830 6.9769425 0.0200789 0.9095801 0.0128268 -0.4148449
1317400869.309867 -16.7474308 0.1061431 6.8570628 0.0221877 0.9093568 0.0126934 -0.4152309
1317400869.725379 -17.0230293 0.1142440 6.6183209 0.0219991 0.9089358 0.0081350 -0.4162759
1317400870.036878 -17.2245903 0.1185247 6.4437695 0.0205821 0.9087811 0.0097806 -0.4166506
1317400870.452139 -17.4764271 0.1233181 6.2292228 0.0196836 0.9089321 0.0100394 -0.4163583
1317400870.763629 -17.6568813 0.1266117 6.0702763 0.0204690 0.9089515 0.0110269 -0.4162531
1317400871.075246 -17.8300896 0.1303540 5.9194851 0.0231089 0.9090517 0.0127721 -0.4158460
1317400871.386754 -17.9930115 0.1338237 5.7772303 0.0247219 0.9094975 0.0128933 -0.4147733
1317400871.906004 -18.2407837 0.1410235 5.5548811 0.0296397 0.9147537 0.0086515 -0.4028304
1317400872.217250 -18.3715687 0.1440927 5.4251180 0.0332664 0.9229706 0.0077527 -0.3833517
1317400872.735641 -18.5516586 0.1486709 5.2054038 0.0354622 0.9457638 0.0082846 -0.3228074
1317400873.150132 -18.6514912 0.1506598 5.0266886 0.0314129 0.9684488 0.0116473 -0.2469505
1317400873.461255 -18.6975212 0.1510258 4.8905449 0.0174878 0.9837508 0.0116186 -0.1783078
1317400873.876131 -18.7294750 0.1512294 4.7047634 0.0132508 0.9966777 0.0106111 -0.0796583
1317400874.187505 -18.7249584 0.1536302 4.5625858 0.0031480 0.9998500 0.0166512 -0.0035782
1317400874.395122 -18.7140865 0.1544289 4.4705830 0.0094372 0.9986557 0.0157447 0.0484750
1317400874.706620 -18.6772137 0.1543593 4.3418641 0.0119576 0.9921802 0.0126710 0.1235913
1317400874.914246 -18.6437454 0.1561938 4.2577143 0.0156545 0.9845039 0.0119108 0.1742563
1317400875.122121 -18.6000443 0.1569439 4.1753626 0.0147052 0.9754453 0.0119963 0.2194227
1317400875.226122 -18.5743237 0.1573779 4.1346831 0.0128080 0.9706244 0.0137343 0.2398656
1317400875.434372 -18.5215530 0.1570342 4.0530658 0.0160367 0.9612892 0.0179963 0.2744848
1317400875.642747 -18.4615707 0.1574272 3.9733572 0.0154015 0.9533380 0.0189421 0.3009163
1317400875.851249 -18.3972588 0.1583361 3.8927255 0.0143028 0.9473637 0.0181674 0.3193232
1317400876.060000 -18.3290749 0.1591502 3.8101687 0.0130573 0.9433843 0.0168521 0.3310160
1317400876.268624 -18.2571087 0.1602436 3.7257290 0.0129187 0.9407673 0.0147429 0.3384858
1317400876.581626 -18.1435204 0.1606878 3.5916009 0.0146010 0.9384795 0.0142772 0.3447306
1317400876.790125 -18.0613232 0.1615559 3.4991307 0.0111279 0.9378123 0.0123410 0.3467449
1317400876.998498 -17.9755135 0.1624763 3.3997355 0.0145609 0.9377645 0.0141463 0.3466781
1317400877.206873 -17.8863602 0.1629461 3.2967644 0.0132826 0.9380103 0.0110391 0.3461769
1317400877.519251 -17.7450104 0.1624696 3.1324615 0.0157207 0.9382982 0.0061287 0.3454155
1317400877.727374 -17.6432953 0.1615446 3.0167503 0.0111364 0.9385267 0.0071484 0.3449529
1317400877.935373 -17.5374947 0.1605414 2.8938403 0.0087360 0.9384173 0.0078809 0.3453034
1317400878.247498 -17.3690701 0.1617123 2.6983581 0.0061287 0.9384649 0.0117572 0.3451200
1317400878.559500 -17.1939087 0.1639538 2.4931684 0.0071579 0.9381012 0.0094286 0.3461588
1317400879.079499 -16.8890762 0.1659235 2.1335912 0.0137167 0.9379594 0.0114961 0.3462830
1317400879.599249 -16.5670147 0.1643302 1.7589359 0.0119784 0.9384700 0.0138159 0.3448763
1317400880.015001 -16.3111000 0.1659073 1.4540343 0.0192585 0.9383733 0.0226629 0.3443416
1317400880.326752 -16.1232662 0.1694044 1.2327371 0.0211033 0.9384804 0.0211895 0.3440352
1317400880.638386 -15.9368992 0.1697650 1.0148945 0.0225328 0.9391373 0.0170044 0.3423803
1317400880.950004 -15.7531395 0.1693931 0.7973056 0.0205492 0.9400048 0.0184701 0.3400405
1317400881.262002 -15.5772171 0.1691696 0.5823154 0.0182011 0.9446777 0.0178080 0.3270103
1317400881.678375 -15.3698626 0.1709840 0.2873573 0.0215930 0.9563966 0.0232248 0.2903445
1317400881.886767 -15.2761326 0.1748532 0.1290436 0.0249995 0.9645683 0.0245381 0.2614974
1317400882.303638 -15.1204872 0.1791275 -0.1942372 0.0304492 0.9798993 0.0158259 0.1965187
1317400882.511920 -15.0599566 0.1788776 -0.3588519 0.0267955 0.9859656 0.0117842 0.1643621
1317400882.823767 -14.9893932 0.1787834 -0.6142123 0.0281088 0.9915232 0.0099042 0.1264657
1317400883.031501 -14.9487514 0.1804323 -0.7891672 0.0259245 0.9938205 0.0129361 0.1071516
1317400883.343130 -14.9004354 0.1822962 -1.0575742 0.0255156 0.9963334 0.0117283 0.0808160
1317400883.654389 -14.8636198 0.1861386 -1.3370471 0.0326308 0.9971957 0.0167901 0.0652231
1317400883.861771 -14.8397961 0.1907611 -1.5276928 0.0333975 0.9972346 0.0212176 0.0629096
1317400884.172881 -14.7983875 0.1967290 -1.8182991 0.0248803 0.9976656 0.0160747 0.0615301
1317400884.484143 -14.7589426 0.2025487 -2.1179051 0.0203805 0.9976983 0.0176472 0.0622195
1317400884.691764 -14.7320833 0.2060288 -2.3203359 0.0190379 0.9976509 0.0173693 0.0634713
1317400884.899389 -14.7051954 0.2101766 -2.5248864 0.0175800 0.9976603 0.0151181 0.0643148
1317400885.107015 -14.6774712 0.2127430 -2.7324519 0.0145778 0.9977582 0.0146422 0.0636531
1317400885.314633 -14.6498823 0.2146428 -2.9359677 0.0133900 0.9978809 0.0152877 0.0618117
1317400885.522259 -14.6242790 0.2182240 -3.1404562 0.0132375 0.9979460 0.0159389 0.0606183
1317400885.729755 -14.5995560 0.2200508 -3.3415003 0.0125803 0.9979644 0.0181929 0.0598139
1317400886.041139 -14.5616474 0.2243322 -3.6388752 0.0115471 0.9981138 0.0154831 0.0582737
1317400886.248760 -14.5376892 0.2263879 -3.8365512 0.0109132 0.9981932 0.0160935 0.0568528
1317400886.456385 -14.5143862 0.2291450 -4.0325537 0.0097275 0.9983556 0.0167211 0.0539607
1317400886.560270 -14.5030899 0.2305562 -4.1295409 0.0094675 0.9984521 0.0161931 0.0523606
1317400886.767884 -14.4818220 0.2328899 -4.3231354 0.0084055 0.9986185 0.0163916 0.0492120
1317400886.975509 -14.4632330 0.2356080 -4.5116949 0.0085224 0.9987233 0.0176888 0.0465428
1317400887.183142 -14.4461918 0.2382518 -4.6981974 0.0088366 0.9988282 0.0176077 0.0442042
1317400887.494508 -14.4201107 0.2421213 -4.9755688 0.0079666 0.9989483 0.0174662 0.0416391
1317400887.702253 -14.4045610 0.2439413 -5.1582775 0.0076571 0.9990156 0.0147155 0.0411432
1317400887.910063 -14.3894424 0.2461091 -5.3389692 0.0075516 0.9990360 0.0126477 0.0413546
1317400888.117636 -14.3738804 0.2472038 -5.5189004 0.0087045 0.9989838 0.0137622 0.0420266
1317400888.429131 -14.3498020 0.2493990 -5.7840981 0.0102519 0.9988940 0.0151577 0.0433125
1317400888.636882 -14.3329077 0.2511061 -5.9582868 0.0096816 0.9988683 0.0147198 0.0441777
1317400888.844517 -14.3157482 0.2525290 -6.1314397 0.0113421 0.9987628 0.0135820 0.0464718
1317400889.052131 -14.2974682 0.2534955 -6.3029385 0.0108056 0.9986625 0.0125775 0.0489708
1317400889.259885 -14.2797337 0.2537551 -6.4719315 0.0100721 0.9985879 0.0126406 0.0506064
1317400889.571785 -14.2527571 0.2554904 -6.7179117 0.0087545 0.9986074 0.0149466 0.0498319
1317400889.883756 -14.2267370 0.2573007 -6.9545574 0.0069374 0.9988062 0.0150465 0.0459513
1317400890.091765 -14.2152777 0.2575489 -7.1017208 0.0072853 0.9990640 0.0153053 0.0397981
1317400890.299891 -14.2068844 0.2583473 -7.2428780 0.0095196 0.9993070 0.0163198 0.0320707
1317400890.819778 -14.1945591 0.2599949 -7.5562000 0.0137644 0.9996611 0.0170419 0.0140618
1317400891.027760 -14.1927280 0.2610963 -7.6663208 0.0149375 0.9997168 0.0165448 0.0083289
1317400891.235642 -14.1920996 0.2618730 -7.7652717 0.0167056 0.9997098 0.0169802 0.0036035
1317400891.443643 -14.1927338 0.2630976 -7.8537121 0.0177538 0.9996782 0.0181179 -0.0001840
1317400891.755512 -14.1940584 0.2637679 -7.9693470 0.0194648 0.9996161 0.0192578 -0.0042355
1317400891.859397 -14.1935339 0.2642405 -8.0035915 0.0198761 0.9995948 0.0196866 -0.0052562
1317400892.067263 -14.1939297 0.2661599 -8.0628910 0.0198681 0.9995767 0.0206280 -0.0051064
1317400892.482886 -14.1927013 0.2654023 -8.1462221 0.0159924 0.9996863 0.0192150 -0.0015391
1317400893.730263 -14.1850853 0.2680946 -8.3057337 0.0128362 0.9995018 0.0161003 0.0239187
1317400901.219899 -14.1699734 0.2681289 -8.3589373 0.0114422 0.9967202 0.0147994 0.0787331
1317400901.947016 -14.1476898 0.2683799 -8.4062862 0.0100648 0.9904502 0.0129691 0.1368902
1317400902.258395 -14.1287527 0.2685589 -8.4437447 0.0092970 0.9851229 0.0159075 0.1708609
1317400902.673395 -14.0935383 0.2694423 -8.5037670 0.0109989 0.9740260 0.0205923 0.2252296
1317400903.191766 -14.0211134 0.2700014 -8.5898399 0.0096997 0.9454808 0.0181305 0.3250279
1317400903.710269 -13.8807716 0.2736917 -8.6990852 0.0158014 0.8941800 0.0149112 0.4471802
1317400904.229406 -13.6573849 0.2742953 -8.7991810 0.0163285 0.8252229 0.0261587 0.5639647
1317400904.437141 -13.5444460 0.2757952 -8.8277149 0.0157195 0.7939253 0.0296170 0.6070900
1317400904.749273 -13.3527279 0.2781638 -8.8539562 0.0183573 0.7503433 0.0305542 0.6600866
1317400904.957641 -13.2101851 0.2794134 -8.8617487 0.0186412 0.7296736 0.0278770 0.6829727
1317400905.166398 -13.0556955 0.2799993 -8.8656864 0.0205101 0.7163607 0.0270802 0.6969027
1317400905.479396 -12.8053589 0.2791671 -8.8619595 0.0248335 0.7013043 0.0256951 0.7119658
1317400905.792269 -12.5377855 0.2777597 -8.8476105 0.0235212 0.6886433 0.0207867 0.7244205
1317400906.000893 -12.3476095 0.2752543 -8.8334494 0.0215139 0.6861214 0.0181933 0.7269412
1317400906.417773 -11.9387903 0.2705625 -8.8063593 0.0211357 0.6827495 0.0196397 0.7300826
1317400906.626019 -11.7239504 0.2679940 -8.7885246 0.0213179 0.6796063 0.0191163 0.7330180
1317400906.938270 -11.3912506 0.2622961 -8.7588396 0.0191002 0.6739956 0.0219985 0.7381607
1317400907.146269 -11.1611366 0.2601573 -8.7356625 0.0184209 0.6717314 0.0225667 0.7402219
1317400907.458520 -10.8055105 0.2579469 -8.6978188 0.0182081 0.6728485 0.0220556 0.7392272
1317400907.666518 -10.5665445 0.2551718 -8.6754255 0.0178141 0.6732620 0.0241982 0.7387932
1317400907.874520 -10.3282671 0.2519810 -8.6527004 0.0175191 0.6737083 0.0247393 0.7383754
1317400908.082521 -10.0907297 0.2490339 -8.6297302 0.0188840 0.6742059 0.0233062 0.7379340
1317400908.394398 -9.7323990 0.2445260 -8.5938473 0.0168947 0.6752478 0.0242970 0.7369971
1317400908.706273 -9.3773117 0.2396982 -8.5611696 0.0190574 0.6757628 0.0228004 0.7365199
1317400908.914272 -9.1412792 0.2358622 -8.5390673 0.0162883 0.6760381 0.0242817 0.7362863
1317400909.122271 -8.9067411 0.2331253 -8.5173941 0.0142114 0.6765084 0.0229442 0.7359403
1317400909.330032 -8.6762342 0.2309862 -8.4951096 0.0143825 0.6768570 0.0218033 0.7356510
1317400909.537896 -8.4436007 0.2301773 -8.4750423 0.0136753 0.6768731 0.0221346 0.7356398
1317400909.849525 -8.0997887 0.2264440 -8.4431753 0.0171439 0.6771831 0.0228655 0.7352594
1317400910.161034 -7.7564197 0.2208911 -8.4133902 0.0175626 0.6743467 0.0254077 0.7377686
1317400910.368646 -7.5299568 0.2189489 -8.3907738 0.0162803 0.6722722 0.0233161 0.7397577
1317400910.576274 -7.3043771 0.2157814 -8.3677015 0.0162460 0.6701472 0.0221792 0.7417188
1317400910.783784 -7.0815935 0.2131276 -8.3438654 0.0154454 0.6687783 0.0227757 0.7429524
1317400910.887545 -6.9707670 0.2119807 -8.3310127 0.0152582 0.6682649 0.0229039 0.7434142
1317400911.095150 -6.7503304 0.2089276 -8.3056736 0.0140293 0.6675179 0.0227667 0.7441134
1317400911.302814 -6.5329180 0.2062117 -8.2810402 0.0133661 0.6677632 0.0218675 0.7439325
1317400911.510529 -6.3167715 0.2046770 -8.2566671 0.0135481 0.6689346 0.0218356 0.7428769
1317400911.718272 -6.1022992 0.2025554 -8.2346907 0.0163410 0.6705006 0.0234358 0.7413587
1317400912.029905 -5.7807326 0.1976622 -8.2035751 0.0172168 0.6729661 0.0259167 0.7390186
1317400912.341536 -5.4622512 0.1950930 -8.1724739 0.0159053 0.6756161 0.0245610 0.7366727
1317400912.549286 -5.2514396 0.1928872 -8.1533852 0.0174398 0.6769785 0.0222226 0.7354605
1317400912.756909 -5.0423555 0.1897653 -8.1357965 0.0186802 0.6779624 0.0217209 0.7345381
1317400912.964652 -4.8340130 0.1864717 -8.1181526 0.0171032 0.6780080 0.0233269 0.7344852
1317400913.172275 -4.6259327 0.1844163 -8.0988150 0.0137483 0.6778021 0.0217393 0.7347943
1317400913.379901 -4.4205604 0.1827006 -8.0807333 0.0110885 0.6775082 0.0183534 0.7352026
1317400913.691278 -4.1132226 0.1793696 -8.0531998 0.0102575 0.6769418 0.0144842 0.7358226
1317400913.898901 -3.9092185 0.1769643 -8.0361214 0.0105915 0.6763029 0.0178720 0.7363307
1317400914.106534 -3.7056766 0.1747443 -8.0182419 0.0098202 0.6754842 0.0214188 0.7369978
1317400914.314162 -3.5047085 0.1727927 -7.9990344 0.0137082 0.6749978 0.0198896 0.7374242
1317400914.521926 -3.3040740 0.1705012 -7.9796834 0.0141680 0.6747544 0.0190156 0.7376613
1317400914.833525 -3.0053716 0.1649092 -7.9520383 0.0180601 0.6747241 0.0193230 0.7375960
1317400915.041404 -2.8087974 0.1605089 -7.9334755 0.0186675 0.6753687 0.0213645 0.7369344
1317400915.353159 -2.5161073 0.1557916 -7.9075541 0.0173278 0.6763452 0.0228503 0.7360263
1317400915.664903 -2.2289598 0.1516533 -7.8812261 0.0157161 0.6777534 0.0222140 0.7347856
1317400915.872788 -2.0379505 0.1496853 -7.8659158 0.0158807 0.6783783 0.0228904 0.7341844
1317400916.080654 -1.8484464 0.1471821 -7.8505025 0.0157192 0.6789462 0.0227297 0.7336677
1317400916.288536 -1.6649013 0.1446846 -7.8348484 0.0138461 0.6796123 0.0224505 0.7330971
1317400916.496411 -1.4874752 0.1425568 -7.8212895 0.0125346 0.6800277 0.0223599 0.7327383
1317400916.808287 -1.2363799 0.1402609 -7.8014488 0.0122476 0.6788516 0.0221837 0.7338381
1317400917.016163 -1.0801461 0.1398776 -7.7885237 0.0118155 0.6760887 0.0206064 0.7364373
1317400917.431906 -0.7918607 0.1348244 -7.7562652 0.0142754 0.6667289 0.0192532 0.7449148
1317400917.639537 -0.6606252 0.1326542 -7.7382832 0.0156288 0.6580013 0.0185219 0.7526267
1317400918.158810 -0.3721204 0.1249423 -7.6780472 0.0144929 0.6285466 0.0174835 0.7774404
1317400918.573911 -0.1732194 0.1196356 -7.6158938 0.0130268 0.5935251 0.0153844 0.8045630
1317400918.885040 -0.0406218 0.1163199 -7.5593066 0.0154075 0.5556996 0.0123877 0.8311481
1317400919.299529 0.1135445 0.1089983 -7.4627271 0.0155816 0.4779457 0.0142801 0.8781350
1317400919.610669 0.2100224 0.1030927 -7.3711290 0.0164512 0.4082460 0.0100344 0.9126686
1317400920.025790 0.3117282 0.0964425 -7.2316957 0.0107313 0.3122680 0.0026142 0.9499298
1317400920.337161 0.3732371 0.0937347 -7.1102710 0.0015209 0.2382751 0.0036717 0.9711896
1317400920.544912 0.3996785 0.0919564 -7.0242324 -0.0041417 0.1894990 -0.0032573 0.9818668
1317400920.752788 0.4218352 0.0910098 -6.9362497 -0.0021900 0.1432070 -0.0034073 0.9896845
1317400920.960913 0.4375882 0.0903712 -6.8428354 -0.0021427 0.1047216 -0.0064378 0.9944784
1317400921.169163 0.4481481 0.0892124 -6.7463708 -0.0020249 0.0736301 -0.0099047 0.9972344
1317400921.377534 0.4558504 0.0882192 -6.6454668 -0.0029602 0.0524250 -0.0107927 0.9985622
1317400921.690287 0.4643576 0.0865382 -6.4842267 -0.0014532 0.0287169 -0.0092359 0.9995438
1317400921.794541 0.4655025 0.0863356 -6.4274764 -0.0011397 0.0216133 -0.0096232 0.9997194
1317400922.002909 0.4657440 0.0854038 -6.3080773 -0.0007777 0.0080808 -0.0093047 0.9999238
1317400922.419397 0.4594277 0.0836070 -6.0465131 0.0007294 -0.0148991 -0.0093446 0.9998451
1317400922.836035 0.4432061 0.0809536 -5.7570243 0.0011947 -0.0226476 -0.0085834 0.9997060
1317400923.148419 0.4298856 0.0791003 -5.5277638 -0.0019287 -0.0270602 -0.0065316 0.9996106
1317400923.668783 0.4013866 0.0738606 -5.1403346 -0.0046430 -0.0351219 -0.0031521 0.9993673
1317400923.876663 0.3883136 0.0726685 -4.9860973 -0.0043544 -0.0382506 -0.0030763 0.9992539
1317400924.188661 0.3671266 0.0710094 -4.7542162 -0.0041433 -0.0397186 -0.0042097 0.9991934
1317400924.396662 0.3535352 0.0695318 -4.6003861 -0.0045334 -0.0398781 -0.0040624 0.9991860
1317400924.708538 0.3325767 0.0672053 -4.3708825 -0.0059206 -0.0398671 -0.0041452 0.9991788
1317400924.916411 0.3198416 0.0663425 -4.2177806 -0.0056259 -0.0399972 -0.0046573 0.9991731
1317400925.540163 0.2814405 0.0637858 -3.7747684 -0.0059770 -0.0359585 -0.0030100 0.9993309
1317400925.852037 0.2662863 0.0612443 -3.5697002 -0.0058931 -0.0346429 -0.0036955 0.9993755
1317400926.164037 0.2501764 0.0598662 -3.3763554 -0.0020381 -0.0336548 -0.0065871 0.9994097
1317400926.579914 0.2316602 0.0543015 -3.1259120 -0.0009404 -0.0330076 -0.0075109 0.9994264
1317400926.891798 0.2175872 0.0510568 -2.9433012 -0.0007115 -0.0332581 -0.0086805 0.9994088
1317400927.411414 0.1946423 0.0462808 -2.6474485 0.0003066 -0.0359605 -0.0077172 0.9993234
1317400927.619289 0.1844217 0.0441348 -2.5317321 0.0003568 -0.0376530 -0.0077425 0.9992608
1317400928.035042 0.1643855 0.0399265 -2.3038049 -0.0006802 -0.0412712 -0.0059841 0.9991298
1317400928.346912 0.1487857 0.0368601 -2.1386397 -0.0020541 -0.0434164 -0.0065279 0.9990336
1317400928.554791 0.1387292 0.0352948 -2.0318615 -0.0021411 -0.0439149 -0.0066993 0.9990105
1317400928.866789 0.1243016 0.0320313 -1.8790562 -0.0022875 -0.0419862 -0.0080021 0.9990835
1317400929.074665 0.1162584 0.0308780 -1.7825884 -0.0018950 -0.0406535 -0.0075997 0.9991426
1317400929.386663 0.1051096 0.0282404 -1.6454806 -0.0014489 -0.0388573 -0.0079542 0.9992121
1317400929.594669 0.0981518 0.0269115 -1.5600477 -0.0015653 -0.0376700 -0.0079807 0.9992571
1317400929.906561 0.0895237 0.0246426 -1.4434246 -0.0028612 -0.0363147 -0.0078787 0.9993052
1317400930.322534 0.0797420 0.0224303 -1.3147279 -0.0025878 -0.0347090 -0.0074694 0.9993662
1317400930.842296 0.0702303 0.0202776 -1.1851022 0.0002658 -0.0334164 -0.0071516 0.9994159
1317400931.258167 0.0628598 0.0185967 -1.0859358 -0.0002718 -0.0328799 -0.0068386 0.9994358
1317400931.777797 0.0538143 0.0168220 -0.9662832 -0.0003506 -0.0349836 -0.0053182 0.9993737
1317400932.089547 0.0458668 0.0152806 -0.8969206 -0.0003059 -0.0439809 -0.0055827 0.9990167
1317400932.505173 0.0340073 0.0135117 -0.8068526 -0.0000213 -0.0553746 -0.0074621 0.9984378
1317400932.817053 0.0237517 0.0130338 -0.7401169 0.0005111 -0.0607259 -0.0088855 0.9981148
1317400933.129169 0.0160090 0.0114616 -0.6746368 0.0006895 -0.0600051 -0.0097034 0.9981506
1317400933.441291 0.0094225 0.0093017 -0.6104067 0.0000295 -0.0567713 -0.0093524 0.9983434
1317400933.961416 -0.0006917 0.0076253 -0.5041636 0.0005023 -0.0483610 -0.0090854 0.9987885
1317400934.481293 -0.0090065 0.0065382 -0.3854132 0.0028184 -0.0374207 -0.0081814 0.9992622
1317400935.105042 -0.0158596 0.0029869 -0.2113562 0.0000101 -0.0230928 -0.0050512 0.9997206
1317400935.728418 -0.0225806 0.0000546 -0.0069270 0.0021242 -0.0138627 -0.0026401 0.9998982
1317400936.351921 -0.0204198 -0.0050069 0.2157989 0.0041002 -0.0018792 0.0044784 0.9999798
1317400938.117295 -0.1335422 -0.0168923 0.7514415 -0.0095277 -0.1201315 -0.0139531 0.9926142
1317400939.573924 -0.1486445 -0.0175236 0.8550028 -0.0041649 -0.0918109 -0.0121505 0.9956936
