/Users/mohamed/Documents/formation/Docker/crud/src/main/java/com/example/crud/repositories/UserRepository.java
/Users/mohamed/Documents/formation/Docker/crud/src/main/java/com/example/crud/models/Country.java
/Users/mohamed/Documents/formation/Docker/crud/src/main/java/com/example/crud/repositories/RoleRepository.java
/Users/mohamed/Documents/formation/Docker/crud/src/main/java/com/example/crud/models/User.java
/Users/mohamed/Documents/formation/Docker/crud/src/main/java/com/example/crud/exceptions/ItemNotFoundException.java
/Users/mohamed/Documents/formation/Docker/crud/src/main/java/com/example/crud/exceptions/handlers/ExceptionController.java
/Users/mohamed/Documents/formation/Docker/crud/src/main/java/com/example/crud/controllers/UserController.java
/Users/mohamed/Documents/formation/Docker/crud/src/main/java/com/example/crud/exceptions/ItemAlreadyExistException.java
/Users/mohamed/Documents/formation/Docker/crud/src/main/java/com/example/crud/controllers/BaseController.java
/Users/mohamed/Documents/formation/Docker/crud/src/main/java/com/example/crud/swagger/SwaggerConfig.java
/Users/mohamed/Documents/formation/Docker/crud/src/main/java/com/example/crud/controllers/RoleController.java
/Users/mohamed/Documents/formation/Docker/crud/src/main/java/com/example/crud/controllers/CountryController.java
/Users/mohamed/Documents/formation/Docker/crud/src/main/java/com/example/crud/App.java
/Users/mohamed/Documents/formation/Docker/crud/src/main/java/com/example/crud/models/Role.java
/Users/mohamed/Documents/formation/Docker/crud/src/main/java/com/example/crud/repositories/CountryRepository.java
/Users/mohamed/Documents/formation/Docker/crud/src/main/java/com/example/crud/models/BaseModel.java
