{
  "type": "service_account",
  "project_id": "nifty-catfish-370607",
  "private_key_id": "4e0255574710efc5353a790041b313e0fa341c39",
  "private_key": "-----BEGIN PRIVATE KEY-----\nMIIEvAIBADANBgkqhkiG9w0BAQEFAASCBKYwggSiAgEAAoIBAQDD+h3LoqA75jiH\ny6eRqbaG1mSXEuWYKZohXScUrnH+O1oVkUA11NXbBJ1KCvFGr8NJoAJxhRFkAzky\n8NaSSIhUUP7OXVKCWFYVlIPA2xLfvu2ibS9NEsOaybM5tZifrz6wMdWgw+LjdTHV\nBuOZQR8Ji46R3IZRDVEe1hFYspZ6OGNJAd8eU1UU3A3jLqc9R4Cl4jDsmSAcuMQQ\nFAXEM/VdGtC9+6Ho9RplzzA5r50w6q85n5BtsHk2c2fQ6jMdCGhTYMAD/VpAOITU\nHZegciiCRMi4ELn0ur6hvWBNEpeDSWkfhAU/U3NLfiL3hMKXLOnYHLIajm+QB/JC\nStVu3shDAgMBAAECggEAPrxNGHiNac9njlUL5e3Zv+1W0yPZ+q1qqT6MOaskU7nF\nOz09vF3PPecKwP6iwTmXvvRpg9SQvh7oCx4c2kQ83Bz3jLFELfTATfU2fiDDOHwC\nz2m7aCVXF7B03sb6vjeXzkiNtgKvGZhVJPgpGNDHckNKFvhsyPqF2uS1Ndspn6Ln\nvex5HiODwOo+va1SBMLJFN+GysG+JLafpo9zaCt/MoUDrysXZ9YwYYyO3qvfzv4C\nTOoYBSJPEuqzRSeqQTGHIdC2ZPNXStDJdxYDfj/BBWit3m8uUIxu3eL1z/ZGX/7g\njPhrjI1FuAsBgLgrj8MefsU8b44sZOHR2dMse0IEoQKBgQD/xgmXvhqGRd0D42AD\ngnIf1ktvJapHLRMsHIj8SyvEghn0NxmLZAhTTX9LxtBc5P7TxhtCVGE9BLmKVtcX\nsqRhBWY7oeXQcaoChJOnGQcTKeCbnkM0svWMkrKM8MF+buRXgGUduaGe36hzvA+e\nvHkqnSsCa7LtnDc0thSjpLssYQKBgQDEJocso5oUm2qxVm/yV7v015xTR++sGuar\nqXxPIn5r4NPR5wjcMuSpFI3y2ECs3nMnW2yreyA9v06Xd6jLfd5PkB4PZAqc7qRS\nzvAocwZsLnxh3+6wj3W6gICQZRVIqmn6z6G1KEA9k9sVYC21vzOsdt4AVMcw9uf1\nbtDbJCsXIwKBgEFo69sair377+GmrE85dOYfb3slLr61EEofogijULYYb3q8/JNh\nKZ/kGcHPPkoDZgfSifYUjimEo851FtzAmrkVIGfvp03/Q3MRZJE/HUgRVZd2iclY\nWuNwQKk6iMFEqrCV7UYEywhOOk4esf/uQy5asz0TPdb2NEgOqIiRAC0BAoGAQCwe\ns0L/CNjj6grOaym661qS4Ug6qELQzr6PVdCCLccLZbPBWVEpMAvyeM25MxU/9VNa\n1SteG/V3v+Q9C/4s+ji7LOvc8QS+K/1Z4tHm+wOmW9sIWylEKfUamqMHeJOQQqcl\nT4BQrBSwa2jg64IXZMgqz07tMB7HOqu7lsZZdqMCgYBaqCKO3qwbFoJAoyilMtOL\neU3Awlr53TGmKNYrEpfx5FtnFrReiwCuiUiGA+1Ecnhh1l5frcWzVZx94tmLMECq\n2dVgcoxRxL6ODmCRfGXSUiiEd1V+nVFtOd8EMjQcuM4mlwJ6qDB9x2KwtA8Dh0KK\nJqeQZM06IEKfoYAFTOwYqw==\n-----END PRIVATE KEY-----\n",
  "client_email": "compte-service-terraform@nifty-catfish-370607.iam.gserviceaccount.com",
  "client_id": "107259572272917645385",
  "auth_uri": "https://accounts.google.com/o/oauth2/auth",
  "token_uri": "https://oauth2.googleapis.com/token",
  "auth_provider_x509_cert_url": "https://www.googleapis.com/oauth2/v1/certs",
  "client_x509_cert_url": "https://www.googleapis.com/robot/v1/metadata/x509/compte-service-terraform%40nifty-catfish-370607.iam.gserviceaccount.com"
}
