INDEX VERSION 1.4+C:\Users\User1\eclipse-workspace\.metadata\.plugins\org.eclipse.wst.jsdt.core\indexes
3512648927.index
2198687054.index
4123665170.index
1023645869.index
3435648363.index
3198759962.index
833971360.index
