{
  "project_info": {
    "project_number": "229222350785",
    "firebase_url": "https://chatappwwsi.firebaseio.com",
    "project_id": "chatappwwsi",
    "storage_bucket": "chatappwwsi.appspot.com"
  },
  "client": [
    {
      "client_info": {
        "mobilesdk_app_id": "1:229222350785:android:196dd146ec61040730b940",
        "android_client_info": {
          "package_name": "com.example.chatappwwsi"
        }
      },
      "oauth_client": [
        {
          "client_id": "229222350785-sj7vooh268ck1oq5ko10qs0l4h1v61o1.apps.googleusercontent.com",
          "client_type": 1,
          "android_info": {
            "package_name": "com.example.chatappwwsi",
            "certificate_hash": "4f395601e2a42ce7c87ef4285a5caafee104cdcf"
          }
        },
        {
          "client_id": "229222350785-5v20ai9i8q9ulcticrpa70t3sgibc8ra.apps.googleusercontent.com",
          "client_type": 3
        }
      ],
      "api_key": [
        {
          "current_key": "AIzaSyCEkvNDZ7EgcBnzzPukXO0Jx9WNg9c_LwE"
        }
      ],
      "services": {
        "appinvite_service": {
          "other_platform_oauth_client": [
            {
              "client_id": "229222350785-5v20ai9i8q9ulcticrpa70t3sgibc8ra.apps.googleusercontent.com",
              "client_type": 3
            }
          ]
        }
      }
    }
  ],
  "configuration_version": "1"
}