0.004282214692447939,0.004232538333302532,-0.006362176973686573,0.0,0.0,0.0,25363.0
0.001939904375406254,0.007847666196178327,0.0022420004177039488,0.0,0.0,0.0,29580.0
-0.009401091008382712,-0.009479491130184842,0.025705596595281932,0.0,0.0,0.0,31000.0
0.0039090714269398585,0.0004424370990982196,-0.008750456898527048,0.0,0.0,0.0,32401.0
-0.0077272990145791365,-0.0013239319109149827,-0.005738011578470648,0.0,0.0,0.0,33760.0
-0.0014682191589209248,-0.007925343238884608,0.020623273806982922,0.0,0.0,0.0,35110.0
-0.010597967235438377,0.009413465643884511,-0.017320528543361746,0.0,0.0,0.0,36467.0
0.00459170474711712,0.004601438907004901,-0.002822501141739764,0.0,0.0,0.0,38039.0
0.009002984702468964,0.003911223070954178,0.011200698934917597,0.0,0.0,0.0,39384.0
0.004252530106801711,0.011824544170066398,0.005271307443068807,0.0,0.0,0.0,40790.0
0.005314628703955826,0.005800853931685279,-0.0006198296523951541,0.0,0.0,0.0,42712.0
0.005367474118897708,-0.007819274664706999,0.002872898366021559,0.0,0.0,0.0,44245.0
-0.007337696446950259,0.013753619878819623,0.0032923073153412474,0.0,0.0,0.0,45749.0
-0.0019869953690755393,-0.008709426446823904,-0.0014516360567409237,0.0,0.0,0.0,47169.0
0.005111017052931599,-0.0023030021443549153,-0.01738393604312627,0.0,0.0,0.0,48582.0
-0.005005616455363571,-0.007907551214734299,-0.00202605381231713,0.0,0.0,0.0,50310.0
-0.005954802764181588,-0.00587142947593694,-0.017022658054312245,0.0,0.0,0.0,51758.0
0.005138438321336425,-0.019440706340347336,0.01103132430251641,0.0,0.0,0.0,53093.0
-0.0058323480977549025,0.018325394240326254,-0.018673367857875434,0.0,0.0,0.0,54600.0
0.004392535731212011,0.00792658226709625,0.017277261191654958,0.0,0.0,0.0,56127.0
0.004583644428117428,-0.010262401526491827,0.022335522858243806,0.0,0.0,0.0,57410.0
-0.0037539050732812163,-0.0070230378523695736,-0.010764675870785112,0.0,0.0,0.0,58667.0
-0.005740837145998823,0.0025304223852412044,0.006150537823675251,0.0,0.0,0.0,59992.0
0.00022032409332040093,0.011500852643797577,-0.0015723606141584412,0.0,0.0,0.0,61285.0
0.00018727547932229083,0.0004257311308853984,0.004613467538023386,0.0,0.0,0.0,62508.0
-0.007490818679757205,0.0063118708532852175,-0.007978500712797043,0.0,0.0,0.0,64044.0
-0.004667217764619203,-0.0005849091667401995,-0.025481991490277522,0.0,0.0,0.0,65384.0
-0.004817124156513475,0.009702822547187628,0.027640787122180654,0.0,0.0,0.0,66699.0
0.008655432307616007,0.005697393997386779,-0.01645527258127899,0.0,0.0,0.0,67982.0
0.0022571324580022978,0.002292792396043075,-0.021637643162593534,0.0,0.0,0.0,69301.0
0.006168558536186142,-0.009101136190841408,0.01135868423525821,0.0,0.0,0.0,71211.0
-0.0075067130848942565,-0.009435956541376633,0.0096548815999693,0.0,0.0,0.0,72637.0
-0.0012807211186887102,0.009829435115927737,-0.005393986168590104,0.0,0.0,0.0,74158.0
-0.0010886129508853593,0.020255018632603816,0.0039153063062595805,0.0,0.0,0.0,75638.0
0.008424710606050989,0.002766761885925284,0.008428451339325349,0.0,0.0,0.0,77080.0
-0.005589034489457245,-0.00019824489869921247,-0.019185933091309337,0.0,0.0,0.0,78543.0
0.0054493413548522,-0.009518514446223869,0.007491853112620461,0.0,0.0,0.0,79970.0
-0.0038680517421439964,-0.006390733834141821,0.008918295635229612,0.0,0.0,0.0,84533.0
0.0009621519660617528,0.0013678773555863,-0.0026195200448935196,0.0,0.0,0.0,86064.0
0.0042178360614494315,-0.006487307084932753,-0.0149768838625004,0.0,0.0,0.0,87455.0
0.004435149708819308,-0.019114213251406553,0.010220011876054258,0.0,0.0,0.0,88870.0
0.005469855365670795,-0.00434708247963031,0.0027362254114180473,0.0,0.0,0.0,99528.0
-0.0021505860558256318,0.009904982121527933,-0.004473715541408296,0.0,0.0,0.0,100853.0
0.00667199374631644,0.0007692319661176394,-0.012302852759757954,0.0,0.0,0.0,104833.0
-0.007928832876818781,-0.00869614644514255,0.019292445454498264,0.0,0.0,0.0,106237.0
-0.006739507945295986,0.00960827197515246,0.004498630516206248,0.0,0.0,0.0,114360.0
0.013821419867744766,-0.00033296071488869705,0.006374056428276376,0.0,0.0,0.0,115767.0
-0.006101765956540772,0.004816981061803005,0.006268291668259707,0.0,0.0,0.0,117108.0
-0.0017864941727626649,-0.0010055637669258433,-0.016771971536936547,0.0,0.0,0.0,119724.0
-0.0006685309902610959,0.0016952632998487316,0.005293623159058569,0.0,0.0,0.0,121144.0
0.007081751495459088,-0.009609023256619581,-0.009100245220196257,0.0,0.0,0.0,124105.0
-0.01183053473693163,0.013932324354855391,-0.01963596718045224,0.0,0.0,0.0,125631.0
0.014594032098325882,-0.016207517813387584,0.018159739175912293,0.0,0.0,0.0,127662.0
0.0005049284995117809,0.0032236063121441894,0.0009856096899056865,0.0,0.0,0.0,129290.0
-0.0029707670017639076,-0.010859936863891168,-0.028061758359649858,0.0,0.0,0.0,130720.0
-0.0016751628949120967,0.00011905994802205444,0.00929712926514803,0.0,0.0,0.0,132160.0
0.0002760896524991452,0.0018012044009672046,-0.0014471677552396756,0.0,0.0,0.0,133635.0
0.004484672151508384,0.01003101563459044,0.0038695377638813255,0.0,0.0,0.0,135029.0
-0.007238038398695856,0.005126369065091951,0.005839327588800458,0.0,0.0,0.0,136514.0
-0.012102306698950072,0.0018074085376054705,-0.00013620190535412746,0.0,0.0,0.0,137855.0
-0.0051869756906361975,0.0015362972569646638,-0.005216212598554648,0.0,0.0,0.0,139466.0
0.00749106944702449,-0.002094141555889939,0.008316511115568304,0.0,0.0,0.0,140897.0
-0.002132582863797472,0.009269976738984581,0.001119060388173665,0.0,0.0,0.0,142238.0
0.004137329289778835,0.0019294808361042526,0.0026510781152264684,0.0,0.0,0.0,143755.0
-0.001583305771107435,0.0024900604332628307,0.004803636887444895,0.0,0.0,0.0,144954.0
0.00035421887168118893,-0.006383453191481925,0.005782968139605771,0.0,0.0,0.0,145966.0
0.003701092931225891,-0.002025928322462678,-0.003584671630894931,0.0,0.0,0.0,151209.0
0.002295889271006768,-0.0017220390740932956,-0.004746847671539101,0.0,0.0,0.0,152373.0
0.010451548438072056,-0.0057137418258504935,-0.017634645426204187,0.0,0.0,0.0,153575.0
-0.0021661935551168243,0.01384331934669919,-0.004789377277434781,0.0,0.0,0.0,154926.0
-0.0035412932989717927,0.007516825497810159,0.00017831596579220843,0.0,0.0,0.0,156092.0
-0.0072600952510102346,-0.011460696502959222,0.010351639905762156,0.0,0.0,0.0,157233.0
-0.003621063129648938,-0.002941590912908465,-0.009900561341332548,0.0,0.0,0.0,158519.0
-0.003077903660201553,-0.005900359166269131,-0.013515918119136217,0.0,0.0,0.0,159750.0
-0.01026622094835239,-0.006715308736477216,0.011461832757913015,0.0,0.0,0.0,160904.0
0.01167370287173397,0.0010919886886012198,0.014842188200061557,0.0,0.0,0.0,162039.0
0.012472665274683603,0.004328197275607959,-0.002683841720621416,0.0,0.0,0.0,163436.0
0.009751776426893843,0.004528969406840999,-0.0022812654625283812,0.0,0.0,0.0,164912.0
0.0006390071256786589,-0.00975037823339886,-0.00023919885787115902,0.0,0.0,0.0,166022.0
-0.0028568508334700926,0.0087121749551346,0.0031964345413655337,0.0,0.0,0.0,167205.0
-0.0032783122650368313,-0.001094643181903887,0.014616917480278602,0.0,0.0,0.0,168475.0
0.005713426468486937,-0.0009304467046182818,0.002224308523397056,0.0,0.0,0.0,169601.0
-0.007043586285851333,-0.0007908796989255507,0.0018906622448877641,0.0,0.0,0.0,170820.0
-0.0068370880635089115,-0.008322250581267787,0.0024574066123790317,0.0,0.0,0.0,172108.0
0.012038498654089347,0.00652608923513609,0.006338892895302095,0.0,0.0,0.0,173374.0
-0.003367253041263729,-0.002102826987315426,-0.0056623560780550974,0.0,0.0,0.0,174719.0
-0.006262171975371156,0.0016125912850918078,0.00878763286221762,0.0,0.0,0.0,175988.0
0.002327156658115559,-0.011379297914311443,-0.012930654736793556,0.0,0.0,0.0,177127.0
-0.0014219237308987775,-0.009672403227164728,0.0000585478896191205,0.0,0.0,0.0,178224.0
0.0055913786093299,-0.009921533522251474,0.004299862980957414,0.0,0.0,0.0,179249.0
0.001352664927633418,0.004316697012725745,-0.0005952137409668268,0.0,0.0,0.0,180336.0
0.00029972546795309363,-0.00568081382151267,0.004594509299181482,0.0,0.0,0.0,181440.0
-0.003995229299124103,0.001971309366321089,0.0030549892000806267,0.0,0.0,0.0,182686.0
-0.0033959449042555434,0.0008256112387986791,0.0034470845242910997,0.0,0.0,0.0,184034.0
-0.007136549115501434,0.004951765499863037,-0.005570172703912135,0.0,0.0,0.0,185285.0
0.007533960813011498,-0.000040995272000576843,0.007165301321791162,0.0,0.0,0.0,186492.0
-0.0037961539798310184,-0.00003484598120048754,-0.016859046412488254,0.0,0.0,0.0,187828.0
-0.011726722776624676,0.0008203826385538016,-0.0015807082494436742,0.0,0.0,0.0,189107.0
-0.007417696526421214,-0.009502670096146054,0.014806443382870071,0.0,0.0,0.0,190416.0
0.007294934849781609,0.006372721704076795,-0.001864691734180468,0.0,0.0,0.0,191633.0
-0.003999326048576446,0.003716822669303843,0.0009652325154494434,0.0,0.0,0.0,192879.0
0.004250575695891046,-0.00789071045856976,0.0025203244234113242,0.0,0.0,0.0,194153.0
0.00021303311515852297,0.008592901784577889,0.002142275759899448,0.0,0.0,0.0,195477.0
0.01378105504512439,-0.003746030544599821,-0.004978572745198306,0.0,0.0,0.0,196650.0
0.00406389395117468,0.007865871098581168,0.008517694367753847,0.0,0.0,0.0,197961.0
-0.014395662985625335,0.009235982935529685,0.0012900661525332424,0.0,0.0,0.0,199151.0
0.005613659306342278,0.0002005953240061531,0.006196997208657962,0.0,0.0,0.0,200414.0
-0.004578370539964571,-0.0006794956971689914,-0.007482844196982086,0.0,0.0,0.0,201682.0
0.008858372881682564,0.0011224321025548045,0.0012894332779023188,0.0,0.0,0.0,202831.0
-0.00012038588775087344,0.010304060903514128,-0.004853955773841179,0.0,0.0,0.0,204161.0
-0.011152337732066253,-0.0031415470160782444,0.012024182987133258,0.0,0.0,0.0,205535.0
-0.0009794951784880546,0.0024296827057918857,-0.009329243426391187,0.0,0.0,0.0,206732.0
-0.0050825668485989794,0.0012152285773488758,-0.0002800060670953286,0.0,0.0,0.0,208063.0
0.0016298429026975203,-0.003217051656137615,0.006562312607250931,0.0,0.0,0.0,209308.0
0.004785373357589773,0.011715510044070954,-0.012271956464012135,0.0,0.0,0.0,210551.0
-0.007832431430113918,-0.002791816969179156,-0.0036316558532973886,0.0,0.0,0.0,211915.0
0.0018424251781714585,-0.0023730444238022896,0.002013533503701481,0.0,0.0,0.0,213147.0
0.0032660395146201227,0.00648290413353636,-0.007639034775637654,0.0,0.0,0.0,214718.0
-0.006573847362928431,0.008060473681228614,0.007107455969272536,0.0,0.0,0.0,215933.0
0.010562224472460247,0.0009014032370116831,-0.005009077465180312,0.0,0.0,0.0,217178.0
-0.0037720970390612285,-0.00688381008572117,-0.0025578390601239676,0.0,0.0,0.0,218377.0
0.0018937025202693247,0.009448767101499167,-0.0021741632011043066,0.0,0.0,0.0,219769.0
0.002459636198816173,0.0003814491990931923,0.006652155828621886,0.0,0.0,0.0,221010.0
0.006340686715877841,-0.00902577446310035,0.0005538914753238089,0.0,0.0,0.0,222363.0
0.00028959870502487384,-0.0008719071790284361,0.003021028243527013,0.0,0.0,0.0,224102.0
-0.004853826104200265,-0.010941116441090942,-0.005081976838338775,0.0,0.0,0.0,225364.0
-0.0032757631319830782,-0.0016499461377462166,0.003330170532748866,0.0,0.0,0.0,226684.0
0.009115600121879619,0.0019975400072256566,-0.0014194523219437372,0.0,0.0,0.0,228118.0
0.000098257266416657,-0.0008520834955939027,0.0030435628011282745,0.0,0.0,0.0,229474.0
0.0026335365101638475,0.019675719706578748,0.0034373720851821332,0.0,0.0,0.0,230692.0
-0.0037115186903673436,-0.011325631764422694,-0.0030282077876542246,0.0,0.0,0.0,231946.0
-0.008254775890283672,-0.002826785885152422,-0.01107417116906717,0.0,0.0,0.0,233217.0
-0.005316581393566722,-0.0007027772232180984,0.006736999901189478,0.0,0.0,0.0,234569.0
-0.0028190654074092825,-0.0031473531414710765,-0.003623277714604356,0.0,0.0,0.0,235805.0
0.006103786297470437,-0.009475251284857267,0.0020198442984220577,0.0,0.0,0.0,237070.0
-0.00841180920833795,0.0038460351919365476,-0.010183080466457994,0.0,0.0,0.0,238310.0
0.004749960956977883,-0.0018308677563123321,-0.0001554238469285707,0.0,0.0,0.0,239657.0
-0.0036125360237500015,0.0035437600765929056,0.007517740575448073,0.0,0.0,0.0,240975.0
0.009679382884412946,0.0055622012328266635,-0.0038099918457081827,0.0,0.0,0.0,242435.0
-0.0011225561625526348,0.0004778624350315064,0.010361331836543641,0.0,0.0,0.0,243722.0
0.0032958232087143546,-0.01234381743686272,-0.0073429133338365205,0.0,0.0,0.0,245149.0
0.0002514825576455104,0.004807760853028864,-0.005391132629537054,0.0,0.0,0.0,246390.0
0.00616373423405725,-0.003563406112106565,-0.014782534069945896,0.0,0.0,0.0,247659.0
0.003539195985774235,-0.004728898640439044,0.0018850146501652176,0.0,0.0,0.0,249015.0
-0.0003916903023888363,-0.006569556346108868,0.00925211329797726,0.0,0.0,0.0,250259.0
-0.01138294648450855,0.009715870114182623,0.004464542732723231,0.0,0.0,0.0,251420.0
-0.005425508564948167,0.010808494764777937,0.002944517618590936,0.0,0.0,0.0,252685.0
-0.00461168228020592,0.0023872194354543907,-0.007697231359037104,0.0,0.0,0.0,253853.0
-0.0005199230478780681,0.010529141079891557,0.0028070809754332515,0.0,0.0,0.0,254897.0
-0.00044193459069630237,0.0012997670807267103,-0.00441348831199484,0.0,0.0,0.0,256016.0
0.0030243624882051456,-0.006545200818563385,0.0064486062696431645,0.0,0.0,0.0,257355.0
0.005970715005271243,0.0029365838639764386,-0.010668730065701126,0.0,0.0,0.0,258798.0
-0.012774915753591354,0.009296097398986819,0.0019811838600478637,0.0,0.0,0.0,260028.0
-0.010858678390552656,-0.01164831883210754,-0.0017157472895164005,0.0,0.0,0.0,261306.0
0.008620146876102242,-0.0031010698926845492,0.005341932568192931,0.0,0.0,0.0,262671.0
-0.0020229067696166947,-0.00433591285393034,-0.004809895570819123,0.0,0.0,0.0,264111.0
0.008480549916716651,0.0005644700210433728,-0.005788288020474042,0.0,0.0,0.0,265377.0
0.008058456485796284,0.003029804685609566,0.003580149732156812,0.0,0.0,0.0,266699.0
0.01109968395981098,0.005975328207078051,-0.00290684678772557,0.0,0.0,0.0,267972.0
-0.0016152276976906244,-0.010220964032358809,0.017078979195886745,0.0,0.0,0.0,269309.0
-0.002222983263572398,0.005762171858295917,-0.0016329130783940826,0.0,0.0,0.0,270539.0
-0.003589513887211071,0.005747847802125755,0.009662438922427796,0.0,0.0,0.0,271758.0
0.007998922923348584,-0.001064328760225719,0.0005624116155580339,0.0,0.0,0.0,273074.0
0.005099055707723732,-0.0009046794461918528,0.0030282703627264596,0.0,0.0,0.0,274451.0
0.0017842301818035144,0.001781027638459609,-0.011025795097078017,0.0,0.0,0.0,275725.0
-0.011233442850067554,-0.002736122454193468,-0.0008717312829560342,0.0,0.0,0.0,276928.0
-0.006998408588847704,-0.016775708037852416,-0.004991068865292547,0.0,0.0,0.0,278210.0
0.003401333649835081,-0.004909358215831994,0.003407442309837805,0.0,0.0,0.0,279436.0
0.00034116643259807233,-0.0041729544834571974,-0.002203304392473626,0.0,0.0,0.0,280750.0
-0.004810044199710983,0.02195298970234033,-0.00017293194832390668,0.0,0.0,0.0,281976.0
0.0069614721577236915,-0.02043994932951637,-0.013746817061470296,0.0,0.0,0.0,283469.0
0.012717265114658982,0.0030260337477446553,0.010415224952707192,0.0,0.0,0.0,284731.0
-0.010440304386960642,0.003422130408157198,0.010552817995080233,0.0,0.0,0.0,285995.0
-0.004624262782032429,0.005458816014656309,-0.008030493803302008,0.0,0.0,0.0,287313.0
0.00031937258215652964,0.0012399867221609406,0.008474592581036333,0.0,0.0,0.0,288549.0
0.006221440754891616,0.021453992057657356,0.001252619010653433,0.0,0.0,0.0,289819.0
-0.00916174131216907,0.00888588696667919,0.007015510842283135,0.0,0.0,0.0,291079.0
-0.010337497949053365,-0.003496993139813692,-0.012737081668458217,0.0,0.0,0.0,292315.0
0.0073631214742539974,-0.0012724407236931468,-0.0014767917875744274,0.0,0.0,0.0,293436.0
0.0037086354194062476,-0.00023157289256495184,0.0029948242553423654,0.0,0.0,0.0,294564.0
0.0031523401064952328,-0.004446832905564357,-0.005104250228296081,0.0,0.0,0.0,295705.0
0.00012952192075921243,0.001320189699728691,0.013511309486123224,0.0,0.0,0.0,297092.0
0.007760096469826339,0.002822152023930824,-0.0021152118421916555,0.0,0.0,0.0,298482.0
-0.012103930565306786,-0.008651167841149832,-0.003497806851139984,0.0,0.0,0.0,299772.0
0.005011664693851392,0.006246509564236363,0.00807646859242439,0.0,0.0,0.0,300959.0
-0.001690109734233003,-0.004040460486741615,-0.003335073031278668,0.0,0.0,0.0,302081.0
0.0028134026727861805,-0.00003439718942044312,-0.009634319217699527,0.0,0.0,0.0,303367.0
0.01514143077646879,-0.011079234672498384,0.012210160711465079,0.0,0.0,0.0,304579.0
-0.01007979235154488,0.006732645259325765,-0.006620941871206654,0.0,0.0,0.0,305866.0
0.004182164341839378,-0.005327248591064121,0.002022050254812058,0.0,0.0,0.0,307176.0
-0.00409516314661762,0.00397184325735081,-0.002531354558190202,0.0,0.0,0.0,308230.0
0.002469136049381704,-0.005123937791007144,-0.008101625434520088,0.0,0.0,0.0,309488.0
-0.0021512303049097126,0.011794647608593334,-0.011136478894123059,0.0,0.0,0.0,310820.0
0.009221413304356663,-0.021424549938007242,-0.0009658125104436976,0.0,0.0,0.0,312081.0
0.0001881984715219609,-0.0029108617729439734,0.000029403070346489812,0.0,0.0,0.0,313359.0
0.005260004368213056,0.006875761109340184,0.02042432465630384,0.0,0.0,0.0,314472.0
-0.003178999124200055,-0.01030559778801024,-0.008988630148708765,0.0,0.0,0.0,315551.0
-0.012902169926460871,0.011640245224011858,0.005959489278993146,0.0,0.0,0.0,316615.0
0.005183150293457617,-0.0037057937888036463,0.002515345397641866,0.0,0.0,0.0,317663.0
0.001855710579677261,0.0019500729489752844,0.0012876998837718645,0.0,0.0,0.0,319037.0
-0.004372670731281003,-0.000042441438519474906,0.01299530364449275,0.0,0.0,0.0,320345.0
-0.005416748234763347,0.013563927006472132,0.005096034037761044,0.0,0.0,0.0,321731.0
0.012395747787987799,-0.015670653836939108,-0.016068513737581114,0.0,0.0,0.0,322936.0
0.0020363937260212683,0.01897993370050055,-0.011108826810611205,0.0,0.0,0.0,324458.0
0.010230926560886422,-0.022117045208505937,0.005007665820599527,0.0,0.0,0.0,325611.0
-0.0015037330941374272,0.005000509140900444,-0.005943555387329269,0.0,0.0,0.0,327257.0
0.006371829707164212,0.017000433276404853,0.007698269745111119,0.0,0.0,0.0,330063.0
-0.010733939479859789,-0.019549637288090144,0.005693185579120907,0.0,0.0,0.0,337318.0
0.00617615711648134,-0.010667192302843992,-0.00876061716314247,0.0,0.0,0.0,400162.0
-0.012600239295114668,0.0223828869478942,-0.0031964273138900268,0.0,0.0,0.0,595933.0
0.0003397556626825171,0.015625459681400167,0.012582738473867039,0.0,0.0,0.0,800937.0
-0.0031111639130687596,-0.0190183613986957,-0.008854471262667474,0.0,0.0,0.0,999735.0
-0.003494529046643713,0.007634390379239159,-0.007526300573266198,0.0,0.0,0.0,1190338.0
0.014029684761837524,-0.006260768684286211,0.008052813122342073,0.0,0.0,0.0,1390463.0
-0.006774780517097234,0.01592835168475154,-0.007605277455628112,0.0,0.0,0.0,1590529.0
0.0001914106205258559,0.005889096094857715,0.0028852417933311614,0.0,0.0,0.0,1796269.0
0.012912737532047469,-0.023044274500372608,0.002452455524331043,0.0,0.0,0.0,1994926.0
-0.03237417228713646,0.020362371639750187,-0.009815360924436689,0.0,0.0,0.0,2210904.0
0.005631932074420032,0.002858011941999694,-0.014293030845829335,0.0,0.0,0.0,2407685.0
0.014137123213612601,-0.03752068214838017,0.010801286940225197,0.0,0.0,0.0,2607698.0
0.00011655594750537013,-0.0029925845885342695,-0.012068581851540472,0.0,0.0,0.0,2795311.0
-0.010100897451563173,0.0034063024917785067,0.010991381176923554,0.0,0.0,0.0,3011825.0
-0.024735757564778083,0.029245359853864922,-0.003407617823956599,0.0,0.0,0.0,3195636.0
0.011274595531837517,-0.01679143986844317,-0.03179600174643227,0.0,0.0,0.0,3397250.0
0.008733417145474598,-0.03637273067714572,0.027373508760284437,0.0,0.0,0.0,3591500.0
-0.0010765873201148413,-0.01476681367863747,-0.01243317253727838,0.0,0.0,0.0,3799661.0
-0.007715113002691565,0.03249819834169643,-0.03266821611164339,0.0,0.0,0.0,3991350.0
-0.0006078719922292253,0.03782347659534577,0.007082327584400971,0.0,0.0,0.0,4192349.0
-0.028566684708409507,-0.015450052696204114,0.016220049781580315,0.0,0.0,0.0,4420213.0
0.02501834191123531,0.0004674574374402274,-0.03296321708507044,0.0,0.0,0.0,4592132.0
0.019565561847427526,-0.009802656517092584,0.003431823186430094,0.0,0.0,0.0,4791228.0
0.0013307218959512923,-0.021932260268742426,0.008867023768523552,0.0,0.0,0.0,4994660.0
0.005381160222390768,0.020457582014061615,-0.010313762600100418,0.0,0.0,0.0,5191192.0
0.001173979298735195,0.03098893427517907,0.02948336663976825,0.0,0.0,0.0,5392449.0
0.03669787875612074,0.0025405965657717133,0.03441139989758746,0.0,0.0,0.0,5591770.0
0.0005931855939782515,0.008109506472938594,-0.014100815915908171,0.0,0.0,0.0,5793865.0
-0.041145813321320834,0.032393081515276756,-0.010285006120074769,0.0,0.0,0.0,5993629.0
0.018576078537144936,-0.02771587868545683,0.0023073492138294682,0.0,0.0,0.0,6191039.0
0.02513964770692878,-0.03375849222155508,-0.04478901256765866,0.0,0.0,0.0,6391356.0
-0.010081299854422188,-0.004044719097617083,0.04012934580247496,0.0,0.0,0.0,6590977.0
-0.02896909555409244,0.03226198511922121,0.018810242241430686,0.0,0.0,0.0,6791616.0
-0.008473736490029138,0.0078726857300917,-0.042661501614315256,0.0,0.0,0.0,6996020.0
0.01914733938531543,-0.012858218750668393,0.21448778847768502,0.0,0.0,0.0,7192851.0
0.021375223480989414,-0.039829481175657044,0.027614484021340147,0.0,0.0,0.0,7391113.0
-0.012431071389883419,0.02309494241928206,-0.09722704656831027,0.0,0.0,0.0,7590896.0
0.005583634713496544,0.0026307046028661296,-0.0061436705065247565,0.0,0.0,0.0,7804915.0
-0.014803912114774276,0.011586092528778735,-0.0026718994410437347,0.0,0.0,0.0,7990826.0
-0.0015333662340282217,0.008998176926887702,-0.02692135446934607,0.0,0.0,0.0,8208421.0
0.01059663748514128,-0.033151543633799574,0.0034669654307926123,0.0,0.0,0.0,8399337.0
-0.007992841925166472,0.01772117960238287,-0.01065290428922161,0.0,0.0,0.0,8592692.0
0.000006098144202271172,0.018463009552322357,-0.024354670336512285,0.0,0.0,0.0,8811737.0
-0.0033948234677250166,0.00634355183714444,0.0030984264541995543,0.0,0.0,0.0,8995706.0
-0.01223558089792176,-0.003957974554769789,0.00008344199656740159,0.0,0.0,0.0,9204971.0
0.015099731918071457,-0.03141428455255599,-0.03307869817376741,0.0,0.0,0.0,9396550.0
-0.017765239218363593,0.0038978568130647595,0.012682581268483872,0.0,0.0,0.0,9599629.0
-0.01765042050537069,0.0024631892345178263,0.0005801227433721579,0.0,0.0,0.0,9807949.0
-0.003952898366035074,0.006343706796224313,-0.012256376869306251,0.0,0.0,0.0,9991030.0
0.011090053006645118,-0.028607854796243615,0.019331949961381767,0.0,0.0,0.0,10191031.0
0.010276534112235503,-0.001366668065263782,-0.002268108417224468,0.0,0.0,0.0,10391309.0
-0.02186490668937613,0.014138325152900977,0.009122522884421613,0.0,0.0,0.0,10592527.0
-0.000735197841845836,-0.006682423518706293,0.00945402123703687,0.0,0.0,0.0,10793258.0
-0.01592492383993116,0.002819944568854954,0.007185574347257528,0.0,0.0,0.0,10992618.0
0.001763820410420669,0.010896944777295026,-0.023642132105123892,0.0,0.0,0.0,11191748.0
0.009999239242625801,-0.002637595723364472,0.017303908856273864,0.0,0.0,0.0,11391714.0
-0.0034006454278333598,-0.00904195747946665,0.0019588413266600213,0.0,0.0,0.0,11590872.0
-0.019890532401194982,0.028864346883210323,-0.0034354258513431546,0.0,0.0,0.0,11791795.0
0.0230430397580641,-0.02646530717582915,0.01322993342125578,0.0,0.0,0.0,11991641.0
0.000036582173108201665,0.024254482314231968,-0.018504426892224757,0.0,0.0,0.0,12192007.0
0.00003109484714203248,0.012116318073328858,-0.02337861370372707,0.0,0.0,0.0,12391055.0
-0.0025235872136391,0.015398868031787916,0.01157792543740399,0.0,0.0,0.0,12592142.0
0.025904995047369428,0.0020390407655287157,0.0004915089911783355,0.0,0.0,0.0,12791841.0
-0.011130783392170107,0.00768318404273205,0.01401760754789727,0.0,0.0,0.0,12993735.0
0.0270888195254384,-0.047869302480532616,-0.0033847352749614146,0.0,0.0,0.0,13192296.0
-0.03647449732370356,0.029011094816777327,0.010722799921678572,0.0,0.0,0.0,13397605.0
-0.02335331988796696,0.020409434647376573,-0.006185321757246953,0.0,0.0,0.0,13593736.0
0.01244971822107499,-0.013251979232467265,0.012592398686514628,0.0,0.0,0.0,13795552.0
0.004632235763907144,-0.022314179409088197,0.01580316923937275,0.0,0.0,0.0,13992110.0
0.006487418233030784,0.00993294273986392,-0.00866732560148975,0.0,0.0,0.0,14191099.0
-0.0038357261162274003,0.004193005382000181,-0.01756729809610391,0.0,0.0,0.0,14390903.0
-0.026210375710336575,0.005264045353861602,0.00886769285854605,0.0,0.0,0.0,14592843.0
0.034671207396778536,-0.0397255623611687,0.013487512989822648,0.0,0.0,0.0,14811712.0
-0.0011294850614625984,-0.0159167171649085,-0.012335510198884236,0.0,0.0,0.0,15007991.0
-0.04686007932532976,0.018770779871726567,0.03796495251564025,0.0,0.0,0.0,15207760.0
0.04006896783557756,-0.061394841871443534,0.01017019018333798,0.0,0.0,0.0,15391682.0
-0.007591398415961459,0.0353643971765879,-0.022805085429734362,0.0,0.0,0.0,15592503.0
-0.0022026927066830515,0.00455973658682074,0.012065424470296904,0.0,0.0,0.0,15798589.0
-0.02057225070139168,0.009825775490830246,-0.010144531869926254,0.0,0.0,0.0,16004253.0
-0.008986421202414663,0.021951911396419416,-0.013722482445272632,0.0,0.0,0.0,16196927.0
0.04081152617079575,-0.04254087267851819,0.011285442457529271,0.0,0.0,0.0,16398576.0
0.0032397968398648613,0.019090256196701627,-0.011657049661831564,0.0,0.0,0.0,16591515.0
-0.011696189303889826,0.033226714220720016,0.01474174773190029,0.0,0.0,0.0,16793929.0
0.03765823422795467,-0.04145729483761801,-0.008720000801787364,0.0,0.0,0.0,16993436.0
-0.010490460375080057,0.020011297361466784,-0.00741200068151926,0.0,0.0,0.0,17213670.0
-0.034416917664070956,0.049309604885132585,-0.009699954149848367,0.0,0.0,0.0,17391515.0
0.015795647952039027,-0.04903683017327512,0.004505330796970242,0.0,0.0,0.0,17598862.0
0.0032262800883423592,0.008468694656699832,-0.01572107841119852,0.0,0.0,0.0,17793758.0
0.03334234942381542,-0.031051611061723605,-0.026962741554914516,0.0,0.0,0.0,17991388.0
-0.014159013122546416,-0.00004386666661188032,0.0025814427038355348,0.0,0.0,0.0,18193160.0
-0.03498516966570775,0.056062713029396194,-0.0012055272722957255,0.0,0.0,0.0,18393982.0
0.03146262848159709,-0.014396705679049188,-0.009524892731011647,0.0,0.0,0.0,18592920.0
0.0148432354252922,-0.03263719050502539,0.014854204337819255,0.0,0.0,0.0,18790889.0
0.0032667184971947316,0.009658387868072604,0.0015756586480843993,0.0,0.0,0.0,18991620.0
-0.004873292114565553,0.012459625634745869,0.04553934876078358,0.0,0.0,0.0,19191042.0
-0.016042297081446,0.0037906806749271327,0.006409166280040068,0.0,0.0,0.0,19393446.0
-0.015335930632403572,0.020222075027211683,-0.0022028701304712683,0.0,0.0,0.0,19590887.0
0.033714465042130715,-0.033811225587440985,-0.01632179759734953,0.0,0.0,0.0,19790907.0
-0.004492733896622969,0.001010455210838257,-0.013023994876691702,0.0,0.0,0.0,19993033.0
-0.018268789765956472,0.014458889158426247,-0.0034205447998516547,0.0,0.0,0.0,20192081.0
-0.010428486297591633,-0.023409953233520436,0.02429299735408641,0.0,0.0,0.0,20392146.0
0.003035785431112381,-0.00799846146442712,0.001099248785520146,0.0,0.0,0.0,20591387.0
0.000030399782735779368,-0.006798692244763038,-0.007565833081867979,0.0,0.0,0.0,20793951.0
-0.001674138297849126,-0.004078884962900098,-0.02428088029976294,0.0,0.0,0.0,20991675.0
-0.01502304511435959,0.005882954063864465,-0.01893887146952089,0.0,0.0,0.0,21210880.0
0.010180420164337622,-0.00774948955235466,0.0060019787058624985,0.0,0.0,0.0,21418470.0
0.00525335024939011,0.0002129349951054127,0.0025514614104817923,0.0,0.0,0.0,21612067.0
-0.0014846263480770006,0.005280992415297975,-0.0029308881569249934,0.0,0.0,0.0,21796737.0
-0.010611913346220914,0.021488840006526927,-0.012691326268225112,0.0,0.0,0.0,22148954.0
0.023279863117610988,-0.018284484069222062,0.0028121975774038077,0.0,0.0,0.0,22194075.0
-0.004012113918161142,0.014208185501324355,0.005790121511349611,0.0,0.0,0.0,22394219.0
0.014439676013686786,-0.0006730428305137814,-0.0044281243459689534,0.0,0.0,0.0,22611276.0
-0.03277625269091744,0.014727919268425482,0.00558582193654189,0.0,0.0,0.0,22802248.0
0.014640195345509754,-0.016381276525414212,-0.009702219963559244,0.0,0.0,0.0,22991101.0
-0.01135583152444719,0.023475914750742122,0.00875350213009618,0.0,0.0,0.0,23200363.0
0.031147524559887008,-0.0199954647609491,-0.01975998362337883,0.0,0.0,0.0,23391959.0
-0.011774618310001483,0.028053857587718556,-0.03209568777054628,0.0,0.0,0.0,23591273.0
0.0010415841639768164,-0.024604230575261454,0.021168801579728225,0.0,0.0,0.0,23791174.0
-0.0008146315737941334,0.012236407861487802,0.00014355916259312096,0.0,0.0,0.0,23990925.0
0.007807555056043247,0.0027509438450835366,0.0018219020734822067,0.0,0.0,0.0,24191942.0
0.01003642868793364,-0.013811692462628394,-0.003551013593375174,0.0,0.0,0.0,24391164.0
-0.016969061960509402,0.018860060089503194,0.013131683840528652,0.0,0.0,0.0,24591539.0
0.020426304629175496,-0.03921894689736438,0.006061490285445004,0.0,0.0,0.0,24794355.0
0.002912342317024197,0.01936388794295965,-0.009297901866990088,0.0,0.0,0.0,24992772.0
-0.00007447620029110702,0.004559305967450439,-0.0019532425268842246,0.0,0.0,0.0,25207419.0
-0.011963303554312632,-0.012274584658616527,-0.005060009718407699,0.0,0.0,0.0,25396470.0
-0.007618840851404074,0.005716597771125348,0.01694866749008561,0.0,0.0,0.0,25592075.0
