0.000000000000000000e+00,0.000000000000000000e+00,0.000000000000000000e+00,0.000000000000000000e+00,0.000000000000000000e+00,0.000000000000000000e+00
-3.520466192219033701e+02,1.910133555651009146e+03,1.607414200860500387e+04,0.000000000000000000e+00,0.000000000000000000e+00,0.000000000000000000e+00
-4.995590181344523444e+02,2.706963946879684954e+03,2.277897067405605412e+04,0.000000000000000000e+00,0.000000000000000000e+00,0.000000000000000000e+00
-6.501539646283346201e+02,3.517515828091087769e+03,2.958981877468791208e+04,0.000000000000000000e+00,0.000000000000000000e+00,0.000000000000000000e+00
-8.067710335812951143e+02,4.354951987743583231e+03,3.660670775091239193e+04,0.000000000000000000e+00,0.000000000000000000e+00,0.000000000000000000e+00
-1.109780718909593361e+03,5.968661680197510577e+03,5.017180757380496652e+04,0.000000000000000000e+00,0.000000000000000000e+00,0.000000000000000000e+00
-1.301967387088271835e+03,6.983126800477361940e+03,5.868594049411373999e+04,0.000000000000000000e+00,0.000000000000000000e+00,0.000000000000000000e+00
-1.506755720808978595e+03,8.050801403369865511e+03,6.762729790811579733e+04,0.000000000000000000e+00,0.000000000000000000e+00,0.000000000000000000e+00
-1.736387710950659311e+03,9.251226060662833333e+03,7.767677642749773804e+04,0.000000000000000000e+00,0.000000000000000000e+00,0.000000000000000000e+00
-1.957285619843040195e+03,1.040329413214952001e+04,8.731405228135827929e+04,0.000000000000000000e+00,0.000000000000000000e+00,0.000000000000000000e+00
-2.277568058678881243e+03,1.205636290473580448e+04,1.011537988872363785e+05,0.000000000000000000e+00,0.000000000000000000e+00,0.000000000000000000e+00
-2.530094904207452601e+03,1.337302005736424690e+04,1.121766641035734792e+05,0.000000000000000000e+00,0.000000000000000000e+00,0.000000000000000000e+00
-2.863706308089922459e+03,1.511071160303194665e+04,1.267089990361604723e+05,0.000000000000000000e+00,0.000000000000000000e+00,0.000000000000000000e+00
-3.126942701949092225e+03,1.648197750412158712e+04,1.381952455696797406e+05,0.000000000000000000e+00,0.000000000000000000e+00,0.000000000000000000e+00
-3.373989209122903503e+03,1.777061658274711954e+04,1.489966951421833655e+05,0.000000000000000000e+00,0.000000000000000000e+00,0.000000000000000000e+00
-3.703549887585859324e+03,1.947974900468148553e+04,1.633193318882549647e+05,0.000000000000000000e+00,0.000000000000000000e+00,0.000000000000000000e+00
-4.016660256341484001e+03,2.110423054188478272e+04,1.769491604638677381e+05,0.000000000000000000e+00,0.000000000000000000e+00,0.000000000000000000e+00
-4.270554949399313955e+03,2.243317978106635564e+04,1.881056738805049390e+05,0.000000000000000000e+00,0.000000000000000000e+00,0.000000000000000000e+00
-4.524736532449470360e+03,2.377140845013963917e+04,1.993334161660440441e+05,0.000000000000000000e+00,0.000000000000000000e+00,0.000000000000000000e+00
-4.760675069490480382e+03,2.501243797356457071e+04,2.097484621999518131e+05,0.000000000000000000e+00,2.526315808296203613e+00,0.000000000000000000e+00
-5.077020808993625906e+03,2.667647288584843409e+04,2.237150499017960392e+05,0.000000000000000000e+00,5.894736886024475098e+00,0.000000000000000000e+00
-5.355302572775199224e+03,2.813607549735127395e+04,2.359844532318150741e+05,0.000000000000000000e+00,2.947368443012237549e+01,0.000000000000000000e+00
-5.595120770975382584e+03,2.939049577482493987e+04,2.465317041724856244e+05,4.042105293273925781e+01,9.515789330005645752e+01,7.578947424888610840e+00
-5.873570051102030448e+03,3.085984060728021359e+04,2.588742545616175630e+05,6.858947448730468750e+02,1.098947359323501587e+02,6.112280601263046265e+01
-6.131867262355202911e+03,3.222809210164787510e+04,2.703588878742596717e+05,1.700350880384445190e+03,3.755964964628219604e+02,6.636841747164726257e+01
-6.448780305318139654e+03,3.391532299803162459e+04,2.845293332776004681e+05,3.016280701398849487e+03,6.442280844449996948e+02,1.806140291392803192e+02
-6.727599951869819961e+03,3.539625043984038348e+04,2.969529163148057414e+05,4.219298243999481201e+03,7.967544075250625610e+02,2.908947288990020752e+02
-6.987905768297111536e+03,3.677448172998154769e+04,3.085047168941402924e+05,5.149596495866775513e+03,1.009543888509273529e+03,4.348070080578327179e+02
-7.248541263055476520e+03,3.815447283700155822e+04,3.200687858087845962e+05,5.990947376132011414e+03,1.103736877381801605e+03,6.350526222288608551e+02
-7.507589534891862968e+03,3.953811455343807756e+04,3.316445756332350429e+05,6.820438607186079025e+03,1.153456180453300476e+03,6.722280584871768951e+02
-7.826985712291092568e+03,4.124314741581439739e+04,3.459135387392096454e+05,7.841350891560316086e+03,1.160754431605339050e+03,6.461227919161319733e+02
-8.087531818331764953e+03,4.262836609963405499e+04,3.575165954567454173e+05,8.587824578136205673e+03,1.175578997574746609e+03,5.893333151936531067e+02
-8.368642120884424003e+03,4.412035445715559035e+04,3.700217506051794044e+05,9.295438615053892136e+03,1.109017598368227482e+03,4.765964679718017578e+02
-8.650362883876468914e+03,4.561235843867336371e+04,3.825348613517489284e+05,9.972105284780263901e+03,9.908772499486804008e+02,3.054034814238548279e+02
-8.891974249403041540e+03,4.689196315642236004e+04,3.932649859236438060e+05,1.048136844477057457e+04,8.517193559631705284e+02,8.287715941667556763e+01
-9.397428321204897657e+03,4.955948922200049128e+04,4.156363865665238118e+05,1.136689476361870766e+04,4.645619113743305206e+01,-6.877368909120559692e+02
-9.681707992672314504e+03,5.105358580572291976e+04,4.281677292825125041e+05,1.178714038172364235e+04,-4.629473204910755157e+02,-1.184614094376564026e+03
-9.946005473553179399e+03,5.244131153217978135e+04,4.398070121520748944e+05,1.201133336672186852e+04,-9.656139900311827660e+02,-1.509614100575447083e+03
-1.020871048012832034e+04,5.383005328614479367e+04,4.514461463165453752e+05,1.224145617632567883e+04,-1.494964869037270546e+03,-1.882052703619003296e+03
-1.047034918412582556e+04,5.521793486856055824e+04,4.630893199722383288e+05,1.246564916132390499e+04,-1.991701713971793652e+03,-2.236701832845807076e+03
-1.077160705617564417e+04,5.681989325573981478e+04,4.765246886709382525e+05,1.264538600577414036e+04,-2.564859611973166466e+03,-2.839333418965339661e+03
-1.105347861287416890e+04,5.831713253811219329e+04,4.890663930357117206e+05,1.273405267257988453e+04,-3.302684173554182053e+03,-3.831614123314619064e+03
-1.131630232291744869e+04,5.970765637026514742e+04,5.007143216106086620e+05,1.266814039342105389e+04,-3.913684174425899982e+03,-4.755982546798884869e+03
-1.157947439236743594e+04,6.109808858700307610e+04,5.123629957036460983e+05,1.259036846505105495e+04,-4.619561368986964226e+03,-5.704070268705487251e+03
-1.184308621760423921e+04,6.248801197762433731e+04,5.240134527408051072e+05,1.250370179977267981e+04,-5.239456102989614010e+03,-6.809298346437513828e+03
-1.216744495775151518e+04,6.419694376970474696e+04,5.383510732158062747e+05,1.222187723686546087e+04,-6.339245569966733456e+03,-8.466000108517706394e+03
-1.243237435020540579e+04,6.558662745992808777e+04,5.499993149829750182e+05,1.201364916562289000e+04,-7.235789424188435078e+03,-9.785386080741882324e+03
-1.271788493284670221e+04,6.708287040484278987e+04,5.625443482898728689e+05,1.181003512953966856e+04,-8.056877139486372471e+03,-1.137475450946390629e+04
-1.296163283976877392e+04,6.836380594458989799e+04,5.732973495610295795e+05,1.163298249708861113e+04,-8.788456082560122013e+03,-1.260064924971759319e+04
-1.322630014458629921e+04,6.975122432933907839e+04,5.849454003163547022e+05,1.142931582938879728e+04,-9.530596429668366909e+03,-1.398207030392438173e+04
-1.349033426068627887e+04,7.113885115128848702e+04,5.965928594890261302e+05,1.113373687904328108e+04,-1.018082449413090944e+04,-1.544057907548546791e+04
-1.886726459971620352e+04,9.903597066112241009e+04,8.333924569073487073e+05,-2.421447392637282610e+04,-1.727177170098572969e+04,-1.196464717641770840e+05
-2.011439508611177735e+04,1.055939329196649051e+05,8.890202466638959013e+05,-3.224619328815490007e+04,-2.075791205612570047e+04,-1.387914188123792410e+05
-2.039466123882503962e+04,1.070742060124687850e+05,9.015830433429129189e+05,-3.394633365399390459e+04,-2.146945591909438372e+04,-1.431557345298528671e+05
-2.065521623182628537e+04,1.084502044653868506e+05,9.132488688115216792e+05,-3.559619331753998995e+04,-2.223987697940319777e+04,-1.471075063945874572e+05
-2.091517099873805637e+04,1.098270122448797629e+05,9.249141481406934327e+05,-3.730238631609827280e+04,-2.301029803971201181e+04,-1.510474186101108789e+05
-2.158861507024323510e+04,1.134335823631535022e+05,9.554113216402358375e+05,-4.176473723540455103e+04,-2.514692963964492083e+04,-1.612504008950293064e+05
-2.186598739422383005e+04,1.149201268133891135e+05,9.679689152634298662e+05,-4.360217584923654795e+04,-2.602671912197023630e+04,-1.654516288947016001e+05
-2.214375396675382945e+04,1.164026033139854699e+05,9.805279521122646984e+05,-4.543961446306854486e+04,-2.690650860429555178e+04,-1.696528568943738937e+05
-2.240283091954430711e+04,1.177812349476746022e+05,9.921908289442359237e+05,-4.714580746162682772e+04,-2.772345598074048758e+04,-1.735539971797838807e+05
-2.266202419285596261e+04,1.191608876969994890e+05,1.003853908155056182e+06,-4.885200046018511057e+04,-2.854040335718542337e+04,-1.774551374651938677e+05
-2.302109674094152797e+04,1.210706369102157041e+05,1.020001739824527060e+06,-5.121442153511196375e+04,-2.967156126303225756e+04,-1.828567163219153881e+05
-2.342230515792264487e+04,1.231954146406862419e+05,1.037941655971365632e+06,-5.383933384058624506e+04,-3.092840338063985109e+04,-1.888584706071615219e+05
-2.375362905932610738e+04,1.248909034190189705e+05,1.052281338608308230e+06,-5.593926368496567011e+04,-3.193387707472592592e+04,-1.936598740353584290e+05
-2.428706939943676844e+04,1.274180153315842326e+05,1.073744912066885037e+06,-5.908915845153480768e+04,-3.344208761585503817e+04,-2.008619791776537895e+05
-2.487249728828712250e+04,1.302696986237106321e+05,1.097936806490161456e+06,-6.263279006392508745e+04,-3.513882447462528944e+04,-2.089643474627360702e+05
-2.519464549360985256e+04,1.318572011560531391e+05,1.111381766535195289e+06,-6.460147429303079844e+04,-3.608145606283098459e+04,-2.134656631766706705e+05
-2.547258637325876043e+04,1.332363942787755223e+05,1.123038705934117548e+06,-6.630766729158908129e+04,-3.689840343927592039e+04,-2.173668034620806575e+05
-2.574759370651810241e+04,1.346168612187678518e+05,1.134695855018994305e+06,-6.801386029014736414e+04,-3.771535081572085619e+04,-2.212679437474906445e+05
-2.602125672553468394e+04,1.359974053406991006e+05,1.146353469616109040e+06,-6.972005328870564699e+04,-3.853229819216579199e+04,-2.251690840329006314e+05
-2.629133502677706565e+04,1.373794515659084718e+05,1.158020673517257441e+06,-7.142624628726392984e+04,-3.934924556861072779e+04,-2.290702243183106184e+05
-2.660417582548030623e+04,1.391805740858329518e+05,1.174000424918736797e+06,-7.365742174691706896e+04,-4.041756136857718229e+04,-2.341717154607698321e+05
-2.693834885556723384e+04,1.406151467778079677e+05,1.187464011886161985e+06,-7.549486036074906588e+04,-4.129735085090249777e+04,-2.383729434604421258e+05
-2.712691006090354495e+04,1.419448807351887808e+05,1.200250478735775454e+06,-7.720105335930734873e+04,-4.211429822734743357e+04,-2.422740837458521128e+05
-2.723712903945987637e+04,1.433745923299428250e+05,1.213259863755512051e+06,-7.890724635786563158e+04,-4.293124560379236937e+04,-2.461752240312620997e+05
-2.738590892429425730e+04,1.449779169470107881e+05,1.226121869931494584e+06,-8.061343935642391443e+04,-4.374819298023730516e+04,-2.500763643166720867e+05
-2.758755584622419701e+04,1.472970703679476574e+05,1.240940830195970368e+06,-8.271336920080333948e+04,-4.475366667432337999e+04,-2.548777677448689938e+05
-2.819202530460470734e+04,1.496354460322858940e+05,1.252266575983400689e+06,-8.441956219936162233e+04,-4.557061405076831579e+04,-2.587789080302789807e+05
-2.883819435975435408e+04,1.528122731936766359e+05,1.262549458122014534e+06,-8.612575519791990519e+04,-4.638756142721325159e+04,-2.626800483156889677e+05
-2.941264517225195596e+04,1.566325448456454033e+05,1.272640453880365472e+06,-8.783194819647818804e+04,-4.720450880365818739e+04,-2.665811886010989547e+05
-3.037073222511324275e+04,1.612440929952924198e+05,1.281335685586864129e+06,-8.953814119503647089e+04,-4.802145618010312319e+04,-2.704823288865089417e+05
-3.042884908816462485e+04,1.675526491446942382e+05,1.292112807776036207e+06,-9.163807103941589594e+04,-4.902692987418919802e+04,-2.752837323147058487e+05
-3.025970791815253324e+04,1.732298079264590924e+05,1.300350949749227846e+06,-9.334426403797417879e+04,-4.984387725063413382e+04,-2.791848726001158357e+05
-2.986126639727722795e+04,1.792434034314954770e+05,1.308109202297873097e+06,-9.505045703653246164e+04,-5.066082462707906961e+04,-2.830860128855258226e+05
-2.910042369405964928e+04,1.856856146741941629e+05,1.315641122426886344e+06,-9.675665003509074450e+04,-5.147777200352400541e+04,-2.869871531709358096e+05
-2.795540548996099824e+04,1.924767786934915057e+05,1.322656441953596193e+06,-9.846284303364902735e+04,-5.229471937996894121e+04,-2.908882934563457966e+05
-2.620512351058060449e+04,2.011416912896543799e+05,1.330791983856463106e+06,-1.005627728780284524e+05,-5.330019307405501604e+04,-2.956896968845427036e+05
-2.449000962972808338e+04,2.089266565330408048e+05,1.337410610253842780e+06,-1.024002114918604493e+05,-5.417998255638033152e+04,-2.998909248842149973e+05
-2.319435378488742572e+04,2.156827850356510025e+05,1.342806007496179314e+06,-1.039751588751450181e+05,-5.493408782694488764e+04,-3.034919774553626776e+05
-2.189435589839622844e+04,2.230689341315164638e+05,1.349020697382780723e+06,-1.056813518737033010e+05,-5.575103520338982344e+04,-3.073931177407726645e+05
-2.043424738872202215e+04,2.310015086157502956e+05,1.355883944299634080e+06,-1.075187904875352979e+05,-5.663082468571513891e+04,-3.115943457404449582e+05
-1.996698952433419254e+04,2.395981802543469821e+05,1.363258709235604852e+06,-1.096187203319147229e+05,-5.763629837980121374e+04,-3.163957491686418653e+05
-1.897722392888463946e+04,2.470683669650229858e+05,1.370208626413189806e+06,-1.114561589457467198e+05,-5.851608786212652922e+04,-3.205969771683141589e+05
-1.777121875788652687e+04,2.534127788899574371e+05,1.376101646769119194e+06,-1.130311063290312886e+05,-5.927019313269108534e+04,-3.241980297394618392e+05
-1.641464049490038451e+04,2.603656203494753281e+05,1.382658878838591510e+06,-1.147372993275895715e+05,-6.008714050913602114e+04,-3.280991700248718262e+05
-1.481281031808551415e+04,2.674671059792516171e+05,1.388978430219362490e+06,-1.164434923261478543e+05,-6.090408788558095694e+04,-3.320003103102818131e+05
-1.374805952273594266e+04,2.748048314530659118e+05,1.395339727102821926e+06,-1.181496853247061372e+05,-6.172103526202589273e+04,-3.359014505956918001e+05
-1.361024002635481520e+04,2.842558175729797804e+05,1.402795617132422514e+06,-1.202496151690855622e+05,-6.272650895611196756e+04,-3.407028540238887072e+05
-1.365835325491518597e+04,2.926351180048534297e+05,1.409180312027412700e+06,-1.220870537829175591e+05,-6.360629843843728304e+04,-3.449040820235610008e+05
-1.387077585430469662e+04,3.005332059434784460e+05,1.415257024568537949e+06,-1.237932467814758420e+05,-6.442324581488221884e+04,-3.488052223089709878e+05
-1.433782957509456719e+04,3.084996907441667281e+05,1.421152183318110183e+06,-1.254994397800341249e+05,-6.524019319132715464e+04,-3.527063625943809748e+05
-1.503101656172501498e+04,3.172511989653636119e+05,1.427697523323859088e+06,-1.273368783938661218e+05,-6.611998267365247011e+04,-3.569075905940532684e+05
-1.571147940974015728e+04,3.273655649358462542e+05,1.435081212588100228e+06,-1.294368082382455468e+05,-6.712545636773854494e+04,-3.617089940222501755e+05
-1.632288900076337632e+04,3.356438216425983701e+05,1.441267387293152977e+06,-1.311430012368038297e+05,-6.794240374418348074e+04,-3.656101343076601624e+05
-1.710083955166446685e+04,3.439821251830938272e+05,1.447685137005412020e+06,-1.328491942353621125e+05,-6.875935112062841654e+04,-3.695112745930701494e+05
-1.792036951277644403e+04,3.522722063844631193e+05,1.454097178961466765e+06,-1.345553872339203954e+05,-6.957629849707335234e+04,-3.734124148784801364e+05
-1.871103041873180700e+04,3.604970217262038495e+05,1.460682638965706108e+06,-1.362615802324786782e+05,-7.039324587351828814e+04,-3.773135551638901234e+05
-1.973554369109585969e+04,3.703341215459878440e+05,1.468641406698934035e+06,-1.383615100768581033e+05,-7.139871956760436296e+04,-3.821149585920870304e+05
-2.078705585998731840e+04,3.789073958976548165e+05,1.476030836690850789e+06,-1.401989486906901002e+05,-7.227850904992967844e+04,-3.863161865917593241e+05
-2.155740090050553772e+04,3.861810778855939279e+05,1.482511753788394155e+06,-1.417738960739746690e+05,-7.303261432049423456e+04,-3.899172391629070044e+05
-2.217339474239892661e+04,3.940034811064020614e+05,1.490039065676370170e+06,-1.434800890725329518e+05,-7.384956169693917036e+04,-3.938183794483169913e+05
-2.274186058680811038e+04,4.011640923430813709e+05,1.497067276641790522e+06,-1.450550364558175206e+05,-7.460366696750372648e+04,-3.974194320194646716e+05
-2.365822125525863885e+04,4.110756257504889509e+05,1.507344732960119145e+06,-1.472862119154706597e+05,-7.567198276747018099e+04,-4.025209231619238853e+05
-2.461038398819290887e+04,4.185507333887533750e+05,1.515447037057398353e+06,-1.489924049140289426e+05,-7.648893014391511679e+04,-4.064220634473338723e+05
-2.559137307668438370e+04,4.258623441678792005e+05,1.523693896207436221e+06,-1.506985979125872254e+05,-7.730587752036005259e+04,-4.103232037327438593e+05
-2.660189231260464658e+04,4.329655996267345618e+05,1.532252814189715311e+06,-1.524047909111455083e+05,-7.812282489680498838e+04,-4.142243440181538463e+05
-2.780802473760740759e+04,4.398730786154182861e+05,1.541080286163922166e+06,-1.541109839097037911e+05,-7.893977227324992418e+04,-4.181254843035638332e+05
-2.940118103962896203e+04,4.481564600571440533e+05,1.551779942956759129e+06,-1.562109137540832162e+05,-7.994524596733599901e+04,-4.229268877317607403e+05
-3.085112932153784641e+04,4.547318420515035978e+05,1.560634699356196914e+06,-1.579171067526414990e+05,-8.076219334378093481e+04,-4.268280280171707273e+05
-3.225815070746414494e+04,4.611786050697253086e+05,1.570097432905068388e+06,-1.596232997511997819e+05,-8.157914072022587061e+04,-4.307291683025807142e+05
-3.366014357920233306e+04,4.673751213159016334e+05,1.579711214061912848e+06,-1.613294927497580647e+05,-8.239608809667080641e+04,-4.346303085879907012e+05
-3.497928566518208390e+04,4.733205732958420413e+05,1.589459275388140697e+06,-1.630356857483163476e+05,-8.321303547311574221e+04,-4.385314488734006882e+05
-3.652174039178674866e+04,4.807085976720097242e+05,1.602165853537730174e+06,-1.652668612079694867e+05,-8.428135127308219671e+04,-4.436329400158599019e+05
-3.768118877230327053e+04,4.862307884697823320e+05,1.611953255952574546e+06,-1.669730542065277696e+05,-8.509829864952713251e+04,-4.475340803012698889e+05
-3.881437910245885723e+04,4.916177630116979708e+05,1.621791481072669849e+06,-1.686792472050860524e+05,-8.591524602597206831e+04,-4.514352205866798759e+05
-3.983360139030425489e+04,4.969156607799736666e+05,1.631745161410993431e+06,-1.703854402036443353e+05,-8.673219340241700411e+04,-4.553363608720898628e+05
-4.116750810853980511e+04,5.020757864676401950e+05,1.641737938567142002e+06,-1.720916332022026181e+05,-8.754914077886193991e+04,-4.592375011574998498e+05
-4.259551102301666106e+04,5.070861973370629712e+05,1.651569158557615941e+06,-1.737978262007609010e+05,-8.836608815530687571e+04,-4.631386414429098368e+05
-4.316229456879573991e+04,5.225468031101647066e+05,1.684360931122171460e+06,-1.789164051964357495e+05,-9.081693028464168310e+04,-4.748420622991397977e+05
-4.333744413919930230e+04,5.280188447744479636e+05,1.696131567714038072e+06,-1.807538438102677464e+05,-9.169671976696699858e+04,-4.790432902988120914e+05
-4.403410980525022023e+04,5.327227226709636161e+05,1.707065477793230209e+06,-1.824600368088260293e+05,-9.251366714341193438e+04,-4.829444305842220783e+05
-4.473347236178657477e+04,5.392562303053223295e+05,1.724098568814724917e+06,-1.849537034990265965e+05,-9.370766715513914824e+04,-4.886460971552059054e+05
-4.491955448911056737e+04,5.440392927467200207e+05,1.736892542750020511e+06,-1.867911421128585935e+05,-9.458745663746446371e+04,-4.928473251548781991e+05
-4.546227481446269667e+04,5.481276623000041582e+05,1.748711782604110427e+06,-1.884973351114168763e+05,-9.540440401390939951e+04,-4.967484654402881861e+05
-4.527150872487261950e+04,5.521367331766786519e+05,1.760355018192485208e+06,-1.902035281099751592e+05,-9.622135139035433531e+04,-5.006496057256981730e+05
-4.546988067071146361e+04,5.560831387765315594e+05,1.773486575966433156e+06,-1.920409667238071561e+05,-9.710114087267965078e+04,-5.048508337253704667e+05
-4.565254141247614461e+04,5.595189474211422494e+05,1.785407793619448319e+06,-1.937471597223654389e+05,-9.791808824912458658e+04,-5.087519740107804537e+05
-4.624546549285343644e+04,5.655831650367235998e+05,1.809037295277336380e+06,-1.970283001042082906e+05,-9.948914089613407850e+04,-5.162541668673381209e+05
-4.669239790988755703e+04,5.689078269766943995e+05,1.822332046911062673e+06,-1.988657387180402875e+05,-1.003689303784593940e+05,-5.204553948670104146e+05
-4.676101482025326550e+04,5.722416893656887114e+05,1.835659869171851082e+06,-2.007031773318722844e+05,-1.012487198607847095e+05,-5.247700965502783656e+05
-4.649718249618369009e+04,5.752145895182165550e+05,1.848032935700290371e+06,-2.024064054181277752e+05,-1.020864216233491898e+05,-5.289633947224318981e+05
-4.628936691860810970e+04,5.779092575206079055e+05,1.859445980344897602e+06,-2.039786159592866898e+05,-1.028596847887933254e+05,-5.328341314967274666e+05
-4.540620759869184258e+04,5.814260496799863176e+05,1.876178534817846026e+06,-2.063369317710250616e+05,-1.040195795369595289e+05,-5.386402366581708193e+05
-4.505355692602179624e+04,5.841041856551296078e+05,1.889236145970841870e+06,-2.081711774023771286e+05,-1.049217198966443539e+05,-5.431560962281823158e+05
-4.485512448792321811e+04,5.863428679908177583e+05,1.900580703453144291e+06,-2.097433879435360432e+05,-1.056949830620884895e+05,-5.470268330024778843e+05
-4.507345800226964639e+04,5.888965405655560317e+05,1.914173673059877474e+06,-2.115776335748881102e+05,-1.065971234217733145e+05,-5.515426925724893808e+05
-4.558619624326817575e+04,5.909560812366612954e+05,1.925895507344911108e+06,-2.131498441160470247e+05,-1.073703865872174501e+05,-5.554134293467849493e+05
-4.470262986774489400e+04,5.951745057695184369e+05,1.950476482598009752e+06,-2.164252827434614301e+05,-1.089813515152260661e+05,-5.634774642932340503e+05
-4.498112682078356011e+04,5.976054112199165393e+05,1.965086560580821941e+06,-2.183905459199100733e+05,-1.099479304720312357e+05,-5.683158852611035109e+05
-4.533812068478009314e+04,5.994691246519987471e+05,1.977943046000600094e+06,-2.200937740061655641e+05,-1.107856322345957160e+05,-5.725091834332570434e+05
-4.532739931712965335e+04,6.012433022444439121e+05,1.990820561884502647e+06,-2.217970020924210548e+05,-1.116233339971601963e+05,-5.767024816054105759e+05
-4.543184509300501668e+04,6.028104045722801238e+05,2.002566181637080386e+06,-2.233692126335799694e+05,-1.123965971626043320e+05,-5.805732183797061443e+05
-4.651139148480950826e+04,6.052926226543289376e+05,2.019939952667759033e+06,-2.257275284453183413e+05,-1.135564919107705355e+05,-5.863793235411494970e+05
-4.705869391067295510e+04,6.072222432827221928e+05,2.032616369480149122e+06,-2.274307565315738320e+05,-1.143941936733350158e+05,-5.905726217133030295e+05
-4.744741101324322517e+04,6.092494171888530254e+05,2.045320725983343320e+06,-2.291339846178293228e+05,-1.152318954358994961e+05,-5.947659198854565620e+05
-4.778148729077455209e+04,6.113271901447604178e+05,2.057944972335095052e+06,-2.308372127040848136e+05,-1.160695971984639764e+05,-5.989592180576100945e+05
-4.794428701876947162e+04,6.134524254284562776e+05,2.070487478269761894e+06,-2.325404407903403044e+05,-1.169072989610284567e+05,-6.031525162297636271e+05
-4.851350149555180542e+04,6.160573746685218066e+05,2.086668704000974772e+06,-2.347677390569821000e+05,-1.180027551120743155e+05,-6.086360599933490157e+05
-4.911958872317374335e+04,6.183390705884806812e+05,2.101087777328961994e+06,-2.367330022334307432e+05,-1.189693340688794851e+05,-6.134744809612184763e+05
-4.998251469641496806e+04,6.201805589342312887e+05,2.113576835226334166e+06,-2.384362303196862340e+05,-1.198070358314439654e+05,-6.175165686097070575e+05
-5.117237820594316872e+04,6.219037336884951219e+05,2.125967174751935992e+06,-2.401394584059417248e+05,-1.206447375940084457e+05,-6.215586562581956387e+05
-5.216523172213727230e+04,6.235534917415021919e+05,2.138377031699891668e+06,-2.418426864921972156e+05,-1.214824393565729260e+05,-6.256007439066842198e+05
-5.397164678586662194e+04,6.252474689837520709e+05,2.154405958164087031e+06,-2.440699847588390112e+05,-1.225778955076187849e+05,-6.308865508316308260e+05
-5.572680335220104462e+04,6.263455664478058461e+05,2.166831904771565925e+06,-2.457732128450945020e+05,-1.234155972701832652e+05,-6.349286384801194072e+05
-5.761109402325758128e+04,6.271132261081914185e+05,2.180243720056023449e+06,-2.476074584764465690e+05,-1.243177376298680902e+05,-6.393297962989583611e+05
-5.877542025320420362e+04,6.277844128664347809e+05,2.192630348742222413e+06,-2.493106865627020597e+05,-1.251554393924325705e+05,-6.434165857021659613e+05
-5.987514116161099810e+04,6.281781553197479807e+05,2.204909149062968791e+06,-2.510139146489575505e+05,-1.259931411549970508e+05,-6.475033751053735614e+05
-6.077399915061330103e+04,6.284451004600689048e+05,2.217345815389933996e+06,-2.527171427352130413e+05,-1.268308429175615311e+05,-6.515901645085811615e+05
-6.167693044261426985e+04,6.287167938093576813e+05,2.232611380966450088e+06,-2.548134234567582607e+05,-1.278618604714870453e+05,-6.566200591586828232e+05
-6.244125189641402540e+04,6.289148353207110194e+05,2.244921057886455674e+06,-2.565166515430137515e+05,-1.286995622340515256e+05,-6.607068485618904233e+05
-6.324070960719958384e+04,6.290205996982440120e+05,2.257277159991361201e+06,-2.582198796292692423e+05,-1.295372639966160059e+05,-6.647936379650980234e+05
-6.388127703491612192e+04,6.289815622145299567e+05,2.269839213910421357e+06,-2.599231077155247331e+05,-1.303749657591804862e+05,-6.688804273683056235e+05
-6.443714263333212148e+04,6.288850743392325239e+05,2.283430162855436560e+06,-2.617573533468768001e+05,-1.312771061188653111e+05,-6.732815851871445775e+05
-6.503362426191172563e+04,6.291116256009101635e+05,2.299089233238596004e+06,-2.639846516135185957e+05,-1.323725622699111700e+05,-6.786258482528775930e+05
-6.538609663694348274e+04,6.291478753521799808e+05,2.311063214128307067e+06,-2.656878796997740865e+05,-1.332102640324756503e+05,-6.827126376560851932e+05
-6.555133897305311984e+04,6.292119036752437241e+05,2.323117414364673197e+06,-2.673911077860295773e+05,-1.340479657950401306e+05,-6.867994270592927933e+05
-6.580178442198193807e+04,6.292749796351222321e+05,2.335564449941580184e+06,-2.690943358722850680e+05,-1.348856675576046109e+05,-6.908862164625003934e+05
-6.589308872112668178e+04,6.293181406358372187e+05,2.348054791641921271e+06,-2.707975639585405588e+05,-1.357233693201690912e+05,-6.949730058657079935e+05
-6.592659178272426652e+04,6.293338433495780919e+05,2.364391324559879489e+06,-2.730248622251823545e+05,-1.368188254712149501e+05,-7.003172689314410090e+05
-6.590766547533318226e+04,6.293236235951053677e+05,2.377848007297393866e+06,-2.748591078565344214e+05,-1.377209658308997750e+05,-7.047184267502799630e+05
-6.585599831110409286e+04,6.292940056722674053e+05,2.390346608502925374e+06,-2.765623359427899122e+05,-1.385586675934642553e+05,-7.088052161534875631e+05
-6.577664517180771509e+04,6.292498645200444153e+05,2.402846416753883939e+06,-2.782655640290454030e+05,-1.393963693560287356e+05,-7.128920055566951632e+05
-6.567131690089574840e+04,6.291915111733408412e+05,2.415347394701541867e+06,-2.799687921153008938e+05,-1.402340711185932159e+05,-7.169787949599027634e+05
-6.549656072615079029e+04,6.290942991607384756e+05,2.431694316574144643e+06,-2.821960903819426894e+05,-1.413295272696390748e+05,-7.223230580256357789e+05
-6.534581577929485502e+04,6.290102884010620182e+05,2.444193788139303215e+06,-2.838993184681981802e+05,-1.421672290322035551e+05,-7.264098474288433790e+05
-6.516511074671822280e+04,6.289109468684643507e+05,2.457655823335405439e+06,-2.857335640995502472e+05,-1.430693693918883801e+05,-7.308110052476823330e+05
-6.498327925483964646e+04,6.288119141313083237e+05,2.470158214989519678e+06,-2.874367921858057380e+05,-1.439070711544528604e+05,-7.348977946508899331e+05
-6.478994984859044780e+04,6.287058195717452327e+05,2.482658225301670842e+06,-2.891400202720612288e+05,-1.447447729170173407e+05,-7.389845840540975332e+05
-6.450628013779845060e+04,6.285509917658899212e+05,2.499967008390029892e+06,-2.914983360837996006e+05,-1.459046676651835442e+05,-7.446432155354619026e+05
-6.426026314896831173e+04,6.284161415813325439e+05,2.514393542276156601e+06,-2.934635992602482438e+05,-1.468712466219887137e+05,-7.493587417699322104e+05
-6.404104668613545800e+04,6.282968440456370590e+05,2.526897734066676814e+06,-2.951668273465037346e+05,-1.477089483845531940e+05,-7.534455311731398106e+05
-6.381529224636949948e+04,6.281718919918419560e+05,2.539401649424899835e+06,-2.968700554327592254e+05,-1.485466501471176744e+05,-7.575323205763474107e+05
-6.360253553051708877e+04,6.280561282913521864e+05,2.550944871292007621e+06,-2.984422659739181399e+05,-1.493199133125618100e+05,-7.613047415639236569e+05
-6.329687224874638923e+04,6.278899336340926820e+05,2.567297513353765011e+06,-3.006695642405599356e+05,-1.504204396390840411e+05,-7.666490046296566725e+05
-6.304169537515286356e+04,6.277526344685349613e+05,2.580765747086185962e+06,-3.025038098719120026e+05,-1.513267554373964667e+05,-7.710501624484956264e+05
-6.280321937662484561e+04,6.276229576041842811e+05,2.593273817015083972e+06,-3.042070379581674933e+05,-1.521683343929722905e+05,-7.751250922024920583e+05
-6.256186609351085644e+04,6.274922855746996356e+05,2.605783318193798419e+06,-3.059102660444229841e+05,-1.530099133485481143e+05,-7.790666008990854025e+05
-6.229944394520465721e+04,6.273510806165583199e+05,2.619252334681880660e+06,-3.077445116757750511e+05,-1.539162291468605399e+05,-7.833113025723397732e+05
-6.205120225069625303e+04,6.272173106282331282e+05,2.631756972846565302e+06,-3.094477397620305419e+05,-1.547578081024363637e+05,-7.872528112689331174e+05
-6.174349674682263867e+04,6.270525211571680848e+05,2.647145415985149331e+06,-3.115440204835757613e+05,-1.557935975862219930e+05,-7.921038988955095410e+05
-6.147383710509489902e+04,6.269090660868741106e+05,2.660610579141166992e+06,-3.133782661149278283e+05,-1.566999133845344186e+05,-7.963486005687639117e+05
-6.120265654148881731e+04,6.267675691761533963e+05,2.674074976709045470e+06,-3.152125117462798953e+05,-1.576062291828468442e+05,-8.005933022420182824e+05
-6.094987497023055039e+04,6.266374706884721527e+05,2.686576783208530862e+06,-3.169157398325353861e+05,-1.584478081384226680e+05,-8.045348109386116266e+05
-6.069511880592005764e+04,6.265060279258413939e+05,2.699076863035172690e+06,-3.186189679187908769e+05,-1.592893870939984918e+05,-8.084763196352049708e+05
-6.037924793310185487e+04,6.263420861669224687e+05,2.714460659161854535e+06,-3.207152486403360963e+05,-1.603251765777841210e+05,-8.133274072617813945e+05
-6.010251416214917117e+04,6.261972275024483679e+05,2.727921216852779500e+06,-3.225494942716881633e+05,-1.612314923760965466e+05,-8.175721089350357652e+05
-5.984400009743270493e+04,6.260624010087742936e+05,2.740419681720881723e+06,-3.242527223579436541e+05,-1.620730713316723704e+05,-8.215136176316291094e+05
-5.958402744163004536e+04,6.259270195693548303e+05,2.752917615835105069e+06,-3.259559504441991448e+05,-1.629146502872481942e+05,-8.254551263282224536e+05
-5.932439513018473372e+04,6.257918846753669204e+05,2.765417397178940475e+06,-3.276591785304546356e+05,-1.637562292428240180e+05,-8.293966350248157978e+05
-5.888049767456097470e+04,6.255600924298872706e+05,2.786574958872381132e+06,-3.305415645225793123e+05,-1.651804397830292583e+05,-8.360668805113583803e+05
-5.859962713720947067e+04,6.254140193729751045e+05,2.800039601572664455e+06,-3.323758101539313793e+05,-1.660867555813416839e+05,-8.403115821846127510e+05
-5.831795901038090960e+04,6.252674967495760648e+05,2.813504706598252989e+06,-3.342100557852834463e+05,-1.669930713796541095e+05,-8.445562838578671217e+05
-5.807615349931939272e+04,6.251421147790044779e+05,2.825045901895042043e+06,-3.357822663264423609e+05,-1.677699134924933314e+05,-8.481945995777994394e+05
-5.781454100338288117e+04,6.250059180537257344e+05,2.837547104422902688e+06,-3.374854944126978517e+05,-1.686114924480691552e+05,-8.521361082743927836e+05
-5.747072076131743233e+04,6.248255627207189100e+05,2.853897432574566454e+06,-3.397127926793396473e+05,-1.697120187745913863e+05,-8.572903888776302338e+05
-5.718875379819222144e+04,6.246765696312328801e+05,2.867361242977134418e+06,-3.415470383106917143e+05,-1.706183345729038119e+05,-8.615350905508846045e+05
-5.694645778006106411e+04,6.245462451767892344e+05,2.878902025490441825e+06,-3.431192488518506289e+05,-1.713951766857430339e+05,-8.651734062708169222e+05
-5.668364915640843537e+04,6.244040307665930595e+05,2.891406636380686890e+06,-3.448224769381061196e+05,-1.722367556413188577e+05,-8.691149149674102664e+05
-5.642042380452961515e+04,6.242618031112770550e+05,2.903911880179929547e+06,-3.465257050243616104e+05,-1.730783345968946815e+05,-8.730564236640036106e+05
-5.605390183961123694e+04,6.240648509275495308e+05,2.921228966032397933e+06,-3.488840208360999823e+05,-1.742435977661535144e+05,-8.785138972439020872e+05
-5.579043468149850378e+04,6.239236036640445236e+05,2.933734397540122736e+06,-3.505872489223554730e+05,-1.750851767217293382e+05,-8.824554059404954314e+05
-5.552716230332147825e+04,6.237842085336901946e+05,2.946239972061441280e+06,-3.522904770086109638e+05,-1.759267556773051620e+05,-8.863969146370887756e+05
-5.524233081702025083e+04,6.236344171311128885e+05,2.959706821817195974e+06,-3.541247226399630308e+05,-1.768330714756175876e+05,-8.906416163103431463e+05
-5.497731718693106814e+04,6.234949897565633291e+05,2.972211964800541289e+06,-3.558279507262185216e+05,-1.776746504311934114e+05,-8.945831250069364905e+05
-5.471257364369744027e+04,6.233552773278238019e+05,2.984716425216555130e+06,-3.575311788124740124e+05,-1.785162293867692351e+05,-8.985246337035298347e+05
-5.436750008868234727e+04,6.231721621188697172e+05,3.001066437239691149e+06,-3.597584770791158080e+05,-1.796167557132914662e+05,-9.036789143067672849e+05
-5.410403811098224833e+04,6.230313522907580482e+05,3.013570848159322515e+06,-3.614617051653712988e+05,-1.804583346688672900e+05,-9.076204230033606291e+05
-5.382255428998619755e+04,6.228786082707989262e+05,3.027036743943978101e+06,-3.632959507967233658e+05,-1.813646504671797156e+05,-9.118651246766149998e+05
-5.356037939697899128e+04,6.227365409857857740e+05,3.039539352954853792e+06,-3.649991788829788566e+05,-1.822062294227555394e+05,-9.158066333732083440e+05
-5.331901852386918472e+04,6.226062120010314975e+05,3.051080528355465271e+06,-3.665713894241377711e+05,-1.829830715355947614e+05,-9.194449490931406617e+05
-5.297745690733005904e+04,6.224234524323568912e+05,3.067433013360572048e+06,-3.687986876907795668e+05,-1.840835978621169925e+05,-9.245992296963781118e+05
-5.271831224782229401e+04,6.222852007868699729e+05,3.079937079690989573e+06,-3.705019157770350575e+05,-1.849251768176928163e+05,-9.285407383929714561e+05
-5.243892139624214906e+04,6.221354662890752079e+05,3.093403899179612286e+06,-3.723361614083871245e+05,-1.858314926160052419e+05,-9.327854400662258267e+05
-5.219949348730046768e+04,6.220075719977254048e+05,3.104945002485295292e+06,-3.739083719495460391e+05,-1.866083347288444638e+05,-9.364237557861581445e+05
-5.193987579871393245e+04,6.218701865692908177e+05,3.117447420686419122e+06,-3.756116000358015299e+05,-1.874499136844202876e+05,-9.403652644827514887e+05
-4.928837995814972965e+04,6.203896194244162180e+05,3.239481884448013734e+06,-3.922508282630667090e+05,-1.956714927119687200e+05,-9.788707725187018514e+05
-4.887281249332666630e+04,6.201569414057404501e+05,3.258704846396929119e+06,-3.948711791649982333e+05,-1.969662295667007565e+05,-9.849346320519223809e+05
-4.858241129677854042e+04,6.199947674115123227e+05,3.272162975671680178e+06,-3.967054247963503003e+05,-1.978725453650131822e+05,-9.891793337251767516e+05
-4.831268563340436231e+04,6.198452653644499369e+05,3.284662178629360627e+06,-3.984086528826057911e+05,-1.987141243205890059e+05,-9.931208424217700958e+05
-4.804218442269403022e+04,6.196948207447540481e+05,3.297161958527614363e+06,-4.001118809688612819e+05,-1.995557032761648297e+05,-9.970623511183634400e+05
-4.764420095070632669e+04,6.194726150347680086e+05,3.315429767208775505e+06,-4.026012143256962299e+05,-2.007857032881602645e+05,-1.002823017674922943e+06
-4.735073327366047306e+04,6.193099772815319011e+05,3.328888916966436896e+06,-4.044354599570482969e+05,-2.016920190864726901e+05,-1.007067719348177314e+06
-4.707778145774194854e+04,6.191580336114461534e+05,3.341385428885537200e+06,-4.061386880433037877e+05,-2.025335980420485139e+05,-1.011009228044770658e+06
-4.680646154318409390e+04,6.190071729265237227e+05,3.353882297701601870e+06,-4.078419161295592785e+05,-2.033751769976243377e+05,-1.014950736741364002e+06
-4.653523589430331776e+04,6.188555089797779219e+05,3.366377889776117168e+06,-4.095451442158147693e+05,-2.042167559532001615e+05,-1.018892245437957346e+06
-4.617921932384988759e+04,6.186574855211295653e+05,3.382715441075182520e+06,-4.117724424824565649e+05,-2.053172822797223926e+05,-1.024046526041194797e+06
-4.590831795210947894e+04,6.185066390241878107e+05,3.395208170102890115e+06,-4.134756705687120557e+05,-2.061588612352982163e+05,-1.027988034737788141e+06
-4.563741198285553401e+04,6.183547081040459452e+05,3.407702896109342109e+06,-4.151788986549675465e+05,-2.070004401908740401e+05,-1.031929543434381485e+06
-4.536549656009893079e+04,6.182040101742695551e+05,3.420197452027585823e+06,-4.168821267412230372e+05,-2.078420191464498639e+05,-1.035871052130974829e+06
-4.509459054494680458e+04,6.180533547364065889e+05,3.432693299903730862e+06,-4.185853548274785280e+05,-2.086835981020256877e+05,-1.039812560827568173e+06
-4.476050904329204059e+04,6.178684225714000640e+05,3.448074033304963261e+06,-4.206816355490237474e+05,-2.097193875858113170e+05,-1.044663648454144597e+06
-4.448639980118858512e+04,6.177184400932346471e+05,3.460570131912869401e+06,-4.223848636352792382e+05,-2.105609665413871408e+05,-1.048605157150737941e+06
-4.419224030229314667e+04,6.175566917022644775e+05,3.474028065069185570e+06,-4.242191092666313052e+05,-2.114672823396995664e+05,-1.052849858823992312e+06
-4.391970715036662295e+04,6.174064727293553296e+05,3.486524435974742286e+06,-4.259223373528867960e+05,-2.123088612952753901e+05,-1.056791367520585656e+06
-4.366784907614979602e+04,6.172682812511360971e+05,3.498059711069200654e+06,-4.274945478940457106e+05,-2.130857034081146121e+05,-1.060429683240517974e+06
-4.330810061552147090e+04,6.170696307488449384e+05,3.514398681862635538e+06,-4.297218461606875062e+05,-2.141862297346368432e+05,-1.065583963843755424e+06
-4.206487021053220815e+04,6.163684714368889108e+05,3.571109743008053862e+06,-4.374518813213855028e+05,-2.180057034560963511e+05,-1.083472349466755986e+06
-4.177045363891775924e+04,6.161987012836228823e+05,3.584565688671850599e+06,-4.392861269527375698e+05,-2.189120192544087768e+05,-1.087717051140010357e+06
-4.141319252242916264e+04,6.159956683493556920e+05,3.600905131124315783e+06,-4.415134252193793654e+05,-2.200125455809310079e+05,-1.092871331743247807e+06
-4.111695275756865885e+04,6.158299281479927013e+05,3.614361688436325174e+06,-4.433476708507314324e+05,-2.209188613792434335e+05,-1.097116033416502178e+06
-4.084024538826389471e+04,6.156765244650398381e+05,3.626858037721868604e+06,-4.450508989369869232e+05,-2.217604403348192573e+05,-1.101057542113095522e+06
-4.056330376322455413e+04,6.155236876729463693e+05,3.639351911534262821e+06,-4.467541270232424140e+05,-2.226020192903950810e+05,-1.104999050809688866e+06
-4.028745587129030901e+04,6.153693216382887913e+05,3.651845979564888868e+06,-4.484573551094979048e+05,-2.234435982459709048e+05,-1.108940559506282210e+06
-3.993151495380449342e+04,6.151703941843500361e+05,3.668182693234458100e+06,-4.506846533761397004e+05,-2.245441245724931359e+05,-1.114094840109519660e+06
-3.963947854329437541e+04,6.150089303892147727e+05,3.681637819789788686e+06,-4.525188990074917674e+05,-2.254504403708055615e+05,-1.118339541782774031e+06
-3.936637242610296380e+04,6.148600102670179913e+05,3.694132576943174936e+06,-4.542221270937472582e+05,-2.262920193263813853e+05,-1.122281050479367375e+06
-3.909291912664525444e+04,6.147102253064756515e+05,3.706626071119764354e+06,-4.559253551800027490e+05,-2.271335982819572091e+05,-1.126222559175960720e+06
-3.882003261972677865e+04,6.145605671329457546e+05,3.719119353603606578e+06,-4.576285832662582397e+05,-2.279751772375330329e+05,-1.130164067872554064e+06
-3.846425054205690685e+04,6.143628337347774068e+05,3.735457643577611074e+06,-4.598558815329000354e+05,-2.290757035640552640e+05,-1.135318348475791514e+06
-3.819170795734842977e+04,6.142119113729278324e+05,3.747952087606783956e+06,-4.615591096191555262e+05,-2.299172825196310878e+05,-1.139259857172384858e+06
-3.791833157310926617e+04,6.140606571132915560e+05,3.760448644389706664e+06,-4.632623377054110169e+05,-2.307588614752069116e+05,-1.143201365868978202e+06
-3.764510835673460679e+04,6.139111318403311307e+05,3.772945704188523814e+06,-4.649655657916665077e+05,-2.316004404307827353e+05,-1.147142874565571547e+06
-3.735035257114878914e+04,6.137496432568916352e+05,3.786404238976181019e+06,-4.667998114230185747e+05,-2.325067562290951610e+05,-1.151387576238825917e+06
-3.707814047339959507e+04,6.136002133326708572e+05,3.798900994396768976e+06,-4.685030395092740655e+05,-2.333483351846709847e+05,-1.155382453354351223e+06
-3.669925262156376266e+04,6.133916852722659241e+05,3.816204278280504514e+06,-4.708613553210124373e+05,-2.345135983539298177e+05,-1.160913821668155491e+06
-3.642573961470001086e+04,6.132403611670670798e+05,3.828700126147042029e+06,-4.725645834072679281e+05,-2.353551773095056415e+05,-1.164893874222166836e+06
-3.613131354436384572e+04,6.130785190733358031e+05,3.842156238559124526e+06,-4.743988290386199951e+05,-2.362614931078180671e+05,-1.169128505715735257e+06
-3.586002164597900992e+04,6.129296342909854138e+05,3.854650213229137938e+06,-4.761020571248754859e+05,-2.371030720633938909e+05,-1.173060663531191647e+06
-3.558821952910105028e+04,6.127813624971655663e+05,3.867144354617599864e+06,-4.778052852111309767e+05,-2.379446510189697146e+05,-1.177022470469675958e+06
-3.523278131855757238e+04,6.125883596225995570e+05,3.883484809078664985e+06,-4.800325834777727723e+05,-2.390451773454919457e+05,-1.182233715980552137e+06
-3.496169155465752556e+04,6.124412120733212214e+05,3.895980564055684488e+06,-4.817358115640282631e+05,-2.398867563010677695e+05,-1.186218786077104509e+06
-3.469121032829569594e+04,6.122944409756242530e+05,3.908475553388952743e+06,-4.834390396502837539e+05,-2.407283352566435933e+05,-1.190203856173656881e+06
-3.441909160233408329e+04,6.121441113103328971e+05,3.920971041178734507e+06,-4.851422677365392447e+05,-2.415699142122194171e+05,-1.194188926270209253e+06
-3.414931590500053426e+04,6.119927679645214230e+05,3.933466665377376135e+06,-4.868454958227947354e+05,-2.424114931677952409e+05,-1.198173996366761625e+06
-3.379895540875935694e+04,6.117951035495877732e+05,3.949804592993336730e+06,-4.890727940894365311e+05,-2.435120194943174720e+05,-1.203385241877637804e+06
-3.350965428395118215e+04,6.116326295656858711e+05,3.963258579924210440e+06,-4.909070397207885981e+05,-2.444183352926298976e+05,-1.207676855827771127e+06
-3.324002300996657868e+04,6.114812687012127135e+05,3.975750998327633832e+06,-4.926102678070440888e+05,-2.452599142482057214e+05,-1.211661925924323499e+06
-3.295050307307777985e+04,6.113211115168151446e+05,3.989204643479102291e+06,-4.944445134383961558e+05,-2.461662300465181470e+05,-1.215953539874456823e+06
-3.270275292165418432e+04,6.111837757423400180e+05,4.000735774516835809e+06,-4.960167239795550704e+05,-2.469430721593573689e+05,-1.219632066117428243e+06
-3.235026175919441812e+04,6.109881348673569737e+05,4.017072053775354754e+06,-4.982440222461968660e+05,-2.480435984858796000e+05,-1.224843311628304422e+06
-3.205960322557542531e+04,6.108252289916544687e+05,4.030524754862248898e+06,-5.000782678775489330e+05,-2.489499142841920257e+05,-1.229134925578437746e+06
-3.179144469805343033e+04,6.106742275951062329e+05,4.043015888055511285e+06,-5.017814959638044238e+05,-2.497914932397678494e+05,-1.233119995674990118e+06
-3.154248020639830793e+04,6.105343016427077819e+05,4.054548501637710258e+06,-5.033537065049633384e+05,-2.505683353526070714e+05,-1.236798521917961538e+06
-3.127119496675440314e+04,6.103816018599761883e+05,4.067040331569932867e+06,-5.050569345912188292e+05,-2.514099143081828952e+05,-1.240783592014513910e+06
-3.093593196845078273e+04,6.101944061635115650e+05,4.082413399406118784e+06,-5.071532153127640486e+05,-2.524457037919685245e+05,-1.245688293671809137e+06
-3.064151641687233496e+04,6.100299269327836810e+05,4.095867028153733350e+06,-5.089874609441161156e+05,-2.533520195902809501e+05,-1.249979907621942461e+06
-3.036778430417961863e+04,6.098781321457276354e+05,4.108360142589711118e+06,-5.106906890303716063e+05,-2.541935985458567739e+05,-1.253964977718494833e+06
-3.009461978208809887e+04,6.097241162470923737e+05,4.120854796437180601e+06,-5.123939171166270971e+05,-2.550351775014325976e+05,-1.257950047815047204e+06
-2.982193771200759875e+04,6.095702235034093028e+05,4.133348029426746536e+06,-5.140971452028825879e+05,-2.558767564570084214e+05,-1.261935117911599576e+06
-2.946752863044706828e+04,6.093684212067089975e+05,4.149681058010089211e+06,-5.163244434695243835e+05,-2.569772827835306525e+05,-1.267146363422475755e+06
-2.917541684545922908e+04,6.092030756441396661e+05,4.163137152577041648e+06,-5.181586891008764505e+05,-2.578835985818430781e+05,-1.271437977372609079e+06
-2.890284107805640087e+04,6.090487229682083707e+05,4.175632438495710026e+06,-5.198619171871319413e+05,-2.587251775374189019e+05,-1.275423047469161451e+06
-2.863157761147276688e+04,6.088928135085857939e+05,4.188126864979770966e+06,-5.215651452733874321e+05,-2.595667564929947257e+05,-1.279408117565713823e+06
-2.835870025147591514e+04,6.087388847330996068e+05,4.200622428464557044e+06,-5.232683733596429229e+05,-2.604083354485705495e+05,-1.283393187662266195e+06
-2.810552218019208158e+04,6.085976191624064231e+05,4.212155292636218481e+06,-5.248405839008018374e+05,-2.611851775614097714e+05,-1.287071713905237615e+06
-2.743563158956537882e+04,6.082232715169811854e+05,4.242904869700687006e+06,-5.290331453438922763e+05,-2.632567565289810300e+05,-1.296881117219828069e+06
-2.714174275990731621e+04,6.080588788693775423e+05,4.256356540698447265e+06,-5.308673909752443433e+05,-2.641630723272934556e+05,-1.301172731169961393e+06
-2.686911298816190902e+04,6.079062083609981928e+05,4.268849751932568848e+06,-5.325706190614998341e+05,-2.650046512828692794e+05,-1.305157801266513765e+06
-2.659757207129795279e+04,6.077530897379100788e+05,4.281343688139097765e+06,-5.342738471477553248e+05,-2.658462302384451032e+05,-1.309142871363066137e+06
-2.630721638051253831e+04,6.075877510082504014e+05,4.294800077390154824e+06,-5.361080927791073918e+05,-2.667525460367575288e+05,-1.313434485313199461e+06
-2.595527451999858022e+04,6.073883940974513534e+05,4.311136796611145139e+06,-5.383353910457491875e+05,-2.678530723632797599e+05,-1.318645730824075639e+06
-2.566513849747832865e+04,6.072258645347825950e+05,4.324588731044791639e+06,-5.401696366771012545e+05,-2.687593881615921855e+05,-1.322937344774208963e+06
-2.539521817242761972e+04,6.070752892170380801e+05,4.337080336001783609e+06,-5.418728647633567452e+05,-2.696009671171680093e+05,-1.326922414870761335e+06
-2.514728400616843646e+04,6.069376480793560622e+05,4.348612528624073602e+06,-5.434450753045156598e+05,-2.703778092300072312e+05,-1.330600941113732755e+06
-2.487789764375003506e+04,6.067858628257844830e+05,4.361107645041696727e+06,-5.451483033907711506e+05,-2.712193881855830550e+05,-1.334586011210285127e+06
-2.450113351317099296e+04,6.065760228830296546e+05,4.378407553203223273e+06,-5.475066192025095224e+05,-2.723846513548418880e+05,-1.340103800574742258e+06
-2.422965404992046751e+04,6.064247592263887636e+05,4.390900185260329396e+06,-5.492098472887650132e+05,-2.732262303104177117e+05,-1.344088870671294630e+06
-2.395784645893576453e+04,6.062733089200319955e+05,4.403392625991608948e+06,-5.509130753750205040e+05,-2.740678092659935355e+05,-1.348073940767847002e+06
-2.368690916170593118e+04,6.061239983617935795e+05,4.415883898550320417e+06,-5.526163034612759948e+05,-2.749093882215693593e+05,-1.352059010864399374e+06
-2.341283306272928894e+04,6.059746391399522545e+05,4.428375758403313346e+06,-5.543195315475314856e+05,-2.757509671771451831e+05,-1.356044080960951746e+06
-2.305477644548209719e+04,6.057839198479504557e+05,4.444713594896792434e+06,-5.565468298141732812e+05,-2.768514935036674142e+05,-1.361255326471827924e+06
-2.278171730863124321e+04,6.056382057206828613e+05,4.457205949371800758e+06,-5.582500579004287720e+05,-2.776930724592432380e+05,-1.365240396568380296e+06
-2.250713995872276791e+04,6.054924584747479530e+05,4.469698360683506355e+06,-5.599532859866842628e+05,-2.785346514148190618e+05,-1.369225466664932668e+06
-2.223170307216700530e+04,6.053479759284252068e+05,4.482189671052702703e+06,-5.616565140729397535e+05,-2.793762303703948855e+05,-1.373210536761485040e+06
-2.195697208665329890e+04,6.052047120270639425e+05,4.494681482153645717e+06,-5.633597421591952443e+05,-2.802178093259707093e+05,-1.377195606858037412e+06
-2.159578674690694243e+04,6.050169274362083524e+05,4.511014461942595430e+06,-5.655870404258370399e+05,-2.813183356524929404e+05,-1.382406852368913591e+06
-2.129823176509459518e+04,6.048626943513870938e+05,4.524468061497920193e+06,-5.674212860571891069e+05,-2.822246514508053660e+05,-1.386698466319046915e+06
-2.102199504356656325e+04,6.047182004912752891e+05,4.536961098839734681e+06,-5.691245141434445977e+05,-2.830662304063811898e+05,-1.390683536415599287e+06
-2.074538205208483851e+04,6.045730517714613816e+05,4.549455345824884251e+06,-5.708277422297000885e+05,-2.839078093619570136e+05,-1.394668606512151659e+06
-2.047089128395088119e+04,6.044260535704212962e+05,4.561948897194813006e+06,-5.725309703159555793e+05,-2.847493883175328374e+05,-1.398653676608704031e+06
-2.011060487466468476e+04,6.042358041881702375e+05,4.578283396298422478e+06,-5.747582685825973749e+05,-2.858499146440550685e+05,-1.403864922119580209e+06
-1.981546011124974393e+04,6.040791028816142352e+05,4.591732979552160017e+06,-5.765925142139494419e+05,-2.867562304423674941e+05,-1.408156536069713533e+06
-1.956271974060521825e+04,6.039437924483264796e+05,4.603261802556243725e+06,-5.781647247551083565e+05,-2.875330725552067161e+05,-1.411835062312684953e+06
-1.929045079261437786e+04,6.037970754360058345e+05,4.615751249851132743e+06,-5.798679528413638473e+05,-2.883746515107825398e+05,-1.415820132409237325e+06
-1.901733024885474879e+04,6.036495290712168207e+05,4.628241608376032673e+06,-5.815711809276193380e+05,-2.892162304663583636e+05,-1.419805202505789697e+06
-1.874391680170554901e+04,6.034994103073262377e+05,4.640731592329735868e+06,-5.832744090138748288e+05,-2.900578094219341874e+05,-1.423790272602342069e+06
-1.836817181550022360e+04,6.032903910102108493e+05,4.658023428838212043e+06,-5.856327248256132007e+05,-2.912230725911930203e+05,-1.429308061966799200e+06
-1.809805403956668670e+04,6.031396354486485943e+05,4.670510234298978001e+06,-5.873359529118686914e+05,-2.920646515467688441e+05,-1.433293132063351572e+06
-1.780639457940185093e+04,6.029758172439420596e+05,4.683956011549893767e+06,-5.891701985432207584e+05,-2.929709673450812697e+05,-1.437584746013484895e+06
-1.753285369234575410e+04,6.028250679018088849e+05,4.696441244427041151e+06,-5.908734266294762492e+05,-2.938125463006570935e+05,-1.441569816110037267e+06
-1.723859428979847507e+04,6.026637373969944892e+05,4.709887083166541532e+06,-5.927076722608283162e+05,-2.947188620989695191e+05,-1.445861430060170591e+06
-1.686594736305776678e+04,6.024566369591563707e+05,4.727175151332781650e+06,-5.950659880725666881e+05,-2.958841252682283521e+05,-1.451379219424627721e+06
-3.873238103818775713e+07,7.274965376411168277e+07,1.138550197372924536e+08,-1.275375620812503248e+07,-6.303592604910351336e+06,-2.989926191944410652e+07
2.367722799664172530e+07,-6.127992999934804440e+07,5.989580857057389021e+08,-3.899198487689086795e+07,-1.926811641555591673e+07,-9.128926675683340430e+07
7.407151920119710267e+07,-1.348554518575903773e+08,8.878141482995094061e+08,-6.542647782821137458e+07,-3.232961601662091166e+07,-1.531384742868869603e+08
1.060894108708049357e+07,-5.313204046657553315e+07,1.522730024086132050e+09,-9.177816769103084505e+07,-4.535020193307637423e+07,-2.147939461014773548e+08
3.460982219269932508e+08,4.534595813851748705e+08,1.940524713479280949e+09,-1.186540587517817169e+08,-5.862979995732098073e+07,-2.776758998742451668e+08
4.868482317757598162e+08,1.013389262119171262e+09,2.262729102273209095e+09,-1.446934027870909572e+08,-7.149605324069237709e+07,-3.386005711418985724e+08
4.364116902661637068e+08,1.059418753312914014e+09,3.023128092236501694e+09,-1.708366437356617749e+08,-8.441364284035390615e+07,-3.997683316854416728e+08
5.591898639595813751e+08,1.139679863545737505e+09,4.143681193729752541e+09,-1.967844065069485009e+08,-9.723464507065242529e+07,-4.604787287994419932e+08
9.953848658626012802e+08,1.658476050118959427e+09,4.670927811126558304e+09,-2.239667476056802571e+08,-1.106656625700579435e+08,-5.240776886457356215e+08
1.569803418910519123e+09,1.601355524241266012e+09,5.421779888945414543e+09,-2.494508392848702073e+08,-1.232575611139116287e+08,-5.837032270619130135e+08
2.171253904450375557e+09,1.192532976394937992e+09,5.879936616103901863e+09,-2.755739035314961672e+08,-1.361651812397917211e+08,-6.448237798520046473e+08
2.870642062571283817e+09,8.948365483606429100e+08,6.727244046415225983e+09,-3.012475775984408855e+08,-1.488507539950852692e+08,-7.048928872243136168e+08
3.036168731785897732e+09,6.500586610512770414e+08,6.892135709567023277e+09,-3.273264889323692918e+08,-1.617365578049631119e+08,-7.659101347357485294e+08
3.214017020336510181e+09,6.620899476966680288e+08,6.829857571374515533e+09,-3.539779469383697510e+08,-1.749052616175999045e+08,-8.282669788873322010e+08
3.720810187010269165e+09,5.081616690932720304e+08,7.351847151540604591e+09,-3.807906875423840880e+08,-1.881536564836454690e+08,-8.910011785226739645e+08
4.095375959482779026e+09,3.036653922936517000e+08,8.023557965424076080e+09,-4.058078326908498406e+08,-2.005148329199858904e+08,-9.495341946446888447e+08
4.611953667687087059e+09,1.323401849635431170e+08,8.954891309486043930e+09,-4.325152351886065006e+08,-2.137111793644712269e+08,-1.012021933021751523e+09
4.907426114532405853e+09,-1.964921191148819923e+08,1.009841902316658020e+10,-4.584652252581598759e+08,-2.265332821210962534e+08,-1.072737541381262779e+09
5.327458707433652878e+09,-5.299164150459923148e+08,1.174462534938481522e+10,-4.844123329417211413e+08,-2.393539606671810746e+08,-1.133446405775995255e+09
5.657065070472692490e+09,-3.909199784650111198e+08,1.347989920945602417e+10,-5.107759454011443853e+08,-2.523804376363255680e+08,-1.195129773081261635e+09
5.868980941269230843e+09,-9.044173387209709883e+08,1.525541558303998947e+10,-5.369533819289853573e+08,-2.653149235519413352e+08,-1.256377541570589304e+09
6.221108659833139420e+09,-1.497664607734807730e+09,1.711239890546521568e+10,-5.631705167729907036e+08,-2.782690247309063077e+08,-1.317718192847552061e+09
6.589587440693966866e+09,-1.545981860292372465e+09,1.889819897235166931e+10,-5.893569935114433765e+08,-2.912079774886709452e+08,-1.378987112862776756e+09
7.239909811735845566e+09,-1.674088493732819557e+09,2.112310706856742859e+10,-6.154305331260228157e+08,-3.040911270879966021e+08,-1.439991792076214790e+09
7.419005385136822701e+09,-2.293566042076312542e+09,2.304898115455567551e+10,-6.419724604643225670e+08,-3.172057109001055956e+08,-1.502092365566204786e+09
7.501775943917294502e+09,-2.427276099100987434e+09,2.432760918070300293e+10,-6.681033857636543512e+08,-3.301172152365498543e+08,-1.563231310987511158e+09
7.639815107622370720e+09,-2.595310110887087345e+09,2.568659993882881165e+10,-6.941723397641553879e+08,-3.429980990463797450e+08,-1.624225261166073799e+09
7.860888448245179176e+09,-2.521240203430298328e+09,2.733261507001353073e+10,-7.204355927840347290e+08,1.053941090840529680e+09,-1.685673815879497051e+09
7.772290047364704132e+09,-2.618495183316164017e+09,2.937289407954866791e+10,-4.337697546261180878e+09,3.094385891055105925e+08,-3.183996324247784615e+09
7.631729105570838928e+09,-2.387093973535476685e+09,3.134509848356318665e+10,1.000957598427907181e+10,-3.859217808088171482e+09,-6.026501135579154968e+09
7.173394453489770889e+09,-2.075394347118417025e+09,3.293790106349958801e+10,-6.237675600896883011e+09,-1.852086977114058304e+10,-1.237678151954275131e+10
6.816640994361364365e+09,-2.137785876906647682e+09,3.447228723122026825e+10,-2.394993377962564087e+10,-3.183082314133101654e+10,-1.523672546963556099e+10
5.803891410019376755e+09,-2.381597704714758396e+09,3.584610654165541077e+10,-3.951165379571917725e+10,-4.440069206844270325e+10,-2.716585518168698883e+10
4.877141624766353607e+09,-2.273214105855449200e+09,3.701790161530245972e+10,-3.834998844638732910e+10,-5.207664439891263580e+10,-3.489786049773797607e+10
4.048942315700408459e+09,-1.722194890248941898e+09,3.854255205196984100e+10,-1.805663479002920914e+10,-4.849129534678127289e+10,-4.765744674361341095e+10
3.584374506716713905e+09,-1.483533251876104355e+09,3.979331130058749390e+10,-1.209213756238849258e+10,-4.483478002025576019e+10,-6.067030044064257050e+10
3.140506560547354698e+09,-1.376103808317832470e+09,4.121480697047274017e+10,-4.338375340617892265e+09,-4.810398266552590942e+10,-7.382923277090330505e+10
2.623349769169149399e+09,-1.407412965122245789e+09,4.275176948826061249e+10,-1.044754632463893509e+10,-5.492148498131899261e+10,-8.929467810083139038e+10
2.245553951588963985e+09,-1.495094431962208748e+09,4.410039709200504303e+10,-2.725534186667330933e+10,-6.422379955648751831e+10,-1.052998868308212891e+11
2.204891422785029888e+09,-1.852301225399415970e+09,4.546310456778302002e+10,-2.694077771928184128e+10,-6.288065289180709076e+10,-1.355374373109433594e+11
1.890162102220729113e+09,-2.082189887159431219e+09,4.662278675548922729e+10,-2.951599009029325104e+10,-6.149464673499150848e+10,-1.783391176129322510e+11
1.244591629079052925e+09,-2.258995101592777252e+09,4.744600502657366180e+10,-3.065190390653724670e+10,-5.414731902880797577e+10,-2.328098962189264832e+11
4.930683065614478588e+08,-2.201217871533356190e+09,4.855435419291717529e+10,-2.225177773535152054e+10,-4.536241229956726074e+10,-2.980561598163613892e+11
-3.863113804216119051e+08,-2.140129002289001703e+09,4.967832398236161804e+10,-9.587276265889764786e+09,-3.648629642402962494e+10,-3.737265509502424316e+11
-1.608681243825858593e+09,-2.042591539957373619e+09,5.043596745946495056e+10,3.116514491586044312e+09,-2.898368372426696777e+10,-4.692462512773401489e+11
-2.818235887675653458e+09,-2.323404924893235207e+09,5.156236971702067566e+10,1.092496052688893700e+10,-1.582302454094965553e+10,-5.967458868078553467e+11
-3.724997799081461906e+09,-2.192028365257606983e+09,5.265762117192495728e+10,1.523190046596865463e+10,-2.102112448981422424e+10,-7.517404980983603516e+11
-4.253838995035230160e+09,-2.232880005256095886e+09,5.356455146850289917e+10,2.446510384572696686e+10,-4.022016307836768341e+10,-9.026791498989642334e+11
-4.787402681768077850e+09,-2.425819775995486259e+09,5.467828680222586823e+10,4.963759167526120758e+10,-6.515900084411300659e+10,-1.073965541078843506e+12
-5.505631583825829506e+09,-2.675868107355730057e+09,5.606132269897901917e+10,6.835618079198297119e+10,-7.527826769608776855e+10,-1.253799871064248291e+12
-6.116210608522376060e+09,-2.738530309037813187e+09,5.724558191456676483e+10,8.857465200366738892e+10,-8.051822578005761719e+10,-1.454230001758160645e+12
-6.176574371773414612e+09,-2.239513980184626102e+09,5.859923087281428528e+10,1.226389795141998596e+11,-8.515143484215361023e+10,-1.676809827528772949e+12
-6.348278700848845482e+09,-2.364302807916975498e+09,6.010888102145722961e+10,1.541096014938083496e+11,-9.149786310055712891e+10,-1.909804681116172119e+12
-6.289702565373332977e+09,-2.555984888203440189e+09,6.211338058133950043e+10,2.089688105708815918e+11,-8.823646078491731262e+10,-2.203262031691534180e+12
-6.199748605749603271e+09,-2.356371136059027195e+09,6.389774911022736359e+10,2.698533074095347595e+11,-8.495421357059344482e+10,-2.558888257982382324e+12
-6.286742100313361168e+09,-2.639501763212994576e+09,6.556990368097080231e+10,3.474290793737796631e+11,-8.240157726618118286e+10,-2.962713865575081543e+12
-6.287468748289402962e+09,-3.031157306585275650e+09,6.659346882540232849e+10,4.345425501700794067e+11,-8.755210106702027893e+10,-3.410104614705579590e+12
-6.645256733830759048e+09,-3.932676726049436569e+09,6.759900925236707306e+10,5.313363179579312744e+11,-1.221100470761284180e+11,-3.903296710661782227e+12
-6.968997527210676193e+09,-4.993874550352092743e+09,6.863015264274255371e+10,6.304113338660609131e+11,-1.596804927037277832e+11,-4.399189438022615234e+12
-7.522081984757792473e+09,-5.986199830110019684e+09,6.955248579275909424e+10,7.319811420265720215e+11,-2.047784331175930786e+11,-4.894994543943925781e+12
-7.831799957751507759e+09,-7.114443657125732422e+09,7.070818771191223145e+10,8.533326843275349121e+11,-2.662861477505382080e+11,-5.422129807336572266e+12
-7.737310583066250801e+09,-8.355141484724040985e+09,7.220782865480903625e+10,9.763866109521879883e+11,-3.422712710962714844e+11,-5.981925033225773438e+12
-7.618579860344531059e+09,-9.941027981787521362e+09,7.365711765183464050e+10,1.096285663082745605e+12,-4.330701411297545776e+11,-6.553907766720839844e+12
-7.351887681237243652e+09,-1.131142830457021332e+10,7.541799512884579468e+10,1.213387994090346924e+12,-5.224172794216878052e+11,-7.147857732953958008e+12
-7.385107752633699417e+09,-1.245581458300405121e+10,7.726190393100051880e+10,1.339145672403048096e+12,-6.274124312220333252e+11,-7.799329957380639648e+12
-7.644863453895776749e+09,-1.317374814685433960e+10,7.957742768529487610e+10,1.475331157835851074e+12,-7.358440835571427002e+11,-8.481914173816804688e+12
-8.234394718092893600e+09,-1.376810196904161263e+10,8.165293389524526978e+10,1.610328063116936523e+12,-8.500695848679960938e+11,-9.184556544592794922e+12
-8.769875001243818283e+09,-1.412173251287155533e+10,8.361405632608065796e+10,1.747180653913006104e+12,-9.658652451968137207e+11,-9.912743960294058594e+12
-9.289359362496570587e+09,-1.451026379072831154e+10,8.602401865667486572e+10,1.888177163311076904e+12,-1.071905016291136841e+12,-1.066035863151181641e+13
-9.190459566025186539e+09,-1.431975845963529587e+10,8.786554426376795959e+10,2.070299595497488525e+12,-1.199509140646783936e+12,-1.151865876910077148e+13
-8.992576449453079224e+09,-1.405520177652807617e+10,8.929577472751431274e+10,2.203105073294954102e+12,-1.294316698995060059e+12,-1.217140944876849219e+13
-8.715568897788518906e+09,-1.393535682719050407e+10,9.137821005548202515e+10,2.344969940747936523e+12,-1.411630365417055664e+12,-1.294330988531240430e+13
-8.119945803042995453e+09,-1.349892458536499786e+10,9.343455686007958984e+10,2.455586353076797363e+12,-1.527844255528055176e+12,-1.375432410686890820e+13
-7.605596641269838333e+09,-1.320906616968326187e+10,9.562308639336482239e+10,2.535148850282286621e+12,-1.632383553022595459e+12,-1.457459465935365625e+13
-7.288742709171321869e+09,-1.324358479974133301e+10,9.826267146589082336e+10,2.618663828494319824e+12,-1.724165519312610840e+12,-1.543522907017868555e+13
-7.036618313575884819e+09,-1.293028017713825607e+10,1.008471000130990143e+11,2.708206683840303223e+12,-1.811918409077312988e+12,-1.633182492072533789e+13
-7.014717486213357925e+09,-1.337629826311909294e+10,1.033286388507926941e+11,2.800998123460793945e+12,-1.896143430320160156e+12,-1.721029367987838281e+13
-7.016309997457269669e+09,-1.420939502259519958e+10,1.060288177142711487e+11,2.898474292354856934e+12,-1.980037657772749756e+12,-1.810133578446878125e+13
-7.039085091961905479e+09,-1.500998061702233696e+10,1.084954927410970612e+11,2.995257583164640137e+12,-2.063660258096333008e+12,-1.901213237458022266e+13
-6.590654969523668289e+09,-1.508596817431308556e+10,1.106876581435109863e+11,3.092409679335040039e+12,-2.150917036277265381e+12,-1.987626726800189062e+13
-6.120093106707295418e+09,-1.482130796779836845e+10,1.125492194045118713e+11,3.190585654944268066e+12,-2.251612649903798828e+12,-2.075920965999256641e+13
-5.745167360678834915e+09,-1.467476151527628708e+10,1.143729293731147614e+11,3.287846769405967773e+12,-2.351369922922441406e+12,-2.163323385343702344e+13
-5.819330891480121613e+09,-1.428774357039631653e+10,1.168358213556543274e+11,3.385775644255091797e+12,-2.464410977910406738e+12,-2.250765928344926953e+13
-5.265206444478240013e+09,-1.292849137843441200e+10,1.192791207096798401e+11,3.498681308388783203e+12,-2.583245997032843750e+12,-2.340193297596163281e+13
-8.191903249645353699e+10,-1.004258233699334717e+10,1.208333176733003235e+11,3.587663762035466797e+12,-2.657789121112158203e+12,-2.426065137948305078e+13
-1.299602954523172302e+11,1.101534102440771484e+10,1.233309218128427734e+11,3.671808074640004395e+12,-2.748495988464064453e+12,-2.515017530228182812e+13
-1.140610965212536011e+11,4.554534822284439850e+10,1.259111047359585724e+11,3.759289272778213867e+12,-2.834128436820590820e+12,-2.602244491998928516e+13
-9.978811304674736023e+10,6.863765426802157593e+10,1.279082143004636383e+11,3.832061821840711426e+12,-2.933168610169246094e+12,-2.689389496608300781e+13
-8.818076050891537476e+10,8.782533177846865845e+10,1.290809126244230042e+11,3.906311892199520020e+12,-3.003031119593002930e+12,-2.776095249865227344e+13
2.780413309579071045e+09,1.273598627090949097e+11,1.313762439484157562e+11,3.979174363144731445e+12,-3.110262741258063477e+12,-2.863652005570059375e+13
-1.536800498819919968e+10,1.287290826443421021e+11,1.332801749700771942e+11,4.088442553787164551e+12,-3.178638145507039062e+12,-2.950058521951582422e+13
-3.281009398539592743e+10,1.300338877238016815e+11,1.352287671515871735e+11,4.192044975882512207e+12,-3.256111061019276855e+12,-3.036215971061421094e+13
-4.695635770239262390e+10,1.316899505631981049e+11,1.366026196152981262e+11,4.308110847094034668e+12,-3.317373135897067383e+12,-3.122746446434207422e+13
-5.894760772177825928e+10,1.341261680498076782e+11,1.382396065846545715e+11,4.415931818206198242e+12,-3.352741318453552246e+12,-3.210187371383305469e+13
-6.875035226712867737e+10,1.366235627217881470e+11,1.400320656837057495e+11,4.514134548014781250e+12,-3.395348441865150879e+12,-3.299658375167452344e+13
-7.644187655626715088e+10,1.393315146380053406e+11,1.417884513840318604e+11,4.626134732000397461e+12,-3.426881184344511230e+12,-3.385983930524286328e+13
-8.299821338646818542e+10,1.424262067093892212e+11,1.436239476425801086e+11,4.708488131490195312e+12,-3.475016522034721191e+12,-3.475125066548732812e+13
-8.828286125594374084e+10,1.455366727052183533e+11,1.452583174105480347e+11,4.791905342625890625e+12,-3.501667300789816406e+12,-3.563713942015516406e+13
-9.285210857321257019e+10,1.481159405478094482e+11,1.466714047872295227e+11,4.909840077878013672e+12,-3.507461250435277832e+12,-3.651925766981697656e+13
-9.664333579378396606e+10,1.509103068702449646e+11,1.483167186715627441e+11,4.992770868556467773e+12,-3.533023696801886230e+12,-3.741460123272060156e+13
-9.997710305025944519e+10,1.538001128772785339e+11,1.495181774953677979e+11,5.092376228774904297e+12,-3.552542140612502441e+12,-3.832261453297694531e+13
-1.027927628257712250e+11,1.562665212029904785e+11,1.506754610878137512e+11,5.197222414936570312e+12,-3.545257172815436523e+12,-3.923371384756125781e+13
-1.049621598195411987e+11,1.583729285825533752e+11,1.521342760932076721e+11,5.302704771100875000e+12,-3.548948818799620605e+12,-4.007566856275912500e+13
-1.069692136770306396e+11,1.607384700013916321e+11,1.535066176879483948e+11,5.426983683823228516e+12,-3.552667850428891602e+12,-4.091853163055844531e+13
-1.084984941543324127e+11,1.628461439484886780e+11,1.552785313937463684e+11,5.539434202201069336e+12,-3.563579477377979980e+12,-4.178186104723203906e+13
-1.097395737656923523e+11,1.651827425586526184e+11,1.567006765916148071e+11,5.640353512959088867e+12,-3.577990762175743652e+12,-4.263971946200107812e+13
-1.107684075718323517e+11,1.676359738867485962e+11,1.580610419884785767e+11,5.728186750877457031e+12,-3.595813242111015625e+12,-4.350142332893710156e+13
-1.112837254707211914e+11,1.707510223021482239e+11,1.601251718946965332e+11,5.803798579734181641e+12,-3.612867655301690918e+12,-4.441055291868756250e+13
-1.115436157841747742e+11,1.737055698013312378e+11,1.614952312770044861e+11,5.863059246872063477e+12,-3.642609889765022949e+12,-4.525952916469519531e+13
-1.117545566405606232e+11,1.770372150146552734e+11,1.631794855355057678e+11,5.915190577989931641e+12,-3.668433573473303711e+12,-4.617084519799451562e+13
-1.119436936406741333e+11,1.805029990407588501e+11,1.651101192506027527e+11,5.955537461547531250e+12,-3.673456194606340332e+12,-4.709037296429678125e+13
-1.112596890851899414e+11,1.838529771913787537e+11,1.666153797848138733e+11,5.986127735688894531e+12,-3.664149779155263672e+12,-4.798530945615179688e+13
-1.101937615786612549e+11,1.870198998777006836e+11,1.681721980548048096e+11,5.975705508151082031e+12,-3.631948071790082031e+12,-4.897807407405811719e+13
-1.089215193674554596e+11,1.897163209663341980e+11,1.696745206837080383e+11,5.987367136137272461e+12,-3.593180850119301758e+12,-4.985266806559457031e+13
-1.082212272053920288e+11,1.925093197218237610e+11,1.714420799738132324e+11,6.021533237843436523e+12,-3.506241996730024902e+12,-5.081333274563900781e+13
-1.070960319823011932e+11,1.950938481096914978e+11,1.727376538852465210e+11,6.034687953237797852e+12,-3.398851006749469727e+12,-5.180179289699178125e+13
-1.061516464471984406e+11,1.981568761964099731e+11,1.742483660190402222e+11,6.057783644486040039e+12,-3.296731491798705566e+12,-5.280649309601061719e+13
-1.051336841996755524e+11,2.013179511179304199e+11,1.756870081654299316e+11,6.099464049750364258e+12,-3.187098998679145508e+12,-5.381553882704010156e+13
-1.045848506824389038e+11,2.046197250024788513e+11,1.768827136374329834e+11,6.167872441126445312e+12,-3.063504502311222656e+12,-5.485530430046175781e+13
-1.039619703745361176e+11,2.080137906724832764e+11,1.784791065995584106e+11,6.249107540657542969e+12,-2.916395178934937500e+12,-5.592609897972211719e+13
-1.034523107504908142e+11,2.115537687430679321e+11,1.799551309692530518e+11,6.307261789164646484e+12,-2.760175066606557617e+12,-5.700446203845127344e+13
-1.026639795637170563e+11,2.153049512877066956e+11,1.812716806495202026e+11,6.354882073090498047e+12,-2.604927617670921387e+12,-5.809690488182517969e+13
-1.018697635370106964e+11,2.195005394192450867e+11,1.830730203288609924e+11,6.406260883291997070e+12,-2.453797359053335938e+12,-5.920481911954887500e+13
-1.012453297225864105e+11,2.236388222738646851e+11,1.849693671334466248e+11,6.464503974735003906e+12,-2.300243728844024414e+12,-6.032398063446270312e+13
-1.007627991852206726e+11,2.279162298658906860e+11,1.864444643308101807e+11,6.535514562441966797e+12,-2.140032706257882080e+12,-6.145964713918875781e+13
-9.989372018806924438e+10,2.320935912017632751e+11,1.886420372972569885e+11,6.599413542377980469e+12,-1.974474097229134033e+12,-6.260822510477644531e+13
-9.893469178421308899e+10,2.360493394038894043e+11,1.908751088978310242e+11,6.668081786307674805e+12,-1.807116394483722900e+12,-6.375825501841448438e+13
-9.769811281583279419e+10,2.398283753830581970e+11,1.930845781515025635e+11,6.735292410771436523e+12,-1.637675495066890381e+12,-6.494786893850035938e+13
-9.664022635811976624e+10,2.437291948025364075e+11,1.952457011562243958e+11,6.793235063750644531e+12,-1.471494483670104004e+12,-6.614024373890528906e+13
-9.545654330458993530e+10,2.473777612633558350e+11,1.973190565468502502e+11,6.846009254340699219e+12,-1.309899705584669189e+12,-6.730426607327358594e+13
-9.426450754150216675e+10,2.508157216619022522e+11,1.996788559745144043e+11,6.915997537287422852e+12,-1.129880379179532715e+12,-6.851816274336257812e+13
-9.317599137778604126e+10,2.542501475507334595e+11,2.019292511486668396e+11,7.001165422291789062e+12,-9.379702823319528809e+11,-6.972080588528910938e+13
-9.154865857294319153e+10,2.582526487637103577e+11,2.045804390986596680e+11,7.084797277414972656e+12,-7.314222466361599121e+11,-7.100714840049414062e+13
-9.003851150543261719e+10,2.619600758934884949e+11,2.068418227964202271e+11,7.165256139948102539e+12,-5.451021561878688354e+11,-7.219580830275121875e+13
-8.850788197448101807e+10,2.652127044401149902e+11,2.085374026128360596e+11,7.236944061612683594e+12,-3.705673184814168701e+11,-7.332560690362917188e+13
-8.708643262417262268e+10,2.684609625221495972e+11,2.103218018427226562e+11,7.321859724958552734e+12,-1.812287625414880981e+11,-7.451567538320060938e+13
-8.588838623551399231e+10,2.718272608494883728e+11,2.123963865760722046e+11,7.403272546550099609e+12,2.351770328904455566e+10,-7.575017012399570312e+13
-8.500626585777046204e+10,2.752224114617606201e+11,2.144687475152720642e+11,7.487844487443704102e+12,2.037712234767419739e+11,-7.690063064851851562e+13
-8.380454509155274963e+10,2.792248294060039673e+11,2.162907524618996277e+11,7.579498179115278320e+12,3.998851751692404785e+11,-7.814742660803878125e+13
-8.304770215646932983e+10,2.829401596682047729e+11,2.174563175130992432e+11,7.658995129623338867e+12,5.899650586395870361e+11,-7.933217043919745312e+13
-8.213370287431224060e+10,2.868642336732226562e+11,2.184961645578063660e+11,7.747987879525718750e+12,7.834005069758776855e+11,-8.053557021075326562e+13
-8.108270124342765808e+10,2.910008563448859863e+11,2.194237993627659607e+11,7.836501735897002930e+12,9.753291425009555664e+11,-8.174965482964132812e+13
-8.000701652389852905e+10,2.947518086883079834e+11,2.206305694024101257e+11,7.926645100407622070e+12,1.153495141508934570e+12,-8.291339852927821875e+13
-7.900023040039151001e+10,2.989247941272661133e+11,2.217961089117836609e+11,8.036422656697342773e+12,1.320678030352973145e+12,-8.412432788524243750e+13
-7.765939756742497253e+10,3.032204131463334351e+11,2.233464461703307800e+11,8.152640394855409180e+12,1.482623170447446533e+12,-8.532236936549243750e+13
-1.254342304337009125e+11,3.053111584313867188e+11,2.250816696263910522e+11,8.277495131648903320e+12,1.658480790406812256e+12,-8.652978110369382812e+13
-2.507344731677353516e+11,3.194079884080546265e+11,2.265562564855718994e+11,8.414413597595752930e+12,1.858406082450666016e+12,-8.774872557657990625e+13
-2.879981210058469238e+11,3.186319316319589233e+11,2.288540133543493652e+11,8.564153445958055664e+12,2.062117751389900391e+12,-8.898783322043145312e+13
-3.621295693322773438e+11,3.283623714630097046e+11,2.312042527916273499e+11,8.710565459142024414e+12,2.259209362198514648e+12,-9.018254215849942188e+13
-3.599533525391648560e+11,3.140736544206871948e+11,2.349496727655698853e+11,8.867861057368015625e+12,2.468850486415993652e+12,-9.147014585837034375e+13
-3.600567486759858398e+11,3.049928636155194092e+11,2.375749683648633423e+11,9.008619205268021484e+12,2.652405625871749512e+12,-9.259085373304781250e+13
-3.592492150763206787e+11,2.967595084137821045e+11,2.394332955765273132e+11,9.163283587121708984e+12,2.854095138013951172e+12,-9.382228220281345312e+13
-3.506801200922944336e+11,2.837274021049691772e+11,2.460181073736511230e+11,9.497882997990384766e+12,3.290428255777368652e+12,-9.648634250921473438e+13
-3.506618659100311279e+11,2.836996856590261230e+11,2.460321042778403015e+11,9.498595071024634766e+12,3.291356831970324219e+12,-9.649201199171884375e+13
-3.471955487041971436e+11,2.795153013353402710e+11,2.479159029649109192e+11,9.614219537989906250e+12,3.442136488245604492e+12,-9.741260701635229688e+13
-3.419282663155133667e+11,2.750646610194160767e+11,2.503736052185079041e+11,9.771030733019117188e+12,3.646625544127885742e+12,-9.866112828299801562e+13
-3.361904221447311401e+11,2.713297306080429077e+11,2.521864436967493896e+11,9.917857014459666016e+12,3.838093810566969238e+12,-9.983015027053460938e+13
-3.300825159450911865e+11,2.682532245057376099e+11,2.542175212268082886e+11,1.006862050737439453e+13,4.034696382991119629e+12,-1.010305200981018750e+14
-3.239820348894117432e+11,2.659536614756272583e+11,2.565664059882763367e+11,1.021966322977864453e+13,4.231663083592954102e+12,-1.022331131340049688e+14
-3.172048972235133057e+11,2.633312226101215515e+11,2.585080624480632629e+11,1.037101696389073242e+13,4.429035357856111328e+12,-1.034381824263471562e+14
-3.042154734161518555e+11,2.564580677002202148e+11,2.598615562434124146e+11,1.052239491302630273e+13,4.626439209630612305e+12,-1.046434445172442188e+14
-2.595154069048607483e+11,2.095543413925170898e+11,2.645546242313906555e+11,1.078353880688361133e+13,4.966982933529636719e+12,-1.067226564324061875e+14
-2.526837655366495972e+11,2.024162765473302307e+11,2.652983181621989441e+11,1.082494952391475391e+13,5.020984425116568359e+12,-1.070523660610510000e+14
-2.294215877405878601e+11,1.789312079064334106e+11,2.679447422071941833e+11,1.097642206298579883e+13,5.218511626544755859e+12,-1.082583812713030156e+14
-2.077139715584196777e+11,1.574579623656490479e+11,2.707690593123505554e+11,1.112800962341837891e+13,5.416188821151827148e+12,-1.094653122746906562e+14
-1.868544779628554382e+11,1.377036209189490967e+11,2.741610727119679260e+11,1.127993846433815039e+13,5.614311061309401367e+12,-1.106749605327109844e+14
-1.474422247086671143e+11,1.045702715861424866e+11,2.837440918773634644e+11,1.159263311630944141e+13,6.022079359670601562e+12,-1.131646164713690312e+14
-1.474175235225097351e+11,1.045495062510139160e+11,2.837500987222184448e+11,1.159282910665574414e+13,6.022334940153041016e+12,-1.131661769346725000e+14
-1.288099911530066833e+11,8.943337442609367371e+10,2.882198942229016113e+11,1.174525057195946680e+13,6.221099585307016602e+12,-1.143797474382934375e+14
-1.122935502213392029e+11,7.641248962535015869e+10,2.927077919708568726e+11,1.188451722575691406e+13,6.402709747423436523e+12,-1.154885801269819531e+14
-9.456924987852609253e+10,6.332394996393624878e+10,2.977056081298565063e+11,1.203548730309071875e+13,6.599581715491239258e+12,-1.166905947672204531e+14
