<?xml version="1.0" encoding="UTF-8" standalone="no"?>
<svg
   xmlns:dc="http://purl.org/dc/elements/1.1/"
   xmlns:cc="http://creativecommons.org/ns#"
   xmlns:rdf="http://www.w3.org/1999/02/22-rdf-syntax-ns#"
   xmlns:svg="http://www.w3.org/2000/svg"
   xmlns="http://www.w3.org/2000/svg"
   id="svg8296"
   version="1.1"
   viewBox="0 0 40.145897 39.944482"
   height="39.944481mm"
   width="40.145897mm">
  <defs
     id="defs8290" />
  <metadata
     id="metadata8293">
    <rdf:RDF>
      <cc:Work
         rdf:about="">
        <dc:format>image/svg+xml</dc:format>
        <dc:type
           rdf:resource="http://purl.org/dc/dcmitype/StillImage" />
        <dc:title></dc:title>
      </cc:Work>
    </rdf:RDF>
  </metadata>
  <g
     transform="translate(-10.711641,-1111.5272)"
     id="layer1">
    <path
       id="path9353"
       d="m 17.735503,1150.7661 h -6.318306 v -26.6003 h 6.318306 z m 0,0"
       style="fill:none;stroke-width:1.41111112;stroke-linecap:butt;stroke-linejoin:miter;stroke-miterlimit:10;stroke-opacity:1" />
    <path
       id="path9355"
       d="m 17.735503,1142.1217 c 6.977008,0 13.299447,-5.3262 13.299447,-12.3032"
       style="fill:none;stroke-width:1.41111112;stroke-linecap:butt;stroke-linejoin:miter;stroke-miterlimit:10;stroke-opacity:1" />
    <path
       id="path9357"
       d="m 17.735503,1138.7965 c 6.059234,0 10.639833,-4.9141 10.639833,-10.9734"
       style="fill:none;stroke-width:1.41111112;stroke-linecap:butt;stroke-linejoin:miter;stroke-miterlimit:10;stroke-opacity:1" />
    <path
       id="path9359"
       d="m 38.481869,1136.1038 -17.499707,-14.3206 7.581966,-9.2632 21.052289,17.2283 z m 0,0"
       style="fill:none;stroke-width:1.41111112;stroke-linecap:butt;stroke-linejoin:miter;stroke-miterlimit:10;stroke-opacity:1" />
    <path
       id="path9361"
       d="m 47.321983,1130.8782 1.641243,1.3423 -5.054644,6.1763 -4.373893,-3.5801"
       style="fill:none;stroke-width:1.41111112;stroke-linecap:butt;stroke-linejoin:miter;stroke-miterlimit:10;stroke-opacity:1" />
    <path
       id="path9363"
       d="m 14.512272,1113.3248 c 0,0 0.784104,2.8291 4.448307,0.5112 3.662826,-2.3178 6.221843,0.3184 6.598047,2.402"
       style="fill:none;stroke-width:1.41111112;stroke-linecap:butt;stroke-linejoin:miter;stroke-miterlimit:10;stroke-opacity:1" />
  </g>
</svg>
