<?xml version="1.0" encoding="UTF-8" standalone="no"?>
<svg
   xmlns:dc="http://purl.org/dc/elements/1.1/"
   xmlns:cc="http://creativecommons.org/ns#"
   xmlns:rdf="http://www.w3.org/1999/02/22-rdf-syntax-ns#"
   xmlns:svg="http://www.w3.org/2000/svg"
   xmlns="http://www.w3.org/2000/svg"
   id="svg8296"
   version="1.1"
   viewBox="0 0 41.730065 43.038892"
   height="43.038891mm"
   width="41.730064mm">
  <defs
     id="defs8290" />
  <metadata
     id="metadata8293">
    <rdf:RDF>
      <cc:Work
         rdf:about="">
        <dc:format>image/svg+xml</dc:format>
        <dc:type
           rdf:resource="http://purl.org/dc/dcmitype/StillImage" />
        <dc:title></dc:title>
      </cc:Work>
    </rdf:RDF>
  </metadata>
  <g
     transform="translate(-8.5422976,-159.74027)"
     id="layer1">
    <g
       transform="translate(-29.934187,430.83848)"
       id="g11030">
      <path
         style="fill:none;stroke-width:1.41111112;stroke-linecap:butt;stroke-linejoin:miter;stroke-miterlimit:10;stroke-opacity:1"
         d="m 59.92734,-248.25033 4.98712,-5.96966 -11.583789,-9.6821 -4.988498,5.96828 z m 0,0"
         id="path9521" />
      <path
         style="fill:none;stroke-width:1.41111112;stroke-linecap:butt;stroke-linejoin:miter;stroke-miterlimit:10;stroke-opacity:1"
         d="m 54.230531,-248.86907 2.038118,-2.44051 -4.267784,-3.56774 -2.040875,2.43913 z m 0,0"
         id="path9523" />
      <path
         style="fill:none;stroke-width:1.41111112;stroke-linecap:butt;stroke-linejoin:miter;stroke-miterlimit:10;stroke-opacity:1"
         d="m 41.909491,-235.98855 11.492839,-13.75006 -2.439128,-2.0395 -11.492838,13.75144 z m 0,0"
         id="path9525" />
      <path
         style="fill:none;stroke-width:1.41111112;stroke-linecap:butt;stroke-linejoin:miter;stroke-miterlimit:10;stroke-opacity:1"
         d="m 45.223673,-239.95317 -2.440505,-2.03811"
         id="path9527" />
      <path
         style="fill:none;stroke-width:1.41111112;stroke-linecap:butt;stroke-linejoin:miter;stroke-miterlimit:10;stroke-opacity:1"
         d="m 71.387105,-270.74543 v 13.59159 l 2.258605,1.43729 2.368847,-4.819 3.486437,4.819 v -15.38166"
         id="path9529" />
      <path
         style="fill:none;stroke-width:1.41111112;stroke-linecap:butt;stroke-linejoin:miter;stroke-miterlimit:10;stroke-opacity:1"
         d="m 71.387105,-228.05932 v -16.58331 l 2.119423,3.04271 2.45842,-2.02848 0.87781,-2.95864 2.151118,4.31188 0.458886,14.03945"
         id="path9531" />
      <path
         style="fill:none;stroke-width:1.41111112;stroke-linecap:butt;stroke-linejoin:miter;stroke-miterlimit:10;stroke-opacity:1"
         d="m 67.992998,-246.14744 -4.854829,2.29443 2.910417,3.35001 z m 0,0"
         id="path9533" />
      <path
         style="fill:none;stroke-width:1.41111112;stroke-linecap:butt;stroke-linejoin:miter;stroke-miterlimit:10;stroke-opacity:1"
         d="m 66.925018,-265.8465 -3.748264,2.88974 1.445563,1.87551 3.782714,1.03215 z m 0,0"
         id="path9535" />
      <path
         style="fill:none;stroke-width:1.41111112;stroke-linecap:butt;stroke-linejoin:miter;stroke-miterlimit:10;stroke-opacity:1"
         d="m 59.333406,-238.5145 -2.284787,1.51171"
         id="path9537" />
      <path
         style="fill:none;stroke-width:1.41111112;stroke-linecap:butt;stroke-linejoin:miter;stroke-miterlimit:10;stroke-opacity:1"
         d="m 72.445439,-251.74366 v 1.45934 h 1.08865 z m 0,0"
         id="path9539" />
    </g>
  </g>
</svg>
