<?xml version="1.0" encoding="UTF-8" standalone="no"?>
<svg
   xmlns:dc="http://purl.org/dc/elements/1.1/"
   xmlns:cc="http://creativecommons.org/ns#"
   xmlns:rdf="http://www.w3.org/1999/02/22-rdf-syntax-ns#"
   xmlns:svg="http://www.w3.org/2000/svg"
   xmlns="http://www.w3.org/2000/svg"
   id="svg8296"
   version="1.1"
   viewBox="0 0 36.617176 44.009004"
   height="44.009003mm"
   width="36.617176mm">
  <defs
     id="defs8290" />
  <metadata
     id="metadata8293">
    <rdf:RDF>
      <cc:Work
         rdf:about="">
        <dc:format>image/svg+xml</dc:format>
        <dc:type
           rdf:resource="http://purl.org/dc/dcmitype/StillImage" />
        <dc:title></dc:title>
      </cc:Work>
    </rdf:RDF>
  </metadata>
  <g
     transform="translate(-12.20822,-878.92185)"
     id="layer1">
    <g
       transform="translate(-29.934187,430.83848)"
       id="g11136">
      <path
         style="fill:none;stroke-width:1.41111112;stroke-linecap:butt;stroke-linejoin:round;stroke-miterlimit:10;stroke-opacity:1"
         d="m 74.914883,463.25282 c 0,7.98849 -6.475401,14.46389 -14.463889,14.46389 -7.988487,0 -14.463888,-6.4754 -14.463888,-14.46389 0,-7.98849 6.475401,-14.46389 14.463888,-14.46389 7.988488,0 14.463889,6.4754 14.463889,14.46389 z m 0,0"
         id="path9153" />
      <path
         style="fill:none;stroke-width:1.41111112;stroke-linecap:butt;stroke-linejoin:round;stroke-miterlimit:10;stroke-opacity:1"
         d="m 62.832245,463.25282 c 0,1.51033 -1.225076,2.73403 -2.734028,2.73403 -1.51033,0 -2.734027,-1.2237 -2.734027,-2.73403 0,-1.51033 1.223697,-2.73403 2.734027,-2.73403 1.508952,0 2.734028,1.2237 2.734028,2.73403 z m 0,0"
         id="path9155" />
      <path
         style="fill:none;stroke-width:1.41111112;stroke-linecap:butt;stroke-linejoin:round;stroke-miterlimit:10;stroke-opacity:1"
         d="m 57.816186,462.4949 c -1.593012,-1.4304 -5.528689,-1.65227 -9.40511,3.28662 l 9.7634,-0.68351"
         id="path9157" />
      <path
         style="fill:none;stroke-width:1.41111112;stroke-linecap:butt;stroke-linejoin:round;stroke-miterlimit:10;stroke-opacity:1"
         d="m 63.027926,462.03326 c 2.08635,-0.48094 4.529612,-3.57601 2.714735,-9.58701 l -5.049131,8.38536"
         id="path9159" />
      <path
         style="fill:none;stroke-width:1.41111112;stroke-linecap:butt;stroke-linejoin:round;stroke-miterlimit:10;stroke-opacity:1"
         d="m 60.262204,466.38786 c -0.564996,2.0643 1.001833,5.68303 7.154774,6.93429 l -4.988498,-8.42119"
         id="path9161" />
      <path
         style="fill:none;stroke-width:1.41111112;stroke-linecap:butt;stroke-linejoin:round;stroke-miterlimit:10;stroke-opacity:1"
         d="m 50.770277,458.58954 c 1.918229,-3.57601 5.691297,-6.00824 10.033496,-6.00824"
         id="path9163" />
      <path
         style="fill:none;stroke-width:1.41111112;stroke-linecap:butt;stroke-linejoin:round;stroke-miterlimit:10;stroke-opacity:1"
         d="m 69.430291,457.50088 c 2.151117,3.44097 2.38814,7.92372 0.230132,11.69128"
         id="path9165" />
      <path
         style="fill:none;stroke-width:1.41111112;stroke-linecap:butt;stroke-linejoin:round;stroke-miterlimit:10;stroke-opacity:1"
         d="m 61.193757,474.39977 c -4.056945,0.0496 -8.009158,-2.07808 -10.10791,-5.88008"
         id="path9167" />
      <path
         style="fill:none;stroke-width:1.41111112;stroke-linecap:butt;stroke-linejoin:round;stroke-miterlimit:10;stroke-opacity:1"
         d="m 77.90247,485.3345 h -2.691308 c -2.676151,0 -4.845183,-2.17041 -4.845183,-4.84656 v -2.15388"
         id="path9169" />
      <path
         style="fill:none;stroke-width:1.41111112;stroke-linecap:butt;stroke-linejoin:round;stroke-miterlimit:10;stroke-opacity:1"
         d="m 74.673726,481.56419 3.380328,3.50022 -3.380328,3.50022"
         id="path9171" />
      <path
         style="fill:none;stroke-width:1.41111112;stroke-linecap:butt;stroke-linejoin:round;stroke-miterlimit:10;stroke-opacity:1"
         d="m 42.998141,485.3345 h 2.692687 c 2.67615,0 4.845182,-2.17041 4.845182,-4.84656 v -2.15388"
         id="path9173" />
      <path
         style="fill:none;stroke-width:1.41111112;stroke-linecap:butt;stroke-linejoin:round;stroke-miterlimit:10;stroke-opacity:1"
         d="m 46.228263,481.56419 -3.380328,3.50022 3.380328,3.50022"
         id="path9175" />
      <path
         style="fill:none;stroke-width:1.41111112;stroke-linecap:butt;stroke-linejoin:round;stroke-miterlimit:10;stroke-opacity:1"
         d="m 64.006333,487.95278 -3.555339,3.43407 -3.555338,-3.43407"
         id="path9177" />
      <path
         style="fill:none;stroke-width:1.41111112;stroke-linecap:butt;stroke-linejoin:round;stroke-miterlimit:10;stroke-opacity:1"
         d="M 60.450995,491.25455 V 481.9776"
         id="path9179" />
    </g>
  </g>
</svg>
