<?xml version="1.0" encoding="UTF-8"?>
<!DOCTYPE svg PUBLIC "-//W3C//DTD SVG 1.1//EN" "http://www.w3.org/Graphics/SVG/1.1/DTD/svg11.dtd">
<!-- Creator: CorelDRAW X8 -->
<svg xmlns="http://www.w3.org/2000/svg" xml:space="preserve" width="100mm" height="100mm" version="1.1" style="shape-rendering:geometricPrecision; text-rendering:geometricPrecision; image-rendering:optimizeQuality; fill-rule:evenodd; clip-rule:evenodd"
viewBox="0 0 10000 10000"
 xmlns:xlink="http://www.w3.org/1999/xlink">
 <defs>
  <style type="text/css">
   <![CDATA[
    .fil0 {fill:#2B2A29}
   ]]>
  </style>
 </defs>
 <g id="Слой_x0020_1">
  <metadata id="CorelCorpID_0Corel-Layer"/>
  <g id="_2538414056192">
   <path class="fil0" d="M7108 1139l505 0 0 1901 1887 1521c35,27 35,71 10,100l-228 283c-26,35 -71,35 -100,10l-3946 -3182c-128,-104 -308,-97 -429,0l-3946 3182c-29,25 -73,25 -100,-10l-228 -283c-25,-29 -25,-74 10,-100l4052 -3266c241,-194 598,-207 854,1l1659 1336 0 -1493z"/>
   <path class="fil0" d="M1650 5485l0 3072c0,69 51,116 116,116l2080 0c65,0 116,-47 116,-116l0 -1934c0,-68 50,-115 115,-115l1909 0c66,0 116,47 116,115l0 1934c0,69 50,116 116,116l2080 0c65,0 115,-47 115,-116l1 -3070c0,-37 -16,-65 -41,-85l-3234 -2611c-66,-51 -148,-51 -212,0l-3236 2609c-25,21 -41,48 -41,85zm504 2608l0 -2420 2825 -2277c5,-5 11,-9 17,-12 28,-18 56,-16 84,7l2829 2285 0 2417c0,45 -31,76 -75,76l-1154 0c-10,0 -20,-2 -28,-6 -28,-11 -47,-38 -47,-70l-2 -1768c0,-193 -123,-318 -292,-318l-2537 0c-160,0 -315,141 -315,318l0 1768 0 5c0,44 -33,71 -76,71l-1153 0c-46,0 -76,-29 -76,-76z"/>
  </g>
 </g>
</svg>
