12/23/2022 07:21:05 AM script INFO: Prepared chrome options..
12/23/2022 07:21:06 AM script INFO: Initialized chrome browser..
12/23/2022 07:21:06 AM script INFO: mengakses-homepage
12/23/2022 07:21:56 AM script INFO: mengakses-login-page
12/23/2022 07:21:57 AM script INFO: mengakses-site-home
12/23/2022 07:21:58 AM script INFO: mengakses-site-course
12/23/2022 07:22:44 AM script INFO: mengakses-quiz
12/23/2022 07:22:46 AM script INFO: mengakses-start-quiz-page
12/23/2022 07:22:48 AM script INFO: memulai-quiz
12/23/2022 07:22:48 AM script INFO: SUCCESS!@#KODE 1!@#USER_ID 29!@#ACTIVITY_CODE 5
12/23/2022 07:22:59 AM script INFO: SUCCESS!@#KODE 1!@#USER_ID 29!@#ACTIVITY_CODE 2
12/23/2022 07:22:59 AM script INFO: SUCCESS!@#KODE 1!@#USER_ID 29!@#ACTIVITY_CODE 2
12/23/2022 07:22:59 AM script INFO: SUCCESS!@#KODE 1!@#USER_ID 29!@#ACTIVITY_CODE 5
12/23/2022 07:22:59 AM script INFO: SUCCESS!@#KODE 1!@#USER_ID 29!@#ACTIVITY_CODE 5
12/23/2022 07:23:02 AM script INFO: SUCCESS!@#KODE 1!@#USER_ID 29!@#ACTIVITY_CODE 3
12/23/2022 07:23:02 AM script INFO: SUCCESS!@#KODE 1!@#USER_ID 29!@#ACTIVITY_CODE 5
12/23/2022 07:23:02 AM script INFO: SUCCESS!@#KODE 1!@#USER_ID 29!@#ACTIVITY_CODE 5
12/23/2022 07:23:05 AM script INFO: SUCCESS!@#KODE 1!@#USER_ID 29!@#ACTIVITY_CODE 5
12/23/2022 07:23:05 AM script INFO: SUCCESS!@#KODE 1!@#USER_ID 29!@#ACTIVITY_CODE 5
12/23/2022 07:23:07 AM script INFO: SUCCESS!@#KODE 1!@#USER_ID 29!@#ACTIVITY_CODE 3
12/23/2022 07:23:07 AM script INFO: SUCCESS!@#KODE 1!@#USER_ID 29!@#ACTIVITY_CODE 1
12/23/2022 07:23:07 AM script INFO: SUCCESS!@#KODE 1!@#USER_ID 29!@#ACTIVITY_CODE 4
12/23/2022 07:23:08 AM script INFO: SUCCESS!@#KODE 1!@#USER_ID 29!@#ACTIVITY_CODE 2
12/23/2022 07:23:08 AM script INFO: SUCCESS!@#KODE 1!@#USER_ID 29!@#ACTIVITY_CODE 3
12/23/2022 07:23:08 AM script INFO: SUCCESS!@#KODE 1!@#USER_ID 29!@#ACTIVITY_CODE 3
12/23/2022 07:23:08 AM script INFO: SUCCESS!@#KODE 1!@#USER_ID 29!@#ACTIVITY_CODE 5
12/23/2022 07:23:08 AM script INFO: SUCCESS!@#KODE 1!@#USER_ID 29!@#ACTIVITY_CODE 5
12/23/2022 07:23:10 AM script INFO: SUCCESS!@#KODE 1!@#USER_ID 29!@#ACTIVITY_CODE 3
12/23/2022 07:23:10 AM script INFO: SUCCESS!@#KODE 1!@#USER_ID 29!@#ACTIVITY_CODE 1
12/23/2022 07:23:10 AM script INFO: SUCCESS!@#KODE 1!@#USER_ID 29!@#ACTIVITY_CODE 1
12/23/2022 07:23:10 AM script INFO: SUCCESS!@#KODE 1!@#USER_ID 29!@#ACTIVITY_CODE 2
12/23/2022 07:23:10 AM script INFO: SUCCESS!@#KODE 1!@#USER_ID 29!@#ACTIVITY_CODE 5
12/23/2022 07:23:10 AM script INFO: SUCCESS!@#KODE 1!@#USER_ID 29!@#ACTIVITY_CODE 5
12/23/2022 07:23:13 AM script INFO: SUCCESS!@#KODE 1!@#USER_ID 29!@#ACTIVITY_CODE 3
12/23/2022 07:23:13 AM script INFO: SUCCESS!@#KODE 1!@#USER_ID 29!@#ACTIVITY_CODE 1
12/23/2022 07:23:13 AM script INFO: SUCCESS!@#KODE 1!@#USER_ID 29!@#ACTIVITY_CODE 1
12/23/2022 07:23:13 AM script INFO: SUCCESS!@#KODE 1!@#USER_ID 29!@#ACTIVITY_CODE 4
12/23/2022 07:23:13 AM script INFO: SUCCESS!@#KODE 1!@#USER_ID 29!@#ACTIVITY_CODE 5
12/23/2022 07:23:13 AM script INFO: SUCCESS!@#KODE 1!@#USER_ID 29!@#ACTIVITY_CODE 5
12/23/2022 07:23:16 AM script INFO: SUCCESS!@#KODE 1!@#USER_ID 29!@#ACTIVITY_CODE 5
12/23/2022 07:23:16 AM script INFO: SUCCESS!@#KODE 1!@#USER_ID 29!@#ACTIVITY_CODE 5
12/23/2022 07:23:18 AM script INFO: SUCCESS!@#KODE 1!@#USER_ID 29!@#ACTIVITY_CODE 5
12/23/2022 07:23:18 AM script INFO: SUCCESS!@#KODE 1!@#USER_ID 29!@#ACTIVITY_CODE 5
12/23/2022 07:23:21 AM script INFO: SUCCESS!@#KODE 1!@#USER_ID 29!@#ACTIVITY_CODE 2
12/23/2022 07:23:21 AM script INFO: SUCCESS!@#KODE 1!@#USER_ID 29!@#ACTIVITY_CODE 2
12/23/2022 07:23:21 AM script INFO: SUCCESS!@#KODE 1!@#USER_ID 29!@#ACTIVITY_CODE 5
12/23/2022 07:23:21 AM script INFO: SUCCESS!@#KODE 1!@#USER_ID 29!@#ACTIVITY_CODE 5
12/23/2022 07:23:24 AM script INFO: SUCCESS!@#KODE 1!@#USER_ID 29!@#ACTIVITY_CODE 5
12/23/2022 07:23:24 AM script INFO: SUCCESS!@#KODE 1!@#USER_ID 29!@#ACTIVITY_CODE 5
12/23/2022 07:23:26 AM script INFO: SUCCESS!@#KODE 1!@#USER_ID 29!@#ACTIVITY_CODE 2
12/23/2022 07:23:26 AM script INFO: SUCCESS!@#KODE 1!@#USER_ID 29!@#ACTIVITY_CODE 1
12/23/2022 07:23:26 AM script INFO: SUCCESS!@#KODE 1!@#USER_ID 29!@#ACTIVITY_CODE 5
12/23/2022 07:23:26 AM script INFO: SUCCESS!@#KODE 1!@#USER_ID 29!@#ACTIVITY_CODE 5
12/23/2022 07:23:29 AM script INFO: SUCCESS!@#KODE 1!@#USER_ID 29!@#ACTIVITY_CODE 1
12/23/2022 07:23:29 AM script INFO: SUCCESS!@#KODE 1!@#USER_ID 29!@#ACTIVITY_CODE 2
12/23/2022 07:23:29 AM script INFO: SUCCESS!@#KODE 1!@#USER_ID 29!@#ACTIVITY_CODE 1
12/23/2022 07:23:29 AM script INFO: SUCCESS!@#KODE 1!@#USER_ID 29!@#ACTIVITY_CODE 2
12/23/2022 07:23:29 AM script INFO: SUCCESS!@#KODE 1!@#USER_ID 29!@#ACTIVITY_CODE 5
12/23/2022 07:23:29 AM script INFO: SUCCESS!@#KODE 1!@#USER_ID 29!@#ACTIVITY_CODE 5
12/23/2022 07:23:32 AM script INFO: SUCCESS!@#KODE 1!@#USER_ID 29!@#ACTIVITY_CODE 1
12/23/2022 07:23:32 AM script INFO: SUCCESS!@#KODE 1!@#USER_ID 29!@#ACTIVITY_CODE 3
12/23/2022 07:23:32 AM script INFO: SUCCESS!@#KODE 1!@#USER_ID 29!@#ACTIVITY_CODE 2
12/23/2022 07:23:32 AM script INFO: SUCCESS!@#KODE 1!@#USER_ID 29!@#ACTIVITY_CODE 3
12/23/2022 07:23:32 AM script INFO: SUCCESS!@#KODE 1!@#USER_ID 29!@#ACTIVITY_CODE 2
12/23/2022 07:23:32 AM script INFO: SUCCESS!@#KODE 1!@#USER_ID 29!@#ACTIVITY_CODE 3
12/23/2022 07:23:32 AM script INFO: SUCCESS!@#KODE 1!@#USER_ID 29!@#ACTIVITY_CODE 5
12/23/2022 07:23:32 AM script INFO: SUCCESS!@#KODE 1!@#USER_ID 29!@#ACTIVITY_CODE 5
12/23/2022 07:23:35 AM script INFO: SUCCESS!@#KODE 1!@#USER_ID 29!@#ACTIVITY_CODE 2
12/23/2022 07:23:35 AM script INFO: SUCCESS!@#KODE 1!@#USER_ID 29!@#ACTIVITY_CODE 1
12/23/2022 07:23:35 AM script INFO: SUCCESS!@#KODE 1!@#USER_ID 29!@#ACTIVITY_CODE 4
12/23/2022 07:23:35 AM script INFO: SUCCESS!@#KODE 1!@#USER_ID 29!@#ACTIVITY_CODE 5
12/23/2022 07:23:35 AM script INFO: SUCCESS!@#KODE 1!@#USER_ID 29!@#ACTIVITY_CODE 5
12/23/2022 07:23:37 AM script INFO: SUCCESS!@#KODE 1!@#USER_ID 29!@#ACTIVITY_CODE 3
12/23/2022 07:23:37 AM script INFO: SUCCESS!@#KODE 1!@#USER_ID 29!@#ACTIVITY_CODE 1
12/23/2022 07:23:37 AM script INFO: SUCCESS!@#KODE 1!@#USER_ID 29!@#ACTIVITY_CODE 4
12/23/2022 07:23:37 AM script INFO: SUCCESS!@#KODE 1!@#USER_ID 29!@#ACTIVITY_CODE 5
12/23/2022 07:23:37 AM script INFO: SUCCESS!@#KODE 1!@#USER_ID 29!@#ACTIVITY_CODE 5
12/23/2022 07:23:40 AM script INFO: SUCCESS!@#KODE 1!@#USER_ID 29!@#ACTIVITY_CODE 2
12/23/2022 07:23:40 AM script INFO: SUCCESS!@#KODE 1!@#USER_ID 29!@#ACTIVITY_CODE 3
12/23/2022 07:23:40 AM script INFO: SUCCESS!@#KODE 1!@#USER_ID 29!@#ACTIVITY_CODE 3
12/23/2022 07:23:40 AM script INFO: SUCCESS!@#KODE 1!@#USER_ID 29!@#ACTIVITY_CODE 3
12/23/2022 07:23:40 AM script INFO: SUCCESS!@#KODE 1!@#USER_ID 29!@#ACTIVITY_CODE 3
12/23/2022 07:23:40 AM script INFO: SUCCESS!@#KODE 1!@#USER_ID 29!@#ACTIVITY_CODE 5
12/23/2022 07:23:40 AM script INFO: SUCCESS!@#KODE 1!@#USER_ID 29!@#ACTIVITY_CODE 5
12/23/2022 07:23:43 AM script INFO: SUCCESS!@#KODE 1!@#USER_ID 29!@#ACTIVITY_CODE 1
12/23/2022 07:23:43 AM script INFO: SUCCESS!@#KODE 1!@#USER_ID 29!@#ACTIVITY_CODE 3
12/23/2022 07:23:43 AM script INFO: SUCCESS!@#KODE 1!@#USER_ID 29!@#ACTIVITY_CODE 1
12/23/2022 07:23:43 AM script INFO: SUCCESS!@#KODE 1!@#USER_ID 29!@#ACTIVITY_CODE 2
12/23/2022 07:23:43 AM script INFO: SUCCESS!@#KODE 1!@#USER_ID 29!@#ACTIVITY_CODE 3
12/23/2022 07:23:43 AM script INFO: SUCCESS!@#KODE 1!@#USER_ID 29!@#ACTIVITY_CODE 1
12/23/2022 07:23:43 AM script INFO: SUCCESS!@#KODE 1!@#USER_ID 29!@#ACTIVITY_CODE 3
12/23/2022 07:23:43 AM script INFO: SUCCESS!@#KODE 1!@#USER_ID 29!@#ACTIVITY_CODE 1
12/23/2022 07:23:43 AM script INFO: SUCCESS!@#KODE 1!@#USER_ID 29!@#ACTIVITY_CODE 4
12/23/2022 07:23:43 AM script INFO: SUCCESS!@#KODE 1!@#USER_ID 29!@#ACTIVITY_CODE 2
12/23/2022 07:23:43 AM script INFO: SUCCESS!@#KODE 1!@#USER_ID 29!@#ACTIVITY_CODE 1
12/23/2022 07:23:43 AM script INFO: SUCCESS!@#KODE 1!@#USER_ID 29!@#ACTIVITY_CODE 1
12/23/2022 07:23:44 AM script INFO: SUCCESS!@#KODE 1!@#USER_ID 29!@#ACTIVITY_CODE 2
12/23/2022 07:23:44 AM script INFO: SUCCESS!@#KODE 1!@#USER_ID 29!@#ACTIVITY_CODE 3
12/23/2022 07:23:44 AM script INFO: SUCCESS!@#KODE 1!@#USER_ID 29!@#ACTIVITY_CODE 3
12/23/2022 07:23:44 AM script INFO: SUCCESS!@#KODE 1!@#USER_ID 29!@#ACTIVITY_CODE 3
12/23/2022 07:23:44 AM script INFO: SUCCESS!@#KODE 1!@#USER_ID 29!@#ACTIVITY_CODE 3
12/23/2022 07:23:44 AM script INFO: SUCCESS!@#KODE 1!@#USER_ID 29!@#ACTIVITY_CODE 3
12/23/2022 07:23:44 AM script INFO: SUCCESS!@#KODE 1!@#USER_ID 29!@#ACTIVITY_CODE 3
12/23/2022 07:23:44 AM script INFO: SUCCESS!@#KODE 1!@#USER_ID 29!@#ACTIVITY_CODE 2
12/23/2022 07:23:44 AM script INFO: SUCCESS!@#KODE 1!@#USER_ID 29!@#ACTIVITY_CODE 2
12/23/2022 07:23:44 AM script INFO: SUCCESS!@#KODE 1!@#USER_ID 29!@#ACTIVITY_CODE 3
12/23/2022 07:23:44 AM script INFO: SUCCESS!@#KODE 1!@#USER_ID 29!@#ACTIVITY_CODE 3
12/23/2022 07:23:44 AM script INFO: SUCCESS!@#KODE 1!@#USER_ID 29!@#ACTIVITY_CODE 2
12/23/2022 07:23:44 AM script INFO: SUCCESS!@#KODE 1!@#USER_ID 29!@#ACTIVITY_CODE 3
12/23/2022 07:23:44 AM script INFO: SUCCESS!@#KODE 1!@#USER_ID 29!@#ACTIVITY_CODE 1
12/23/2022 07:23:44 AM script INFO: SUCCESS!@#KODE 1!@#USER_ID 29!@#ACTIVITY_CODE 3
12/23/2022 07:23:44 AM script INFO: SUCCESS!@#KODE 1!@#USER_ID 29!@#ACTIVITY_CODE 3
12/23/2022 07:23:44 AM script INFO: SUCCESS!@#KODE 1!@#USER_ID 29!@#ACTIVITY_CODE 3
12/23/2022 07:23:45 AM script INFO: SUCCESS!@#KODE 1!@#USER_ID 29!@#ACTIVITY_CODE 3
12/23/2022 07:23:45 AM script INFO: SUCCESS!@#KODE 1!@#USER_ID 29!@#ACTIVITY_CODE 4
12/23/2022 07:23:45 AM script INFO: SUCCESS!@#KODE 1!@#USER_ID 29!@#ACTIVITY_CODE 3
12/23/2022 07:23:45 AM script INFO: SUCCESS!@#KODE 1!@#USER_ID 29!@#ACTIVITY_CODE 3
12/23/2022 07:23:45 AM script INFO: SUCCESS!@#KODE 1!@#USER_ID 29!@#ACTIVITY_CODE 2
12/23/2022 07:23:45 AM script INFO: SUCCESS!@#KODE 1!@#USER_ID 29!@#ACTIVITY_CODE 4
12/23/2022 07:23:45 AM script INFO: SUCCESS!@#KODE 1!@#USER_ID 29!@#ACTIVITY_CODE 2
12/23/2022 07:23:45 AM script INFO: SUCCESS!@#KODE 1!@#USER_ID 29!@#ACTIVITY_CODE 1
12/23/2022 07:23:45 AM script INFO: SUCCESS!@#KODE 1!@#USER_ID 29!@#ACTIVITY_CODE 4
12/23/2022 07:23:45 AM script INFO: SUCCESS!@#KODE 1!@#USER_ID 29!@#ACTIVITY_CODE 3
12/23/2022 07:23:45 AM script INFO: SUCCESS!@#KODE 1!@#USER_ID 29!@#ACTIVITY_CODE 3
12/23/2022 07:23:45 AM script INFO: SUCCESS!@#KODE 1!@#USER_ID 29!@#ACTIVITY_CODE 1
12/23/2022 07:23:45 AM script INFO: SUCCESS!@#KODE 1!@#USER_ID 29!@#ACTIVITY_CODE 3
12/23/2022 07:23:45 AM script INFO: SUCCESS!@#KODE 1!@#USER_ID 29!@#ACTIVITY_CODE 4
12/23/2022 07:23:45 AM script INFO: SUCCESS!@#KODE 1!@#USER_ID 29!@#ACTIVITY_CODE 3
12/23/2022 07:23:45 AM script INFO: SUCCESS!@#KODE 1!@#USER_ID 29!@#ACTIVITY_CODE 1
12/23/2022 07:23:45 AM script INFO: SUCCESS!@#KODE 1!@#USER_ID 29!@#ACTIVITY_CODE 3
12/23/2022 07:23:46 AM script INFO: SUCCESS!@#KODE 1!@#USER_ID 29!@#ACTIVITY_CODE 4
12/23/2022 07:23:46 AM script INFO: SUCCESS!@#KODE 1!@#USER_ID 29!@#ACTIVITY_CODE 2
12/23/2022 07:23:46 AM script INFO: SUCCESS!@#KODE 1!@#USER_ID 29!@#ACTIVITY_CODE 2
12/23/2022 07:23:46 AM script INFO: SUCCESS!@#KODE 1!@#USER_ID 29!@#ACTIVITY_CODE 3
12/23/2022 07:23:46 AM script INFO: SUCCESS!@#KODE 1!@#USER_ID 29!@#ACTIVITY_CODE 2
12/23/2022 07:23:46 AM script INFO: SUCCESS!@#KODE 1!@#USER_ID 29!@#ACTIVITY_CODE 3
12/23/2022 07:23:46 AM script INFO: SUCCESS!@#KODE 1!@#USER_ID 29!@#ACTIVITY_CODE 1
12/23/2022 07:23:46 AM script INFO: SUCCESS!@#KODE 1!@#USER_ID 29!@#ACTIVITY_CODE 2
12/23/2022 07:23:46 AM script INFO: SUCCESS!@#KODE 1!@#USER_ID 29!@#ACTIVITY_CODE 1
12/23/2022 07:23:46 AM script INFO: SUCCESS!@#KODE 1!@#USER_ID 29!@#ACTIVITY_CODE 1
12/23/2022 07:23:46 AM script INFO: SUCCESS!@#KODE 1!@#USER_ID 29!@#ACTIVITY_CODE 3
12/23/2022 07:23:46 AM script INFO: SUCCESS!@#KODE 1!@#USER_ID 29!@#ACTIVITY_CODE 1
12/23/2022 07:23:46 AM script INFO: SUCCESS!@#KODE 1!@#USER_ID 29!@#ACTIVITY_CODE 4
12/23/2022 07:23:46 AM script INFO: SUCCESS!@#KODE 1!@#USER_ID 29!@#ACTIVITY_CODE 1
12/23/2022 07:23:46 AM script INFO: SUCCESS!@#KODE 1!@#USER_ID 29!@#ACTIVITY_CODE 3
12/23/2022 07:23:46 AM script INFO: SUCCESS!@#KODE 1!@#USER_ID 29!@#ACTIVITY_CODE 4
12/23/2022 07:23:46 AM script INFO: SUCCESS!@#KODE 1!@#USER_ID 29!@#ACTIVITY_CODE 1
12/23/2022 07:23:46 AM script INFO: SUCCESS!@#KODE 1!@#USER_ID 29!@#ACTIVITY_CODE 1
12/23/2022 07:23:47 AM script INFO: SUCCESS!@#KODE 1!@#USER_ID 29!@#ACTIVITY_CODE 1
12/23/2022 07:23:47 AM script INFO: SUCCESS!@#KODE 1!@#USER_ID 29!@#ACTIVITY_CODE 4
12/23/2022 07:23:47 AM script INFO: SUCCESS!@#KODE 1!@#USER_ID 29!@#ACTIVITY_CODE 3
12/23/2022 07:23:47 AM script INFO: SUCCESS!@#KODE 1!@#USER_ID 29!@#ACTIVITY_CODE 1
12/23/2022 07:23:47 AM script INFO: SUCCESS!@#KODE 1!@#USER_ID 29!@#ACTIVITY_CODE 3
12/23/2022 07:23:47 AM script INFO: SUCCESS!@#KODE 1!@#USER_ID 29!@#ACTIVITY_CODE 3
12/23/2022 07:23:47 AM script INFO: SUCCESS!@#KODE 1!@#USER_ID 29!@#ACTIVITY_CODE 3
12/23/2022 07:23:47 AM script INFO: SUCCESS!@#KODE 1!@#USER_ID 29!@#ACTIVITY_CODE 1
12/23/2022 07:23:47 AM script INFO: SUCCESS!@#KODE 1!@#USER_ID 29!@#ACTIVITY_CODE 1
12/23/2022 07:23:47 AM script INFO: SUCCESS!@#KODE 1!@#USER_ID 29!@#ACTIVITY_CODE 1
12/23/2022 07:23:47 AM script INFO: SUCCESS!@#KODE 1!@#USER_ID 29!@#ACTIVITY_CODE 4
12/23/2022 07:23:47 AM script INFO: SUCCESS!@#KODE 1!@#USER_ID 29!@#ACTIVITY_CODE 3
12/23/2022 07:23:47 AM script INFO: SUCCESS!@#KODE 1!@#USER_ID 29!@#ACTIVITY_CODE 2
12/23/2022 07:23:47 AM script INFO: SUCCESS!@#KODE 1!@#USER_ID 29!@#ACTIVITY_CODE 1
12/23/2022 07:23:47 AM script INFO: SUCCESS!@#KODE 1!@#USER_ID 29!@#ACTIVITY_CODE 3
12/23/2022 07:23:47 AM script INFO: SUCCESS!@#KODE 1!@#USER_ID 29!@#ACTIVITY_CODE 2
12/23/2022 07:23:47 AM script INFO: SUCCESS!@#KODE 1!@#USER_ID 29!@#ACTIVITY_CODE 3
12/23/2022 07:23:47 AM script INFO: SUCCESS!@#KODE 1!@#USER_ID 29!@#ACTIVITY_CODE 2
12/23/2022 07:23:48 AM script INFO: SUCCESS!@#KODE 1!@#USER_ID 29!@#ACTIVITY_CODE 2
12/23/2022 07:23:48 AM script INFO: SUCCESS!@#KODE 1!@#USER_ID 29!@#ACTIVITY_CODE 3
12/23/2022 07:23:48 AM script INFO: SUCCESS!@#KODE 1!@#USER_ID 29!@#ACTIVITY_CODE 2
12/23/2022 07:23:48 AM script INFO: SUCCESS!@#KODE 1!@#USER_ID 29!@#ACTIVITY_CODE 2
12/23/2022 07:23:48 AM script INFO: SUCCESS!@#KODE 1!@#USER_ID 29!@#ACTIVITY_CODE 2
12/23/2022 07:23:48 AM script INFO: SUCCESS!@#KODE 1!@#USER_ID 29!@#ACTIVITY_CODE 2
12/23/2022 07:23:48 AM script INFO: SUCCESS!@#KODE 1!@#USER_ID 29!@#ACTIVITY_CODE 3
12/23/2022 07:23:48 AM script INFO: SUCCESS!@#KODE 1!@#USER_ID 29!@#ACTIVITY_CODE 3
12/23/2022 07:23:48 AM script INFO: SUCCESS!@#KODE 1!@#USER_ID 29!@#ACTIVITY_CODE 1
12/23/2022 07:23:48 AM script INFO: SUCCESS!@#KODE 1!@#USER_ID 29!@#ACTIVITY_CODE 1
12/23/2022 07:23:48 AM script INFO: SUCCESS!@#KODE 1!@#USER_ID 29!@#ACTIVITY_CODE 2
12/23/2022 07:23:48 AM script INFO: SUCCESS!@#KODE 1!@#USER_ID 29!@#ACTIVITY_CODE 3
12/23/2022 07:23:48 AM script INFO: SUCCESS!@#KODE 1!@#USER_ID 29!@#ACTIVITY_CODE 2
12/23/2022 07:23:49 AM script INFO: SUCCESS!@#KODE 1!@#USER_ID 29!@#ACTIVITY_CODE 2
12/23/2022 07:23:49 AM script INFO: SUCCESS!@#KODE 1!@#USER_ID 29!@#ACTIVITY_CODE 2
12/23/2022 07:23:49 AM script INFO: SUCCESS!@#KODE 1!@#USER_ID 29!@#ACTIVITY_CODE 3
12/23/2022 07:23:49 AM script INFO: SUCCESS!@#KODE 1!@#USER_ID 29!@#ACTIVITY_CODE 1
12/23/2022 07:23:49 AM script INFO: SUCCESS!@#KODE 1!@#USER_ID 29!@#ACTIVITY_CODE 4
12/23/2022 07:23:49 AM script INFO: SUCCESS!@#KODE 1!@#USER_ID 29!@#ACTIVITY_CODE 2
12/23/2022 07:23:49 AM script INFO: SUCCESS!@#KODE 1!@#USER_ID 29!@#ACTIVITY_CODE 3
12/23/2022 07:23:49 AM script INFO: SUCCESS!@#KODE 1!@#USER_ID 29!@#ACTIVITY_CODE 2
12/23/2022 07:23:49 AM script INFO: SUCCESS!@#KODE 1!@#USER_ID 29!@#ACTIVITY_CODE 2
12/23/2022 07:23:49 AM script INFO: SUCCESS!@#KODE 1!@#USER_ID 29!@#ACTIVITY_CODE 3
12/23/2022 07:23:49 AM script INFO: SUCCESS!@#KODE 1!@#USER_ID 29!@#ACTIVITY_CODE 3
12/23/2022 07:23:49 AM script INFO: SUCCESS!@#KODE 1!@#USER_ID 29!@#ACTIVITY_CODE 3
12/23/2022 07:23:49 AM script INFO: SUCCESS!@#KODE 1!@#USER_ID 29!@#ACTIVITY_CODE 1
12/23/2022 07:23:49 AM script INFO: SUCCESS!@#KODE 1!@#USER_ID 29!@#ACTIVITY_CODE 4
12/23/2022 07:23:49 AM script INFO: SUCCESS!@#KODE 1!@#USER_ID 29!@#ACTIVITY_CODE 3
12/23/2022 07:23:49 AM script INFO: SUCCESS!@#KODE 1!@#USER_ID 29!@#ACTIVITY_CODE 2
12/23/2022 07:23:50 AM script INFO: SUCCESS!@#KODE 1!@#USER_ID 29!@#ACTIVITY_CODE 1
12/23/2022 07:23:50 AM script INFO: SUCCESS!@#KODE 1!@#USER_ID 29!@#ACTIVITY_CODE 2
12/23/2022 07:23:50 AM script INFO: SUCCESS!@#KODE 1!@#USER_ID 29!@#ACTIVITY_CODE 3
12/23/2022 07:23:50 AM script INFO: SUCCESS!@#KODE 1!@#USER_ID 29!@#ACTIVITY_CODE 2
12/23/2022 07:23:50 AM script INFO: SUCCESS!@#KODE 1!@#USER_ID 29!@#ACTIVITY_CODE 2
12/23/2022 07:23:50 AM script INFO: SUCCESS!@#KODE 1!@#USER_ID 29!@#ACTIVITY_CODE 2
12/23/2022 07:23:50 AM script INFO: SUCCESS!@#KODE 1!@#USER_ID 29!@#ACTIVITY_CODE 1
12/23/2022 07:23:50 AM script INFO: SUCCESS!@#KODE 1!@#USER_ID 29!@#ACTIVITY_CODE 3
12/23/2022 07:23:50 AM script INFO: SUCCESS!@#KODE 1!@#USER_ID 29!@#ACTIVITY_CODE 3
12/23/2022 07:23:50 AM script INFO: SUCCESS!@#KODE 1!@#USER_ID 29!@#ACTIVITY_CODE 2
12/23/2022 07:23:50 AM script INFO: SUCCESS!@#KODE 1!@#USER_ID 29!@#ACTIVITY_CODE 3
12/23/2022 07:23:50 AM script INFO: SUCCESS!@#KODE 1!@#USER_ID 29!@#ACTIVITY_CODE 3
12/23/2022 07:23:50 AM script INFO: SUCCESS!@#KODE 1!@#USER_ID 29!@#ACTIVITY_CODE 1
12/23/2022 07:23:50 AM script INFO: SUCCESS!@#KODE 1!@#USER_ID 29!@#ACTIVITY_CODE 3
12/23/2022 07:23:50 AM script INFO: SUCCESS!@#KODE 1!@#USER_ID 29!@#ACTIVITY_CODE 3
12/23/2022 07:23:51 AM script INFO: SUCCESS!@#KODE 1!@#USER_ID 29!@#ACTIVITY_CODE 4
12/23/2022 07:23:51 AM script INFO: SUCCESS!@#KODE 1!@#USER_ID 29!@#ACTIVITY_CODE 3
12/23/2022 07:23:51 AM script INFO: SUCCESS!@#KODE 1!@#USER_ID 29!@#ACTIVITY_CODE 2
12/23/2022 07:23:51 AM script INFO: SUCCESS!@#KODE 1!@#USER_ID 29!@#ACTIVITY_CODE 4
12/23/2022 07:23:51 AM script INFO: SUCCESS!@#KODE 1!@#USER_ID 29!@#ACTIVITY_CODE 2
12/23/2022 07:23:51 AM script INFO: SUCCESS!@#KODE 1!@#USER_ID 29!@#ACTIVITY_CODE 3
12/23/2022 07:23:51 AM script INFO: SUCCESS!@#KODE 1!@#USER_ID 29!@#ACTIVITY_CODE 3
12/23/2022 07:23:51 AM script INFO: SUCCESS!@#KODE 1!@#USER_ID 29!@#ACTIVITY_CODE 2
12/23/2022 07:23:51 AM script INFO: SUCCESS!@#KODE 1!@#USER_ID 29!@#ACTIVITY_CODE 1
12/23/2022 07:23:51 AM script INFO: SUCCESS!@#KODE 1!@#USER_ID 29!@#ACTIVITY_CODE 1
12/23/2022 07:23:51 AM script INFO: SUCCESS!@#KODE 1!@#USER_ID 29!@#ACTIVITY_CODE 1
12/23/2022 07:23:51 AM script INFO: SUCCESS!@#KODE 1!@#USER_ID 29!@#ACTIVITY_CODE 1
12/23/2022 07:23:51 AM script INFO: SUCCESS!@#KODE 1!@#USER_ID 29!@#ACTIVITY_CODE 2
12/23/2022 07:23:51 AM script INFO: SUCCESS!@#KODE 1!@#USER_ID 29!@#ACTIVITY_CODE 3
12/23/2022 07:23:51 AM script INFO: SUCCESS!@#KODE 1!@#USER_ID 29!@#ACTIVITY_CODE 3
12/23/2022 07:23:51 AM script INFO: SUCCESS!@#KODE 1!@#USER_ID 29!@#ACTIVITY_CODE 3
12/23/2022 07:23:51 AM script INFO: SUCCESS!@#KODE 1!@#USER_ID 29!@#ACTIVITY_CODE 3
12/23/2022 07:23:52 AM script INFO: SUCCESS!@#KODE 1!@#USER_ID 29!@#ACTIVITY_CODE 1
12/23/2022 07:23:52 AM script INFO: SUCCESS!@#KODE 1!@#USER_ID 29!@#ACTIVITY_CODE 4
12/23/2022 07:23:52 AM script INFO: SUCCESS!@#KODE 1!@#USER_ID 29!@#ACTIVITY_CODE 1
12/23/2022 07:23:52 AM script INFO: SUCCESS!@#KODE 1!@#USER_ID 29!@#ACTIVITY_CODE 2
12/23/2022 07:23:52 AM script INFO: SUCCESS!@#KODE 1!@#USER_ID 29!@#ACTIVITY_CODE 2
12/23/2022 07:23:52 AM script INFO: SUCCESS!@#KODE 1!@#USER_ID 29!@#ACTIVITY_CODE 1
12/23/2022 07:23:52 AM script INFO: SUCCESS!@#KODE 1!@#USER_ID 29!@#ACTIVITY_CODE 2
12/23/2022 07:23:52 AM script INFO: SUCCESS!@#KODE 1!@#USER_ID 29!@#ACTIVITY_CODE 2
12/23/2022 07:23:52 AM script INFO: SUCCESS!@#KODE 1!@#USER_ID 29!@#ACTIVITY_CODE 2
12/23/2022 07:23:52 AM script INFO: SUCCESS!@#KODE 1!@#USER_ID 29!@#ACTIVITY_CODE 4
12/23/2022 07:23:52 AM script INFO: SUCCESS!@#KODE 1!@#USER_ID 29!@#ACTIVITY_CODE 2
12/23/2022 07:23:52 AM script INFO: SUCCESS!@#KODE 1!@#USER_ID 29!@#ACTIVITY_CODE 2
12/23/2022 07:23:53 AM script INFO: SUCCESS!@#KODE 1!@#USER_ID 29!@#ACTIVITY_CODE 4
12/23/2022 07:23:53 AM script INFO: SUCCESS!@#KODE 1!@#USER_ID 29!@#ACTIVITY_CODE 1
12/23/2022 07:23:53 AM script INFO: SUCCESS!@#KODE 1!@#USER_ID 29!@#ACTIVITY_CODE 1
12/23/2022 07:23:53 AM script INFO: SUCCESS!@#KODE 1!@#USER_ID 29!@#ACTIVITY_CODE 2
12/23/2022 07:23:53 AM script INFO: SUCCESS!@#KODE 1!@#USER_ID 29!@#ACTIVITY_CODE 3
12/23/2022 07:23:53 AM script INFO: SUCCESS!@#KODE 1!@#USER_ID 29!@#ACTIVITY_CODE 1
12/23/2022 07:23:53 AM script INFO: SUCCESS!@#KODE 1!@#USER_ID 29!@#ACTIVITY_CODE 3
12/23/2022 07:23:53 AM script INFO: SUCCESS!@#KODE 1!@#USER_ID 29!@#ACTIVITY_CODE 2
12/23/2022 07:23:53 AM script INFO: SUCCESS!@#KODE 1!@#USER_ID 29!@#ACTIVITY_CODE 2
12/23/2022 07:23:53 AM script INFO: SUCCESS!@#KODE 1!@#USER_ID 29!@#ACTIVITY_CODE 1
12/23/2022 07:23:53 AM script INFO: SUCCESS!@#KODE 1!@#USER_ID 29!@#ACTIVITY_CODE 4
12/23/2022 07:23:53 AM script INFO: SUCCESS!@#KODE 1!@#USER_ID 29!@#ACTIVITY_CODE 2
12/23/2022 07:23:53 AM script INFO: SUCCESS!@#KODE 1!@#USER_ID 29!@#ACTIVITY_CODE 2
12/23/2022 07:23:53 AM script INFO: SUCCESS!@#KODE 1!@#USER_ID 29!@#ACTIVITY_CODE 3
12/23/2022 07:23:53 AM script INFO: SUCCESS!@#KODE 1!@#USER_ID 29!@#ACTIVITY_CODE 1
12/23/2022 07:23:53 AM script INFO: SUCCESS!@#KODE 1!@#USER_ID 29!@#ACTIVITY_CODE 3
12/23/2022 07:23:54 AM script INFO: SUCCESS!@#KODE 1!@#USER_ID 29!@#ACTIVITY_CODE 4
12/23/2022 07:23:54 AM script INFO: SUCCESS!@#KODE 1!@#USER_ID 29!@#ACTIVITY_CODE 1
12/23/2022 07:23:54 AM script INFO: SUCCESS!@#KODE 1!@#USER_ID 29!@#ACTIVITY_CODE 1
12/23/2022 07:23:54 AM script INFO: Duration: 54.7915518283844
12/23/2022 07:23:54 AM script INFO: mengakhiri-quiz
12/23/2022 07:23:54 AM script INFO: SUCCESS!@#KODE 1!@#USER_ID 29!@#ACTIVITY_CODE 5
12/23/2022 07:23:54 AM script INFO: berhasil-submit
