12/23/2022 01:06:08 AM script INFO: Prepared chrome options..
12/23/2022 01:06:09 AM script INFO: Initialized chrome browser..
12/23/2022 01:06:09 AM script INFO: mengakses-homepage
12/23/2022 01:06:39 AM script INFO: mengakses-login-page
12/23/2022 01:07:37 AM script INFO: mengakses-site-home
12/23/2022 01:07:50 AM script INFO: mengakses-site-course
12/23/2022 01:08:23 AM script INFO: mengakses-quiz
12/23/2022 01:08:43 AM script INFO: mengakses-start-quiz-page
12/23/2022 01:09:04 AM script INFO: memulai-quiz
12/23/2022 01:09:04 AM script INFO: SUCCESS!@#KODE 1!@#USER_ID 50!@#ACTIVITY_CODE 5
12/23/2022 01:09:15 AM script INFO: SUCCESS!@#KODE 1!@#USER_ID 50!@#ACTIVITY_CODE 2
12/23/2022 01:09:15 AM script INFO: SUCCESS!@#KODE 1!@#USER_ID 50!@#ACTIVITY_CODE 2
12/23/2022 01:09:15 AM script INFO: SUCCESS!@#KODE 1!@#USER_ID 50!@#ACTIVITY_CODE 1
12/23/2022 01:09:15 AM script INFO: SUCCESS!@#KODE 1!@#USER_ID 50!@#ACTIVITY_CODE 1
12/23/2022 01:09:15 AM script INFO: SUCCESS!@#KODE 1!@#USER_ID 50!@#ACTIVITY_CODE 3
12/23/2022 01:09:15 AM script INFO: SUCCESS!@#KODE 1!@#USER_ID 50!@#ACTIVITY_CODE 5
12/23/2022 01:09:15 AM script INFO: SUCCESS!@#KODE 1!@#USER_ID 50!@#ACTIVITY_CODE 5
12/23/2022 01:09:18 AM script INFO: SUCCESS!@#KODE 1!@#USER_ID 50!@#ACTIVITY_CODE 3
12/23/2022 01:09:18 AM script INFO: SUCCESS!@#KODE 1!@#USER_ID 50!@#ACTIVITY_CODE 2
12/23/2022 01:09:18 AM script INFO: SUCCESS!@#KODE 1!@#USER_ID 50!@#ACTIVITY_CODE 3
12/23/2022 01:09:18 AM script INFO: SUCCESS!@#KODE 1!@#USER_ID 50!@#ACTIVITY_CODE 2
12/23/2022 01:09:18 AM script INFO: SUCCESS!@#KODE 1!@#USER_ID 50!@#ACTIVITY_CODE 3
12/23/2022 01:09:18 AM script INFO: SUCCESS!@#KODE 1!@#USER_ID 50!@#ACTIVITY_CODE 2
12/23/2022 01:09:18 AM script INFO: SUCCESS!@#KODE 1!@#USER_ID 50!@#ACTIVITY_CODE 2
12/23/2022 01:09:18 AM script INFO: SUCCESS!@#KODE 1!@#USER_ID 50!@#ACTIVITY_CODE 1
12/23/2022 01:09:18 AM script INFO: SUCCESS!@#KODE 1!@#USER_ID 50!@#ACTIVITY_CODE 2
12/23/2022 01:09:18 AM script INFO: SUCCESS!@#KODE 1!@#USER_ID 50!@#ACTIVITY_CODE 2
12/23/2022 01:09:19 AM script INFO: SUCCESS!@#KODE 1!@#USER_ID 50!@#ACTIVITY_CODE 3
12/23/2022 01:09:19 AM script INFO: SUCCESS!@#KODE 1!@#USER_ID 50!@#ACTIVITY_CODE 2
12/23/2022 01:09:19 AM script INFO: SUCCESS!@#KODE 1!@#USER_ID 50!@#ACTIVITY_CODE 4
12/23/2022 01:09:19 AM script INFO: SUCCESS!@#KODE 1!@#USER_ID 50!@#ACTIVITY_CODE 5
12/23/2022 01:09:19 AM script INFO: SUCCESS!@#KODE 1!@#USER_ID 50!@#ACTIVITY_CODE 5
12/23/2022 01:09:21 AM script INFO: SUCCESS!@#KODE 1!@#USER_ID 50!@#ACTIVITY_CODE 2
12/23/2022 01:09:21 AM script INFO: SUCCESS!@#KODE 1!@#USER_ID 50!@#ACTIVITY_CODE 2
12/23/2022 01:09:22 AM script INFO: SUCCESS!@#KODE 1!@#USER_ID 50!@#ACTIVITY_CODE 1
12/23/2022 01:09:22 AM script INFO: SUCCESS!@#KODE 1!@#USER_ID 50!@#ACTIVITY_CODE 2
12/23/2022 01:09:22 AM script INFO: SUCCESS!@#KODE 1!@#USER_ID 50!@#ACTIVITY_CODE 1
12/23/2022 01:09:22 AM script INFO: SUCCESS!@#KODE 1!@#USER_ID 50!@#ACTIVITY_CODE 5
12/23/2022 01:09:22 AM script INFO: SUCCESS!@#KODE 1!@#USER_ID 50!@#ACTIVITY_CODE 5
12/23/2022 01:09:24 AM script INFO: SUCCESS!@#KODE 1!@#USER_ID 50!@#ACTIVITY_CODE 1
12/23/2022 01:09:24 AM script INFO: SUCCESS!@#KODE 1!@#USER_ID 50!@#ACTIVITY_CODE 1
12/23/2022 01:09:24 AM script INFO: SUCCESS!@#KODE 1!@#USER_ID 50!@#ACTIVITY_CODE 4
12/23/2022 01:09:24 AM script INFO: SUCCESS!@#KODE 1!@#USER_ID 50!@#ACTIVITY_CODE 2
12/23/2022 01:09:25 AM script INFO: SUCCESS!@#KODE 1!@#USER_ID 50!@#ACTIVITY_CODE 2
12/23/2022 01:09:25 AM script INFO: SUCCESS!@#KODE 1!@#USER_ID 50!@#ACTIVITY_CODE 2
12/23/2022 01:09:25 AM script INFO: SUCCESS!@#KODE 1!@#USER_ID 50!@#ACTIVITY_CODE 3
12/23/2022 01:09:25 AM script INFO: SUCCESS!@#KODE 1!@#USER_ID 50!@#ACTIVITY_CODE 3
12/23/2022 01:09:25 AM script INFO: SUCCESS!@#KODE 1!@#USER_ID 50!@#ACTIVITY_CODE 1
12/23/2022 01:09:25 AM script INFO: SUCCESS!@#KODE 1!@#USER_ID 50!@#ACTIVITY_CODE 5
12/23/2022 01:09:25 AM script INFO: SUCCESS!@#KODE 1!@#USER_ID 50!@#ACTIVITY_CODE 5
12/23/2022 01:09:28 AM script INFO: SUCCESS!@#KODE 1!@#USER_ID 50!@#ACTIVITY_CODE 2
12/23/2022 01:09:28 AM script INFO: SUCCESS!@#KODE 1!@#USER_ID 50!@#ACTIVITY_CODE 2
12/23/2022 01:09:28 AM script INFO: SUCCESS!@#KODE 1!@#USER_ID 50!@#ACTIVITY_CODE 1
12/23/2022 01:09:28 AM script INFO: SUCCESS!@#KODE 1!@#USER_ID 50!@#ACTIVITY_CODE 5
12/23/2022 01:09:28 AM script INFO: SUCCESS!@#KODE 1!@#USER_ID 50!@#ACTIVITY_CODE 5
12/23/2022 01:09:30 AM script INFO: SUCCESS!@#KODE 1!@#USER_ID 50!@#ACTIVITY_CODE 5
12/23/2022 01:09:30 AM script INFO: SUCCESS!@#KODE 1!@#USER_ID 50!@#ACTIVITY_CODE 5
12/23/2022 01:09:33 AM script INFO: SUCCESS!@#KODE 1!@#USER_ID 50!@#ACTIVITY_CODE 4
12/23/2022 01:09:33 AM script INFO: Duration: 18.239551544189453
12/23/2022 01:09:33 AM script INFO: mengakhiri-quiz
12/23/2022 01:09:50 AM script INFO: SUCCESS!@#KODE 1!@#USER_ID 50!@#ACTIVITY_CODE 5
12/23/2022 01:09:50 AM script INFO: berhasil-submit
12/23/2022 01:11:20 AM script ERROR: TIMEOUT EXCEPTION!@#KODE 0!@#LOCATION berhasil-submit
12/23/2022 01:11:20 AM main_worker ERROR: Message: None

