12/10/2022 09:21:39 AM script INFO: Prepared chrome options..
12/10/2022 09:21:41 AM script INFO: Initialized chrome browser..
12/10/2022 09:21:41 AM script INFO: mengakses-homepage
12/10/2022 09:22:02 AM script INFO: mengakses-login-page
12/10/2022 09:22:31 AM script INFO: mengakses-site-home
12/10/2022 09:22:35 AM script INFO: mengakses-site-course
12/10/2022 09:23:02 AM script INFO: mengakses-quiz
12/10/2022 09:23:07 AM script INFO: mengakses-start-quiz-page
12/10/2022 09:23:32 AM script INFO: memulai-quiz
12/10/2022 09:23:32 AM script INFO: SUCCESS!@#KODE 1!@#USER_ID 66!@#ACTIVITY_CODE 5
12/10/2022 09:23:43 AM script INFO: SUCCESS!@#KODE 1!@#USER_ID 66!@#ACTIVITY_CODE 2
12/10/2022 09:23:43 AM script INFO: SUCCESS!@#KODE 1!@#USER_ID 66!@#ACTIVITY_CODE 3
12/10/2022 09:23:43 AM script INFO: SUCCESS!@#KODE 1!@#USER_ID 66!@#ACTIVITY_CODE 2
12/10/2022 09:23:43 AM script INFO: SUCCESS!@#KODE 1!@#USER_ID 66!@#ACTIVITY_CODE 5
12/10/2022 09:23:43 AM script INFO: SUCCESS!@#KODE 1!@#USER_ID 66!@#ACTIVITY_CODE 5
12/10/2022 09:23:46 AM script INFO: SUCCESS!@#KODE 1!@#USER_ID 66!@#ACTIVITY_CODE 3
12/10/2022 09:23:46 AM script INFO: SUCCESS!@#KODE 1!@#USER_ID 66!@#ACTIVITY_CODE 5
12/10/2022 09:23:46 AM script INFO: SUCCESS!@#KODE 1!@#USER_ID 66!@#ACTIVITY_CODE 5
12/10/2022 09:23:49 AM script INFO: SUCCESS!@#KODE 1!@#USER_ID 66!@#ACTIVITY_CODE 1
12/10/2022 09:23:49 AM script INFO: SUCCESS!@#KODE 1!@#USER_ID 66!@#ACTIVITY_CODE 1
12/10/2022 09:23:49 AM script INFO: SUCCESS!@#KODE 1!@#USER_ID 66!@#ACTIVITY_CODE 3
12/10/2022 09:23:49 AM script INFO: SUCCESS!@#KODE 1!@#USER_ID 66!@#ACTIVITY_CODE 3
12/10/2022 09:23:50 AM script INFO: SUCCESS!@#KODE 1!@#USER_ID 66!@#ACTIVITY_CODE 2
12/10/2022 09:23:50 AM script INFO: SUCCESS!@#KODE 1!@#USER_ID 66!@#ACTIVITY_CODE 5
12/10/2022 09:23:50 AM script INFO: SUCCESS!@#KODE 1!@#USER_ID 66!@#ACTIVITY_CODE 5
12/10/2022 09:23:53 AM script INFO: SUCCESS!@#KODE 1!@#USER_ID 66!@#ACTIVITY_CODE 3
12/10/2022 09:23:53 AM script INFO: SUCCESS!@#KODE 1!@#USER_ID 66!@#ACTIVITY_CODE 5
12/10/2022 09:23:53 AM script INFO: SUCCESS!@#KODE 1!@#USER_ID 66!@#ACTIVITY_CODE 5
12/10/2022 09:23:55 AM script INFO: SUCCESS!@#KODE 1!@#USER_ID 66!@#ACTIVITY_CODE 3
12/10/2022 09:23:56 AM script INFO: SUCCESS!@#KODE 1!@#USER_ID 66!@#ACTIVITY_CODE 3
12/10/2022 09:23:56 AM script INFO: SUCCESS!@#KODE 1!@#USER_ID 66!@#ACTIVITY_CODE 5
12/10/2022 09:23:56 AM script INFO: SUCCESS!@#KODE 1!@#USER_ID 66!@#ACTIVITY_CODE 5
12/10/2022 09:23:58 AM script INFO: SUCCESS!@#KODE 1!@#USER_ID 66!@#ACTIVITY_CODE 3
12/10/2022 09:23:58 AM script INFO: SUCCESS!@#KODE 1!@#USER_ID 66!@#ACTIVITY_CODE 1
12/10/2022 09:23:59 AM script INFO: SUCCESS!@#KODE 1!@#USER_ID 66!@#ACTIVITY_CODE 1
12/10/2022 09:23:59 AM script INFO: SUCCESS!@#KODE 1!@#USER_ID 66!@#ACTIVITY_CODE 4
12/10/2022 09:23:59 AM script INFO: SUCCESS!@#KODE 1!@#USER_ID 66!@#ACTIVITY_CODE 3
12/10/2022 09:23:59 AM script INFO: SUCCESS!@#KODE 1!@#USER_ID 66!@#ACTIVITY_CODE 2
12/10/2022 09:23:59 AM script INFO: SUCCESS!@#KODE 1!@#USER_ID 66!@#ACTIVITY_CODE 5
12/10/2022 09:23:59 AM script INFO: SUCCESS!@#KODE 1!@#USER_ID 66!@#ACTIVITY_CODE 5
12/10/2022 09:24:02 AM script INFO: SUCCESS!@#KODE 1!@#USER_ID 66!@#ACTIVITY_CODE 1
12/10/2022 09:24:02 AM script INFO: SUCCESS!@#KODE 1!@#USER_ID 66!@#ACTIVITY_CODE 1
12/10/2022 09:24:02 AM script INFO: SUCCESS!@#KODE 1!@#USER_ID 66!@#ACTIVITY_CODE 5
12/10/2022 09:24:02 AM script INFO: SUCCESS!@#KODE 1!@#USER_ID 66!@#ACTIVITY_CODE 5
12/10/2022 09:24:05 AM script INFO: SUCCESS!@#KODE 1!@#USER_ID 66!@#ACTIVITY_CODE 1
12/10/2022 09:24:05 AM script INFO: SUCCESS!@#KODE 1!@#USER_ID 66!@#ACTIVITY_CODE 3
12/10/2022 09:24:05 AM script INFO: SUCCESS!@#KODE 1!@#USER_ID 66!@#ACTIVITY_CODE 1
12/10/2022 09:24:05 AM script INFO: SUCCESS!@#KODE 1!@#USER_ID 66!@#ACTIVITY_CODE 4
12/10/2022 09:24:06 AM script INFO: SUCCESS!@#KODE 1!@#USER_ID 66!@#ACTIVITY_CODE 3
12/10/2022 09:24:06 AM script INFO: SUCCESS!@#KODE 1!@#USER_ID 66!@#ACTIVITY_CODE 1
12/10/2022 09:24:06 AM script INFO: SUCCESS!@#KODE 1!@#USER_ID 66!@#ACTIVITY_CODE 1
12/10/2022 09:24:06 AM script INFO: SUCCESS!@#KODE 1!@#USER_ID 66!@#ACTIVITY_CODE 2
12/10/2022 09:24:06 AM script INFO: SUCCESS!@#KODE 1!@#USER_ID 66!@#ACTIVITY_CODE 5
12/10/2022 09:24:06 AM script INFO: SUCCESS!@#KODE 1!@#USER_ID 66!@#ACTIVITY_CODE 5
12/10/2022 09:24:09 AM script INFO: SUCCESS!@#KODE 1!@#USER_ID 66!@#ACTIVITY_CODE 2
12/10/2022 09:24:10 AM script INFO: SUCCESS!@#KODE 1!@#USER_ID 66!@#ACTIVITY_CODE 2
12/10/2022 09:24:10 AM script INFO: SUCCESS!@#KODE 1!@#USER_ID 66!@#ACTIVITY_CODE 2
12/10/2022 09:24:10 AM script INFO: SUCCESS!@#KODE 1!@#USER_ID 66!@#ACTIVITY_CODE 1
12/10/2022 09:24:10 AM script INFO: SUCCESS!@#KODE 1!@#USER_ID 66!@#ACTIVITY_CODE 1
12/10/2022 09:24:10 AM script INFO: SUCCESS!@#KODE 1!@#USER_ID 66!@#ACTIVITY_CODE 1
12/10/2022 09:24:10 AM script INFO: SUCCESS!@#KODE 1!@#USER_ID 66!@#ACTIVITY_CODE 5
12/10/2022 09:24:10 AM script INFO: SUCCESS!@#KODE 1!@#USER_ID 66!@#ACTIVITY_CODE 5
12/10/2022 09:24:13 AM script INFO: SUCCESS!@#KODE 1!@#USER_ID 66!@#ACTIVITY_CODE 2
12/10/2022 09:24:13 AM script INFO: SUCCESS!@#KODE 1!@#USER_ID 66!@#ACTIVITY_CODE 1
12/10/2022 09:24:14 AM script INFO: SUCCESS!@#KODE 1!@#USER_ID 66!@#ACTIVITY_CODE 2
12/10/2022 09:24:14 AM script INFO: SUCCESS!@#KODE 1!@#USER_ID 66!@#ACTIVITY_CODE 5
12/10/2022 09:24:14 AM script INFO: SUCCESS!@#KODE 1!@#USER_ID 66!@#ACTIVITY_CODE 5
12/10/2022 09:24:16 AM script INFO: SUCCESS!@#KODE 1!@#USER_ID 66!@#ACTIVITY_CODE 3
12/10/2022 09:24:17 AM script INFO: SUCCESS!@#KODE 1!@#USER_ID 66!@#ACTIVITY_CODE 2
12/10/2022 09:24:17 AM script INFO: SUCCESS!@#KODE 1!@#USER_ID 66!@#ACTIVITY_CODE 2
12/10/2022 09:24:18 AM script INFO: SUCCESS!@#KODE 1!@#USER_ID 66!@#ACTIVITY_CODE 2
12/10/2022 09:24:18 AM script INFO: SUCCESS!@#KODE 1!@#USER_ID 66!@#ACTIVITY_CODE 3
12/10/2022 09:24:18 AM script INFO: SUCCESS!@#KODE 1!@#USER_ID 66!@#ACTIVITY_CODE 2
12/10/2022 09:24:19 AM script INFO: SUCCESS!@#KODE 1!@#USER_ID 66!@#ACTIVITY_CODE 2
12/10/2022 09:24:19 AM script INFO: SUCCESS!@#KODE 1!@#USER_ID 66!@#ACTIVITY_CODE 1
12/10/2022 09:24:19 AM script INFO: SUCCESS!@#KODE 1!@#USER_ID 66!@#ACTIVITY_CODE 2
12/10/2022 09:24:20 AM script INFO: SUCCESS!@#KODE 1!@#USER_ID 66!@#ACTIVITY_CODE 1
12/10/2022 09:24:20 AM script INFO: SUCCESS!@#KODE 1!@#USER_ID 66!@#ACTIVITY_CODE 5
12/10/2022 09:24:20 AM script INFO: SUCCESS!@#KODE 1!@#USER_ID 66!@#ACTIVITY_CODE 5
12/10/2022 09:24:22 AM script INFO: SUCCESS!@#KODE 1!@#USER_ID 66!@#ACTIVITY_CODE 4
12/10/2022 09:24:22 AM script INFO: SUCCESS!@#KODE 1!@#USER_ID 66!@#ACTIVITY_CODE 1
12/10/2022 09:24:22 AM script INFO: SUCCESS!@#KODE 1!@#USER_ID 66!@#ACTIVITY_CODE 5
12/10/2022 09:24:22 AM script INFO: SUCCESS!@#KODE 1!@#USER_ID 66!@#ACTIVITY_CODE 5
12/10/2022 09:24:25 AM script INFO: SUCCESS!@#KODE 1!@#USER_ID 66!@#ACTIVITY_CODE 3
12/10/2022 09:24:26 AM script INFO: SUCCESS!@#KODE 1!@#USER_ID 66!@#ACTIVITY_CODE 2
12/10/2022 09:24:26 AM script INFO: SUCCESS!@#KODE 1!@#USER_ID 66!@#ACTIVITY_CODE 3
12/10/2022 09:24:26 AM script INFO: SUCCESS!@#KODE 1!@#USER_ID 66!@#ACTIVITY_CODE 2
12/10/2022 09:24:26 AM script INFO: SUCCESS!@#KODE 1!@#USER_ID 66!@#ACTIVITY_CODE 1
12/10/2022 09:24:27 AM script INFO: SUCCESS!@#KODE 1!@#USER_ID 66!@#ACTIVITY_CODE 1
12/10/2022 09:24:27 AM script INFO: SUCCESS!@#KODE 1!@#USER_ID 66!@#ACTIVITY_CODE 1
12/10/2022 09:24:27 AM script INFO: SUCCESS!@#KODE 1!@#USER_ID 66!@#ACTIVITY_CODE 1
12/10/2022 09:24:27 AM script INFO: SUCCESS!@#KODE 1!@#USER_ID 66!@#ACTIVITY_CODE 3
12/10/2022 09:24:27 AM script INFO: SUCCESS!@#KODE 1!@#USER_ID 66!@#ACTIVITY_CODE 2
12/10/2022 09:24:28 AM script INFO: SUCCESS!@#KODE 1!@#USER_ID 66!@#ACTIVITY_CODE 3
12/10/2022 09:24:28 AM script INFO: SUCCESS!@#KODE 1!@#USER_ID 66!@#ACTIVITY_CODE 1
12/10/2022 09:24:28 AM script INFO: SUCCESS!@#KODE 1!@#USER_ID 66!@#ACTIVITY_CODE 2
12/10/2022 09:24:28 AM script INFO: SUCCESS!@#KODE 1!@#USER_ID 66!@#ACTIVITY_CODE 4
12/10/2022 09:24:28 AM script INFO: SUCCESS!@#KODE 1!@#USER_ID 66!@#ACTIVITY_CODE 5
12/10/2022 09:24:28 AM script INFO: SUCCESS!@#KODE 1!@#USER_ID 66!@#ACTIVITY_CODE 5
12/10/2022 09:24:31 AM script INFO: SUCCESS!@#KODE 1!@#USER_ID 66!@#ACTIVITY_CODE 2
12/10/2022 09:24:31 AM script INFO: SUCCESS!@#KODE 1!@#USER_ID 66!@#ACTIVITY_CODE 5
12/10/2022 09:24:32 AM script INFO: SUCCESS!@#KODE 1!@#USER_ID 66!@#ACTIVITY_CODE 5
12/10/2022 09:24:34 AM script INFO: SUCCESS!@#KODE 1!@#USER_ID 66!@#ACTIVITY_CODE 2
12/10/2022 09:24:35 AM script INFO: SUCCESS!@#KODE 1!@#USER_ID 66!@#ACTIVITY_CODE 3
12/10/2022 09:24:35 AM script INFO: SUCCESS!@#KODE 1!@#USER_ID 66!@#ACTIVITY_CODE 5
12/10/2022 09:24:35 AM script INFO: SUCCESS!@#KODE 1!@#USER_ID 66!@#ACTIVITY_CODE 5
12/10/2022 09:24:37 AM script INFO: SUCCESS!@#KODE 1!@#USER_ID 66!@#ACTIVITY_CODE 1
12/10/2022 09:24:38 AM script INFO: SUCCESS!@#KODE 1!@#USER_ID 66!@#ACTIVITY_CODE 1
12/10/2022 09:24:38 AM script INFO: SUCCESS!@#KODE 1!@#USER_ID 66!@#ACTIVITY_CODE 2
12/10/2022 09:24:38 AM script INFO: SUCCESS!@#KODE 1!@#USER_ID 66!@#ACTIVITY_CODE 3
12/10/2022 09:24:39 AM script INFO: SUCCESS!@#KODE 1!@#USER_ID 66!@#ACTIVITY_CODE 2
12/10/2022 09:24:39 AM script INFO: SUCCESS!@#KODE 1!@#USER_ID 66!@#ACTIVITY_CODE 3
12/10/2022 09:24:39 AM script INFO: SUCCESS!@#KODE 1!@#USER_ID 66!@#ACTIVITY_CODE 3
12/10/2022 09:24:40 AM script INFO: SUCCESS!@#KODE 1!@#USER_ID 66!@#ACTIVITY_CODE 2
12/10/2022 09:24:41 AM script INFO: SUCCESS!@#KODE 1!@#USER_ID 66!@#ACTIVITY_CODE 2
12/10/2022 09:24:42 AM script INFO: SUCCESS!@#KODE 1!@#USER_ID 66!@#ACTIVITY_CODE 2
12/10/2022 09:24:42 AM script INFO: SUCCESS!@#KODE 1!@#USER_ID 66!@#ACTIVITY_CODE 5
12/10/2022 09:24:42 AM script INFO: SUCCESS!@#KODE 1!@#USER_ID 66!@#ACTIVITY_CODE 5
12/10/2022 09:24:44 AM script INFO: SUCCESS!@#KODE 1!@#USER_ID 66!@#ACTIVITY_CODE 5
12/10/2022 09:24:44 AM script INFO: SUCCESS!@#KODE 1!@#USER_ID 66!@#ACTIVITY_CODE 5
12/10/2022 09:24:47 AM script INFO: SUCCESS!@#KODE 1!@#USER_ID 66!@#ACTIVITY_CODE 2
12/10/2022 09:24:48 AM script INFO: SUCCESS!@#KODE 1!@#USER_ID 66!@#ACTIVITY_CODE 1
12/10/2022 09:24:48 AM script INFO: SUCCESS!@#KODE 1!@#USER_ID 66!@#ACTIVITY_CODE 5
12/10/2022 09:24:48 AM script INFO: SUCCESS!@#KODE 1!@#USER_ID 66!@#ACTIVITY_CODE 5
12/10/2022 09:24:51 AM script INFO: SUCCESS!@#KODE 1!@#USER_ID 66!@#ACTIVITY_CODE 2
12/10/2022 09:24:52 AM script INFO: SUCCESS!@#KODE 1!@#USER_ID 66!@#ACTIVITY_CODE 2
12/10/2022 09:24:53 AM script INFO: SUCCESS!@#KODE 1!@#USER_ID 66!@#ACTIVITY_CODE 2
12/10/2022 09:24:53 AM script INFO: SUCCESS!@#KODE 1!@#USER_ID 66!@#ACTIVITY_CODE 1
12/10/2022 09:24:54 AM script INFO: SUCCESS!@#KODE 1!@#USER_ID 66!@#ACTIVITY_CODE 2
12/10/2022 09:24:55 AM script INFO: SUCCESS!@#KODE 1!@#USER_ID 66!@#ACTIVITY_CODE 2
12/10/2022 09:24:56 AM script INFO: SUCCESS!@#KODE 1!@#USER_ID 66!@#ACTIVITY_CODE 2
12/10/2022 09:24:57 AM script INFO: SUCCESS!@#KODE 1!@#USER_ID 66!@#ACTIVITY_CODE 3
12/10/2022 09:24:57 AM script INFO: SUCCESS!@#KODE 1!@#USER_ID 66!@#ACTIVITY_CODE 3
12/10/2022 09:24:57 AM script INFO: SUCCESS!@#KODE 1!@#USER_ID 66!@#ACTIVITY_CODE 1
12/10/2022 09:24:58 AM script INFO: SUCCESS!@#KODE 1!@#USER_ID 66!@#ACTIVITY_CODE 1
12/10/2022 09:24:58 AM script INFO: SUCCESS!@#KODE 1!@#USER_ID 66!@#ACTIVITY_CODE 4
12/10/2022 09:24:58 AM script INFO: SUCCESS!@#KODE 1!@#USER_ID 66!@#ACTIVITY_CODE 1
12/10/2022 09:24:58 AM script INFO: SUCCESS!@#KODE 1!@#USER_ID 66!@#ACTIVITY_CODE 5
12/10/2022 09:24:58 AM script INFO: SUCCESS!@#KODE 1!@#USER_ID 66!@#ACTIVITY_CODE 5
12/10/2022 09:25:02 AM script INFO: SUCCESS!@#KODE 1!@#USER_ID 66!@#ACTIVITY_CODE 4
12/10/2022 09:25:03 AM script INFO: SUCCESS!@#KODE 1!@#USER_ID 66!@#ACTIVITY_CODE 2
12/10/2022 09:25:03 AM script INFO: SUCCESS!@#KODE 1!@#USER_ID 66!@#ACTIVITY_CODE 2
12/10/2022 09:25:04 AM script INFO: SUCCESS!@#KODE 1!@#USER_ID 66!@#ACTIVITY_CODE 4
12/10/2022 09:25:04 AM script INFO: SUCCESS!@#KODE 1!@#USER_ID 66!@#ACTIVITY_CODE 3
12/10/2022 09:25:05 AM script INFO: SUCCESS!@#KODE 1!@#USER_ID 66!@#ACTIVITY_CODE 2
12/10/2022 09:25:06 AM script INFO: SUCCESS!@#KODE 1!@#USER_ID 66!@#ACTIVITY_CODE 4
12/10/2022 09:25:06 AM script INFO: SUCCESS!@#KODE 1!@#USER_ID 66!@#ACTIVITY_CODE 1
12/10/2022 09:25:06 AM script INFO: SUCCESS!@#KODE 1!@#USER_ID 66!@#ACTIVITY_CODE 2
12/10/2022 09:25:07 AM script INFO: SUCCESS!@#KODE 1!@#USER_ID 66!@#ACTIVITY_CODE 2
12/10/2022 09:25:08 AM script INFO: SUCCESS!@#KODE 1!@#USER_ID 66!@#ACTIVITY_CODE 2
12/10/2022 09:25:08 AM script INFO: SUCCESS!@#KODE 1!@#USER_ID 66!@#ACTIVITY_CODE 3
12/10/2022 09:25:08 AM script INFO: SUCCESS!@#KODE 1!@#USER_ID 66!@#ACTIVITY_CODE 2
12/10/2022 09:25:09 AM script INFO: SUCCESS!@#KODE 1!@#USER_ID 66!@#ACTIVITY_CODE 1
12/10/2022 09:25:09 AM script INFO: SUCCESS!@#KODE 1!@#USER_ID 66!@#ACTIVITY_CODE 1
12/10/2022 09:25:09 AM script INFO: SUCCESS!@#KODE 1!@#USER_ID 66!@#ACTIVITY_CODE 3
12/10/2022 09:25:09 AM script INFO: SUCCESS!@#KODE 1!@#USER_ID 66!@#ACTIVITY_CODE 1
12/10/2022 09:25:09 AM script INFO: SUCCESS!@#KODE 1!@#USER_ID 66!@#ACTIVITY_CODE 3
12/10/2022 09:25:10 AM script INFO: SUCCESS!@#KODE 1!@#USER_ID 66!@#ACTIVITY_CODE 2
12/10/2022 09:25:10 AM script INFO: SUCCESS!@#KODE 1!@#USER_ID 66!@#ACTIVITY_CODE 1
12/10/2022 09:25:10 AM script INFO: SUCCESS!@#KODE 1!@#USER_ID 66!@#ACTIVITY_CODE 5
12/10/2022 09:25:10 AM script INFO: SUCCESS!@#KODE 1!@#USER_ID 66!@#ACTIVITY_CODE 5
12/10/2022 09:25:13 AM script INFO: SUCCESS!@#KODE 1!@#USER_ID 66!@#ACTIVITY_CODE 1
12/10/2022 09:25:13 AM script INFO: SUCCESS!@#KODE 1!@#USER_ID 66!@#ACTIVITY_CODE 5
12/10/2022 09:25:13 AM script INFO: SUCCESS!@#KODE 1!@#USER_ID 66!@#ACTIVITY_CODE 5
12/10/2022 09:25:16 AM script INFO: SUCCESS!@#KODE 1!@#USER_ID 66!@#ACTIVITY_CODE 1
12/10/2022 09:25:17 AM script INFO: SUCCESS!@#KODE 1!@#USER_ID 66!@#ACTIVITY_CODE 2
12/10/2022 09:25:17 AM script INFO: SUCCESS!@#KODE 1!@#USER_ID 66!@#ACTIVITY_CODE 3
12/10/2022 09:25:17 AM script INFO: SUCCESS!@#KODE 1!@#USER_ID 66!@#ACTIVITY_CODE 3
12/10/2022 09:25:17 AM script INFO: SUCCESS!@#KODE 1!@#USER_ID 66!@#ACTIVITY_CODE 2
12/10/2022 09:25:18 AM script INFO: SUCCESS!@#KODE 1!@#USER_ID 66!@#ACTIVITY_CODE 3
12/10/2022 09:25:18 AM script INFO: SUCCESS!@#KODE 1!@#USER_ID 66!@#ACTIVITY_CODE 1
12/10/2022 09:25:18 AM script INFO: SUCCESS!@#KODE 1!@#USER_ID 66!@#ACTIVITY_CODE 4
12/10/2022 09:25:19 AM script INFO: SUCCESS!@#KODE 1!@#USER_ID 66!@#ACTIVITY_CODE 2
12/10/2022 09:25:19 AM script INFO: SUCCESS!@#KODE 1!@#USER_ID 66!@#ACTIVITY_CODE 1
12/10/2022 09:25:19 AM script INFO: SUCCESS!@#KODE 1!@#USER_ID 66!@#ACTIVITY_CODE 1
12/10/2022 09:25:20 AM script INFO: SUCCESS!@#KODE 1!@#USER_ID 66!@#ACTIVITY_CODE 2
12/10/2022 09:25:21 AM script INFO: SUCCESS!@#KODE 1!@#USER_ID 66!@#ACTIVITY_CODE 1
12/10/2022 09:25:21 AM script INFO: SUCCESS!@#KODE 1!@#USER_ID 66!@#ACTIVITY_CODE 4
12/10/2022 09:25:22 AM script INFO: SUCCESS!@#KODE 1!@#USER_ID 66!@#ACTIVITY_CODE 2
12/10/2022 09:25:23 AM script INFO: SUCCESS!@#KODE 1!@#USER_ID 66!@#ACTIVITY_CODE 2
12/10/2022 09:25:24 AM script INFO: SUCCESS!@#KODE 1!@#USER_ID 66!@#ACTIVITY_CODE 1
12/10/2022 09:25:25 AM script INFO: SUCCESS!@#KODE 1!@#USER_ID 66!@#ACTIVITY_CODE 1
12/10/2022 09:25:25 AM script INFO: SUCCESS!@#KODE 1!@#USER_ID 66!@#ACTIVITY_CODE 1
12/10/2022 09:25:26 AM script INFO: SUCCESS!@#KODE 1!@#USER_ID 66!@#ACTIVITY_CODE 2
12/10/2022 09:25:26 AM script INFO: SUCCESS!@#KODE 1!@#USER_ID 66!@#ACTIVITY_CODE 4
12/10/2022 09:25:27 AM script INFO: SUCCESS!@#KODE 1!@#USER_ID 66!@#ACTIVITY_CODE 2
12/10/2022 09:25:28 AM script INFO: SUCCESS!@#KODE 1!@#USER_ID 66!@#ACTIVITY_CODE 2
12/10/2022 09:25:29 AM script INFO: SUCCESS!@#KODE 1!@#USER_ID 66!@#ACTIVITY_CODE 1
12/10/2022 09:25:29 AM script INFO: SUCCESS!@#KODE 1!@#USER_ID 66!@#ACTIVITY_CODE 3
12/10/2022 09:25:29 AM script INFO: SUCCESS!@#KODE 1!@#USER_ID 66!@#ACTIVITY_CODE 3
12/10/2022 09:25:30 AM script INFO: SUCCESS!@#KODE 1!@#USER_ID 66!@#ACTIVITY_CODE 3
12/10/2022 09:25:30 AM script INFO: SUCCESS!@#KODE 1!@#USER_ID 66!@#ACTIVITY_CODE 1
12/10/2022 09:25:30 AM script INFO: SUCCESS!@#KODE 1!@#USER_ID 66!@#ACTIVITY_CODE 4
12/10/2022 09:25:31 AM script INFO: SUCCESS!@#KODE 1!@#USER_ID 66!@#ACTIVITY_CODE 3
12/10/2022 09:25:31 AM script INFO: SUCCESS!@#KODE 1!@#USER_ID 66!@#ACTIVITY_CODE 2
12/10/2022 09:25:32 AM script INFO: SUCCESS!@#KODE 1!@#USER_ID 66!@#ACTIVITY_CODE 2
12/10/2022 09:25:32 AM script INFO: SUCCESS!@#KODE 1!@#USER_ID 66!@#ACTIVITY_CODE 1
12/10/2022 09:25:33 AM script INFO: SUCCESS!@#KODE 1!@#USER_ID 66!@#ACTIVITY_CODE 1
12/10/2022 09:25:33 AM script INFO: SUCCESS!@#KODE 1!@#USER_ID 66!@#ACTIVITY_CODE 2
12/10/2022 09:25:34 AM script INFO: SUCCESS!@#KODE 1!@#USER_ID 66!@#ACTIVITY_CODE 4
12/10/2022 09:25:35 AM script INFO: SUCCESS!@#KODE 1!@#USER_ID 66!@#ACTIVITY_CODE 2
12/10/2022 09:25:35 AM script INFO: SUCCESS!@#KODE 1!@#USER_ID 66!@#ACTIVITY_CODE 1
12/10/2022 09:25:36 AM script INFO: SUCCESS!@#KODE 1!@#USER_ID 66!@#ACTIVITY_CODE 3
12/10/2022 09:25:36 AM script INFO: SUCCESS!@#KODE 1!@#USER_ID 66!@#ACTIVITY_CODE 3
12/10/2022 09:25:36 AM script INFO: SUCCESS!@#KODE 1!@#USER_ID 66!@#ACTIVITY_CODE 4
12/10/2022 09:25:37 AM script INFO: SUCCESS!@#KODE 1!@#USER_ID 66!@#ACTIVITY_CODE 2
12/10/2022 09:25:37 AM script INFO: SUCCESS!@#KODE 1!@#USER_ID 66!@#ACTIVITY_CODE 3
12/10/2022 09:25:38 AM script INFO: SUCCESS!@#KODE 1!@#USER_ID 66!@#ACTIVITY_CODE 2
12/10/2022 09:25:39 AM script INFO: SUCCESS!@#KODE 1!@#USER_ID 66!@#ACTIVITY_CODE 2
12/10/2022 09:25:39 AM script INFO: SUCCESS!@#KODE 1!@#USER_ID 66!@#ACTIVITY_CODE 1
12/10/2022 09:25:40 AM script INFO: SUCCESS!@#KODE 1!@#USER_ID 66!@#ACTIVITY_CODE 3
12/10/2022 09:25:41 AM script INFO: SUCCESS!@#KODE 1!@#USER_ID 66!@#ACTIVITY_CODE 4
12/10/2022 09:25:42 AM script INFO: SUCCESS!@#KODE 1!@#USER_ID 66!@#ACTIVITY_CODE 2
12/10/2022 09:25:43 AM script INFO: SUCCESS!@#KODE 1!@#USER_ID 66!@#ACTIVITY_CODE 2
12/10/2022 09:25:44 AM script INFO: SUCCESS!@#KODE 1!@#USER_ID 66!@#ACTIVITY_CODE 2
12/10/2022 09:25:44 AM script INFO: SUCCESS!@#KODE 1!@#USER_ID 66!@#ACTIVITY_CODE 1
12/10/2022 09:25:45 AM script INFO: SUCCESS!@#KODE 1!@#USER_ID 66!@#ACTIVITY_CODE 4
12/10/2022 09:25:47 AM script INFO: SUCCESS!@#KODE 1!@#USER_ID 66!@#ACTIVITY_CODE 2
12/10/2022 09:25:49 AM script INFO: SUCCESS!@#KODE 1!@#USER_ID 66!@#ACTIVITY_CODE 2
12/10/2022 09:25:49 AM script INFO: SUCCESS!@#KODE 1!@#USER_ID 66!@#ACTIVITY_CODE 2
12/10/2022 09:25:50 AM script INFO: SUCCESS!@#KODE 1!@#USER_ID 66!@#ACTIVITY_CODE 2
12/10/2022 09:25:50 AM script INFO: SUCCESS!@#KODE 1!@#USER_ID 66!@#ACTIVITY_CODE 1
12/10/2022 09:25:50 AM script INFO: SUCCESS!@#KODE 1!@#USER_ID 66!@#ACTIVITY_CODE 4
12/10/2022 09:25:51 AM script INFO: SUCCESS!@#KODE 1!@#USER_ID 66!@#ACTIVITY_CODE 2
12/10/2022 09:25:52 AM script INFO: SUCCESS!@#KODE 1!@#USER_ID 66!@#ACTIVITY_CODE 3
12/10/2022 09:25:52 AM script INFO: SUCCESS!@#KODE 1!@#USER_ID 66!@#ACTIVITY_CODE 3
12/10/2022 09:25:52 AM script INFO: SUCCESS!@#KODE 1!@#USER_ID 66!@#ACTIVITY_CODE 3
12/10/2022 09:25:53 AM script INFO: SUCCESS!@#KODE 1!@#USER_ID 66!@#ACTIVITY_CODE 3
12/10/2022 09:25:53 AM script INFO: SUCCESS!@#KODE 1!@#USER_ID 66!@#ACTIVITY_CODE 3
12/10/2022 09:25:54 AM script INFO: SUCCESS!@#KODE 1!@#USER_ID 66!@#ACTIVITY_CODE 3
12/10/2022 09:25:54 AM script INFO: SUCCESS!@#KODE 1!@#USER_ID 66!@#ACTIVITY_CODE 3
12/10/2022 09:25:55 AM script INFO: SUCCESS!@#KODE 1!@#USER_ID 66!@#ACTIVITY_CODE 2
12/10/2022 09:25:56 AM script INFO: SUCCESS!@#KODE 1!@#USER_ID 66!@#ACTIVITY_CODE 3
12/10/2022 09:25:56 AM script INFO: SUCCESS!@#KODE 1!@#USER_ID 66!@#ACTIVITY_CODE 1
12/10/2022 09:25:56 AM script INFO: SUCCESS!@#KODE 1!@#USER_ID 66!@#ACTIVITY_CODE 3
12/10/2022 09:25:56 AM script INFO: SUCCESS!@#KODE 1!@#USER_ID 66!@#ACTIVITY_CODE 3
12/10/2022 09:25:56 AM script INFO: SUCCESS!@#KODE 1!@#USER_ID 66!@#ACTIVITY_CODE 1
12/10/2022 09:25:57 AM script INFO: SUCCESS!@#KODE 1!@#USER_ID 66!@#ACTIVITY_CODE 2
12/10/2022 09:25:57 AM script INFO: SUCCESS!@#KODE 1!@#USER_ID 66!@#ACTIVITY_CODE 1
12/10/2022 09:25:57 AM script INFO: SUCCESS!@#KODE 1!@#USER_ID 66!@#ACTIVITY_CODE 4
12/10/2022 09:25:59 AM script INFO: SUCCESS!@#KODE 1!@#USER_ID 66!@#ACTIVITY_CODE 2
12/10/2022 09:25:59 AM script INFO: SUCCESS!@#KODE 1!@#USER_ID 66!@#ACTIVITY_CODE 3
12/10/2022 09:26:00 AM script INFO: SUCCESS!@#KODE 1!@#USER_ID 66!@#ACTIVITY_CODE 2
12/10/2022 09:26:01 AM script INFO: SUCCESS!@#KODE 1!@#USER_ID 66!@#ACTIVITY_CODE 3
12/10/2022 09:26:01 AM script INFO: SUCCESS!@#KODE 1!@#USER_ID 66!@#ACTIVITY_CODE 1
12/10/2022 09:26:02 AM script INFO: SUCCESS!@#KODE 1!@#USER_ID 66!@#ACTIVITY_CODE 2
12/10/2022 09:26:02 AM script INFO: SUCCESS!@#KODE 1!@#USER_ID 66!@#ACTIVITY_CODE 2
12/10/2022 09:26:02 AM script INFO: SUCCESS!@#KODE 1!@#USER_ID 66!@#ACTIVITY_CODE 1
12/10/2022 09:26:03 AM script INFO: SUCCESS!@#KODE 1!@#USER_ID 66!@#ACTIVITY_CODE 2
12/10/2022 09:26:03 AM script INFO: SUCCESS!@#KODE 1!@#USER_ID 66!@#ACTIVITY_CODE 2
12/10/2022 09:26:03 AM script INFO: SUCCESS!@#KODE 1!@#USER_ID 66!@#ACTIVITY_CODE 4
12/10/2022 09:26:03 AM script INFO: SUCCESS!@#KODE 1!@#USER_ID 66!@#ACTIVITY_CODE 3
12/10/2022 09:26:04 AM script INFO: SUCCESS!@#KODE 1!@#USER_ID 66!@#ACTIVITY_CODE 1
12/10/2022 09:26:04 AM script INFO: SUCCESS!@#KODE 1!@#USER_ID 66!@#ACTIVITY_CODE 3
12/10/2022 09:26:04 AM script INFO: SUCCESS!@#KODE 1!@#USER_ID 66!@#ACTIVITY_CODE 2
12/10/2022 09:26:05 AM script INFO: SUCCESS!@#KODE 1!@#USER_ID 66!@#ACTIVITY_CODE 2
12/10/2022 09:26:05 AM script INFO: SUCCESS!@#KODE 1!@#USER_ID 66!@#ACTIVITY_CODE 2
12/10/2022 09:26:06 AM script INFO: SUCCESS!@#KODE 1!@#USER_ID 66!@#ACTIVITY_CODE 3
12/10/2022 09:26:07 AM script INFO: SUCCESS!@#KODE 1!@#USER_ID 66!@#ACTIVITY_CODE 2
12/10/2022 09:26:08 AM script INFO: SUCCESS!@#KODE 1!@#USER_ID 66!@#ACTIVITY_CODE 2
12/10/2022 09:26:08 AM script INFO: SUCCESS!@#KODE 1!@#USER_ID 66!@#ACTIVITY_CODE 1
12/10/2022 09:26:09 AM script INFO: SUCCESS!@#KODE 1!@#USER_ID 66!@#ACTIVITY_CODE 3
12/10/2022 09:26:09 AM script INFO: SUCCESS!@#KODE 1!@#USER_ID 66!@#ACTIVITY_CODE 3
12/10/2022 09:26:09 AM script INFO: SUCCESS!@#KODE 1!@#USER_ID 66!@#ACTIVITY_CODE 4
12/10/2022 09:26:10 AM script INFO: SUCCESS!@#KODE 1!@#USER_ID 66!@#ACTIVITY_CODE 1
12/10/2022 09:26:10 AM script INFO: SUCCESS!@#KODE 1!@#USER_ID 66!@#ACTIVITY_CODE 3
12/10/2022 09:26:10 AM script INFO: SUCCESS!@#KODE 1!@#USER_ID 66!@#ACTIVITY_CODE 3
12/10/2022 09:26:11 AM script INFO: SUCCESS!@#KODE 1!@#USER_ID 66!@#ACTIVITY_CODE 2
12/10/2022 09:26:11 AM script INFO: SUCCESS!@#KODE 1!@#USER_ID 66!@#ACTIVITY_CODE 3
12/10/2022 09:26:12 AM script INFO: SUCCESS!@#KODE 1!@#USER_ID 66!@#ACTIVITY_CODE 2
12/10/2022 09:26:12 AM script INFO: SUCCESS!@#KODE 1!@#USER_ID 66!@#ACTIVITY_CODE 1
12/10/2022 09:26:13 AM script INFO: SUCCESS!@#KODE 1!@#USER_ID 66!@#ACTIVITY_CODE 3
12/10/2022 09:26:13 AM script INFO: SUCCESS!@#KODE 1!@#USER_ID 66!@#ACTIVITY_CODE 1
12/10/2022 09:26:14 AM script INFO: SUCCESS!@#KODE 1!@#USER_ID 66!@#ACTIVITY_CODE 2
12/10/2022 09:26:14 AM script INFO: SUCCESS!@#KODE 1!@#USER_ID 66!@#ACTIVITY_CODE 3
12/10/2022 09:26:15 AM script INFO: SUCCESS!@#KODE 1!@#USER_ID 66!@#ACTIVITY_CODE 1
12/10/2022 09:26:15 AM script INFO: SUCCESS!@#KODE 1!@#USER_ID 66!@#ACTIVITY_CODE 3
12/10/2022 09:26:15 AM script INFO: SUCCESS!@#KODE 1!@#USER_ID 66!@#ACTIVITY_CODE 1
12/10/2022 09:26:15 AM script INFO: SUCCESS!@#KODE 1!@#USER_ID 66!@#ACTIVITY_CODE 1
12/10/2022 09:26:15 AM script INFO: SUCCESS!@#KODE 1!@#USER_ID 66!@#ACTIVITY_CODE 1
12/10/2022 09:26:16 AM script INFO: SUCCESS!@#KODE 1!@#USER_ID 66!@#ACTIVITY_CODE 3
12/10/2022 09:26:16 AM script INFO: SUCCESS!@#KODE 1!@#USER_ID 66!@#ACTIVITY_CODE 2
12/10/2022 09:26:16 AM script INFO: SUCCESS!@#KODE 1!@#USER_ID 66!@#ACTIVITY_CODE 4
12/10/2022 09:26:17 AM script INFO: SUCCESS!@#KODE 1!@#USER_ID 66!@#ACTIVITY_CODE 1
12/10/2022 09:26:18 AM script INFO: SUCCESS!@#KODE 1!@#USER_ID 66!@#ACTIVITY_CODE 2
12/10/2022 09:26:18 AM script INFO: SUCCESS!@#KODE 1!@#USER_ID 66!@#ACTIVITY_CODE 2
12/10/2022 09:26:19 AM script INFO: SUCCESS!@#KODE 1!@#USER_ID 66!@#ACTIVITY_CODE 1
12/10/2022 09:26:19 AM script INFO: SUCCESS!@#KODE 1!@#USER_ID 66!@#ACTIVITY_CODE 1
12/10/2022 09:26:19 AM script INFO: SUCCESS!@#KODE 1!@#USER_ID 66!@#ACTIVITY_CODE 3
12/10/2022 09:26:20 AM script INFO: SUCCESS!@#KODE 1!@#USER_ID 66!@#ACTIVITY_CODE 3
12/10/2022 09:26:20 AM script INFO: SUCCESS!@#KODE 1!@#USER_ID 66!@#ACTIVITY_CODE 3
12/10/2022 09:26:21 AM script INFO: SUCCESS!@#KODE 1!@#USER_ID 66!@#ACTIVITY_CODE 1
12/10/2022 09:26:21 AM script INFO: SUCCESS!@#KODE 1!@#USER_ID 66!@#ACTIVITY_CODE 3
12/10/2022 09:26:21 AM script INFO: SUCCESS!@#KODE 1!@#USER_ID 66!@#ACTIVITY_CODE 1
12/10/2022 09:26:22 AM script INFO: SUCCESS!@#KODE 1!@#USER_ID 66!@#ACTIVITY_CODE 1
12/10/2022 09:26:22 AM script INFO: SUCCESS!@#KODE 1!@#USER_ID 66!@#ACTIVITY_CODE 1
12/10/2022 09:26:22 AM script INFO: SUCCESS!@#KODE 1!@#USER_ID 66!@#ACTIVITY_CODE 2
12/10/2022 09:26:23 AM script INFO: SUCCESS!@#KODE 1!@#USER_ID 66!@#ACTIVITY_CODE 1
12/10/2022 09:26:23 AM script INFO: SUCCESS!@#KODE 1!@#USER_ID 66!@#ACTIVITY_CODE 3
12/10/2022 09:26:23 AM script INFO: SUCCESS!@#KODE 1!@#USER_ID 66!@#ACTIVITY_CODE 2
12/10/2022 09:26:24 AM script INFO: SUCCESS!@#KODE 1!@#USER_ID 66!@#ACTIVITY_CODE 4
12/10/2022 09:26:24 AM script INFO: SUCCESS!@#KODE 1!@#USER_ID 66!@#ACTIVITY_CODE 1
12/10/2022 09:26:25 AM script INFO: SUCCESS!@#KODE 1!@#USER_ID 66!@#ACTIVITY_CODE 4
12/10/2022 09:26:26 AM script INFO: SUCCESS!@#KODE 1!@#USER_ID 66!@#ACTIVITY_CODE 3
12/10/2022 09:26:27 AM script INFO: SUCCESS!@#KODE 1!@#USER_ID 66!@#ACTIVITY_CODE 2
12/10/2022 09:26:27 AM script INFO: SUCCESS!@#KODE 1!@#USER_ID 66!@#ACTIVITY_CODE 1
12/10/2022 09:26:27 AM script INFO: SUCCESS!@#KODE 1!@#USER_ID 66!@#ACTIVITY_CODE 3
12/10/2022 09:26:28 AM script INFO: SUCCESS!@#KODE 1!@#USER_ID 66!@#ACTIVITY_CODE 1
12/10/2022 09:26:28 AM script INFO: SUCCESS!@#KODE 1!@#USER_ID 66!@#ACTIVITY_CODE 3
12/10/2022 09:26:28 AM script INFO: SUCCESS!@#KODE 1!@#USER_ID 66!@#ACTIVITY_CODE 4
12/10/2022 09:26:30 AM script INFO: SUCCESS!@#KODE 1!@#USER_ID 66!@#ACTIVITY_CODE 3
12/10/2022 09:26:30 AM script INFO: SUCCESS!@#KODE 1!@#USER_ID 66!@#ACTIVITY_CODE 1
12/10/2022 09:26:30 AM script INFO: SUCCESS!@#KODE 1!@#USER_ID 66!@#ACTIVITY_CODE 3
12/10/2022 09:26:31 AM script INFO: SUCCESS!@#KODE 1!@#USER_ID 66!@#ACTIVITY_CODE 4
12/10/2022 09:26:32 AM script INFO: SUCCESS!@#KODE 1!@#USER_ID 66!@#ACTIVITY_CODE 3
12/10/2022 09:26:32 AM script INFO: SUCCESS!@#KODE 1!@#USER_ID 66!@#ACTIVITY_CODE 2
12/10/2022 09:26:33 AM script INFO: SUCCESS!@#KODE 1!@#USER_ID 66!@#ACTIVITY_CODE 2
12/10/2022 09:26:33 AM script INFO: SUCCESS!@#KODE 1!@#USER_ID 66!@#ACTIVITY_CODE 2
12/10/2022 09:26:34 AM script INFO: SUCCESS!@#KODE 1!@#USER_ID 66!@#ACTIVITY_CODE 1
12/10/2022 09:26:34 AM script INFO: SUCCESS!@#KODE 1!@#USER_ID 66!@#ACTIVITY_CODE 1
12/10/2022 09:26:34 AM script INFO: SUCCESS!@#KODE 1!@#USER_ID 66!@#ACTIVITY_CODE 3
12/10/2022 09:26:35 AM script INFO: SUCCESS!@#KODE 1!@#USER_ID 66!@#ACTIVITY_CODE 2
12/10/2022 09:26:35 AM script INFO: SUCCESS!@#KODE 1!@#USER_ID 66!@#ACTIVITY_CODE 1
12/10/2022 09:26:35 AM script INFO: SUCCESS!@#KODE 1!@#USER_ID 66!@#ACTIVITY_CODE 1
12/10/2022 09:26:35 AM script INFO: SUCCESS!@#KODE 1!@#USER_ID 66!@#ACTIVITY_CODE 1
12/10/2022 09:26:36 AM script INFO: SUCCESS!@#KODE 1!@#USER_ID 66!@#ACTIVITY_CODE 1
12/10/2022 09:26:36 AM script INFO: SUCCESS!@#KODE 1!@#USER_ID 66!@#ACTIVITY_CODE 4
12/10/2022 09:26:36 AM script INFO: SUCCESS!@#KODE 1!@#USER_ID 66!@#ACTIVITY_CODE 1
12/10/2022 09:26:37 AM script INFO: SUCCESS!@#KODE 1!@#USER_ID 66!@#ACTIVITY_CODE 2
12/10/2022 09:26:37 AM script INFO: SUCCESS!@#KODE 1!@#USER_ID 66!@#ACTIVITY_CODE 3
12/10/2022 09:26:38 AM script INFO: SUCCESS!@#KODE 1!@#USER_ID 66!@#ACTIVITY_CODE 1
12/10/2022 09:26:38 AM script INFO: SUCCESS!@#KODE 1!@#USER_ID 66!@#ACTIVITY_CODE 1
12/10/2022 09:26:38 AM script INFO: SUCCESS!@#KODE 1!@#USER_ID 66!@#ACTIVITY_CODE 3
12/10/2022 09:26:39 AM script INFO: SUCCESS!@#KODE 1!@#USER_ID 66!@#ACTIVITY_CODE 4
12/10/2022 09:26:39 AM script INFO: SUCCESS!@#KODE 1!@#USER_ID 66!@#ACTIVITY_CODE 2
12/10/2022 09:26:39 AM script INFO: SUCCESS!@#KODE 1!@#USER_ID 66!@#ACTIVITY_CODE 3
12/10/2022 09:26:39 AM script INFO: SUCCESS!@#KODE 1!@#USER_ID 66!@#ACTIVITY_CODE 1
12/10/2022 09:26:40 AM script INFO: SUCCESS!@#KODE 1!@#USER_ID 66!@#ACTIVITY_CODE 3
12/10/2022 09:26:40 AM script INFO: SUCCESS!@#KODE 1!@#USER_ID 66!@#ACTIVITY_CODE 3
12/10/2022 09:26:40 AM script INFO: SUCCESS!@#KODE 1!@#USER_ID 66!@#ACTIVITY_CODE 3
12/10/2022 09:26:41 AM script INFO: SUCCESS!@#KODE 1!@#USER_ID 66!@#ACTIVITY_CODE 4
12/10/2022 09:26:41 AM script INFO: SUCCESS!@#KODE 1!@#USER_ID 66!@#ACTIVITY_CODE 1
12/10/2022 09:26:41 AM script INFO: SUCCESS!@#KODE 1!@#USER_ID 66!@#ACTIVITY_CODE 1
12/10/2022 09:26:41 AM script INFO: SUCCESS!@#KODE 1!@#USER_ID 66!@#ACTIVITY_CODE 3
12/10/2022 09:26:42 AM script INFO: SUCCESS!@#KODE 1!@#USER_ID 66!@#ACTIVITY_CODE 3
12/10/2022 09:26:42 AM script INFO: SUCCESS!@#KODE 1!@#USER_ID 66!@#ACTIVITY_CODE 2
12/10/2022 09:26:42 AM script INFO: SUCCESS!@#KODE 1!@#USER_ID 66!@#ACTIVITY_CODE 3
12/10/2022 09:26:43 AM script INFO: SUCCESS!@#KODE 1!@#USER_ID 66!@#ACTIVITY_CODE 1
12/10/2022 09:26:43 AM script INFO: SUCCESS!@#KODE 1!@#USER_ID 66!@#ACTIVITY_CODE 1
12/10/2022 09:26:44 AM script INFO: SUCCESS!@#KODE 1!@#USER_ID 66!@#ACTIVITY_CODE 3
12/10/2022 09:26:44 AM script INFO: SUCCESS!@#KODE 1!@#USER_ID 66!@#ACTIVITY_CODE 3
12/10/2022 09:26:44 AM script INFO: SUCCESS!@#KODE 1!@#USER_ID 66!@#ACTIVITY_CODE 1
12/10/2022 09:26:45 AM script INFO: SUCCESS!@#KODE 1!@#USER_ID 66!@#ACTIVITY_CODE 2
12/10/2022 09:26:45 AM script INFO: SUCCESS!@#KODE 1!@#USER_ID 66!@#ACTIVITY_CODE 1
12/10/2022 09:26:46 AM script INFO: SUCCESS!@#KODE 1!@#USER_ID 66!@#ACTIVITY_CODE 4
12/10/2022 09:26:46 AM script INFO: SUCCESS!@#KODE 1!@#USER_ID 66!@#ACTIVITY_CODE 3
12/10/2022 09:26:46 AM script INFO: SUCCESS!@#KODE 1!@#USER_ID 66!@#ACTIVITY_CODE 2
12/10/2022 09:26:46 AM script INFO: SUCCESS!@#KODE 1!@#USER_ID 66!@#ACTIVITY_CODE 3
12/10/2022 09:26:47 AM script INFO: SUCCESS!@#KODE 1!@#USER_ID 66!@#ACTIVITY_CODE 1
12/10/2022 09:26:47 AM script INFO: SUCCESS!@#KODE 1!@#USER_ID 66!@#ACTIVITY_CODE 1
12/10/2022 09:26:48 AM script INFO: SUCCESS!@#KODE 1!@#USER_ID 66!@#ACTIVITY_CODE 4
12/10/2022 09:26:48 AM script INFO: SUCCESS!@#KODE 1!@#USER_ID 66!@#ACTIVITY_CODE 3
12/10/2022 09:26:49 AM script INFO: SUCCESS!@#KODE 1!@#USER_ID 66!@#ACTIVITY_CODE 1
12/10/2022 09:26:50 AM script INFO: SUCCESS!@#KODE 1!@#USER_ID 66!@#ACTIVITY_CODE 4
12/10/2022 09:26:51 AM script INFO: SUCCESS!@#KODE 1!@#USER_ID 66!@#ACTIVITY_CODE 3
12/10/2022 09:26:51 AM script INFO: SUCCESS!@#KODE 1!@#USER_ID 66!@#ACTIVITY_CODE 1
12/10/2022 09:26:51 AM script INFO: SUCCESS!@#KODE 1!@#USER_ID 66!@#ACTIVITY_CODE 3
12/10/2022 09:26:52 AM script INFO: SUCCESS!@#KODE 1!@#USER_ID 66!@#ACTIVITY_CODE 3
12/10/2022 09:26:53 AM script INFO: SUCCESS!@#KODE 1!@#USER_ID 66!@#ACTIVITY_CODE 2
12/10/2022 09:26:53 AM script INFO: SUCCESS!@#KODE 1!@#USER_ID 66!@#ACTIVITY_CODE 4
12/10/2022 09:26:54 AM script INFO: SUCCESS!@#KODE 1!@#USER_ID 66!@#ACTIVITY_CODE 2
12/10/2022 09:26:54 AM script INFO: SUCCESS!@#KODE 1!@#USER_ID 66!@#ACTIVITY_CODE 3
12/10/2022 09:26:55 AM script INFO: SUCCESS!@#KODE 1!@#USER_ID 66!@#ACTIVITY_CODE 2
12/10/2022 09:26:56 AM script INFO: SUCCESS!@#KODE 1!@#USER_ID 66!@#ACTIVITY_CODE 2
12/10/2022 09:26:58 AM script INFO: SUCCESS!@#KODE 1!@#USER_ID 66!@#ACTIVITY_CODE 3
12/10/2022 09:26:58 AM script INFO: SUCCESS!@#KODE 1!@#USER_ID 66!@#ACTIVITY_CODE 3
12/10/2022 09:26:59 AM script INFO: SUCCESS!@#KODE 1!@#USER_ID 66!@#ACTIVITY_CODE 1
12/10/2022 09:27:00 AM script INFO: SUCCESS!@#KODE 1!@#USER_ID 66!@#ACTIVITY_CODE 3
12/10/2022 09:27:00 AM script INFO: SUCCESS!@#KODE 1!@#USER_ID 66!@#ACTIVITY_CODE 1
12/10/2022 09:27:01 AM script INFO: SUCCESS!@#KODE 1!@#USER_ID 66!@#ACTIVITY_CODE 1
12/10/2022 09:27:01 AM script INFO: SUCCESS!@#KODE 1!@#USER_ID 66!@#ACTIVITY_CODE 1
12/10/2022 09:27:02 AM script INFO: SUCCESS!@#KODE 1!@#USER_ID 66!@#ACTIVITY_CODE 3
12/10/2022 09:27:03 AM script INFO: SUCCESS!@#KODE 1!@#USER_ID 66!@#ACTIVITY_CODE 1
12/10/2022 09:27:05 AM script INFO: SUCCESS!@#KODE 1!@#USER_ID 66!@#ACTIVITY_CODE 1
12/10/2022 09:27:06 AM script INFO: SUCCESS!@#KODE 1!@#USER_ID 66!@#ACTIVITY_CODE 3
12/10/2022 09:27:07 AM script INFO: SUCCESS!@#KODE 1!@#USER_ID 66!@#ACTIVITY_CODE 1
12/10/2022 09:27:08 AM script INFO: SUCCESS!@#KODE 1!@#USER_ID 66!@#ACTIVITY_CODE 2
12/10/2022 09:27:09 AM script INFO: SUCCESS!@#KODE 1!@#USER_ID 66!@#ACTIVITY_CODE 1
12/10/2022 09:27:10 AM script INFO: SUCCESS!@#KODE 1!@#USER_ID 66!@#ACTIVITY_CODE 4
12/10/2022 09:27:12 AM script INFO: SUCCESS!@#KODE 1!@#USER_ID 66!@#ACTIVITY_CODE 2
12/10/2022 09:27:12 AM script INFO: SUCCESS!@#KODE 1!@#USER_ID 66!@#ACTIVITY_CODE 3
12/10/2022 09:27:12 AM script INFO: SUCCESS!@#KODE 1!@#USER_ID 66!@#ACTIVITY_CODE 3
12/10/2022 09:27:12 AM script INFO: SUCCESS!@#KODE 1!@#USER_ID 66!@#ACTIVITY_CODE 1
12/10/2022 09:27:12 AM script INFO: SUCCESS!@#KODE 1!@#USER_ID 66!@#ACTIVITY_CODE 1
12/10/2022 09:27:12 AM script INFO: SUCCESS!@#KODE 1!@#USER_ID 66!@#ACTIVITY_CODE 1
12/10/2022 09:27:12 AM script INFO: SUCCESS!@#KODE 1!@#USER_ID 66!@#ACTIVITY_CODE 1
12/10/2022 09:27:13 AM script INFO: SUCCESS!@#KODE 1!@#USER_ID 66!@#ACTIVITY_CODE 3
12/10/2022 09:27:14 AM script INFO: SUCCESS!@#KODE 1!@#USER_ID 66!@#ACTIVITY_CODE 2
12/10/2022 09:27:14 AM script INFO: SUCCESS!@#KODE 1!@#USER_ID 66!@#ACTIVITY_CODE 1
12/10/2022 09:27:14 AM script INFO: SUCCESS!@#KODE 1!@#USER_ID 66!@#ACTIVITY_CODE 1
12/10/2022 09:27:14 AM script INFO: SUCCESS!@#KODE 1!@#USER_ID 66!@#ACTIVITY_CODE 1
12/10/2022 09:27:15 AM script INFO: SUCCESS!@#KODE 1!@#USER_ID 66!@#ACTIVITY_CODE 4
12/10/2022 09:27:15 AM script INFO: SUCCESS!@#KODE 1!@#USER_ID 66!@#ACTIVITY_CODE 1
12/10/2022 09:27:15 AM script INFO: SUCCESS!@#KODE 1!@#USER_ID 66!@#ACTIVITY_CODE 4
12/10/2022 09:27:16 AM script INFO: SUCCESS!@#KODE 1!@#USER_ID 66!@#ACTIVITY_CODE 3
12/10/2022 09:27:16 AM script INFO: SUCCESS!@#KODE 1!@#USER_ID 66!@#ACTIVITY_CODE 2
12/10/2022 09:27:17 AM script INFO: SUCCESS!@#KODE 1!@#USER_ID 66!@#ACTIVITY_CODE 2
12/10/2022 09:27:18 AM script INFO: SUCCESS!@#KODE 1!@#USER_ID 66!@#ACTIVITY_CODE 2
12/10/2022 09:27:18 AM script INFO: SUCCESS!@#KODE 1!@#USER_ID 66!@#ACTIVITY_CODE 2
12/10/2022 09:27:19 AM script INFO: SUCCESS!@#KODE 1!@#USER_ID 66!@#ACTIVITY_CODE 1
12/10/2022 09:27:20 AM script INFO: SUCCESS!@#KODE 1!@#USER_ID 66!@#ACTIVITY_CODE 2
12/10/2022 09:27:20 AM script INFO: SUCCESS!@#KODE 1!@#USER_ID 66!@#ACTIVITY_CODE 2
12/10/2022 09:27:21 AM script INFO: SUCCESS!@#KODE 1!@#USER_ID 66!@#ACTIVITY_CODE 3
12/10/2022 09:27:21 AM script INFO: SUCCESS!@#KODE 1!@#USER_ID 66!@#ACTIVITY_CODE 2
12/10/2022 09:27:21 AM script INFO: SUCCESS!@#KODE 1!@#USER_ID 66!@#ACTIVITY_CODE 3
12/10/2022 09:27:22 AM script INFO: SUCCESS!@#KODE 1!@#USER_ID 66!@#ACTIVITY_CODE 4
12/10/2022 09:27:22 AM script INFO: SUCCESS!@#KODE 1!@#USER_ID 66!@#ACTIVITY_CODE 3
12/10/2022 09:27:22 AM script INFO: SUCCESS!@#KODE 1!@#USER_ID 66!@#ACTIVITY_CODE 2
12/10/2022 09:27:22 AM script INFO: SUCCESS!@#KODE 1!@#USER_ID 66!@#ACTIVITY_CODE 1
12/10/2022 09:27:23 AM script INFO: SUCCESS!@#KODE 1!@#USER_ID 66!@#ACTIVITY_CODE 2
12/10/2022 09:27:24 AM script INFO: SUCCESS!@#KODE 1!@#USER_ID 66!@#ACTIVITY_CODE 2
12/10/2022 09:27:24 AM script INFO: SUCCESS!@#KODE 1!@#USER_ID 66!@#ACTIVITY_CODE 3
12/10/2022 09:27:25 AM script INFO: SUCCESS!@#KODE 1!@#USER_ID 66!@#ACTIVITY_CODE 2
12/10/2022 09:27:25 AM script INFO: SUCCESS!@#KODE 1!@#USER_ID 66!@#ACTIVITY_CODE 1
12/10/2022 09:27:25 AM script INFO: SUCCESS!@#KODE 1!@#USER_ID 66!@#ACTIVITY_CODE 1
12/10/2022 09:27:25 AM script INFO: SUCCESS!@#KODE 1!@#USER_ID 66!@#ACTIVITY_CODE 3
12/10/2022 09:27:26 AM script INFO: SUCCESS!@#KODE 1!@#USER_ID 66!@#ACTIVITY_CODE 3
12/10/2022 09:27:26 AM script INFO: SUCCESS!@#KODE 1!@#USER_ID 66!@#ACTIVITY_CODE 2
12/10/2022 09:27:26 AM script INFO: SUCCESS!@#KODE 1!@#USER_ID 66!@#ACTIVITY_CODE 1
12/10/2022 09:27:26 AM script INFO: SUCCESS!@#KODE 1!@#USER_ID 66!@#ACTIVITY_CODE 3
12/10/2022 09:27:27 AM script INFO: SUCCESS!@#KODE 1!@#USER_ID 66!@#ACTIVITY_CODE 3
12/10/2022 09:27:27 AM script INFO: SUCCESS!@#KODE 1!@#USER_ID 66!@#ACTIVITY_CODE 3
12/10/2022 09:27:28 AM script INFO: SUCCESS!@#KODE 1!@#USER_ID 66!@#ACTIVITY_CODE 2
12/10/2022 09:27:28 AM script INFO: SUCCESS!@#KODE 1!@#USER_ID 66!@#ACTIVITY_CODE 3
12/10/2022 09:27:29 AM script INFO: SUCCESS!@#KODE 1!@#USER_ID 66!@#ACTIVITY_CODE 2
12/10/2022 09:27:29 AM script INFO: SUCCESS!@#KODE 1!@#USER_ID 66!@#ACTIVITY_CODE 3
12/10/2022 09:27:29 AM script INFO: SUCCESS!@#KODE 1!@#USER_ID 66!@#ACTIVITY_CODE 3
12/10/2022 09:27:30 AM script INFO: SUCCESS!@#KODE 1!@#USER_ID 66!@#ACTIVITY_CODE 4
12/10/2022 09:27:30 AM script INFO: SUCCESS!@#KODE 1!@#USER_ID 66!@#ACTIVITY_CODE 3
12/10/2022 09:27:32 AM script INFO: SUCCESS!@#KODE 1!@#USER_ID 66!@#ACTIVITY_CODE 2
12/10/2022 09:27:33 AM script INFO: SUCCESS!@#KODE 1!@#USER_ID 66!@#ACTIVITY_CODE 3
12/10/2022 09:27:35 AM script INFO: SUCCESS!@#KODE 1!@#USER_ID 66!@#ACTIVITY_CODE 2
12/10/2022 09:27:36 AM script INFO: SUCCESS!@#KODE 1!@#USER_ID 66!@#ACTIVITY_CODE 4
12/10/2022 09:27:36 AM script INFO: SUCCESS!@#KODE 1!@#USER_ID 66!@#ACTIVITY_CODE 1
12/10/2022 09:27:37 AM script INFO: SUCCESS!@#KODE 1!@#USER_ID 66!@#ACTIVITY_CODE 1
12/10/2022 09:27:37 AM script INFO: SUCCESS!@#KODE 1!@#USER_ID 66!@#ACTIVITY_CODE 1
12/10/2022 09:27:37 AM script INFO: SUCCESS!@#KODE 1!@#USER_ID 66!@#ACTIVITY_CODE 4
12/10/2022 09:27:37 AM script INFO: SUCCESS!@#KODE 1!@#USER_ID 66!@#ACTIVITY_CODE 1
12/10/2022 09:27:38 AM script INFO: SUCCESS!@#KODE 1!@#USER_ID 66!@#ACTIVITY_CODE 3
12/10/2022 09:27:38 AM script INFO: SUCCESS!@#KODE 1!@#USER_ID 66!@#ACTIVITY_CODE 2
12/10/2022 09:27:39 AM script INFO: SUCCESS!@#KODE 1!@#USER_ID 66!@#ACTIVITY_CODE 2
12/10/2022 09:27:39 AM script INFO: SUCCESS!@#KODE 1!@#USER_ID 66!@#ACTIVITY_CODE 3
12/10/2022 09:27:39 AM script INFO: SUCCESS!@#KODE 1!@#USER_ID 66!@#ACTIVITY_CODE 1
12/10/2022 09:27:39 AM script INFO: SUCCESS!@#KODE 1!@#USER_ID 66!@#ACTIVITY_CODE 2
12/10/2022 09:27:39 AM script INFO: SUCCESS!@#KODE 1!@#USER_ID 66!@#ACTIVITY_CODE 1
12/10/2022 09:27:39 AM script INFO: SUCCESS!@#KODE 1!@#USER_ID 66!@#ACTIVITY_CODE 1
12/10/2022 09:27:41 AM script INFO: SUCCESS!@#KODE 1!@#USER_ID 66!@#ACTIVITY_CODE 2
12/10/2022 09:27:41 AM script INFO: SUCCESS!@#KODE 1!@#USER_ID 66!@#ACTIVITY_CODE 1
12/10/2022 09:27:42 AM script INFO: SUCCESS!@#KODE 1!@#USER_ID 66!@#ACTIVITY_CODE 1
12/10/2022 09:27:42 AM script INFO: SUCCESS!@#KODE 1!@#USER_ID 66!@#ACTIVITY_CODE 3
12/10/2022 09:27:43 AM script INFO: SUCCESS!@#KODE 1!@#USER_ID 66!@#ACTIVITY_CODE 2
12/10/2022 09:27:44 AM script INFO: SUCCESS!@#KODE 1!@#USER_ID 66!@#ACTIVITY_CODE 3
12/10/2022 09:27:45 AM script INFO: SUCCESS!@#KODE 1!@#USER_ID 66!@#ACTIVITY_CODE 4
12/10/2022 09:27:45 AM script INFO: SUCCESS!@#KODE 1!@#USER_ID 66!@#ACTIVITY_CODE 2
12/10/2022 09:27:45 AM script INFO: SUCCESS!@#KODE 1!@#USER_ID 66!@#ACTIVITY_CODE 1
12/10/2022 09:27:46 AM script INFO: SUCCESS!@#KODE 1!@#USER_ID 66!@#ACTIVITY_CODE 2
12/10/2022 09:27:46 AM script INFO: SUCCESS!@#KODE 1!@#USER_ID 66!@#ACTIVITY_CODE 3
12/10/2022 09:27:46 AM script INFO: SUCCESS!@#KODE 1!@#USER_ID 66!@#ACTIVITY_CODE 3
12/10/2022 09:27:47 AM script INFO: SUCCESS!@#KODE 1!@#USER_ID 66!@#ACTIVITY_CODE 3
12/10/2022 09:27:47 AM script INFO: SUCCESS!@#KODE 1!@#USER_ID 66!@#ACTIVITY_CODE 3
12/10/2022 09:27:47 AM script INFO: SUCCESS!@#KODE 1!@#USER_ID 66!@#ACTIVITY_CODE 3
12/10/2022 09:27:47 AM script INFO: SUCCESS!@#KODE 1!@#USER_ID 66!@#ACTIVITY_CODE 2
12/10/2022 09:27:48 AM script INFO: SUCCESS!@#KODE 1!@#USER_ID 66!@#ACTIVITY_CODE 3
12/10/2022 09:27:48 AM script INFO: SUCCESS!@#KODE 1!@#USER_ID 66!@#ACTIVITY_CODE 1
12/10/2022 09:27:48 AM script INFO: SUCCESS!@#KODE 1!@#USER_ID 66!@#ACTIVITY_CODE 3
12/10/2022 09:27:49 AM script INFO: SUCCESS!@#KODE 1!@#USER_ID 66!@#ACTIVITY_CODE 2
12/10/2022 09:27:49 AM script INFO: SUCCESS!@#KODE 1!@#USER_ID 66!@#ACTIVITY_CODE 2
12/10/2022 09:27:49 AM script INFO: SUCCESS!@#KODE 1!@#USER_ID 66!@#ACTIVITY_CODE 1
12/10/2022 09:27:50 AM script INFO: SUCCESS!@#KODE 1!@#USER_ID 66!@#ACTIVITY_CODE 1
12/10/2022 09:27:50 AM script INFO: SUCCESS!@#KODE 1!@#USER_ID 66!@#ACTIVITY_CODE 1
12/10/2022 09:27:50 AM script INFO: SUCCESS!@#KODE 1!@#USER_ID 66!@#ACTIVITY_CODE 1
12/10/2022 09:27:50 AM script INFO: SUCCESS!@#KODE 1!@#USER_ID 66!@#ACTIVITY_CODE 4
12/10/2022 09:27:50 AM script INFO: SUCCESS!@#KODE 1!@#USER_ID 66!@#ACTIVITY_CODE 3
12/10/2022 09:27:51 AM script INFO: SUCCESS!@#KODE 1!@#USER_ID 66!@#ACTIVITY_CODE 2
12/10/2022 09:27:51 AM script INFO: SUCCESS!@#KODE 1!@#USER_ID 66!@#ACTIVITY_CODE 3
12/10/2022 09:27:51 AM script INFO: SUCCESS!@#KODE 1!@#USER_ID 66!@#ACTIVITY_CODE 4
12/10/2022 09:27:52 AM script INFO: SUCCESS!@#KODE 1!@#USER_ID 66!@#ACTIVITY_CODE 1
12/10/2022 09:27:52 AM script INFO: SUCCESS!@#KODE 1!@#USER_ID 66!@#ACTIVITY_CODE 2
12/10/2022 09:27:52 AM script INFO: SUCCESS!@#KODE 1!@#USER_ID 66!@#ACTIVITY_CODE 3
12/10/2022 09:27:53 AM script INFO: SUCCESS!@#KODE 1!@#USER_ID 66!@#ACTIVITY_CODE 3
12/10/2022 09:27:53 AM script INFO: SUCCESS!@#KODE 1!@#USER_ID 66!@#ACTIVITY_CODE 2
12/10/2022 09:27:53 AM script INFO: SUCCESS!@#KODE 1!@#USER_ID 66!@#ACTIVITY_CODE 3
12/10/2022 09:27:53 AM script INFO: SUCCESS!@#KODE 1!@#USER_ID 66!@#ACTIVITY_CODE 1
12/10/2022 09:27:54 AM script INFO: SUCCESS!@#KODE 1!@#USER_ID 66!@#ACTIVITY_CODE 2
12/10/2022 09:27:54 AM script INFO: SUCCESS!@#KODE 1!@#USER_ID 66!@#ACTIVITY_CODE 3
12/10/2022 09:27:54 AM script INFO: SUCCESS!@#KODE 1!@#USER_ID 66!@#ACTIVITY_CODE 3
12/10/2022 09:27:55 AM script INFO: SUCCESS!@#KODE 1!@#USER_ID 66!@#ACTIVITY_CODE 2
12/10/2022 09:27:55 AM script INFO: SUCCESS!@#KODE 1!@#USER_ID 66!@#ACTIVITY_CODE 2
12/10/2022 09:27:55 AM script INFO: SUCCESS!@#KODE 1!@#USER_ID 66!@#ACTIVITY_CODE 3
12/10/2022 09:27:56 AM script INFO: SUCCESS!@#KODE 1!@#USER_ID 66!@#ACTIVITY_CODE 2
12/10/2022 09:27:56 AM script INFO: SUCCESS!@#KODE 1!@#USER_ID 66!@#ACTIVITY_CODE 2
12/10/2022 09:27:57 AM script INFO: SUCCESS!@#KODE 1!@#USER_ID 66!@#ACTIVITY_CODE 2
12/10/2022 09:27:57 AM script INFO: SUCCESS!@#KODE 1!@#USER_ID 66!@#ACTIVITY_CODE 2
12/10/2022 09:27:57 AM script INFO: SUCCESS!@#KODE 1!@#USER_ID 66!@#ACTIVITY_CODE 3
12/10/2022 09:27:58 AM script INFO: SUCCESS!@#KODE 1!@#USER_ID 66!@#ACTIVITY_CODE 2
12/10/2022 09:27:58 AM script INFO: SUCCESS!@#KODE 1!@#USER_ID 66!@#ACTIVITY_CODE 3
12/10/2022 09:27:58 AM script INFO: SUCCESS!@#KODE 1!@#USER_ID 66!@#ACTIVITY_CODE 3
12/10/2022 09:27:59 AM script INFO: SUCCESS!@#KODE 1!@#USER_ID 66!@#ACTIVITY_CODE 1
12/10/2022 09:27:59 AM script INFO: Duration: 256.20315170288086
12/10/2022 09:27:59 AM script INFO: mengakhiri-quiz
12/10/2022 09:28:03 AM script INFO: SUCCESS!@#KODE 1!@#USER_ID 66!@#ACTIVITY_CODE 5
12/10/2022 09:28:03 AM script INFO: berhasil-submit
12/10/2022 09:29:33 AM script ERROR: TIMEOUT EXCEPTION!@#KODE 0!@#LOCATION berhasil-submit
12/10/2022 09:29:33 AM main_worker ERROR: Message: None

