12/11/2022 03:52:32 PM script INFO: Prepared chrome options..
12/11/2022 03:52:33 PM script INFO: Initialized chrome browser..
12/11/2022 03:52:33 PM script INFO: mengakses-homepage
12/11/2022 03:53:06 PM script INFO: mengakses-login-page
12/11/2022 03:53:08 PM script INFO: mengakses-site-home
12/11/2022 03:53:09 PM script INFO: mengakses-site-course
12/11/2022 03:53:25 PM script INFO: mengakses-quiz
12/11/2022 03:53:39 PM script INFO: mengakses-start-quiz-page
12/11/2022 03:54:16 PM script INFO: memulai-quiz
12/11/2022 03:54:16 PM script INFO: SUCCESS!@#KODE 1!@#USER_ID 12!@#ACTIVITY_CODE 5
12/11/2022 03:54:28 PM script INFO: SUCCESS!@#KODE 1!@#USER_ID 12!@#ACTIVITY_CODE 1
12/11/2022 03:54:28 PM script INFO: SUCCESS!@#KODE 1!@#USER_ID 12!@#ACTIVITY_CODE 4
12/11/2022 03:54:28 PM script INFO: SUCCESS!@#KODE 1!@#USER_ID 12!@#ACTIVITY_CODE 2
12/11/2022 03:54:28 PM script INFO: SUCCESS!@#KODE 1!@#USER_ID 12!@#ACTIVITY_CODE 5
12/11/2022 03:54:28 PM script INFO: SUCCESS!@#KODE 1!@#USER_ID 12!@#ACTIVITY_CODE 5
12/11/2022 03:54:30 PM script INFO: SUCCESS!@#KODE 1!@#USER_ID 12!@#ACTIVITY_CODE 5
12/11/2022 03:54:30 PM script INFO: SUCCESS!@#KODE 1!@#USER_ID 12!@#ACTIVITY_CODE 5
12/11/2022 03:54:33 PM script INFO: SUCCESS!@#KODE 1!@#USER_ID 12!@#ACTIVITY_CODE 1
12/11/2022 03:54:33 PM script INFO: SUCCESS!@#KODE 1!@#USER_ID 12!@#ACTIVITY_CODE 4
12/11/2022 03:54:33 PM script INFO: SUCCESS!@#KODE 1!@#USER_ID 12!@#ACTIVITY_CODE 1
12/11/2022 03:54:33 PM script INFO: SUCCESS!@#KODE 1!@#USER_ID 12!@#ACTIVITY_CODE 5
12/11/2022 03:54:33 PM script INFO: SUCCESS!@#KODE 1!@#USER_ID 12!@#ACTIVITY_CODE 5
12/11/2022 03:54:36 PM script INFO: SUCCESS!@#KODE 1!@#USER_ID 12!@#ACTIVITY_CODE 4
12/11/2022 03:54:36 PM script INFO: SUCCESS!@#KODE 1!@#USER_ID 12!@#ACTIVITY_CODE 1
12/11/2022 03:54:36 PM script INFO: SUCCESS!@#KODE 1!@#USER_ID 12!@#ACTIVITY_CODE 5
12/11/2022 03:54:36 PM script INFO: SUCCESS!@#KODE 1!@#USER_ID 12!@#ACTIVITY_CODE 5
12/11/2022 03:54:38 PM script INFO: SUCCESS!@#KODE 1!@#USER_ID 12!@#ACTIVITY_CODE 1
12/11/2022 03:54:38 PM script INFO: SUCCESS!@#KODE 1!@#USER_ID 12!@#ACTIVITY_CODE 5
12/11/2022 03:54:38 PM script INFO: SUCCESS!@#KODE 1!@#USER_ID 12!@#ACTIVITY_CODE 5
12/11/2022 03:54:41 PM script INFO: SUCCESS!@#KODE 1!@#USER_ID 12!@#ACTIVITY_CODE 1
12/11/2022 03:54:41 PM script INFO: SUCCESS!@#KODE 1!@#USER_ID 12!@#ACTIVITY_CODE 1
12/11/2022 03:54:41 PM script INFO: SUCCESS!@#KODE 1!@#USER_ID 12!@#ACTIVITY_CODE 4
12/11/2022 03:54:41 PM script INFO: SUCCESS!@#KODE 1!@#USER_ID 12!@#ACTIVITY_CODE 2
12/11/2022 03:54:41 PM script INFO: SUCCESS!@#KODE 1!@#USER_ID 12!@#ACTIVITY_CODE 3
12/11/2022 03:54:41 PM script INFO: SUCCESS!@#KODE 1!@#USER_ID 12!@#ACTIVITY_CODE 3
12/11/2022 03:54:41 PM script INFO: SUCCESS!@#KODE 1!@#USER_ID 12!@#ACTIVITY_CODE 2
12/11/2022 03:54:41 PM script INFO: SUCCESS!@#KODE 1!@#USER_ID 12!@#ACTIVITY_CODE 1
12/11/2022 03:54:42 PM script INFO: SUCCESS!@#KODE 1!@#USER_ID 12!@#ACTIVITY_CODE 2
12/11/2022 03:54:42 PM script INFO: SUCCESS!@#KODE 1!@#USER_ID 12!@#ACTIVITY_CODE 1
12/11/2022 03:54:42 PM script INFO: SUCCESS!@#KODE 1!@#USER_ID 12!@#ACTIVITY_CODE 1
12/11/2022 03:54:42 PM script INFO: SUCCESS!@#KODE 1!@#USER_ID 12!@#ACTIVITY_CODE 2
12/11/2022 03:54:42 PM script INFO: SUCCESS!@#KODE 1!@#USER_ID 12!@#ACTIVITY_CODE 2
12/11/2022 03:54:42 PM script INFO: SUCCESS!@#KODE 1!@#USER_ID 12!@#ACTIVITY_CODE 5
12/11/2022 03:54:42 PM script INFO: SUCCESS!@#KODE 1!@#USER_ID 12!@#ACTIVITY_CODE 5
12/11/2022 03:54:44 PM script INFO: SUCCESS!@#KODE 1!@#USER_ID 12!@#ACTIVITY_CODE 1
12/11/2022 03:54:44 PM script INFO: SUCCESS!@#KODE 1!@#USER_ID 12!@#ACTIVITY_CODE 5
12/11/2022 03:54:44 PM script INFO: SUCCESS!@#KODE 1!@#USER_ID 12!@#ACTIVITY_CODE 5
12/11/2022 03:54:47 PM script INFO: SUCCESS!@#KODE 1!@#USER_ID 12!@#ACTIVITY_CODE 3
12/11/2022 03:54:47 PM script INFO: SUCCESS!@#KODE 1!@#USER_ID 12!@#ACTIVITY_CODE 5
12/11/2022 03:54:47 PM script INFO: SUCCESS!@#KODE 1!@#USER_ID 12!@#ACTIVITY_CODE 5
12/11/2022 03:54:50 PM script INFO: SUCCESS!@#KODE 1!@#USER_ID 12!@#ACTIVITY_CODE 2
12/11/2022 03:54:50 PM script INFO: SUCCESS!@#KODE 1!@#USER_ID 12!@#ACTIVITY_CODE 1
12/11/2022 03:54:50 PM script INFO: SUCCESS!@#KODE 1!@#USER_ID 12!@#ACTIVITY_CODE 4
12/11/2022 03:54:50 PM script INFO: SUCCESS!@#KODE 1!@#USER_ID 12!@#ACTIVITY_CODE 3
12/11/2022 03:54:50 PM script INFO: SUCCESS!@#KODE 1!@#USER_ID 12!@#ACTIVITY_CODE 1
12/11/2022 03:54:50 PM script INFO: SUCCESS!@#KODE 1!@#USER_ID 12!@#ACTIVITY_CODE 4
12/11/2022 03:54:50 PM script INFO: SUCCESS!@#KODE 1!@#USER_ID 12!@#ACTIVITY_CODE 1
12/11/2022 03:54:50 PM script INFO: SUCCESS!@#KODE 1!@#USER_ID 12!@#ACTIVITY_CODE 4
12/11/2022 03:54:50 PM script INFO: SUCCESS!@#KODE 1!@#USER_ID 12!@#ACTIVITY_CODE 2
12/11/2022 03:54:50 PM script INFO: SUCCESS!@#KODE 1!@#USER_ID 12!@#ACTIVITY_CODE 5
12/11/2022 03:54:50 PM script INFO: SUCCESS!@#KODE 1!@#USER_ID 12!@#ACTIVITY_CODE 5
12/11/2022 03:54:53 PM script INFO: SUCCESS!@#KODE 1!@#USER_ID 12!@#ACTIVITY_CODE 1
12/11/2022 03:54:53 PM script INFO: SUCCESS!@#KODE 1!@#USER_ID 12!@#ACTIVITY_CODE 3
12/11/2022 03:54:53 PM script INFO: SUCCESS!@#KODE 1!@#USER_ID 12!@#ACTIVITY_CODE 2
12/11/2022 03:54:53 PM script INFO: SUCCESS!@#KODE 1!@#USER_ID 12!@#ACTIVITY_CODE 3
12/11/2022 03:54:53 PM script INFO: SUCCESS!@#KODE 1!@#USER_ID 12!@#ACTIVITY_CODE 2
12/11/2022 03:54:53 PM script INFO: SUCCESS!@#KODE 1!@#USER_ID 12!@#ACTIVITY_CODE 1
12/11/2022 03:54:53 PM script INFO: SUCCESS!@#KODE 1!@#USER_ID 12!@#ACTIVITY_CODE 1
12/11/2022 03:54:53 PM script INFO: SUCCESS!@#KODE 1!@#USER_ID 12!@#ACTIVITY_CODE 5
12/11/2022 03:54:53 PM script INFO: SUCCESS!@#KODE 1!@#USER_ID 12!@#ACTIVITY_CODE 5
12/11/2022 03:54:56 PM script INFO: SUCCESS!@#KODE 1!@#USER_ID 12!@#ACTIVITY_CODE 3
12/11/2022 03:54:56 PM script INFO: SUCCESS!@#KODE 1!@#USER_ID 12!@#ACTIVITY_CODE 3
12/11/2022 03:54:56 PM script INFO: SUCCESS!@#KODE 1!@#USER_ID 12!@#ACTIVITY_CODE 5
12/11/2022 03:54:56 PM script INFO: SUCCESS!@#KODE 1!@#USER_ID 12!@#ACTIVITY_CODE 5
12/11/2022 03:54:59 PM script INFO: SUCCESS!@#KODE 1!@#USER_ID 12!@#ACTIVITY_CODE 3
12/11/2022 03:54:59 PM script INFO: SUCCESS!@#KODE 1!@#USER_ID 12!@#ACTIVITY_CODE 2
12/11/2022 03:54:59 PM script INFO: SUCCESS!@#KODE 1!@#USER_ID 12!@#ACTIVITY_CODE 1
12/11/2022 03:54:59 PM script INFO: SUCCESS!@#KODE 1!@#USER_ID 12!@#ACTIVITY_CODE 1
12/11/2022 03:54:59 PM script INFO: SUCCESS!@#KODE 1!@#USER_ID 12!@#ACTIVITY_CODE 1
12/11/2022 03:54:59 PM script INFO: SUCCESS!@#KODE 1!@#USER_ID 12!@#ACTIVITY_CODE 4
12/11/2022 03:54:59 PM script INFO: SUCCESS!@#KODE 1!@#USER_ID 12!@#ACTIVITY_CODE 3
12/11/2022 03:54:59 PM script INFO: SUCCESS!@#KODE 1!@#USER_ID 12!@#ACTIVITY_CODE 1
12/11/2022 03:54:59 PM script INFO: SUCCESS!@#KODE 1!@#USER_ID 12!@#ACTIVITY_CODE 2
12/11/2022 03:54:59 PM script INFO: SUCCESS!@#KODE 1!@#USER_ID 12!@#ACTIVITY_CODE 3
12/11/2022 03:54:59 PM script INFO: SUCCESS!@#KODE 1!@#USER_ID 12!@#ACTIVITY_CODE 5
12/11/2022 03:54:59 PM script INFO: SUCCESS!@#KODE 1!@#USER_ID 12!@#ACTIVITY_CODE 5
12/11/2022 03:55:02 PM script INFO: SUCCESS!@#KODE 1!@#USER_ID 12!@#ACTIVITY_CODE 5
12/11/2022 03:55:02 PM script INFO: SUCCESS!@#KODE 1!@#USER_ID 12!@#ACTIVITY_CODE 5
12/11/2022 03:55:04 PM script INFO: SUCCESS!@#KODE 1!@#USER_ID 12!@#ACTIVITY_CODE 1
12/11/2022 03:55:04 PM script INFO: SUCCESS!@#KODE 1!@#USER_ID 12!@#ACTIVITY_CODE 3
12/11/2022 03:55:04 PM script INFO: SUCCESS!@#KODE 1!@#USER_ID 12!@#ACTIVITY_CODE 5
12/11/2022 03:55:04 PM script INFO: SUCCESS!@#KODE 1!@#USER_ID 12!@#ACTIVITY_CODE 5
12/11/2022 03:55:07 PM script INFO: SUCCESS!@#KODE 1!@#USER_ID 12!@#ACTIVITY_CODE 1
12/11/2022 03:55:07 PM script INFO: SUCCESS!@#KODE 1!@#USER_ID 12!@#ACTIVITY_CODE 1
12/11/2022 03:55:07 PM script INFO: SUCCESS!@#KODE 1!@#USER_ID 12!@#ACTIVITY_CODE 2
12/11/2022 03:55:07 PM script INFO: SUCCESS!@#KODE 1!@#USER_ID 12!@#ACTIVITY_CODE 2
12/11/2022 03:55:07 PM script INFO: SUCCESS!@#KODE 1!@#USER_ID 12!@#ACTIVITY_CODE 3
12/11/2022 03:55:07 PM script INFO: SUCCESS!@#KODE 1!@#USER_ID 12!@#ACTIVITY_CODE 5
12/11/2022 03:55:07 PM script INFO: SUCCESS!@#KODE 1!@#USER_ID 12!@#ACTIVITY_CODE 5
12/11/2022 03:55:10 PM script INFO: SUCCESS!@#KODE 1!@#USER_ID 12!@#ACTIVITY_CODE 2
12/11/2022 03:55:10 PM script INFO: SUCCESS!@#KODE 1!@#USER_ID 12!@#ACTIVITY_CODE 4
12/11/2022 03:55:10 PM script INFO: SUCCESS!@#KODE 1!@#USER_ID 12!@#ACTIVITY_CODE 3
12/11/2022 03:55:10 PM script INFO: SUCCESS!@#KODE 1!@#USER_ID 12!@#ACTIVITY_CODE 2
12/11/2022 03:55:10 PM script INFO: SUCCESS!@#KODE 1!@#USER_ID 12!@#ACTIVITY_CODE 2
12/11/2022 03:55:11 PM script INFO: SUCCESS!@#KODE 1!@#USER_ID 12!@#ACTIVITY_CODE 3
12/11/2022 03:55:11 PM script INFO: SUCCESS!@#KODE 1!@#USER_ID 12!@#ACTIVITY_CODE 2
12/11/2022 03:55:11 PM script INFO: SUCCESS!@#KODE 1!@#USER_ID 12!@#ACTIVITY_CODE 3
12/11/2022 03:55:11 PM script INFO: SUCCESS!@#KODE 1!@#USER_ID 12!@#ACTIVITY_CODE 5
12/11/2022 03:55:11 PM script INFO: SUCCESS!@#KODE 1!@#USER_ID 12!@#ACTIVITY_CODE 5
12/11/2022 03:55:13 PM script INFO: SUCCESS!@#KODE 1!@#USER_ID 12!@#ACTIVITY_CODE 3
12/11/2022 03:55:13 PM script INFO: SUCCESS!@#KODE 1!@#USER_ID 12!@#ACTIVITY_CODE 2
12/11/2022 03:55:14 PM script INFO: SUCCESS!@#KODE 1!@#USER_ID 12!@#ACTIVITY_CODE 3
12/11/2022 03:55:14 PM script INFO: SUCCESS!@#KODE 1!@#USER_ID 12!@#ACTIVITY_CODE 2
12/11/2022 03:55:14 PM script INFO: SUCCESS!@#KODE 1!@#USER_ID 12!@#ACTIVITY_CODE 1
12/11/2022 03:55:14 PM script INFO: SUCCESS!@#KODE 1!@#USER_ID 12!@#ACTIVITY_CODE 1
12/11/2022 03:55:14 PM script INFO: SUCCESS!@#KODE 1!@#USER_ID 12!@#ACTIVITY_CODE 4
12/11/2022 03:55:14 PM script INFO: SUCCESS!@#KODE 1!@#USER_ID 12!@#ACTIVITY_CODE 3
12/11/2022 03:55:14 PM script INFO: SUCCESS!@#KODE 1!@#USER_ID 12!@#ACTIVITY_CODE 3
12/11/2022 03:55:14 PM script INFO: SUCCESS!@#KODE 1!@#USER_ID 12!@#ACTIVITY_CODE 1
12/11/2022 03:55:14 PM script INFO: SUCCESS!@#KODE 1!@#USER_ID 12!@#ACTIVITY_CODE 2
12/11/2022 03:55:14 PM script INFO: SUCCESS!@#KODE 1!@#USER_ID 12!@#ACTIVITY_CODE 4
12/11/2022 03:55:14 PM script INFO: SUCCESS!@#KODE 1!@#USER_ID 12!@#ACTIVITY_CODE 2
12/11/2022 03:55:14 PM script INFO: SUCCESS!@#KODE 1!@#USER_ID 12!@#ACTIVITY_CODE 3
12/11/2022 03:55:14 PM script INFO: SUCCESS!@#KODE 1!@#USER_ID 12!@#ACTIVITY_CODE 3
12/11/2022 03:55:15 PM script INFO: SUCCESS!@#KODE 1!@#USER_ID 12!@#ACTIVITY_CODE 1
12/11/2022 03:55:15 PM script INFO: SUCCESS!@#KODE 1!@#USER_ID 12!@#ACTIVITY_CODE 3
12/11/2022 03:55:15 PM script INFO: SUCCESS!@#KODE 1!@#USER_ID 12!@#ACTIVITY_CODE 2
12/11/2022 03:55:15 PM script INFO: SUCCESS!@#KODE 1!@#USER_ID 12!@#ACTIVITY_CODE 2
12/11/2022 03:55:15 PM script INFO: SUCCESS!@#KODE 1!@#USER_ID 12!@#ACTIVITY_CODE 3
12/11/2022 03:55:15 PM script INFO: SUCCESS!@#KODE 1!@#USER_ID 12!@#ACTIVITY_CODE 2
12/11/2022 03:55:15 PM script INFO: SUCCESS!@#KODE 1!@#USER_ID 12!@#ACTIVITY_CODE 1
12/11/2022 03:55:15 PM script INFO: SUCCESS!@#KODE 1!@#USER_ID 12!@#ACTIVITY_CODE 2
12/11/2022 03:55:15 PM script INFO: SUCCESS!@#KODE 1!@#USER_ID 12!@#ACTIVITY_CODE 1
12/11/2022 03:55:15 PM script INFO: SUCCESS!@#KODE 1!@#USER_ID 12!@#ACTIVITY_CODE 2
12/11/2022 03:55:16 PM script INFO: SUCCESS!@#KODE 1!@#USER_ID 12!@#ACTIVITY_CODE 2
12/11/2022 03:55:16 PM script INFO: SUCCESS!@#KODE 1!@#USER_ID 12!@#ACTIVITY_CODE 2
12/11/2022 03:55:16 PM script INFO: SUCCESS!@#KODE 1!@#USER_ID 12!@#ACTIVITY_CODE 4
12/11/2022 03:55:16 PM script INFO: SUCCESS!@#KODE 1!@#USER_ID 12!@#ACTIVITY_CODE 2
12/11/2022 03:55:16 PM script INFO: SUCCESS!@#KODE 1!@#USER_ID 12!@#ACTIVITY_CODE 2
12/11/2022 03:55:16 PM script INFO: SUCCESS!@#KODE 1!@#USER_ID 12!@#ACTIVITY_CODE 2
12/11/2022 03:55:16 PM script INFO: SUCCESS!@#KODE 1!@#USER_ID 12!@#ACTIVITY_CODE 1
12/11/2022 03:55:16 PM script INFO: SUCCESS!@#KODE 1!@#USER_ID 12!@#ACTIVITY_CODE 3
12/11/2022 03:55:16 PM script INFO: SUCCESS!@#KODE 1!@#USER_ID 12!@#ACTIVITY_CODE 2
12/11/2022 03:55:17 PM script INFO: SUCCESS!@#KODE 1!@#USER_ID 12!@#ACTIVITY_CODE 2
12/11/2022 03:55:17 PM script INFO: SUCCESS!@#KODE 1!@#USER_ID 12!@#ACTIVITY_CODE 3
12/11/2022 03:55:17 PM script INFO: SUCCESS!@#KODE 1!@#USER_ID 12!@#ACTIVITY_CODE 2
12/11/2022 03:55:17 PM script INFO: SUCCESS!@#KODE 1!@#USER_ID 12!@#ACTIVITY_CODE 1
12/11/2022 03:55:17 PM script INFO: SUCCESS!@#KODE 1!@#USER_ID 12!@#ACTIVITY_CODE 3
12/11/2022 03:55:17 PM script INFO: SUCCESS!@#KODE 1!@#USER_ID 12!@#ACTIVITY_CODE 2
12/11/2022 03:55:17 PM script INFO: SUCCESS!@#KODE 1!@#USER_ID 12!@#ACTIVITY_CODE 2
12/11/2022 03:55:17 PM script INFO: SUCCESS!@#KODE 1!@#USER_ID 12!@#ACTIVITY_CODE 3
12/11/2022 03:55:17 PM script INFO: SUCCESS!@#KODE 1!@#USER_ID 12!@#ACTIVITY_CODE 2
12/11/2022 03:55:17 PM script INFO: SUCCESS!@#KODE 1!@#USER_ID 12!@#ACTIVITY_CODE 4
12/11/2022 03:55:17 PM script INFO: SUCCESS!@#KODE 1!@#USER_ID 12!@#ACTIVITY_CODE 1
12/11/2022 03:55:17 PM script INFO: SUCCESS!@#KODE 1!@#USER_ID 12!@#ACTIVITY_CODE 3
12/11/2022 03:55:18 PM script INFO: SUCCESS!@#KODE 1!@#USER_ID 12!@#ACTIVITY_CODE 2
12/11/2022 03:55:18 PM script INFO: SUCCESS!@#KODE 1!@#USER_ID 12!@#ACTIVITY_CODE 4
12/11/2022 03:55:18 PM script INFO: SUCCESS!@#KODE 1!@#USER_ID 12!@#ACTIVITY_CODE 2
12/11/2022 03:55:18 PM script INFO: SUCCESS!@#KODE 1!@#USER_ID 12!@#ACTIVITY_CODE 3
12/11/2022 03:55:18 PM script INFO: SUCCESS!@#KODE 1!@#USER_ID 12!@#ACTIVITY_CODE 2
12/11/2022 03:55:18 PM script INFO: SUCCESS!@#KODE 1!@#USER_ID 12!@#ACTIVITY_CODE 2
12/11/2022 03:55:18 PM script INFO: SUCCESS!@#KODE 1!@#USER_ID 12!@#ACTIVITY_CODE 2
12/11/2022 03:55:18 PM script INFO: SUCCESS!@#KODE 1!@#USER_ID 12!@#ACTIVITY_CODE 1
12/11/2022 03:55:18 PM script INFO: SUCCESS!@#KODE 1!@#USER_ID 12!@#ACTIVITY_CODE 3
12/11/2022 03:55:19 PM script INFO: SUCCESS!@#KODE 1!@#USER_ID 12!@#ACTIVITY_CODE 2
12/11/2022 03:55:19 PM script INFO: SUCCESS!@#KODE 1!@#USER_ID 12!@#ACTIVITY_CODE 1
12/11/2022 03:55:19 PM script INFO: SUCCESS!@#KODE 1!@#USER_ID 12!@#ACTIVITY_CODE 1
12/11/2022 03:55:19 PM script INFO: SUCCESS!@#KODE 1!@#USER_ID 12!@#ACTIVITY_CODE 3
12/11/2022 03:55:19 PM script INFO: SUCCESS!@#KODE 1!@#USER_ID 12!@#ACTIVITY_CODE 2
12/11/2022 03:55:19 PM script INFO: SUCCESS!@#KODE 1!@#USER_ID 12!@#ACTIVITY_CODE 1
12/11/2022 03:55:19 PM script INFO: SUCCESS!@#KODE 1!@#USER_ID 12!@#ACTIVITY_CODE 3
12/11/2022 03:55:19 PM script INFO: SUCCESS!@#KODE 1!@#USER_ID 12!@#ACTIVITY_CODE 2
12/11/2022 03:55:19 PM script INFO: SUCCESS!@#KODE 1!@#USER_ID 12!@#ACTIVITY_CODE 1
12/11/2022 03:55:19 PM script INFO: SUCCESS!@#KODE 1!@#USER_ID 12!@#ACTIVITY_CODE 2
12/11/2022 03:55:19 PM script INFO: SUCCESS!@#KODE 1!@#USER_ID 12!@#ACTIVITY_CODE 3
12/11/2022 03:55:19 PM script INFO: SUCCESS!@#KODE 1!@#USER_ID 12!@#ACTIVITY_CODE 4
12/11/2022 03:55:19 PM script INFO: SUCCESS!@#KODE 1!@#USER_ID 12!@#ACTIVITY_CODE 1
12/11/2022 03:55:20 PM script INFO: SUCCESS!@#KODE 1!@#USER_ID 12!@#ACTIVITY_CODE 1
12/11/2022 03:55:20 PM script INFO: SUCCESS!@#KODE 1!@#USER_ID 12!@#ACTIVITY_CODE 2
12/11/2022 03:55:20 PM script INFO: SUCCESS!@#KODE 1!@#USER_ID 12!@#ACTIVITY_CODE 2
12/11/2022 03:55:20 PM script INFO: SUCCESS!@#KODE 1!@#USER_ID 12!@#ACTIVITY_CODE 3
12/11/2022 03:55:20 PM script INFO: SUCCESS!@#KODE 1!@#USER_ID 12!@#ACTIVITY_CODE 4
12/11/2022 03:55:20 PM script INFO: SUCCESS!@#KODE 1!@#USER_ID 12!@#ACTIVITY_CODE 1
12/11/2022 03:55:20 PM script INFO: SUCCESS!@#KODE 1!@#USER_ID 12!@#ACTIVITY_CODE 3
12/11/2022 03:55:20 PM script INFO: SUCCESS!@#KODE 1!@#USER_ID 12!@#ACTIVITY_CODE 4
12/11/2022 03:55:20 PM script INFO: SUCCESS!@#KODE 1!@#USER_ID 12!@#ACTIVITY_CODE 1
12/11/2022 03:55:20 PM script INFO: SUCCESS!@#KODE 1!@#USER_ID 12!@#ACTIVITY_CODE 3
12/11/2022 03:55:20 PM script INFO: SUCCESS!@#KODE 1!@#USER_ID 12!@#ACTIVITY_CODE 3
12/11/2022 03:55:20 PM script INFO: SUCCESS!@#KODE 1!@#USER_ID 12!@#ACTIVITY_CODE 1
12/11/2022 03:55:20 PM script INFO: SUCCESS!@#KODE 1!@#USER_ID 12!@#ACTIVITY_CODE 2
12/11/2022 03:55:21 PM script INFO: SUCCESS!@#KODE 1!@#USER_ID 12!@#ACTIVITY_CODE 2
12/11/2022 03:55:21 PM script INFO: SUCCESS!@#KODE 1!@#USER_ID 12!@#ACTIVITY_CODE 2
12/11/2022 03:55:21 PM script INFO: SUCCESS!@#KODE 1!@#USER_ID 12!@#ACTIVITY_CODE 1
12/11/2022 03:55:21 PM script INFO: SUCCESS!@#KODE 1!@#USER_ID 12!@#ACTIVITY_CODE 4
12/11/2022 03:55:21 PM script INFO: SUCCESS!@#KODE 1!@#USER_ID 12!@#ACTIVITY_CODE 2
12/11/2022 03:55:21 PM script INFO: SUCCESS!@#KODE 1!@#USER_ID 12!@#ACTIVITY_CODE 3
12/11/2022 03:55:21 PM script INFO: SUCCESS!@#KODE 1!@#USER_ID 12!@#ACTIVITY_CODE 4
12/11/2022 03:55:21 PM script INFO: SUCCESS!@#KODE 1!@#USER_ID 12!@#ACTIVITY_CODE 3
12/11/2022 03:55:21 PM script INFO: SUCCESS!@#KODE 1!@#USER_ID 12!@#ACTIVITY_CODE 3
12/11/2022 03:55:21 PM script INFO: SUCCESS!@#KODE 1!@#USER_ID 12!@#ACTIVITY_CODE 1
12/11/2022 03:55:21 PM script INFO: SUCCESS!@#KODE 1!@#USER_ID 12!@#ACTIVITY_CODE 3
12/11/2022 03:55:21 PM script INFO: SUCCESS!@#KODE 1!@#USER_ID 12!@#ACTIVITY_CODE 4
12/11/2022 03:55:21 PM script INFO: SUCCESS!@#KODE 1!@#USER_ID 12!@#ACTIVITY_CODE 3
12/11/2022 03:55:21 PM script INFO: SUCCESS!@#KODE 1!@#USER_ID 12!@#ACTIVITY_CODE 1
12/11/2022 03:55:21 PM script INFO: SUCCESS!@#KODE 1!@#USER_ID 12!@#ACTIVITY_CODE 1
12/11/2022 03:55:21 PM script INFO: SUCCESS!@#KODE 1!@#USER_ID 12!@#ACTIVITY_CODE 1
12/11/2022 03:55:22 PM script INFO: SUCCESS!@#KODE 1!@#USER_ID 12!@#ACTIVITY_CODE 4
12/11/2022 03:55:22 PM script INFO: SUCCESS!@#KODE 1!@#USER_ID 12!@#ACTIVITY_CODE 1
12/11/2022 03:55:22 PM script INFO: SUCCESS!@#KODE 1!@#USER_ID 12!@#ACTIVITY_CODE 4
12/11/2022 03:55:22 PM script INFO: SUCCESS!@#KODE 1!@#USER_ID 12!@#ACTIVITY_CODE 1
12/11/2022 03:55:22 PM script INFO: SUCCESS!@#KODE 1!@#USER_ID 12!@#ACTIVITY_CODE 3
12/11/2022 03:55:22 PM script INFO: SUCCESS!@#KODE 1!@#USER_ID 12!@#ACTIVITY_CODE 1
12/11/2022 03:55:22 PM script INFO: SUCCESS!@#KODE 1!@#USER_ID 12!@#ACTIVITY_CODE 1
12/11/2022 03:55:22 PM script INFO: SUCCESS!@#KODE 1!@#USER_ID 12!@#ACTIVITY_CODE 2
12/11/2022 03:55:22 PM script INFO: SUCCESS!@#KODE 1!@#USER_ID 12!@#ACTIVITY_CODE 3
12/11/2022 03:55:22 PM script INFO: SUCCESS!@#KODE 1!@#USER_ID 12!@#ACTIVITY_CODE 1
12/11/2022 03:55:22 PM script INFO: SUCCESS!@#KODE 1!@#USER_ID 12!@#ACTIVITY_CODE 3
12/11/2022 03:55:22 PM script INFO: SUCCESS!@#KODE 1!@#USER_ID 12!@#ACTIVITY_CODE 1
12/11/2022 03:55:22 PM script INFO: SUCCESS!@#KODE 1!@#USER_ID 12!@#ACTIVITY_CODE 4
12/11/2022 03:55:22 PM script INFO: SUCCESS!@#KODE 1!@#USER_ID 12!@#ACTIVITY_CODE 1
12/11/2022 03:55:22 PM script INFO: SUCCESS!@#KODE 1!@#USER_ID 12!@#ACTIVITY_CODE 3
12/11/2022 03:55:22 PM script INFO: SUCCESS!@#KODE 1!@#USER_ID 12!@#ACTIVITY_CODE 4
12/11/2022 03:55:22 PM script INFO: SUCCESS!@#KODE 1!@#USER_ID 12!@#ACTIVITY_CODE 3
12/11/2022 03:55:22 PM script INFO: SUCCESS!@#KODE 1!@#USER_ID 12!@#ACTIVITY_CODE 3
12/11/2022 03:55:23 PM script INFO: SUCCESS!@#KODE 1!@#USER_ID 12!@#ACTIVITY_CODE 1
12/11/2022 03:55:23 PM script INFO: SUCCESS!@#KODE 1!@#USER_ID 12!@#ACTIVITY_CODE 1
12/11/2022 03:55:23 PM script INFO: SUCCESS!@#KODE 1!@#USER_ID 12!@#ACTIVITY_CODE 4
12/11/2022 03:55:23 PM script INFO: SUCCESS!@#KODE 1!@#USER_ID 12!@#ACTIVITY_CODE 1
12/11/2022 03:55:23 PM script INFO: SUCCESS!@#KODE 1!@#USER_ID 12!@#ACTIVITY_CODE 1
12/11/2022 03:55:23 PM script INFO: SUCCESS!@#KODE 1!@#USER_ID 12!@#ACTIVITY_CODE 2
12/11/2022 03:55:23 PM script INFO: SUCCESS!@#KODE 1!@#USER_ID 12!@#ACTIVITY_CODE 2
12/11/2022 03:55:23 PM script INFO: SUCCESS!@#KODE 1!@#USER_ID 12!@#ACTIVITY_CODE 2
12/11/2022 03:55:23 PM script INFO: SUCCESS!@#KODE 1!@#USER_ID 12!@#ACTIVITY_CODE 4
12/11/2022 03:55:23 PM script INFO: SUCCESS!@#KODE 1!@#USER_ID 12!@#ACTIVITY_CODE 1
12/11/2022 03:55:23 PM script INFO: SUCCESS!@#KODE 1!@#USER_ID 12!@#ACTIVITY_CODE 2
12/11/2022 03:55:23 PM script INFO: SUCCESS!@#KODE 1!@#USER_ID 12!@#ACTIVITY_CODE 3
12/11/2022 03:55:23 PM script INFO: SUCCESS!@#KODE 1!@#USER_ID 12!@#ACTIVITY_CODE 4
12/11/2022 03:55:24 PM script INFO: SUCCESS!@#KODE 1!@#USER_ID 12!@#ACTIVITY_CODE 2
12/11/2022 03:55:24 PM script INFO: SUCCESS!@#KODE 1!@#USER_ID 12!@#ACTIVITY_CODE 2
12/11/2022 03:55:24 PM script INFO: SUCCESS!@#KODE 1!@#USER_ID 12!@#ACTIVITY_CODE 1
12/11/2022 03:55:24 PM script INFO: SUCCESS!@#KODE 1!@#USER_ID 12!@#ACTIVITY_CODE 2
12/11/2022 03:55:24 PM script INFO: SUCCESS!@#KODE 1!@#USER_ID 12!@#ACTIVITY_CODE 4
12/11/2022 03:55:24 PM script INFO: SUCCESS!@#KODE 1!@#USER_ID 12!@#ACTIVITY_CODE 3
12/11/2022 03:55:24 PM script INFO: SUCCESS!@#KODE 1!@#USER_ID 12!@#ACTIVITY_CODE 1
12/11/2022 03:55:24 PM script INFO: SUCCESS!@#KODE 1!@#USER_ID 12!@#ACTIVITY_CODE 1
12/11/2022 03:55:24 PM script INFO: SUCCESS!@#KODE 1!@#USER_ID 12!@#ACTIVITY_CODE 2
12/11/2022 03:55:24 PM script INFO: SUCCESS!@#KODE 1!@#USER_ID 12!@#ACTIVITY_CODE 2
12/11/2022 03:55:24 PM script INFO: SUCCESS!@#KODE 1!@#USER_ID 12!@#ACTIVITY_CODE 2
12/11/2022 03:55:24 PM script INFO: SUCCESS!@#KODE 1!@#USER_ID 12!@#ACTIVITY_CODE 2
12/11/2022 03:55:25 PM script INFO: SUCCESS!@#KODE 1!@#USER_ID 12!@#ACTIVITY_CODE 2
12/11/2022 03:55:25 PM script INFO: SUCCESS!@#KODE 1!@#USER_ID 12!@#ACTIVITY_CODE 3
12/11/2022 03:55:25 PM script INFO: SUCCESS!@#KODE 1!@#USER_ID 12!@#ACTIVITY_CODE 2
12/11/2022 03:55:25 PM script INFO: SUCCESS!@#KODE 1!@#USER_ID 12!@#ACTIVITY_CODE 2
12/11/2022 03:55:25 PM script INFO: SUCCESS!@#KODE 1!@#USER_ID 12!@#ACTIVITY_CODE 2
12/11/2022 03:55:25 PM script INFO: SUCCESS!@#KODE 1!@#USER_ID 12!@#ACTIVITY_CODE 1
12/11/2022 03:55:25 PM script INFO: SUCCESS!@#KODE 1!@#USER_ID 12!@#ACTIVITY_CODE 4
12/11/2022 03:55:25 PM script INFO: SUCCESS!@#KODE 1!@#USER_ID 12!@#ACTIVITY_CODE 2
12/11/2022 03:55:25 PM script INFO: SUCCESS!@#KODE 1!@#USER_ID 12!@#ACTIVITY_CODE 3
12/11/2022 03:55:25 PM script INFO: Duration: 57.75075578689575
12/11/2022 03:55:25 PM script INFO: mengakhiri-quiz
12/11/2022 03:55:26 PM script INFO: SUCCESS!@#KODE 1!@#USER_ID 12!@#ACTIVITY_CODE 5
12/11/2022 03:55:26 PM script INFO: berhasil-submit
12/11/2022 03:56:56 PM script ERROR: TIMEOUT EXCEPTION!@#KODE 0!@#LOCATION berhasil-submit
12/11/2022 03:56:56 PM main_worker ERROR: Message: None

