12/23/2022 03:16:01 AM script INFO: Prepared chrome options..
12/23/2022 03:16:03 AM script INFO: Initialized chrome browser..
12/23/2022 03:16:03 AM script INFO: mengakses-homepage
12/23/2022 03:16:41 AM script INFO: mengakses-login-page
12/23/2022 03:16:42 AM script INFO: mengakses-site-home
12/23/2022 03:16:43 AM script INFO: mengakses-site-course
12/23/2022 03:16:44 AM script INFO: mengakses-quiz
12/23/2022 03:16:44 AM script INFO: mengakses-start-quiz-page
12/23/2022 03:16:46 AM script INFO: memulai-quiz
12/23/2022 03:16:46 AM script INFO: SUCCESS!@#KODE 1!@#USER_ID 59!@#ACTIVITY_CODE 5
12/23/2022 03:16:57 AM script INFO: SUCCESS!@#KODE 1!@#USER_ID 59!@#ACTIVITY_CODE 2
12/23/2022 03:16:57 AM script INFO: SUCCESS!@#KODE 1!@#USER_ID 59!@#ACTIVITY_CODE 2
12/23/2022 03:16:57 AM script INFO: SUCCESS!@#KODE 1!@#USER_ID 59!@#ACTIVITY_CODE 5
12/23/2022 03:16:57 AM script INFO: SUCCESS!@#KODE 1!@#USER_ID 59!@#ACTIVITY_CODE 5
12/23/2022 03:17:00 AM script INFO: SUCCESS!@#KODE 1!@#USER_ID 59!@#ACTIVITY_CODE 1
12/23/2022 03:17:00 AM script INFO: SUCCESS!@#KODE 1!@#USER_ID 59!@#ACTIVITY_CODE 1
12/23/2022 03:17:00 AM script INFO: SUCCESS!@#KODE 1!@#USER_ID 59!@#ACTIVITY_CODE 3
12/23/2022 03:17:00 AM script INFO: SUCCESS!@#KODE 1!@#USER_ID 59!@#ACTIVITY_CODE 1
12/23/2022 03:17:00 AM script INFO: SUCCESS!@#KODE 1!@#USER_ID 59!@#ACTIVITY_CODE 1
12/23/2022 03:17:00 AM script INFO: SUCCESS!@#KODE 1!@#USER_ID 59!@#ACTIVITY_CODE 1
12/23/2022 03:17:00 AM script INFO: SUCCESS!@#KODE 1!@#USER_ID 59!@#ACTIVITY_CODE 3
12/23/2022 03:17:00 AM script INFO: SUCCESS!@#KODE 1!@#USER_ID 59!@#ACTIVITY_CODE 5
12/23/2022 03:17:00 AM script INFO: SUCCESS!@#KODE 1!@#USER_ID 59!@#ACTIVITY_CODE 5
12/23/2022 03:17:03 AM script INFO: SUCCESS!@#KODE 1!@#USER_ID 59!@#ACTIVITY_CODE 3
12/23/2022 03:17:03 AM script INFO: SUCCESS!@#KODE 1!@#USER_ID 59!@#ACTIVITY_CODE 5
12/23/2022 03:17:03 AM script INFO: SUCCESS!@#KODE 1!@#USER_ID 59!@#ACTIVITY_CODE 5
12/23/2022 03:17:05 AM script INFO: SUCCESS!@#KODE 1!@#USER_ID 59!@#ACTIVITY_CODE 2
12/23/2022 03:17:06 AM script INFO: SUCCESS!@#KODE 1!@#USER_ID 59!@#ACTIVITY_CODE 1
12/23/2022 03:17:06 AM script INFO: SUCCESS!@#KODE 1!@#USER_ID 59!@#ACTIVITY_CODE 3
12/23/2022 03:17:06 AM script INFO: SUCCESS!@#KODE 1!@#USER_ID 59!@#ACTIVITY_CODE 1
12/23/2022 03:17:06 AM script INFO: SUCCESS!@#KODE 1!@#USER_ID 59!@#ACTIVITY_CODE 5
12/23/2022 03:17:06 AM script INFO: SUCCESS!@#KODE 1!@#USER_ID 59!@#ACTIVITY_CODE 5
12/23/2022 03:17:08 AM script INFO: SUCCESS!@#KODE 1!@#USER_ID 59!@#ACTIVITY_CODE 4
12/23/2022 03:17:09 AM script INFO: SUCCESS!@#KODE 1!@#USER_ID 59!@#ACTIVITY_CODE 3
12/23/2022 03:17:09 AM script INFO: SUCCESS!@#KODE 1!@#USER_ID 59!@#ACTIVITY_CODE 5
12/23/2022 03:17:09 AM script INFO: SUCCESS!@#KODE 1!@#USER_ID 59!@#ACTIVITY_CODE 5
12/23/2022 03:17:11 AM script INFO: SUCCESS!@#KODE 1!@#USER_ID 59!@#ACTIVITY_CODE 2
12/23/2022 03:17:11 AM script INFO: SUCCESS!@#KODE 1!@#USER_ID 59!@#ACTIVITY_CODE 2
12/23/2022 03:17:11 AM script INFO: SUCCESS!@#KODE 1!@#USER_ID 59!@#ACTIVITY_CODE 1
12/23/2022 03:17:12 AM script INFO: SUCCESS!@#KODE 1!@#USER_ID 59!@#ACTIVITY_CODE 3
12/23/2022 03:17:12 AM script INFO: SUCCESS!@#KODE 1!@#USER_ID 59!@#ACTIVITY_CODE 1
12/23/2022 03:17:12 AM script INFO: SUCCESS!@#KODE 1!@#USER_ID 59!@#ACTIVITY_CODE 5
12/23/2022 03:17:12 AM script INFO: SUCCESS!@#KODE 1!@#USER_ID 59!@#ACTIVITY_CODE 5
12/23/2022 03:17:14 AM script INFO: SUCCESS!@#KODE 1!@#USER_ID 59!@#ACTIVITY_CODE 3
12/23/2022 03:17:14 AM script INFO: SUCCESS!@#KODE 1!@#USER_ID 59!@#ACTIVITY_CODE 1
12/23/2022 03:17:14 AM script INFO: SUCCESS!@#KODE 1!@#USER_ID 59!@#ACTIVITY_CODE 3
12/23/2022 03:17:14 AM script INFO: SUCCESS!@#KODE 1!@#USER_ID 59!@#ACTIVITY_CODE 2
12/23/2022 03:17:15 AM script INFO: SUCCESS!@#KODE 1!@#USER_ID 59!@#ACTIVITY_CODE 3
12/23/2022 03:17:15 AM script INFO: SUCCESS!@#KODE 1!@#USER_ID 59!@#ACTIVITY_CODE 2
12/23/2022 03:17:15 AM script INFO: SUCCESS!@#KODE 1!@#USER_ID 59!@#ACTIVITY_CODE 2
12/23/2022 03:17:15 AM script INFO: SUCCESS!@#KODE 1!@#USER_ID 59!@#ACTIVITY_CODE 3
12/23/2022 03:17:15 AM script INFO: SUCCESS!@#KODE 1!@#USER_ID 59!@#ACTIVITY_CODE 1
12/23/2022 03:17:15 AM script INFO: SUCCESS!@#KODE 1!@#USER_ID 59!@#ACTIVITY_CODE 2
12/23/2022 03:17:15 AM script INFO: SUCCESS!@#KODE 1!@#USER_ID 59!@#ACTIVITY_CODE 2
12/23/2022 03:17:15 AM script INFO: SUCCESS!@#KODE 1!@#USER_ID 59!@#ACTIVITY_CODE 2
12/23/2022 03:17:15 AM script INFO: SUCCESS!@#KODE 1!@#USER_ID 59!@#ACTIVITY_CODE 1
12/23/2022 03:17:16 AM script INFO: SUCCESS!@#KODE 1!@#USER_ID 59!@#ACTIVITY_CODE 4
12/23/2022 03:17:16 AM script INFO: SUCCESS!@#KODE 1!@#USER_ID 59!@#ACTIVITY_CODE 1
12/23/2022 03:17:16 AM script INFO: Duration: 19.076276302337646
12/23/2022 03:17:16 AM script INFO: mengakhiri-quiz
12/23/2022 03:17:16 AM script INFO: SUCCESS!@#KODE 1!@#USER_ID 59!@#ACTIVITY_CODE 5
12/23/2022 03:17:16 AM script INFO: berhasil-submit
