12/12/2022 01:44:27 AM script INFO: Prepared chrome options..
12/12/2022 01:44:29 AM script INFO: Initialized chrome browser..
12/12/2022 01:44:29 AM script INFO: mengakses-homepage
12/12/2022 01:45:17 AM script INFO: mengakses-login-page
12/12/2022 01:45:31 AM script INFO: mengakses-site-home
12/12/2022 01:45:32 AM script INFO: mengakses-site-course
12/12/2022 01:45:40 AM script INFO: mengakses-quiz
12/12/2022 01:45:41 AM script INFO: mengakses-start-quiz-page
12/12/2022 01:45:42 AM script INFO: memulai-quiz
12/12/2022 01:45:42 AM script INFO: SUCCESS!@#KODE 1!@#USER_ID 91!@#ACTIVITY_CODE 5
12/12/2022 01:45:53 AM script INFO: SUCCESS!@#KODE 1!@#USER_ID 91!@#ACTIVITY_CODE 1
12/12/2022 01:45:54 AM script INFO: SUCCESS!@#KODE 1!@#USER_ID 91!@#ACTIVITY_CODE 2
12/12/2022 01:45:54 AM script INFO: SUCCESS!@#KODE 1!@#USER_ID 91!@#ACTIVITY_CODE 5
12/12/2022 01:45:54 AM script INFO: SUCCESS!@#KODE 1!@#USER_ID 91!@#ACTIVITY_CODE 5
12/12/2022 01:45:56 AM script INFO: SUCCESS!@#KODE 1!@#USER_ID 91!@#ACTIVITY_CODE 2
12/12/2022 01:45:56 AM script INFO: SUCCESS!@#KODE 1!@#USER_ID 91!@#ACTIVITY_CODE 4
12/12/2022 01:45:56 AM script INFO: SUCCESS!@#KODE 1!@#USER_ID 91!@#ACTIVITY_CODE 2
12/12/2022 01:45:57 AM script INFO: SUCCESS!@#KODE 1!@#USER_ID 91!@#ACTIVITY_CODE 1
12/12/2022 01:45:57 AM script INFO: SUCCESS!@#KODE 1!@#USER_ID 91!@#ACTIVITY_CODE 3
12/12/2022 01:45:57 AM script INFO: SUCCESS!@#KODE 1!@#USER_ID 91!@#ACTIVITY_CODE 1
12/12/2022 01:45:57 AM script INFO: SUCCESS!@#KODE 1!@#USER_ID 91!@#ACTIVITY_CODE 2
12/12/2022 01:45:57 AM script INFO: SUCCESS!@#KODE 1!@#USER_ID 91!@#ACTIVITY_CODE 5
12/12/2022 01:45:57 AM script INFO: SUCCESS!@#KODE 1!@#USER_ID 91!@#ACTIVITY_CODE 5
12/12/2022 01:45:59 AM script INFO: SUCCESS!@#KODE 1!@#USER_ID 91!@#ACTIVITY_CODE 5
12/12/2022 01:45:59 AM script INFO: SUCCESS!@#KODE 1!@#USER_ID 91!@#ACTIVITY_CODE 5
12/12/2022 01:46:02 AM script INFO: SUCCESS!@#KODE 1!@#USER_ID 91!@#ACTIVITY_CODE 1
12/12/2022 01:46:02 AM script INFO: SUCCESS!@#KODE 1!@#USER_ID 91!@#ACTIVITY_CODE 3
12/12/2022 01:46:02 AM script INFO: SUCCESS!@#KODE 1!@#USER_ID 91!@#ACTIVITY_CODE 3
12/12/2022 01:46:02 AM script INFO: SUCCESS!@#KODE 1!@#USER_ID 91!@#ACTIVITY_CODE 3
12/12/2022 01:46:02 AM script INFO: SUCCESS!@#KODE 1!@#USER_ID 91!@#ACTIVITY_CODE 2
12/12/2022 01:46:02 AM script INFO: SUCCESS!@#KODE 1!@#USER_ID 91!@#ACTIVITY_CODE 3
12/12/2022 01:46:02 AM script INFO: SUCCESS!@#KODE 1!@#USER_ID 91!@#ACTIVITY_CODE 1
12/12/2022 01:46:02 AM script INFO: SUCCESS!@#KODE 1!@#USER_ID 91!@#ACTIVITY_CODE 3
12/12/2022 01:46:02 AM script INFO: SUCCESS!@#KODE 1!@#USER_ID 91!@#ACTIVITY_CODE 1
12/12/2022 01:46:02 AM script INFO: SUCCESS!@#KODE 1!@#USER_ID 91!@#ACTIVITY_CODE 1
12/12/2022 01:46:02 AM script INFO: SUCCESS!@#KODE 1!@#USER_ID 91!@#ACTIVITY_CODE 5
12/12/2022 01:46:02 AM script INFO: SUCCESS!@#KODE 1!@#USER_ID 91!@#ACTIVITY_CODE 5
12/12/2022 01:46:05 AM script INFO: SUCCESS!@#KODE 1!@#USER_ID 91!@#ACTIVITY_CODE 1
12/12/2022 01:46:05 AM script INFO: SUCCESS!@#KODE 1!@#USER_ID 91!@#ACTIVITY_CODE 1
12/12/2022 01:46:05 AM script INFO: SUCCESS!@#KODE 1!@#USER_ID 91!@#ACTIVITY_CODE 5
12/12/2022 01:46:05 AM script INFO: SUCCESS!@#KODE 1!@#USER_ID 91!@#ACTIVITY_CODE 5
12/12/2022 01:46:08 AM script INFO: SUCCESS!@#KODE 1!@#USER_ID 91!@#ACTIVITY_CODE 2
12/12/2022 01:46:08 AM script INFO: SUCCESS!@#KODE 1!@#USER_ID 91!@#ACTIVITY_CODE 5
12/12/2022 01:46:08 AM script INFO: SUCCESS!@#KODE 1!@#USER_ID 91!@#ACTIVITY_CODE 5
12/12/2022 01:46:10 AM script INFO: SUCCESS!@#KODE 1!@#USER_ID 91!@#ACTIVITY_CODE 2
12/12/2022 01:46:10 AM script INFO: SUCCESS!@#KODE 1!@#USER_ID 91!@#ACTIVITY_CODE 1
12/12/2022 01:46:10 AM script INFO: SUCCESS!@#KODE 1!@#USER_ID 91!@#ACTIVITY_CODE 5
12/12/2022 01:46:10 AM script INFO: SUCCESS!@#KODE 1!@#USER_ID 91!@#ACTIVITY_CODE 5
12/12/2022 01:46:13 AM script INFO: SUCCESS!@#KODE 1!@#USER_ID 91!@#ACTIVITY_CODE 1
12/12/2022 01:46:13 AM script INFO: SUCCESS!@#KODE 1!@#USER_ID 91!@#ACTIVITY_CODE 5
12/12/2022 01:46:13 AM script INFO: SUCCESS!@#KODE 1!@#USER_ID 91!@#ACTIVITY_CODE 5
12/12/2022 01:46:16 AM script INFO: SUCCESS!@#KODE 1!@#USER_ID 91!@#ACTIVITY_CODE 2
12/12/2022 01:46:16 AM script INFO: SUCCESS!@#KODE 1!@#USER_ID 91!@#ACTIVITY_CODE 5
12/12/2022 01:46:16 AM script INFO: SUCCESS!@#KODE 1!@#USER_ID 91!@#ACTIVITY_CODE 5
12/12/2022 01:46:18 AM script INFO: SUCCESS!@#KODE 1!@#USER_ID 91!@#ACTIVITY_CODE 1
12/12/2022 01:46:18 AM script INFO: SUCCESS!@#KODE 1!@#USER_ID 91!@#ACTIVITY_CODE 1
12/12/2022 01:46:18 AM script INFO: SUCCESS!@#KODE 1!@#USER_ID 91!@#ACTIVITY_CODE 3
12/12/2022 01:46:18 AM script INFO: SUCCESS!@#KODE 1!@#USER_ID 91!@#ACTIVITY_CODE 4
12/12/2022 01:46:18 AM script INFO: SUCCESS!@#KODE 1!@#USER_ID 91!@#ACTIVITY_CODE 3
12/12/2022 01:46:18 AM script INFO: SUCCESS!@#KODE 1!@#USER_ID 91!@#ACTIVITY_CODE 3
12/12/2022 01:46:18 AM script INFO: SUCCESS!@#KODE 1!@#USER_ID 91!@#ACTIVITY_CODE 3
12/12/2022 01:46:19 AM script INFO: SUCCESS!@#KODE 1!@#USER_ID 91!@#ACTIVITY_CODE 3
12/12/2022 01:46:19 AM script INFO: SUCCESS!@#KODE 1!@#USER_ID 91!@#ACTIVITY_CODE 2
12/12/2022 01:46:19 AM script INFO: SUCCESS!@#KODE 1!@#USER_ID 91!@#ACTIVITY_CODE 2
12/12/2022 01:46:19 AM script INFO: SUCCESS!@#KODE 1!@#USER_ID 91!@#ACTIVITY_CODE 2
12/12/2022 01:46:19 AM script INFO: SUCCESS!@#KODE 1!@#USER_ID 91!@#ACTIVITY_CODE 5
12/12/2022 01:46:19 AM script INFO: SUCCESS!@#KODE 1!@#USER_ID 91!@#ACTIVITY_CODE 5
12/12/2022 01:46:21 AM script INFO: SUCCESS!@#KODE 1!@#USER_ID 91!@#ACTIVITY_CODE 3
12/12/2022 01:46:21 AM script INFO: SUCCESS!@#KODE 1!@#USER_ID 91!@#ACTIVITY_CODE 5
12/12/2022 01:46:21 AM script INFO: SUCCESS!@#KODE 1!@#USER_ID 91!@#ACTIVITY_CODE 5
12/12/2022 01:46:24 AM script INFO: SUCCESS!@#KODE 1!@#USER_ID 91!@#ACTIVITY_CODE 2
12/12/2022 01:46:24 AM script INFO: SUCCESS!@#KODE 1!@#USER_ID 91!@#ACTIVITY_CODE 4
12/12/2022 01:46:24 AM script INFO: SUCCESS!@#KODE 1!@#USER_ID 91!@#ACTIVITY_CODE 3
12/12/2022 01:46:24 AM script INFO: SUCCESS!@#KODE 1!@#USER_ID 91!@#ACTIVITY_CODE 3
12/12/2022 01:46:24 AM script INFO: SUCCESS!@#KODE 1!@#USER_ID 91!@#ACTIVITY_CODE 2
12/12/2022 01:46:25 AM script INFO: SUCCESS!@#KODE 1!@#USER_ID 91!@#ACTIVITY_CODE 2
12/12/2022 01:46:25 AM script INFO: SUCCESS!@#KODE 1!@#USER_ID 91!@#ACTIVITY_CODE 3
12/12/2022 01:46:25 AM script INFO: SUCCESS!@#KODE 1!@#USER_ID 91!@#ACTIVITY_CODE 1
12/12/2022 01:46:25 AM script INFO: SUCCESS!@#KODE 1!@#USER_ID 91!@#ACTIVITY_CODE 1
12/12/2022 01:46:25 AM script INFO: SUCCESS!@#KODE 1!@#USER_ID 91!@#ACTIVITY_CODE 3
12/12/2022 01:46:25 AM script INFO: SUCCESS!@#KODE 1!@#USER_ID 91!@#ACTIVITY_CODE 2
12/12/2022 01:46:25 AM script INFO: SUCCESS!@#KODE 1!@#USER_ID 91!@#ACTIVITY_CODE 1
12/12/2022 01:46:25 AM script INFO: SUCCESS!@#KODE 1!@#USER_ID 91!@#ACTIVITY_CODE 1
12/12/2022 01:46:25 AM script INFO: SUCCESS!@#KODE 1!@#USER_ID 91!@#ACTIVITY_CODE 4
12/12/2022 01:46:25 AM script INFO: SUCCESS!@#KODE 1!@#USER_ID 91!@#ACTIVITY_CODE 3
12/12/2022 01:46:25 AM script INFO: SUCCESS!@#KODE 1!@#USER_ID 91!@#ACTIVITY_CODE 1
12/12/2022 01:46:25 AM script INFO: SUCCESS!@#KODE 1!@#USER_ID 91!@#ACTIVITY_CODE 1
12/12/2022 01:46:25 AM script INFO: SUCCESS!@#KODE 1!@#USER_ID 91!@#ACTIVITY_CODE 4
12/12/2022 01:46:25 AM script INFO: SUCCESS!@#KODE 1!@#USER_ID 91!@#ACTIVITY_CODE 3
12/12/2022 01:46:25 AM script INFO: SUCCESS!@#KODE 1!@#USER_ID 91!@#ACTIVITY_CODE 1
12/12/2022 01:46:25 AM script INFO: SUCCESS!@#KODE 1!@#USER_ID 91!@#ACTIVITY_CODE 1
12/12/2022 01:46:25 AM script INFO: SUCCESS!@#KODE 1!@#USER_ID 91!@#ACTIVITY_CODE 4
12/12/2022 01:46:26 AM script INFO: SUCCESS!@#KODE 1!@#USER_ID 91!@#ACTIVITY_CODE 3
12/12/2022 01:46:26 AM script INFO: SUCCESS!@#KODE 1!@#USER_ID 91!@#ACTIVITY_CODE 1
12/12/2022 01:46:26 AM script INFO: SUCCESS!@#KODE 1!@#USER_ID 91!@#ACTIVITY_CODE 2
12/12/2022 01:46:26 AM script INFO: SUCCESS!@#KODE 1!@#USER_ID 91!@#ACTIVITY_CODE 4
12/12/2022 01:46:26 AM script INFO: SUCCESS!@#KODE 1!@#USER_ID 91!@#ACTIVITY_CODE 3
12/12/2022 01:46:26 AM script INFO: SUCCESS!@#KODE 1!@#USER_ID 91!@#ACTIVITY_CODE 3
12/12/2022 01:46:26 AM script INFO: SUCCESS!@#KODE 1!@#USER_ID 91!@#ACTIVITY_CODE 3
12/12/2022 01:46:26 AM script INFO: SUCCESS!@#KODE 1!@#USER_ID 91!@#ACTIVITY_CODE 2
12/12/2022 01:46:26 AM script INFO: SUCCESS!@#KODE 1!@#USER_ID 91!@#ACTIVITY_CODE 1
12/12/2022 01:46:26 AM script INFO: SUCCESS!@#KODE 1!@#USER_ID 91!@#ACTIVITY_CODE 4
12/12/2022 01:46:26 AM script INFO: SUCCESS!@#KODE 1!@#USER_ID 91!@#ACTIVITY_CODE 1
12/12/2022 01:46:26 AM script INFO: SUCCESS!@#KODE 1!@#USER_ID 91!@#ACTIVITY_CODE 1
12/12/2022 01:46:26 AM script INFO: SUCCESS!@#KODE 1!@#USER_ID 91!@#ACTIVITY_CODE 1
12/12/2022 01:46:26 AM script INFO: SUCCESS!@#KODE 1!@#USER_ID 91!@#ACTIVITY_CODE 3
12/12/2022 01:46:26 AM script INFO: SUCCESS!@#KODE 1!@#USER_ID 91!@#ACTIVITY_CODE 4
12/12/2022 01:46:27 AM script INFO: SUCCESS!@#KODE 1!@#USER_ID 91!@#ACTIVITY_CODE 2
12/12/2022 01:46:27 AM script INFO: Duration: 33.27734327316284
12/12/2022 01:46:27 AM script INFO: mengakhiri-quiz
12/12/2022 01:46:27 AM script INFO: SUCCESS!@#KODE 1!@#USER_ID 91!@#ACTIVITY_CODE 5
12/12/2022 01:46:27 AM script INFO: berhasil-submit
