12/12/2022 01:44:27 AM script INFO: Prepared chrome options..
12/12/2022 01:44:29 AM script INFO: Initialized chrome browser..
12/12/2022 01:44:29 AM script INFO: mengakses-homepage
12/12/2022 01:45:05 AM script INFO: mengakses-login-page
12/12/2022 01:45:06 AM script INFO: mengakses-site-home
12/12/2022 01:45:07 AM script INFO: mengakses-site-course
12/12/2022 01:45:22 AM script INFO: mengakses-quiz
12/12/2022 01:45:22 AM script INFO: mengakses-start-quiz-page
12/12/2022 01:45:23 AM script INFO: memulai-quiz
12/12/2022 01:45:23 AM script INFO: SUCCESS!@#KODE 1!@#USER_ID 5!@#ACTIVITY_CODE 5
12/12/2022 01:45:34 AM script INFO: SUCCESS!@#KODE 1!@#USER_ID 5!@#ACTIVITY_CODE 5
12/12/2022 01:45:34 AM script INFO: SUCCESS!@#KODE 1!@#USER_ID 5!@#ACTIVITY_CODE 5
12/12/2022 01:45:37 AM script INFO: SUCCESS!@#KODE 1!@#USER_ID 5!@#ACTIVITY_CODE 5
12/12/2022 01:45:37 AM script INFO: SUCCESS!@#KODE 1!@#USER_ID 5!@#ACTIVITY_CODE 5
12/12/2022 01:45:39 AM script INFO: SUCCESS!@#KODE 1!@#USER_ID 5!@#ACTIVITY_CODE 3
12/12/2022 01:45:39 AM script INFO: SUCCESS!@#KODE 1!@#USER_ID 5!@#ACTIVITY_CODE 3
12/12/2022 01:45:39 AM script INFO: SUCCESS!@#KODE 1!@#USER_ID 5!@#ACTIVITY_CODE 5
12/12/2022 01:45:39 AM script INFO: SUCCESS!@#KODE 1!@#USER_ID 5!@#ACTIVITY_CODE 5
12/12/2022 01:45:42 AM script INFO: SUCCESS!@#KODE 1!@#USER_ID 5!@#ACTIVITY_CODE 2
12/12/2022 01:45:42 AM script INFO: SUCCESS!@#KODE 1!@#USER_ID 5!@#ACTIVITY_CODE 2
12/12/2022 01:45:43 AM script INFO: SUCCESS!@#KODE 1!@#USER_ID 5!@#ACTIVITY_CODE 3
12/12/2022 01:45:43 AM script INFO: SUCCESS!@#KODE 1!@#USER_ID 5!@#ACTIVITY_CODE 1
12/12/2022 01:45:43 AM script INFO: SUCCESS!@#KODE 1!@#USER_ID 5!@#ACTIVITY_CODE 5
12/12/2022 01:45:43 AM script INFO: SUCCESS!@#KODE 1!@#USER_ID 5!@#ACTIVITY_CODE 5
12/12/2022 01:45:45 AM script INFO: SUCCESS!@#KODE 1!@#USER_ID 5!@#ACTIVITY_CODE 2
12/12/2022 01:45:46 AM script INFO: SUCCESS!@#KODE 1!@#USER_ID 5!@#ACTIVITY_CODE 1
12/12/2022 01:45:46 AM script INFO: SUCCESS!@#KODE 1!@#USER_ID 5!@#ACTIVITY_CODE 5
12/12/2022 01:45:46 AM script INFO: SUCCESS!@#KODE 1!@#USER_ID 5!@#ACTIVITY_CODE 5
12/12/2022 01:45:48 AM script INFO: SUCCESS!@#KODE 1!@#USER_ID 5!@#ACTIVITY_CODE 1
12/12/2022 01:45:48 AM script INFO: SUCCESS!@#KODE 1!@#USER_ID 5!@#ACTIVITY_CODE 2
12/12/2022 01:45:48 AM script INFO: SUCCESS!@#KODE 1!@#USER_ID 5!@#ACTIVITY_CODE 2
12/12/2022 01:45:49 AM script INFO: SUCCESS!@#KODE 1!@#USER_ID 5!@#ACTIVITY_CODE 1
12/12/2022 01:45:49 AM script INFO: SUCCESS!@#KODE 1!@#USER_ID 5!@#ACTIVITY_CODE 1
12/12/2022 01:45:49 AM script INFO: SUCCESS!@#KODE 1!@#USER_ID 5!@#ACTIVITY_CODE 3
12/12/2022 01:45:49 AM script INFO: SUCCESS!@#KODE 1!@#USER_ID 5!@#ACTIVITY_CODE 4
12/12/2022 01:45:49 AM script INFO: SUCCESS!@#KODE 1!@#USER_ID 5!@#ACTIVITY_CODE 2
12/12/2022 01:45:49 AM script INFO: SUCCESS!@#KODE 1!@#USER_ID 5!@#ACTIVITY_CODE 5
12/12/2022 01:45:49 AM script INFO: SUCCESS!@#KODE 1!@#USER_ID 5!@#ACTIVITY_CODE 5
12/12/2022 01:45:51 AM script INFO: SUCCESS!@#KODE 1!@#USER_ID 5!@#ACTIVITY_CODE 5
12/12/2022 01:45:51 AM script INFO: SUCCESS!@#KODE 1!@#USER_ID 5!@#ACTIVITY_CODE 5
12/12/2022 01:45:54 AM script INFO: SUCCESS!@#KODE 1!@#USER_ID 5!@#ACTIVITY_CODE 1
12/12/2022 01:45:54 AM script INFO: SUCCESS!@#KODE 1!@#USER_ID 5!@#ACTIVITY_CODE 5
12/12/2022 01:45:54 AM script INFO: SUCCESS!@#KODE 1!@#USER_ID 5!@#ACTIVITY_CODE 5
12/12/2022 01:45:57 AM script INFO: SUCCESS!@#KODE 1!@#USER_ID 5!@#ACTIVITY_CODE 2
12/12/2022 01:45:57 AM script INFO: SUCCESS!@#KODE 1!@#USER_ID 5!@#ACTIVITY_CODE 5
12/12/2022 01:45:57 AM script INFO: SUCCESS!@#KODE 1!@#USER_ID 5!@#ACTIVITY_CODE 5
12/12/2022 01:45:59 AM script INFO: SUCCESS!@#KODE 1!@#USER_ID 5!@#ACTIVITY_CODE 3
12/12/2022 01:45:59 AM script INFO: SUCCESS!@#KODE 1!@#USER_ID 5!@#ACTIVITY_CODE 5
12/12/2022 01:45:59 AM script INFO: SUCCESS!@#KODE 1!@#USER_ID 5!@#ACTIVITY_CODE 5
12/12/2022 01:46:02 AM script INFO: SUCCESS!@#KODE 1!@#USER_ID 5!@#ACTIVITY_CODE 4
12/12/2022 01:46:02 AM script INFO: SUCCESS!@#KODE 1!@#USER_ID 5!@#ACTIVITY_CODE 3
12/12/2022 01:46:02 AM script INFO: SUCCESS!@#KODE 1!@#USER_ID 5!@#ACTIVITY_CODE 3
12/12/2022 01:46:02 AM script INFO: SUCCESS!@#KODE 1!@#USER_ID 5!@#ACTIVITY_CODE 1
12/12/2022 01:46:02 AM script INFO: SUCCESS!@#KODE 1!@#USER_ID 5!@#ACTIVITY_CODE 2
12/12/2022 01:46:02 AM script INFO: SUCCESS!@#KODE 1!@#USER_ID 5!@#ACTIVITY_CODE 4
12/12/2022 01:46:02 AM script INFO: SUCCESS!@#KODE 1!@#USER_ID 5!@#ACTIVITY_CODE 1
12/12/2022 01:46:02 AM script INFO: SUCCESS!@#KODE 1!@#USER_ID 5!@#ACTIVITY_CODE 5
12/12/2022 01:46:02 AM script INFO: SUCCESS!@#KODE 1!@#USER_ID 5!@#ACTIVITY_CODE 5
12/12/2022 01:46:05 AM script INFO: SUCCESS!@#KODE 1!@#USER_ID 5!@#ACTIVITY_CODE 3
12/12/2022 01:46:05 AM script INFO: SUCCESS!@#KODE 1!@#USER_ID 5!@#ACTIVITY_CODE 3
12/12/2022 01:46:05 AM script INFO: SUCCESS!@#KODE 1!@#USER_ID 5!@#ACTIVITY_CODE 4
12/12/2022 01:46:05 AM script INFO: SUCCESS!@#KODE 1!@#USER_ID 5!@#ACTIVITY_CODE 3
12/12/2022 01:46:05 AM script INFO: SUCCESS!@#KODE 1!@#USER_ID 5!@#ACTIVITY_CODE 1
12/12/2022 01:46:05 AM script INFO: SUCCESS!@#KODE 1!@#USER_ID 5!@#ACTIVITY_CODE 2
12/12/2022 01:46:05 AM script INFO: SUCCESS!@#KODE 1!@#USER_ID 5!@#ACTIVITY_CODE 4
12/12/2022 01:46:05 AM script INFO: SUCCESS!@#KODE 1!@#USER_ID 5!@#ACTIVITY_CODE 3
12/12/2022 01:46:05 AM script INFO: SUCCESS!@#KODE 1!@#USER_ID 5!@#ACTIVITY_CODE 2
12/12/2022 01:46:06 AM script INFO: SUCCESS!@#KODE 1!@#USER_ID 5!@#ACTIVITY_CODE 3
12/12/2022 01:46:06 AM script INFO: SUCCESS!@#KODE 1!@#USER_ID 5!@#ACTIVITY_CODE 2
12/12/2022 01:46:06 AM script INFO: SUCCESS!@#KODE 1!@#USER_ID 5!@#ACTIVITY_CODE 2
12/12/2022 01:46:06 AM script INFO: SUCCESS!@#KODE 1!@#USER_ID 5!@#ACTIVITY_CODE 3
12/12/2022 01:46:06 AM script INFO: SUCCESS!@#KODE 1!@#USER_ID 5!@#ACTIVITY_CODE 3
12/12/2022 01:46:06 AM script INFO: SUCCESS!@#KODE 1!@#USER_ID 5!@#ACTIVITY_CODE 2
12/12/2022 01:46:06 AM script INFO: SUCCESS!@#KODE 1!@#USER_ID 5!@#ACTIVITY_CODE 1
12/12/2022 01:46:06 AM script INFO: SUCCESS!@#KODE 1!@#USER_ID 5!@#ACTIVITY_CODE 3
12/12/2022 01:46:06 AM script INFO: SUCCESS!@#KODE 1!@#USER_ID 5!@#ACTIVITY_CODE 3
12/12/2022 01:46:06 AM script INFO: SUCCESS!@#KODE 1!@#USER_ID 5!@#ACTIVITY_CODE 1
12/12/2022 01:46:06 AM script INFO: SUCCESS!@#KODE 1!@#USER_ID 5!@#ACTIVITY_CODE 2
12/12/2022 01:46:06 AM script INFO: SUCCESS!@#KODE 1!@#USER_ID 5!@#ACTIVITY_CODE 1
12/12/2022 01:46:06 AM script INFO: SUCCESS!@#KODE 1!@#USER_ID 5!@#ACTIVITY_CODE 3
12/12/2022 01:46:06 AM script INFO: SUCCESS!@#KODE 1!@#USER_ID 5!@#ACTIVITY_CODE 4
12/12/2022 01:46:06 AM script INFO: SUCCESS!@#KODE 1!@#USER_ID 5!@#ACTIVITY_CODE 3
12/12/2022 01:46:07 AM script INFO: SUCCESS!@#KODE 1!@#USER_ID 5!@#ACTIVITY_CODE 3
12/12/2022 01:46:07 AM script INFO: SUCCESS!@#KODE 1!@#USER_ID 5!@#ACTIVITY_CODE 2
12/12/2022 01:46:07 AM script INFO: SUCCESS!@#KODE 1!@#USER_ID 5!@#ACTIVITY_CODE 2
12/12/2022 01:46:07 AM script INFO: SUCCESS!@#KODE 1!@#USER_ID 5!@#ACTIVITY_CODE 2
12/12/2022 01:46:07 AM script INFO: SUCCESS!@#KODE 1!@#USER_ID 5!@#ACTIVITY_CODE 4
12/12/2022 01:46:07 AM script INFO: SUCCESS!@#KODE 1!@#USER_ID 5!@#ACTIVITY_CODE 1
12/12/2022 01:46:07 AM script INFO: SUCCESS!@#KODE 1!@#USER_ID 5!@#ACTIVITY_CODE 4
12/12/2022 01:46:07 AM script INFO: SUCCESS!@#KODE 1!@#USER_ID 5!@#ACTIVITY_CODE 3
12/12/2022 01:46:07 AM script INFO: SUCCESS!@#KODE 1!@#USER_ID 5!@#ACTIVITY_CODE 3
12/12/2022 01:46:07 AM script INFO: SUCCESS!@#KODE 1!@#USER_ID 5!@#ACTIVITY_CODE 2
12/12/2022 01:46:07 AM script INFO: SUCCESS!@#KODE 1!@#USER_ID 5!@#ACTIVITY_CODE 2
12/12/2022 01:46:07 AM script INFO: SUCCESS!@#KODE 1!@#USER_ID 5!@#ACTIVITY_CODE 2
12/12/2022 01:46:08 AM script INFO: SUCCESS!@#KODE 1!@#USER_ID 5!@#ACTIVITY_CODE 3
12/12/2022 01:46:08 AM script INFO: SUCCESS!@#KODE 1!@#USER_ID 5!@#ACTIVITY_CODE 3
12/12/2022 01:46:08 AM script INFO: SUCCESS!@#KODE 1!@#USER_ID 5!@#ACTIVITY_CODE 2
12/12/2022 01:46:08 AM script INFO: SUCCESS!@#KODE 1!@#USER_ID 5!@#ACTIVITY_CODE 1
12/12/2022 01:46:08 AM script INFO: SUCCESS!@#KODE 1!@#USER_ID 5!@#ACTIVITY_CODE 3
12/12/2022 01:46:08 AM script INFO: SUCCESS!@#KODE 1!@#USER_ID 5!@#ACTIVITY_CODE 3
12/12/2022 01:46:08 AM script INFO: SUCCESS!@#KODE 1!@#USER_ID 5!@#ACTIVITY_CODE 1
12/12/2022 01:46:08 AM script INFO: SUCCESS!@#KODE 1!@#USER_ID 5!@#ACTIVITY_CODE 4
12/12/2022 01:46:08 AM script INFO: SUCCESS!@#KODE 1!@#USER_ID 5!@#ACTIVITY_CODE 3
12/12/2022 01:46:08 AM script INFO: SUCCESS!@#KODE 1!@#USER_ID 5!@#ACTIVITY_CODE 1
12/12/2022 01:46:08 AM script INFO: SUCCESS!@#KODE 1!@#USER_ID 5!@#ACTIVITY_CODE 1
12/12/2022 01:46:08 AM script INFO: SUCCESS!@#KODE 1!@#USER_ID 5!@#ACTIVITY_CODE 2
12/12/2022 01:46:08 AM script INFO: SUCCESS!@#KODE 1!@#USER_ID 5!@#ACTIVITY_CODE 3
12/12/2022 01:46:08 AM script INFO: SUCCESS!@#KODE 1!@#USER_ID 5!@#ACTIVITY_CODE 3
12/12/2022 01:46:08 AM script INFO: Duration: 34.037195444107056
12/12/2022 01:46:08 AM script INFO: mengakhiri-quiz
12/12/2022 01:46:09 AM script INFO: SUCCESS!@#KODE 1!@#USER_ID 5!@#ACTIVITY_CODE 5
12/12/2022 01:46:09 AM script INFO: berhasil-submit
