12/12/2022 01:32:05 AM script INFO: Prepared chrome options..
12/12/2022 01:32:07 AM script INFO: Initialized chrome browser..
12/12/2022 01:32:07 AM script INFO: mengakses-homepage
12/12/2022 01:32:33 AM script INFO: mengakses-login-page
12/12/2022 01:32:35 AM script INFO: mengakses-site-home
12/12/2022 01:32:35 AM script INFO: mengakses-site-course
12/12/2022 01:32:36 AM script INFO: mengakses-quiz
12/12/2022 01:32:36 AM script INFO: mengakses-start-quiz-page
12/12/2022 01:32:37 AM script INFO: memulai-quiz
12/12/2022 01:32:37 AM script INFO: SUCCESS!@#KODE 1!@#USER_ID 36!@#ACTIVITY_CODE 5
12/12/2022 01:32:48 AM script INFO: SUCCESS!@#KODE 1!@#USER_ID 36!@#ACTIVITY_CODE 5
12/12/2022 01:32:48 AM script INFO: SUCCESS!@#KODE 1!@#USER_ID 36!@#ACTIVITY_CODE 5
12/12/2022 01:32:51 AM script INFO: SUCCESS!@#KODE 1!@#USER_ID 36!@#ACTIVITY_CODE 5
12/12/2022 01:32:51 AM script INFO: SUCCESS!@#KODE 1!@#USER_ID 36!@#ACTIVITY_CODE 5
12/12/2022 01:32:53 AM script INFO: SUCCESS!@#KODE 1!@#USER_ID 36!@#ACTIVITY_CODE 5
12/12/2022 01:32:53 AM script INFO: SUCCESS!@#KODE 1!@#USER_ID 36!@#ACTIVITY_CODE 5
12/12/2022 01:32:56 AM script INFO: SUCCESS!@#KODE 1!@#USER_ID 36!@#ACTIVITY_CODE 3
12/12/2022 01:32:56 AM script INFO: SUCCESS!@#KODE 1!@#USER_ID 36!@#ACTIVITY_CODE 2
12/12/2022 01:32:56 AM script INFO: SUCCESS!@#KODE 1!@#USER_ID 36!@#ACTIVITY_CODE 3
12/12/2022 01:32:56 AM script INFO: SUCCESS!@#KODE 1!@#USER_ID 36!@#ACTIVITY_CODE 5
12/12/2022 01:32:56 AM script INFO: SUCCESS!@#KODE 1!@#USER_ID 36!@#ACTIVITY_CODE 5
12/12/2022 01:32:59 AM script INFO: SUCCESS!@#KODE 1!@#USER_ID 36!@#ACTIVITY_CODE 5
12/12/2022 01:32:59 AM script INFO: SUCCESS!@#KODE 1!@#USER_ID 36!@#ACTIVITY_CODE 5
12/12/2022 01:33:01 AM script INFO: SUCCESS!@#KODE 1!@#USER_ID 36!@#ACTIVITY_CODE 5
12/12/2022 01:33:01 AM script INFO: SUCCESS!@#KODE 1!@#USER_ID 36!@#ACTIVITY_CODE 5
12/12/2022 01:33:04 AM script INFO: SUCCESS!@#KODE 1!@#USER_ID 36!@#ACTIVITY_CODE 2
12/12/2022 01:33:04 AM script INFO: SUCCESS!@#KODE 1!@#USER_ID 36!@#ACTIVITY_CODE 3
12/12/2022 01:33:04 AM script INFO: SUCCESS!@#KODE 1!@#USER_ID 36!@#ACTIVITY_CODE 1
12/12/2022 01:33:04 AM script INFO: SUCCESS!@#KODE 1!@#USER_ID 36!@#ACTIVITY_CODE 5
12/12/2022 01:33:04 AM script INFO: SUCCESS!@#KODE 1!@#USER_ID 36!@#ACTIVITY_CODE 5
12/12/2022 01:33:06 AM script INFO: SUCCESS!@#KODE 1!@#USER_ID 36!@#ACTIVITY_CODE 3
12/12/2022 01:33:06 AM script INFO: SUCCESS!@#KODE 1!@#USER_ID 36!@#ACTIVITY_CODE 3
12/12/2022 01:33:06 AM script INFO: SUCCESS!@#KODE 1!@#USER_ID 36!@#ACTIVITY_CODE 5
12/12/2022 01:33:06 AM script INFO: SUCCESS!@#KODE 1!@#USER_ID 36!@#ACTIVITY_CODE 5
12/12/2022 01:33:09 AM script INFO: SUCCESS!@#KODE 1!@#USER_ID 36!@#ACTIVITY_CODE 3
12/12/2022 01:33:09 AM script INFO: SUCCESS!@#KODE 1!@#USER_ID 36!@#ACTIVITY_CODE 2
12/12/2022 01:33:09 AM script INFO: SUCCESS!@#KODE 1!@#USER_ID 36!@#ACTIVITY_CODE 3
12/12/2022 01:33:09 AM script INFO: SUCCESS!@#KODE 1!@#USER_ID 36!@#ACTIVITY_CODE 5
12/12/2022 01:33:09 AM script INFO: SUCCESS!@#KODE 1!@#USER_ID 36!@#ACTIVITY_CODE 5
12/12/2022 01:33:12 AM script INFO: SUCCESS!@#KODE 1!@#USER_ID 36!@#ACTIVITY_CODE 3
12/12/2022 01:33:12 AM script INFO: SUCCESS!@#KODE 1!@#USER_ID 36!@#ACTIVITY_CODE 2
12/12/2022 01:33:12 AM script INFO: SUCCESS!@#KODE 1!@#USER_ID 36!@#ACTIVITY_CODE 1
12/12/2022 01:33:12 AM script INFO: SUCCESS!@#KODE 1!@#USER_ID 36!@#ACTIVITY_CODE 3
12/12/2022 01:33:12 AM script INFO: SUCCESS!@#KODE 1!@#USER_ID 36!@#ACTIVITY_CODE 2
12/12/2022 01:33:12 AM script INFO: SUCCESS!@#KODE 1!@#USER_ID 36!@#ACTIVITY_CODE 5
12/12/2022 01:33:12 AM script INFO: SUCCESS!@#KODE 1!@#USER_ID 36!@#ACTIVITY_CODE 5
12/12/2022 01:33:15 AM script INFO: SUCCESS!@#KODE 1!@#USER_ID 36!@#ACTIVITY_CODE 5
12/12/2022 01:33:15 AM script INFO: SUCCESS!@#KODE 1!@#USER_ID 36!@#ACTIVITY_CODE 5
12/12/2022 01:33:17 AM script INFO: SUCCESS!@#KODE 1!@#USER_ID 36!@#ACTIVITY_CODE 3
12/12/2022 01:33:18 AM script INFO: SUCCESS!@#KODE 1!@#USER_ID 36!@#ACTIVITY_CODE 2
12/12/2022 01:33:18 AM script INFO: SUCCESS!@#KODE 1!@#USER_ID 36!@#ACTIVITY_CODE 1
12/12/2022 01:33:18 AM script INFO: SUCCESS!@#KODE 1!@#USER_ID 36!@#ACTIVITY_CODE 4
12/12/2022 01:33:18 AM script INFO: SUCCESS!@#KODE 1!@#USER_ID 36!@#ACTIVITY_CODE 3
12/12/2022 01:33:18 AM script INFO: SUCCESS!@#KODE 1!@#USER_ID 36!@#ACTIVITY_CODE 1
12/12/2022 01:33:18 AM script INFO: SUCCESS!@#KODE 1!@#USER_ID 36!@#ACTIVITY_CODE 3
12/12/2022 01:33:18 AM script INFO: SUCCESS!@#KODE 1!@#USER_ID 36!@#ACTIVITY_CODE 1
12/12/2022 01:33:18 AM script INFO: SUCCESS!@#KODE 1!@#USER_ID 36!@#ACTIVITY_CODE 5
12/12/2022 01:33:18 AM script INFO: SUCCESS!@#KODE 1!@#USER_ID 36!@#ACTIVITY_CODE 5
12/12/2022 01:33:21 AM script INFO: SUCCESS!@#KODE 1!@#USER_ID 36!@#ACTIVITY_CODE 2
12/12/2022 01:33:21 AM script INFO: SUCCESS!@#KODE 1!@#USER_ID 36!@#ACTIVITY_CODE 2
12/12/2022 01:33:21 AM script INFO: SUCCESS!@#KODE 1!@#USER_ID 36!@#ACTIVITY_CODE 3
12/12/2022 01:33:21 AM script INFO: SUCCESS!@#KODE 1!@#USER_ID 36!@#ACTIVITY_CODE 1
12/12/2022 01:33:21 AM script INFO: SUCCESS!@#KODE 1!@#USER_ID 36!@#ACTIVITY_CODE 3
12/12/2022 01:33:21 AM script INFO: SUCCESS!@#KODE 1!@#USER_ID 36!@#ACTIVITY_CODE 2
12/12/2022 01:33:21 AM script INFO: SUCCESS!@#KODE 1!@#USER_ID 36!@#ACTIVITY_CODE 1
12/12/2022 01:33:21 AM script INFO: SUCCESS!@#KODE 1!@#USER_ID 36!@#ACTIVITY_CODE 4
12/12/2022 01:33:22 AM script INFO: SUCCESS!@#KODE 1!@#USER_ID 36!@#ACTIVITY_CODE 2
12/12/2022 01:33:22 AM script INFO: SUCCESS!@#KODE 1!@#USER_ID 36!@#ACTIVITY_CODE 5
12/12/2022 01:33:22 AM script INFO: SUCCESS!@#KODE 1!@#USER_ID 36!@#ACTIVITY_CODE 5
12/12/2022 01:33:24 AM script INFO: SUCCESS!@#KODE 1!@#USER_ID 36!@#ACTIVITY_CODE 3
12/12/2022 01:33:24 AM script INFO: SUCCESS!@#KODE 1!@#USER_ID 36!@#ACTIVITY_CODE 2
12/12/2022 01:33:24 AM script INFO: SUCCESS!@#KODE 1!@#USER_ID 36!@#ACTIVITY_CODE 1
12/12/2022 01:33:25 AM script INFO: SUCCESS!@#KODE 1!@#USER_ID 36!@#ACTIVITY_CODE 2
12/12/2022 01:33:25 AM script INFO: SUCCESS!@#KODE 1!@#USER_ID 36!@#ACTIVITY_CODE 1
12/12/2022 01:33:25 AM script INFO: SUCCESS!@#KODE 1!@#USER_ID 36!@#ACTIVITY_CODE 4
12/12/2022 01:33:25 AM script INFO: SUCCESS!@#KODE 1!@#USER_ID 36!@#ACTIVITY_CODE 2
12/12/2022 01:33:25 AM script INFO: SUCCESS!@#KODE 1!@#USER_ID 36!@#ACTIVITY_CODE 5
12/12/2022 01:33:25 AM script INFO: SUCCESS!@#KODE 1!@#USER_ID 36!@#ACTIVITY_CODE 5
12/12/2022 01:33:28 AM script INFO: SUCCESS!@#KODE 1!@#USER_ID 36!@#ACTIVITY_CODE 2
12/12/2022 01:33:28 AM script INFO: SUCCESS!@#KODE 1!@#USER_ID 36!@#ACTIVITY_CODE 3
12/12/2022 01:33:28 AM script INFO: SUCCESS!@#KODE 1!@#USER_ID 36!@#ACTIVITY_CODE 2
12/12/2022 01:33:28 AM script INFO: SUCCESS!@#KODE 1!@#USER_ID 36!@#ACTIVITY_CODE 1
12/12/2022 01:33:28 AM script INFO: SUCCESS!@#KODE 1!@#USER_ID 36!@#ACTIVITY_CODE 2
12/12/2022 01:33:28 AM script INFO: SUCCESS!@#KODE 1!@#USER_ID 36!@#ACTIVITY_CODE 5
12/12/2022 01:33:28 AM script INFO: SUCCESS!@#KODE 1!@#USER_ID 36!@#ACTIVITY_CODE 5
12/12/2022 01:33:31 AM script INFO: SUCCESS!@#KODE 1!@#USER_ID 36!@#ACTIVITY_CODE 1
12/12/2022 01:33:31 AM script INFO: SUCCESS!@#KODE 1!@#USER_ID 36!@#ACTIVITY_CODE 3
12/12/2022 01:33:31 AM script INFO: SUCCESS!@#KODE 1!@#USER_ID 36!@#ACTIVITY_CODE 5
12/12/2022 01:33:31 AM script INFO: SUCCESS!@#KODE 1!@#USER_ID 36!@#ACTIVITY_CODE 5
12/12/2022 01:33:33 AM script INFO: SUCCESS!@#KODE 1!@#USER_ID 36!@#ACTIVITY_CODE 4
12/12/2022 01:33:33 AM script INFO: SUCCESS!@#KODE 1!@#USER_ID 36!@#ACTIVITY_CODE 1
12/12/2022 01:33:33 AM script INFO: SUCCESS!@#KODE 1!@#USER_ID 36!@#ACTIVITY_CODE 4
12/12/2022 01:33:33 AM script INFO: SUCCESS!@#KODE 1!@#USER_ID 36!@#ACTIVITY_CODE 3
12/12/2022 01:33:34 AM script INFO: SUCCESS!@#KODE 1!@#USER_ID 36!@#ACTIVITY_CODE 2
12/12/2022 01:33:34 AM script INFO: SUCCESS!@#KODE 1!@#USER_ID 36!@#ACTIVITY_CODE 3
12/12/2022 01:33:34 AM script INFO: SUCCESS!@#KODE 1!@#USER_ID 36!@#ACTIVITY_CODE 1
12/12/2022 01:33:34 AM script INFO: SUCCESS!@#KODE 1!@#USER_ID 36!@#ACTIVITY_CODE 4
12/12/2022 01:33:34 AM script INFO: SUCCESS!@#KODE 1!@#USER_ID 36!@#ACTIVITY_CODE 2
12/12/2022 01:33:34 AM script INFO: SUCCESS!@#KODE 1!@#USER_ID 36!@#ACTIVITY_CODE 2
12/12/2022 01:33:34 AM script INFO: SUCCESS!@#KODE 1!@#USER_ID 36!@#ACTIVITY_CODE 3
12/12/2022 01:33:34 AM script INFO: SUCCESS!@#KODE 1!@#USER_ID 36!@#ACTIVITY_CODE 2
12/12/2022 01:33:35 AM script INFO: SUCCESS!@#KODE 1!@#USER_ID 36!@#ACTIVITY_CODE 1
12/12/2022 01:33:35 AM script INFO: SUCCESS!@#KODE 1!@#USER_ID 36!@#ACTIVITY_CODE 2
12/12/2022 01:33:35 AM script INFO: SUCCESS!@#KODE 1!@#USER_ID 36!@#ACTIVITY_CODE 2
12/12/2022 01:33:35 AM script INFO: SUCCESS!@#KODE 1!@#USER_ID 36!@#ACTIVITY_CODE 1
12/12/2022 01:33:35 AM script INFO: SUCCESS!@#KODE 1!@#USER_ID 36!@#ACTIVITY_CODE 3
12/12/2022 01:33:35 AM script INFO: SUCCESS!@#KODE 1!@#USER_ID 36!@#ACTIVITY_CODE 4
12/12/2022 01:33:35 AM script INFO: SUCCESS!@#KODE 1!@#USER_ID 36!@#ACTIVITY_CODE 3
12/12/2022 01:33:35 AM script INFO: SUCCESS!@#KODE 1!@#USER_ID 36!@#ACTIVITY_CODE 1
12/12/2022 01:33:35 AM script INFO: SUCCESS!@#KODE 1!@#USER_ID 36!@#ACTIVITY_CODE 3
12/12/2022 01:33:35 AM script INFO: SUCCESS!@#KODE 1!@#USER_ID 36!@#ACTIVITY_CODE 4
12/12/2022 01:33:36 AM script INFO: SUCCESS!@#KODE 1!@#USER_ID 36!@#ACTIVITY_CODE 2
12/12/2022 01:33:36 AM script INFO: SUCCESS!@#KODE 1!@#USER_ID 36!@#ACTIVITY_CODE 3
12/12/2022 01:33:36 AM script INFO: SUCCESS!@#KODE 1!@#USER_ID 36!@#ACTIVITY_CODE 3
12/12/2022 01:33:36 AM script INFO: SUCCESS!@#KODE 1!@#USER_ID 36!@#ACTIVITY_CODE 3
12/12/2022 01:33:36 AM script INFO: SUCCESS!@#KODE 1!@#USER_ID 36!@#ACTIVITY_CODE 3
12/12/2022 01:33:36 AM script INFO: SUCCESS!@#KODE 1!@#USER_ID 36!@#ACTIVITY_CODE 2
12/12/2022 01:33:36 AM script INFO: SUCCESS!@#KODE 1!@#USER_ID 36!@#ACTIVITY_CODE 3
12/12/2022 01:33:36 AM script INFO: SUCCESS!@#KODE 1!@#USER_ID 36!@#ACTIVITY_CODE 1
12/12/2022 01:33:36 AM script INFO: SUCCESS!@#KODE 1!@#USER_ID 36!@#ACTIVITY_CODE 1
12/12/2022 01:33:36 AM script INFO: SUCCESS!@#KODE 1!@#USER_ID 36!@#ACTIVITY_CODE 3
12/12/2022 01:33:36 AM script INFO: SUCCESS!@#KODE 1!@#USER_ID 36!@#ACTIVITY_CODE 4
12/12/2022 01:33:37 AM script INFO: SUCCESS!@#KODE 1!@#USER_ID 36!@#ACTIVITY_CODE 3
12/12/2022 01:33:37 AM script INFO: SUCCESS!@#KODE 1!@#USER_ID 36!@#ACTIVITY_CODE 2
12/12/2022 01:33:37 AM script INFO: SUCCESS!@#KODE 1!@#USER_ID 36!@#ACTIVITY_CODE 2
12/12/2022 01:33:37 AM script INFO: SUCCESS!@#KODE 1!@#USER_ID 36!@#ACTIVITY_CODE 3
12/12/2022 01:33:37 AM script INFO: SUCCESS!@#KODE 1!@#USER_ID 36!@#ACTIVITY_CODE 2
12/12/2022 01:33:38 AM script INFO: SUCCESS!@#KODE 1!@#USER_ID 36!@#ACTIVITY_CODE 2
12/12/2022 01:33:38 AM script INFO: SUCCESS!@#KODE 1!@#USER_ID 36!@#ACTIVITY_CODE 2
12/12/2022 01:33:38 AM script INFO: SUCCESS!@#KODE 1!@#USER_ID 36!@#ACTIVITY_CODE 1
12/12/2022 01:33:38 AM script INFO: SUCCESS!@#KODE 1!@#USER_ID 36!@#ACTIVITY_CODE 3
12/12/2022 01:33:38 AM script INFO: SUCCESS!@#KODE 1!@#USER_ID 36!@#ACTIVITY_CODE 1
12/12/2022 01:33:38 AM script INFO: SUCCESS!@#KODE 1!@#USER_ID 36!@#ACTIVITY_CODE 4
12/12/2022 01:33:38 AM script INFO: SUCCESS!@#KODE 1!@#USER_ID 36!@#ACTIVITY_CODE 2
12/12/2022 01:33:38 AM script INFO: SUCCESS!@#KODE 1!@#USER_ID 36!@#ACTIVITY_CODE 4
12/12/2022 01:33:39 AM script INFO: SUCCESS!@#KODE 1!@#USER_ID 36!@#ACTIVITY_CODE 1
12/12/2022 01:33:39 AM script INFO: SUCCESS!@#KODE 1!@#USER_ID 36!@#ACTIVITY_CODE 1
12/12/2022 01:33:39 AM script INFO: SUCCESS!@#KODE 1!@#USER_ID 36!@#ACTIVITY_CODE 4
12/12/2022 01:33:39 AM script INFO: SUCCESS!@#KODE 1!@#USER_ID 36!@#ACTIVITY_CODE 1
12/12/2022 01:33:39 AM script INFO: SUCCESS!@#KODE 1!@#USER_ID 36!@#ACTIVITY_CODE 4
12/12/2022 01:33:39 AM script INFO: SUCCESS!@#KODE 1!@#USER_ID 36!@#ACTIVITY_CODE 3
12/12/2022 01:33:39 AM script INFO: SUCCESS!@#KODE 1!@#USER_ID 36!@#ACTIVITY_CODE 3
12/12/2022 01:33:39 AM script INFO: SUCCESS!@#KODE 1!@#USER_ID 36!@#ACTIVITY_CODE 1
12/12/2022 01:33:39 AM script INFO: SUCCESS!@#KODE 1!@#USER_ID 36!@#ACTIVITY_CODE 3
12/12/2022 01:33:39 AM script INFO: SUCCESS!@#KODE 1!@#USER_ID 36!@#ACTIVITY_CODE 3
12/12/2022 01:33:40 AM script INFO: SUCCESS!@#KODE 1!@#USER_ID 36!@#ACTIVITY_CODE 4
12/12/2022 01:33:40 AM script INFO: SUCCESS!@#KODE 1!@#USER_ID 36!@#ACTIVITY_CODE 1
12/12/2022 01:33:40 AM script INFO: SUCCESS!@#KODE 1!@#USER_ID 36!@#ACTIVITY_CODE 1
12/12/2022 01:33:40 AM script INFO: SUCCESS!@#KODE 1!@#USER_ID 36!@#ACTIVITY_CODE 2
12/12/2022 01:33:40 AM script INFO: SUCCESS!@#KODE 1!@#USER_ID 36!@#ACTIVITY_CODE 3
12/12/2022 01:33:40 AM script INFO: SUCCESS!@#KODE 1!@#USER_ID 36!@#ACTIVITY_CODE 2
12/12/2022 01:33:40 AM script INFO: SUCCESS!@#KODE 1!@#USER_ID 36!@#ACTIVITY_CODE 3
12/12/2022 01:33:40 AM script INFO: SUCCESS!@#KODE 1!@#USER_ID 36!@#ACTIVITY_CODE 1
12/12/2022 01:33:40 AM script INFO: SUCCESS!@#KODE 1!@#USER_ID 36!@#ACTIVITY_CODE 1
12/12/2022 01:33:41 AM script INFO: SUCCESS!@#KODE 1!@#USER_ID 36!@#ACTIVITY_CODE 1
12/12/2022 01:33:41 AM script INFO: SUCCESS!@#KODE 1!@#USER_ID 36!@#ACTIVITY_CODE 1
12/12/2022 01:33:41 AM script INFO: SUCCESS!@#KODE 1!@#USER_ID 36!@#ACTIVITY_CODE 3
12/12/2022 01:33:41 AM script INFO: SUCCESS!@#KODE 1!@#USER_ID 36!@#ACTIVITY_CODE 1
12/12/2022 01:33:41 AM script INFO: SUCCESS!@#KODE 1!@#USER_ID 36!@#ACTIVITY_CODE 3
12/12/2022 01:33:41 AM script INFO: SUCCESS!@#KODE 1!@#USER_ID 36!@#ACTIVITY_CODE 1
12/12/2022 01:33:41 AM script INFO: SUCCESS!@#KODE 1!@#USER_ID 36!@#ACTIVITY_CODE 4
12/12/2022 01:33:41 AM script INFO: SUCCESS!@#KODE 1!@#USER_ID 36!@#ACTIVITY_CODE 1
12/12/2022 01:33:41 AM script INFO: SUCCESS!@#KODE 1!@#USER_ID 36!@#ACTIVITY_CODE 2
12/12/2022 01:33:42 AM script INFO: SUCCESS!@#KODE 1!@#USER_ID 36!@#ACTIVITY_CODE 3
12/12/2022 01:33:42 AM script INFO: SUCCESS!@#KODE 1!@#USER_ID 36!@#ACTIVITY_CODE 1
12/12/2022 01:33:42 AM script INFO: SUCCESS!@#KODE 1!@#USER_ID 36!@#ACTIVITY_CODE 2
12/12/2022 01:33:42 AM script INFO: SUCCESS!@#KODE 1!@#USER_ID 36!@#ACTIVITY_CODE 3
12/12/2022 01:33:42 AM script INFO: SUCCESS!@#KODE 1!@#USER_ID 36!@#ACTIVITY_CODE 1
12/12/2022 01:33:42 AM script INFO: SUCCESS!@#KODE 1!@#USER_ID 36!@#ACTIVITY_CODE 4
12/12/2022 01:33:42 AM script INFO: SUCCESS!@#KODE 1!@#USER_ID 36!@#ACTIVITY_CODE 1
12/12/2022 01:33:42 AM script INFO: SUCCESS!@#KODE 1!@#USER_ID 36!@#ACTIVITY_CODE 1
12/12/2022 01:33:43 AM script INFO: SUCCESS!@#KODE 1!@#USER_ID 36!@#ACTIVITY_CODE 3
12/12/2022 01:33:43 AM script INFO: SUCCESS!@#KODE 1!@#USER_ID 36!@#ACTIVITY_CODE 2
12/12/2022 01:33:43 AM script INFO: SUCCESS!@#KODE 1!@#USER_ID 36!@#ACTIVITY_CODE 3
12/12/2022 01:33:43 AM script INFO: SUCCESS!@#KODE 1!@#USER_ID 36!@#ACTIVITY_CODE 2
12/12/2022 01:33:44 AM script INFO: SUCCESS!@#KODE 1!@#USER_ID 36!@#ACTIVITY_CODE 2
12/12/2022 01:33:44 AM script INFO: SUCCESS!@#KODE 1!@#USER_ID 36!@#ACTIVITY_CODE 3
12/12/2022 01:33:44 AM script INFO: SUCCESS!@#KODE 1!@#USER_ID 36!@#ACTIVITY_CODE 3
12/12/2022 01:33:44 AM script INFO: SUCCESS!@#KODE 1!@#USER_ID 36!@#ACTIVITY_CODE 1
12/12/2022 01:33:44 AM script INFO: SUCCESS!@#KODE 1!@#USER_ID 36!@#ACTIVITY_CODE 1
12/12/2022 01:33:44 AM script INFO: SUCCESS!@#KODE 1!@#USER_ID 36!@#ACTIVITY_CODE 1
12/12/2022 01:33:44 AM script INFO: SUCCESS!@#KODE 1!@#USER_ID 36!@#ACTIVITY_CODE 4
12/12/2022 01:33:44 AM script INFO: SUCCESS!@#KODE 1!@#USER_ID 36!@#ACTIVITY_CODE 3
12/12/2022 01:33:45 AM script INFO: SUCCESS!@#KODE 1!@#USER_ID 36!@#ACTIVITY_CODE 3
12/12/2022 01:33:45 AM script INFO: SUCCESS!@#KODE 1!@#USER_ID 36!@#ACTIVITY_CODE 3
12/12/2022 01:33:45 AM script INFO: SUCCESS!@#KODE 1!@#USER_ID 36!@#ACTIVITY_CODE 1
12/12/2022 01:33:45 AM script INFO: SUCCESS!@#KODE 1!@#USER_ID 36!@#ACTIVITY_CODE 4
12/12/2022 01:33:45 AM script INFO: SUCCESS!@#KODE 1!@#USER_ID 36!@#ACTIVITY_CODE 2
12/12/2022 01:33:45 AM script INFO: SUCCESS!@#KODE 1!@#USER_ID 36!@#ACTIVITY_CODE 3
12/12/2022 01:33:45 AM script INFO: SUCCESS!@#KODE 1!@#USER_ID 36!@#ACTIVITY_CODE 1
12/12/2022 01:33:46 AM script INFO: SUCCESS!@#KODE 1!@#USER_ID 36!@#ACTIVITY_CODE 2
12/12/2022 01:33:46 AM script INFO: SUCCESS!@#KODE 1!@#USER_ID 36!@#ACTIVITY_CODE 1
12/12/2022 01:33:46 AM script INFO: SUCCESS!@#KODE 1!@#USER_ID 36!@#ACTIVITY_CODE 3
12/12/2022 01:33:46 AM script INFO: SUCCESS!@#KODE 1!@#USER_ID 36!@#ACTIVITY_CODE 2
12/12/2022 01:33:46 AM script INFO: SUCCESS!@#KODE 1!@#USER_ID 36!@#ACTIVITY_CODE 1
12/12/2022 01:33:46 AM script INFO: SUCCESS!@#KODE 1!@#USER_ID 36!@#ACTIVITY_CODE 3
12/12/2022 01:33:46 AM script INFO: SUCCESS!@#KODE 1!@#USER_ID 36!@#ACTIVITY_CODE 1
12/12/2022 01:33:47 AM script INFO: SUCCESS!@#KODE 1!@#USER_ID 36!@#ACTIVITY_CODE 2
12/12/2022 01:33:47 AM script INFO: SUCCESS!@#KODE 1!@#USER_ID 36!@#ACTIVITY_CODE 4
12/12/2022 01:33:47 AM script INFO: SUCCESS!@#KODE 1!@#USER_ID 36!@#ACTIVITY_CODE 1
12/12/2022 01:33:47 AM script INFO: SUCCESS!@#KODE 1!@#USER_ID 36!@#ACTIVITY_CODE 2
12/12/2022 01:33:47 AM script INFO: SUCCESS!@#KODE 1!@#USER_ID 36!@#ACTIVITY_CODE 2
12/12/2022 01:33:48 AM script INFO: SUCCESS!@#KODE 1!@#USER_ID 36!@#ACTIVITY_CODE 2
12/12/2022 01:33:48 AM script INFO: SUCCESS!@#KODE 1!@#USER_ID 36!@#ACTIVITY_CODE 1
12/12/2022 01:33:48 AM script INFO: SUCCESS!@#KODE 1!@#USER_ID 36!@#ACTIVITY_CODE 1
12/12/2022 01:33:48 AM script INFO: SUCCESS!@#KODE 1!@#USER_ID 36!@#ACTIVITY_CODE 1
12/12/2022 01:33:48 AM script INFO: SUCCESS!@#KODE 1!@#USER_ID 36!@#ACTIVITY_CODE 3
12/12/2022 01:33:48 AM script INFO: SUCCESS!@#KODE 1!@#USER_ID 36!@#ACTIVITY_CODE 3
12/12/2022 01:33:48 AM script INFO: SUCCESS!@#KODE 1!@#USER_ID 36!@#ACTIVITY_CODE 3
12/12/2022 01:33:48 AM script INFO: SUCCESS!@#KODE 1!@#USER_ID 36!@#ACTIVITY_CODE 4
12/12/2022 01:33:49 AM script INFO: SUCCESS!@#KODE 1!@#USER_ID 36!@#ACTIVITY_CODE 2
12/12/2022 01:33:49 AM script INFO: SUCCESS!@#KODE 1!@#USER_ID 36!@#ACTIVITY_CODE 4
12/12/2022 01:33:49 AM script INFO: SUCCESS!@#KODE 1!@#USER_ID 36!@#ACTIVITY_CODE 3
12/12/2022 01:33:49 AM script INFO: SUCCESS!@#KODE 1!@#USER_ID 36!@#ACTIVITY_CODE 2
12/12/2022 01:33:49 AM script INFO: SUCCESS!@#KODE 1!@#USER_ID 36!@#ACTIVITY_CODE 2
12/12/2022 01:33:50 AM script INFO: SUCCESS!@#KODE 1!@#USER_ID 36!@#ACTIVITY_CODE 1
12/12/2022 01:33:50 AM script INFO: SUCCESS!@#KODE 1!@#USER_ID 36!@#ACTIVITY_CODE 1
12/12/2022 01:33:50 AM script INFO: SUCCESS!@#KODE 1!@#USER_ID 36!@#ACTIVITY_CODE 2
12/12/2022 01:33:50 AM script INFO: SUCCESS!@#KODE 1!@#USER_ID 36!@#ACTIVITY_CODE 2
12/12/2022 01:33:51 AM script INFO: SUCCESS!@#KODE 1!@#USER_ID 36!@#ACTIVITY_CODE 1
12/12/2022 01:33:51 AM script INFO: SUCCESS!@#KODE 1!@#USER_ID 36!@#ACTIVITY_CODE 2
12/12/2022 01:33:51 AM script INFO: SUCCESS!@#KODE 1!@#USER_ID 36!@#ACTIVITY_CODE 3
12/12/2022 01:33:51 AM script INFO: SUCCESS!@#KODE 1!@#USER_ID 36!@#ACTIVITY_CODE 3
12/12/2022 01:33:51 AM script INFO: SUCCESS!@#KODE 1!@#USER_ID 36!@#ACTIVITY_CODE 3
12/12/2022 01:33:51 AM script INFO: SUCCESS!@#KODE 1!@#USER_ID 36!@#ACTIVITY_CODE 4
12/12/2022 01:33:52 AM script INFO: SUCCESS!@#KODE 1!@#USER_ID 36!@#ACTIVITY_CODE 2
12/12/2022 01:33:52 AM script INFO: SUCCESS!@#KODE 1!@#USER_ID 36!@#ACTIVITY_CODE 1
12/12/2022 01:33:52 AM script INFO: SUCCESS!@#KODE 1!@#USER_ID 36!@#ACTIVITY_CODE 2
12/12/2022 01:33:52 AM script INFO: SUCCESS!@#KODE 1!@#USER_ID 36!@#ACTIVITY_CODE 1
12/12/2022 01:33:52 AM script INFO: SUCCESS!@#KODE 1!@#USER_ID 36!@#ACTIVITY_CODE 2
12/12/2022 01:33:53 AM script INFO: SUCCESS!@#KODE 1!@#USER_ID 36!@#ACTIVITY_CODE 4
12/12/2022 01:33:53 AM script INFO: SUCCESS!@#KODE 1!@#USER_ID 36!@#ACTIVITY_CODE 2
12/12/2022 01:33:53 AM script INFO: SUCCESS!@#KODE 1!@#USER_ID 36!@#ACTIVITY_CODE 1
12/12/2022 01:33:53 AM script INFO: SUCCESS!@#KODE 1!@#USER_ID 36!@#ACTIVITY_CODE 3
12/12/2022 01:33:53 AM script INFO: SUCCESS!@#KODE 1!@#USER_ID 36!@#ACTIVITY_CODE 2
12/12/2022 01:33:54 AM script INFO: SUCCESS!@#KODE 1!@#USER_ID 36!@#ACTIVITY_CODE 1
12/12/2022 01:33:54 AM script INFO: SUCCESS!@#KODE 1!@#USER_ID 36!@#ACTIVITY_CODE 4
12/12/2022 01:33:54 AM script INFO: SUCCESS!@#KODE 1!@#USER_ID 36!@#ACTIVITY_CODE 1
12/12/2022 01:33:54 AM script INFO: SUCCESS!@#KODE 1!@#USER_ID 36!@#ACTIVITY_CODE 4
12/12/2022 01:33:54 AM script INFO: SUCCESS!@#KODE 1!@#USER_ID 36!@#ACTIVITY_CODE 2
12/12/2022 01:33:54 AM script INFO: SUCCESS!@#KODE 1!@#USER_ID 36!@#ACTIVITY_CODE 4
12/12/2022 01:33:55 AM script INFO: SUCCESS!@#KODE 1!@#USER_ID 36!@#ACTIVITY_CODE 3
12/12/2022 01:33:55 AM script INFO: SUCCESS!@#KODE 1!@#USER_ID 36!@#ACTIVITY_CODE 2
12/12/2022 01:33:55 AM script INFO: SUCCESS!@#KODE 1!@#USER_ID 36!@#ACTIVITY_CODE 1
12/12/2022 01:33:55 AM script INFO: SUCCESS!@#KODE 1!@#USER_ID 36!@#ACTIVITY_CODE 4
12/12/2022 01:33:55 AM script INFO: SUCCESS!@#KODE 1!@#USER_ID 36!@#ACTIVITY_CODE 1
12/12/2022 01:33:55 AM script INFO: SUCCESS!@#KODE 1!@#USER_ID 36!@#ACTIVITY_CODE 1
12/12/2022 01:33:56 AM script INFO: SUCCESS!@#KODE 1!@#USER_ID 36!@#ACTIVITY_CODE 2
12/12/2022 01:33:56 AM script INFO: SUCCESS!@#KODE 1!@#USER_ID 36!@#ACTIVITY_CODE 1
12/12/2022 01:33:56 AM script INFO: SUCCESS!@#KODE 1!@#USER_ID 36!@#ACTIVITY_CODE 2
12/12/2022 01:33:56 AM script INFO: SUCCESS!@#KODE 1!@#USER_ID 36!@#ACTIVITY_CODE 2
12/12/2022 01:33:56 AM script INFO: SUCCESS!@#KODE 1!@#USER_ID 36!@#ACTIVITY_CODE 1
12/12/2022 01:33:56 AM script INFO: SUCCESS!@#KODE 1!@#USER_ID 36!@#ACTIVITY_CODE 1
12/12/2022 01:33:56 AM script INFO: SUCCESS!@#KODE 1!@#USER_ID 36!@#ACTIVITY_CODE 1
12/12/2022 01:33:57 AM script INFO: SUCCESS!@#KODE 1!@#USER_ID 36!@#ACTIVITY_CODE 2
12/12/2022 01:33:57 AM script INFO: SUCCESS!@#KODE 1!@#USER_ID 36!@#ACTIVITY_CODE 3
12/12/2022 01:33:57 AM script INFO: SUCCESS!@#KODE 1!@#USER_ID 36!@#ACTIVITY_CODE 3
12/12/2022 01:33:57 AM script INFO: SUCCESS!@#KODE 1!@#USER_ID 36!@#ACTIVITY_CODE 2
12/12/2022 01:33:57 AM script INFO: Duration: 69.11897611618042
12/12/2022 01:33:57 AM script INFO: mengakhiri-quiz
12/12/2022 01:34:07 AM script INFO: SUCCESS!@#KODE 1!@#USER_ID 36!@#ACTIVITY_CODE 5
12/12/2022 01:34:07 AM script INFO: berhasil-submit
