12/21/2022 02:41:06 PM script INFO: Prepared chrome options..
12/21/2022 02:41:07 PM script INFO: Initialized chrome browser..
12/21/2022 02:41:07 PM script INFO: mengakses-homepage
12/21/2022 02:41:31 PM script INFO: mengakses-login-page
12/21/2022 02:41:32 PM script INFO: mengakses-site-home
12/21/2022 02:41:32 PM script INFO: mengakses-site-course
12/21/2022 02:41:33 PM script INFO: mengakses-quiz
12/21/2022 02:41:34 PM script INFO: mengakses-start-quiz-page
12/21/2022 02:41:35 PM script INFO: memulai-quiz
12/21/2022 02:41:35 PM script INFO: SUCCESS!@#KODE 1!@#USER_ID 90!@#ACTIVITY_CODE 5
12/21/2022 02:41:46 PM script INFO: SUCCESS!@#KODE 1!@#USER_ID 90!@#ACTIVITY_CODE 3
12/21/2022 02:41:46 PM script INFO: SUCCESS!@#KODE 1!@#USER_ID 90!@#ACTIVITY_CODE 2
12/21/2022 02:41:46 PM script INFO: SUCCESS!@#KODE 1!@#USER_ID 90!@#ACTIVITY_CODE 5
12/21/2022 02:41:46 PM script INFO: SUCCESS!@#KODE 1!@#USER_ID 90!@#ACTIVITY_CODE 5
12/21/2022 02:41:48 PM script INFO: SUCCESS!@#KODE 1!@#USER_ID 90!@#ACTIVITY_CODE 2
12/21/2022 02:41:48 PM script INFO: SUCCESS!@#KODE 1!@#USER_ID 90!@#ACTIVITY_CODE 1
12/21/2022 02:41:48 PM script INFO: SUCCESS!@#KODE 1!@#USER_ID 90!@#ACTIVITY_CODE 5
12/21/2022 02:41:48 PM script INFO: SUCCESS!@#KODE 1!@#USER_ID 90!@#ACTIVITY_CODE 5
12/21/2022 02:41:51 PM script INFO: SUCCESS!@#KODE 1!@#USER_ID 90!@#ACTIVITY_CODE 5
12/21/2022 02:41:51 PM script INFO: SUCCESS!@#KODE 1!@#USER_ID 90!@#ACTIVITY_CODE 5
12/21/2022 02:41:54 PM script INFO: SUCCESS!@#KODE 1!@#USER_ID 90!@#ACTIVITY_CODE 3
12/21/2022 02:41:54 PM script INFO: SUCCESS!@#KODE 1!@#USER_ID 90!@#ACTIVITY_CODE 1
12/21/2022 02:41:54 PM script INFO: SUCCESS!@#KODE 1!@#USER_ID 90!@#ACTIVITY_CODE 3
12/21/2022 02:41:54 PM script INFO: SUCCESS!@#KODE 1!@#USER_ID 90!@#ACTIVITY_CODE 5
12/21/2022 02:41:54 PM script INFO: SUCCESS!@#KODE 1!@#USER_ID 90!@#ACTIVITY_CODE 5
12/21/2022 02:41:56 PM script INFO: SUCCESS!@#KODE 1!@#USER_ID 90!@#ACTIVITY_CODE 5
12/21/2022 02:41:56 PM script INFO: SUCCESS!@#KODE 1!@#USER_ID 90!@#ACTIVITY_CODE 5
12/21/2022 02:41:59 PM script INFO: SUCCESS!@#KODE 1!@#USER_ID 90!@#ACTIVITY_CODE 1
12/21/2022 02:41:59 PM script INFO: SUCCESS!@#KODE 1!@#USER_ID 90!@#ACTIVITY_CODE 5
12/21/2022 02:41:59 PM script INFO: SUCCESS!@#KODE 1!@#USER_ID 90!@#ACTIVITY_CODE 5
12/21/2022 02:42:01 PM script INFO: SUCCESS!@#KODE 1!@#USER_ID 90!@#ACTIVITY_CODE 2
12/21/2022 02:42:02 PM script INFO: SUCCESS!@#KODE 1!@#USER_ID 90!@#ACTIVITY_CODE 3
12/21/2022 02:42:02 PM script INFO: SUCCESS!@#KODE 1!@#USER_ID 90!@#ACTIVITY_CODE 5
12/21/2022 02:42:02 PM script INFO: SUCCESS!@#KODE 1!@#USER_ID 90!@#ACTIVITY_CODE 5
12/21/2022 02:42:04 PM script INFO: SUCCESS!@#KODE 1!@#USER_ID 90!@#ACTIVITY_CODE 3
12/21/2022 02:42:04 PM script INFO: SUCCESS!@#KODE 1!@#USER_ID 90!@#ACTIVITY_CODE 3
12/21/2022 02:42:04 PM script INFO: SUCCESS!@#KODE 1!@#USER_ID 90!@#ACTIVITY_CODE 5
12/21/2022 02:42:04 PM script INFO: SUCCESS!@#KODE 1!@#USER_ID 90!@#ACTIVITY_CODE 5
12/21/2022 02:42:07 PM script INFO: SUCCESS!@#KODE 1!@#USER_ID 90!@#ACTIVITY_CODE 2
12/21/2022 02:42:07 PM script INFO: SUCCESS!@#KODE 1!@#USER_ID 90!@#ACTIVITY_CODE 2
12/21/2022 02:42:07 PM script INFO: SUCCESS!@#KODE 1!@#USER_ID 90!@#ACTIVITY_CODE 2
12/21/2022 02:42:07 PM script INFO: SUCCESS!@#KODE 1!@#USER_ID 90!@#ACTIVITY_CODE 2
12/21/2022 02:42:07 PM script INFO: SUCCESS!@#KODE 1!@#USER_ID 90!@#ACTIVITY_CODE 5
12/21/2022 02:42:07 PM script INFO: SUCCESS!@#KODE 1!@#USER_ID 90!@#ACTIVITY_CODE 5
12/21/2022 02:42:10 PM script INFO: SUCCESS!@#KODE 1!@#USER_ID 90!@#ACTIVITY_CODE 1
12/21/2022 02:42:10 PM script INFO: SUCCESS!@#KODE 1!@#USER_ID 90!@#ACTIVITY_CODE 5
12/21/2022 02:42:10 PM script INFO: SUCCESS!@#KODE 1!@#USER_ID 90!@#ACTIVITY_CODE 5
12/21/2022 02:42:12 PM script INFO: SUCCESS!@#KODE 1!@#USER_ID 90!@#ACTIVITY_CODE 2
12/21/2022 02:42:13 PM script INFO: SUCCESS!@#KODE 1!@#USER_ID 90!@#ACTIVITY_CODE 3
12/21/2022 02:42:13 PM script INFO: SUCCESS!@#KODE 1!@#USER_ID 90!@#ACTIVITY_CODE 5
12/21/2022 02:42:13 PM script INFO: SUCCESS!@#KODE 1!@#USER_ID 90!@#ACTIVITY_CODE 5
12/21/2022 02:42:15 PM script INFO: SUCCESS!@#KODE 1!@#USER_ID 90!@#ACTIVITY_CODE 5
12/21/2022 02:42:15 PM script INFO: SUCCESS!@#KODE 1!@#USER_ID 90!@#ACTIVITY_CODE 5
12/21/2022 02:42:18 PM script INFO: SUCCESS!@#KODE 1!@#USER_ID 90!@#ACTIVITY_CODE 3
12/21/2022 02:42:18 PM script INFO: SUCCESS!@#KODE 1!@#USER_ID 90!@#ACTIVITY_CODE 3
12/21/2022 02:42:18 PM script INFO: SUCCESS!@#KODE 1!@#USER_ID 90!@#ACTIVITY_CODE 2
12/21/2022 02:42:18 PM script INFO: SUCCESS!@#KODE 1!@#USER_ID 90!@#ACTIVITY_CODE 5
12/21/2022 02:42:18 PM script INFO: SUCCESS!@#KODE 1!@#USER_ID 90!@#ACTIVITY_CODE 5
12/21/2022 02:42:20 PM script INFO: SUCCESS!@#KODE 1!@#USER_ID 90!@#ACTIVITY_CODE 3
12/21/2022 02:42:20 PM script INFO: SUCCESS!@#KODE 1!@#USER_ID 90!@#ACTIVITY_CODE 3
12/21/2022 02:42:20 PM script INFO: SUCCESS!@#KODE 1!@#USER_ID 90!@#ACTIVITY_CODE 5
12/21/2022 02:42:20 PM script INFO: SUCCESS!@#KODE 1!@#USER_ID 90!@#ACTIVITY_CODE 5
12/21/2022 02:42:23 PM script INFO: SUCCESS!@#KODE 1!@#USER_ID 90!@#ACTIVITY_CODE 1
12/21/2022 02:42:23 PM script INFO: SUCCESS!@#KODE 1!@#USER_ID 90!@#ACTIVITY_CODE 2
12/21/2022 02:42:23 PM script INFO: SUCCESS!@#KODE 1!@#USER_ID 90!@#ACTIVITY_CODE 5
12/21/2022 02:42:23 PM script INFO: SUCCESS!@#KODE 1!@#USER_ID 90!@#ACTIVITY_CODE 5
12/21/2022 02:42:26 PM script INFO: SUCCESS!@#KODE 1!@#USER_ID 90!@#ACTIVITY_CODE 3
12/21/2022 02:42:26 PM script INFO: SUCCESS!@#KODE 1!@#USER_ID 90!@#ACTIVITY_CODE 5
12/21/2022 02:42:26 PM script INFO: SUCCESS!@#KODE 1!@#USER_ID 90!@#ACTIVITY_CODE 5
12/21/2022 02:42:28 PM script INFO: SUCCESS!@#KODE 1!@#USER_ID 90!@#ACTIVITY_CODE 2
12/21/2022 02:42:28 PM script INFO: SUCCESS!@#KODE 1!@#USER_ID 90!@#ACTIVITY_CODE 1
12/21/2022 02:42:29 PM script INFO: SUCCESS!@#KODE 1!@#USER_ID 90!@#ACTIVITY_CODE 4
12/21/2022 02:42:29 PM script INFO: SUCCESS!@#KODE 1!@#USER_ID 90!@#ACTIVITY_CODE 3
12/21/2022 02:42:29 PM script INFO: SUCCESS!@#KODE 1!@#USER_ID 90!@#ACTIVITY_CODE 2
12/21/2022 02:42:29 PM script INFO: SUCCESS!@#KODE 1!@#USER_ID 90!@#ACTIVITY_CODE 2
12/21/2022 02:42:29 PM script INFO: SUCCESS!@#KODE 1!@#USER_ID 90!@#ACTIVITY_CODE 3
12/21/2022 02:42:29 PM script INFO: SUCCESS!@#KODE 1!@#USER_ID 90!@#ACTIVITY_CODE 3
12/21/2022 02:42:29 PM script INFO: SUCCESS!@#KODE 1!@#USER_ID 90!@#ACTIVITY_CODE 1
12/21/2022 02:42:29 PM script INFO: SUCCESS!@#KODE 1!@#USER_ID 90!@#ACTIVITY_CODE 3
12/21/2022 02:42:29 PM script INFO: SUCCESS!@#KODE 1!@#USER_ID 90!@#ACTIVITY_CODE 2
12/21/2022 02:42:29 PM script INFO: SUCCESS!@#KODE 1!@#USER_ID 90!@#ACTIVITY_CODE 3
12/21/2022 02:42:29 PM script INFO: SUCCESS!@#KODE 1!@#USER_ID 90!@#ACTIVITY_CODE 1
12/21/2022 02:42:29 PM script INFO: SUCCESS!@#KODE 1!@#USER_ID 90!@#ACTIVITY_CODE 3
12/21/2022 02:42:30 PM script INFO: SUCCESS!@#KODE 1!@#USER_ID 90!@#ACTIVITY_CODE 2
12/21/2022 02:42:30 PM script INFO: SUCCESS!@#KODE 1!@#USER_ID 90!@#ACTIVITY_CODE 1
12/21/2022 02:42:30 PM script INFO: SUCCESS!@#KODE 1!@#USER_ID 90!@#ACTIVITY_CODE 4
12/21/2022 02:42:30 PM script INFO: SUCCESS!@#KODE 1!@#USER_ID 90!@#ACTIVITY_CODE 1
12/21/2022 02:42:30 PM script INFO: SUCCESS!@#KODE 1!@#USER_ID 90!@#ACTIVITY_CODE 1
12/21/2022 02:42:30 PM script INFO: SUCCESS!@#KODE 1!@#USER_ID 90!@#ACTIVITY_CODE 4
12/21/2022 02:42:30 PM script INFO: SUCCESS!@#KODE 1!@#USER_ID 90!@#ACTIVITY_CODE 1
12/21/2022 02:42:30 PM script INFO: SUCCESS!@#KODE 1!@#USER_ID 90!@#ACTIVITY_CODE 2
12/21/2022 02:42:30 PM script INFO: SUCCESS!@#KODE 1!@#USER_ID 90!@#ACTIVITY_CODE 3
12/21/2022 02:42:30 PM script INFO: SUCCESS!@#KODE 1!@#USER_ID 90!@#ACTIVITY_CODE 1
12/21/2022 02:42:30 PM script INFO: SUCCESS!@#KODE 1!@#USER_ID 90!@#ACTIVITY_CODE 3
12/21/2022 02:42:30 PM script INFO: SUCCESS!@#KODE 1!@#USER_ID 90!@#ACTIVITY_CODE 2
12/21/2022 02:42:31 PM script INFO: SUCCESS!@#KODE 1!@#USER_ID 90!@#ACTIVITY_CODE 3
12/21/2022 02:42:31 PM script INFO: SUCCESS!@#KODE 1!@#USER_ID 90!@#ACTIVITY_CODE 3
12/21/2022 02:42:31 PM script INFO: SUCCESS!@#KODE 1!@#USER_ID 90!@#ACTIVITY_CODE 2
12/21/2022 02:42:31 PM script INFO: SUCCESS!@#KODE 1!@#USER_ID 90!@#ACTIVITY_CODE 2
12/21/2022 02:42:31 PM script INFO: SUCCESS!@#KODE 1!@#USER_ID 90!@#ACTIVITY_CODE 2
12/21/2022 02:42:31 PM script INFO: SUCCESS!@#KODE 1!@#USER_ID 90!@#ACTIVITY_CODE 2
12/21/2022 02:42:31 PM script INFO: SUCCESS!@#KODE 1!@#USER_ID 90!@#ACTIVITY_CODE 2
12/21/2022 02:42:31 PM script INFO: SUCCESS!@#KODE 1!@#USER_ID 90!@#ACTIVITY_CODE 1
12/21/2022 02:42:32 PM script INFO: SUCCESS!@#KODE 1!@#USER_ID 90!@#ACTIVITY_CODE 2
12/21/2022 02:42:32 PM script INFO: SUCCESS!@#KODE 1!@#USER_ID 90!@#ACTIVITY_CODE 2
12/21/2022 02:42:32 PM script INFO: SUCCESS!@#KODE 1!@#USER_ID 90!@#ACTIVITY_CODE 3
12/21/2022 02:42:32 PM script INFO: SUCCESS!@#KODE 1!@#USER_ID 90!@#ACTIVITY_CODE 1
12/21/2022 02:42:32 PM script INFO: SUCCESS!@#KODE 1!@#USER_ID 90!@#ACTIVITY_CODE 1
12/21/2022 02:42:32 PM script INFO: SUCCESS!@#KODE 1!@#USER_ID 90!@#ACTIVITY_CODE 1
12/21/2022 02:42:32 PM script INFO: SUCCESS!@#KODE 1!@#USER_ID 90!@#ACTIVITY_CODE 1
12/21/2022 02:42:32 PM script INFO: SUCCESS!@#KODE 1!@#USER_ID 90!@#ACTIVITY_CODE 3
12/21/2022 02:42:32 PM script INFO: SUCCESS!@#KODE 1!@#USER_ID 90!@#ACTIVITY_CODE 4
12/21/2022 02:42:32 PM script INFO: SUCCESS!@#KODE 1!@#USER_ID 90!@#ACTIVITY_CODE 2
12/21/2022 02:42:32 PM script INFO: SUCCESS!@#KODE 1!@#USER_ID 90!@#ACTIVITY_CODE 1
12/21/2022 02:42:33 PM script INFO: SUCCESS!@#KODE 1!@#USER_ID 90!@#ACTIVITY_CODE 4
12/21/2022 02:42:33 PM script INFO: SUCCESS!@#KODE 1!@#USER_ID 90!@#ACTIVITY_CODE 3
12/21/2022 02:42:33 PM script INFO: SUCCESS!@#KODE 1!@#USER_ID 90!@#ACTIVITY_CODE 3
12/21/2022 02:42:33 PM script INFO: SUCCESS!@#KODE 1!@#USER_ID 90!@#ACTIVITY_CODE 2
12/21/2022 02:42:33 PM script INFO: SUCCESS!@#KODE 1!@#USER_ID 90!@#ACTIVITY_CODE 1
12/21/2022 02:42:33 PM script INFO: SUCCESS!@#KODE 1!@#USER_ID 90!@#ACTIVITY_CODE 3
12/21/2022 02:42:33 PM script INFO: SUCCESS!@#KODE 1!@#USER_ID 90!@#ACTIVITY_CODE 2
12/21/2022 02:42:33 PM script INFO: SUCCESS!@#KODE 1!@#USER_ID 90!@#ACTIVITY_CODE 4
12/21/2022 02:42:34 PM script INFO: SUCCESS!@#KODE 1!@#USER_ID 90!@#ACTIVITY_CODE 2
12/21/2022 02:42:34 PM script INFO: SUCCESS!@#KODE 1!@#USER_ID 90!@#ACTIVITY_CODE 1
12/21/2022 02:42:34 PM script INFO: SUCCESS!@#KODE 1!@#USER_ID 90!@#ACTIVITY_CODE 3
12/21/2022 02:42:34 PM script INFO: SUCCESS!@#KODE 1!@#USER_ID 90!@#ACTIVITY_CODE 1
12/21/2022 02:42:34 PM script INFO: SUCCESS!@#KODE 1!@#USER_ID 90!@#ACTIVITY_CODE 3
12/21/2022 02:42:34 PM script INFO: SUCCESS!@#KODE 1!@#USER_ID 90!@#ACTIVITY_CODE 1
12/21/2022 02:42:34 PM script INFO: SUCCESS!@#KODE 1!@#USER_ID 90!@#ACTIVITY_CODE 3
12/21/2022 02:42:34 PM script INFO: SUCCESS!@#KODE 1!@#USER_ID 90!@#ACTIVITY_CODE 2
12/21/2022 02:42:34 PM script INFO: SUCCESS!@#KODE 1!@#USER_ID 90!@#ACTIVITY_CODE 1
12/21/2022 02:42:34 PM script INFO: SUCCESS!@#KODE 1!@#USER_ID 90!@#ACTIVITY_CODE 2
12/21/2022 02:42:35 PM script INFO: SUCCESS!@#KODE 1!@#USER_ID 90!@#ACTIVITY_CODE 1
12/21/2022 02:42:35 PM script INFO: SUCCESS!@#KODE 1!@#USER_ID 90!@#ACTIVITY_CODE 4
12/21/2022 02:42:35 PM script INFO: SUCCESS!@#KODE 1!@#USER_ID 90!@#ACTIVITY_CODE 1
12/21/2022 02:42:35 PM script INFO: SUCCESS!@#KODE 1!@#USER_ID 90!@#ACTIVITY_CODE 4
12/21/2022 02:42:35 PM script INFO: SUCCESS!@#KODE 1!@#USER_ID 90!@#ACTIVITY_CODE 3
12/21/2022 02:42:35 PM script INFO: SUCCESS!@#KODE 1!@#USER_ID 90!@#ACTIVITY_CODE 3
12/21/2022 02:42:35 PM script INFO: SUCCESS!@#KODE 1!@#USER_ID 90!@#ACTIVITY_CODE 2
12/21/2022 02:42:35 PM script INFO: SUCCESS!@#KODE 1!@#USER_ID 90!@#ACTIVITY_CODE 3
12/21/2022 02:42:35 PM script INFO: SUCCESS!@#KODE 1!@#USER_ID 90!@#ACTIVITY_CODE 4
12/21/2022 02:42:35 PM script INFO: SUCCESS!@#KODE 1!@#USER_ID 90!@#ACTIVITY_CODE 1
12/21/2022 02:42:36 PM script INFO: SUCCESS!@#KODE 1!@#USER_ID 90!@#ACTIVITY_CODE 2
12/21/2022 02:42:36 PM script INFO: SUCCESS!@#KODE 1!@#USER_ID 90!@#ACTIVITY_CODE 1
12/21/2022 02:42:36 PM script INFO: SUCCESS!@#KODE 1!@#USER_ID 90!@#ACTIVITY_CODE 1
12/21/2022 02:42:36 PM script INFO: SUCCESS!@#KODE 1!@#USER_ID 90!@#ACTIVITY_CODE 2
12/21/2022 02:42:36 PM script INFO: SUCCESS!@#KODE 1!@#USER_ID 90!@#ACTIVITY_CODE 2
12/21/2022 02:42:36 PM script INFO: SUCCESS!@#KODE 1!@#USER_ID 90!@#ACTIVITY_CODE 4
12/21/2022 02:42:36 PM script INFO: SUCCESS!@#KODE 1!@#USER_ID 90!@#ACTIVITY_CODE 1
12/21/2022 02:42:36 PM script INFO: SUCCESS!@#KODE 1!@#USER_ID 90!@#ACTIVITY_CODE 4
12/21/2022 02:42:36 PM script INFO: SUCCESS!@#KODE 1!@#USER_ID 90!@#ACTIVITY_CODE 3
12/21/2022 02:42:37 PM script INFO: SUCCESS!@#KODE 1!@#USER_ID 90!@#ACTIVITY_CODE 3
12/21/2022 02:42:37 PM script INFO: SUCCESS!@#KODE 1!@#USER_ID 90!@#ACTIVITY_CODE 2
12/21/2022 02:42:37 PM script INFO: SUCCESS!@#KODE 1!@#USER_ID 90!@#ACTIVITY_CODE 1
12/21/2022 02:42:37 PM script INFO: SUCCESS!@#KODE 1!@#USER_ID 90!@#ACTIVITY_CODE 3
12/21/2022 02:42:37 PM script INFO: SUCCESS!@#KODE 1!@#USER_ID 90!@#ACTIVITY_CODE 2
12/21/2022 02:42:37 PM script INFO: SUCCESS!@#KODE 1!@#USER_ID 90!@#ACTIVITY_CODE 1
12/21/2022 02:42:37 PM script INFO: SUCCESS!@#KODE 1!@#USER_ID 90!@#ACTIVITY_CODE 2
12/21/2022 02:42:38 PM script INFO: SUCCESS!@#KODE 1!@#USER_ID 90!@#ACTIVITY_CODE 2
12/21/2022 02:42:38 PM script INFO: SUCCESS!@#KODE 1!@#USER_ID 90!@#ACTIVITY_CODE 4
12/21/2022 02:42:38 PM script INFO: SUCCESS!@#KODE 1!@#USER_ID 90!@#ACTIVITY_CODE 1
12/21/2022 02:42:38 PM script INFO: SUCCESS!@#KODE 1!@#USER_ID 90!@#ACTIVITY_CODE 2
12/21/2022 02:42:38 PM script INFO: SUCCESS!@#KODE 1!@#USER_ID 90!@#ACTIVITY_CODE 1
12/21/2022 02:42:38 PM script INFO: SUCCESS!@#KODE 1!@#USER_ID 90!@#ACTIVITY_CODE 1
12/21/2022 02:42:38 PM script INFO: SUCCESS!@#KODE 1!@#USER_ID 90!@#ACTIVITY_CODE 4
12/21/2022 02:42:38 PM script INFO: SUCCESS!@#KODE 1!@#USER_ID 90!@#ACTIVITY_CODE 3
12/21/2022 02:42:38 PM script INFO: SUCCESS!@#KODE 1!@#USER_ID 90!@#ACTIVITY_CODE 1
12/21/2022 02:42:39 PM script INFO: SUCCESS!@#KODE 1!@#USER_ID 90!@#ACTIVITY_CODE 3
12/21/2022 02:42:39 PM script INFO: SUCCESS!@#KODE 1!@#USER_ID 90!@#ACTIVITY_CODE 3
12/21/2022 02:42:39 PM script INFO: SUCCESS!@#KODE 1!@#USER_ID 90!@#ACTIVITY_CODE 2
12/21/2022 02:42:39 PM script INFO: SUCCESS!@#KODE 1!@#USER_ID 90!@#ACTIVITY_CODE 3
12/21/2022 02:42:39 PM script INFO: SUCCESS!@#KODE 1!@#USER_ID 90!@#ACTIVITY_CODE 2
12/21/2022 02:42:39 PM script INFO: SUCCESS!@#KODE 1!@#USER_ID 90!@#ACTIVITY_CODE 1
12/21/2022 02:42:40 PM script INFO: SUCCESS!@#KODE 1!@#USER_ID 90!@#ACTIVITY_CODE 2
12/21/2022 02:42:40 PM script INFO: SUCCESS!@#KODE 1!@#USER_ID 90!@#ACTIVITY_CODE 4
12/21/2022 02:42:40 PM script INFO: SUCCESS!@#KODE 1!@#USER_ID 90!@#ACTIVITY_CODE 2
12/21/2022 02:42:40 PM script INFO: SUCCESS!@#KODE 1!@#USER_ID 90!@#ACTIVITY_CODE 3
12/21/2022 02:42:40 PM script INFO: SUCCESS!@#KODE 1!@#USER_ID 90!@#ACTIVITY_CODE 1
12/21/2022 02:42:40 PM script INFO: SUCCESS!@#KODE 1!@#USER_ID 90!@#ACTIVITY_CODE 1
12/21/2022 02:42:40 PM script INFO: SUCCESS!@#KODE 1!@#USER_ID 90!@#ACTIVITY_CODE 2
12/21/2022 02:42:40 PM script INFO: SUCCESS!@#KODE 1!@#USER_ID 90!@#ACTIVITY_CODE 1
12/21/2022 02:42:40 PM script INFO: SUCCESS!@#KODE 1!@#USER_ID 90!@#ACTIVITY_CODE 1
12/21/2022 02:42:41 PM script INFO: SUCCESS!@#KODE 1!@#USER_ID 90!@#ACTIVITY_CODE 1
12/21/2022 02:42:41 PM script INFO: SUCCESS!@#KODE 1!@#USER_ID 90!@#ACTIVITY_CODE 4
12/21/2022 02:42:41 PM script INFO: SUCCESS!@#KODE 1!@#USER_ID 90!@#ACTIVITY_CODE 2
12/21/2022 02:42:41 PM script INFO: SUCCESS!@#KODE 1!@#USER_ID 90!@#ACTIVITY_CODE 1
12/21/2022 02:42:41 PM script INFO: SUCCESS!@#KODE 1!@#USER_ID 90!@#ACTIVITY_CODE 2
12/21/2022 02:42:41 PM script INFO: SUCCESS!@#KODE 1!@#USER_ID 90!@#ACTIVITY_CODE 1
12/21/2022 02:42:41 PM script INFO: SUCCESS!@#KODE 1!@#USER_ID 90!@#ACTIVITY_CODE 3
12/21/2022 02:42:42 PM script INFO: SUCCESS!@#KODE 1!@#USER_ID 90!@#ACTIVITY_CODE 2
12/21/2022 02:42:42 PM script INFO: SUCCESS!@#KODE 1!@#USER_ID 90!@#ACTIVITY_CODE 1
12/21/2022 02:42:42 PM script INFO: SUCCESS!@#KODE 1!@#USER_ID 90!@#ACTIVITY_CODE 2
12/21/2022 02:42:42 PM script INFO: SUCCESS!@#KODE 1!@#USER_ID 90!@#ACTIVITY_CODE 4
12/21/2022 02:42:42 PM script INFO: SUCCESS!@#KODE 1!@#USER_ID 90!@#ACTIVITY_CODE 2
12/21/2022 02:42:42 PM script INFO: SUCCESS!@#KODE 1!@#USER_ID 90!@#ACTIVITY_CODE 3
12/21/2022 02:42:43 PM script INFO: SUCCESS!@#KODE 1!@#USER_ID 90!@#ACTIVITY_CODE 2
12/21/2022 02:42:43 PM script INFO: SUCCESS!@#KODE 1!@#USER_ID 90!@#ACTIVITY_CODE 3
12/21/2022 02:42:43 PM script INFO: SUCCESS!@#KODE 1!@#USER_ID 90!@#ACTIVITY_CODE 1
12/21/2022 02:42:43 PM script INFO: SUCCESS!@#KODE 1!@#USER_ID 90!@#ACTIVITY_CODE 3
12/21/2022 02:42:43 PM script INFO: SUCCESS!@#KODE 1!@#USER_ID 90!@#ACTIVITY_CODE 1
12/21/2022 02:42:43 PM script INFO: SUCCESS!@#KODE 1!@#USER_ID 90!@#ACTIVITY_CODE 1
12/21/2022 02:42:43 PM script INFO: SUCCESS!@#KODE 1!@#USER_ID 90!@#ACTIVITY_CODE 4
12/21/2022 02:42:44 PM script INFO: SUCCESS!@#KODE 1!@#USER_ID 90!@#ACTIVITY_CODE 2
12/21/2022 02:42:44 PM script INFO: SUCCESS!@#KODE 1!@#USER_ID 90!@#ACTIVITY_CODE 2
12/21/2022 02:42:44 PM script INFO: SUCCESS!@#KODE 1!@#USER_ID 90!@#ACTIVITY_CODE 2
12/21/2022 02:42:44 PM script INFO: SUCCESS!@#KODE 1!@#USER_ID 90!@#ACTIVITY_CODE 1
12/21/2022 02:42:44 PM script INFO: SUCCESS!@#KODE 1!@#USER_ID 90!@#ACTIVITY_CODE 4
12/21/2022 02:42:44 PM script INFO: SUCCESS!@#KODE 1!@#USER_ID 90!@#ACTIVITY_CODE 3
12/21/2022 02:42:45 PM script INFO: SUCCESS!@#KODE 1!@#USER_ID 90!@#ACTIVITY_CODE 2
12/21/2022 02:42:45 PM script INFO: SUCCESS!@#KODE 1!@#USER_ID 90!@#ACTIVITY_CODE 4
12/21/2022 02:42:45 PM script INFO: SUCCESS!@#KODE 1!@#USER_ID 90!@#ACTIVITY_CODE 2
12/21/2022 02:42:45 PM script INFO: SUCCESS!@#KODE 1!@#USER_ID 90!@#ACTIVITY_CODE 3
12/21/2022 02:42:45 PM script INFO: SUCCESS!@#KODE 1!@#USER_ID 90!@#ACTIVITY_CODE 3
12/21/2022 02:42:46 PM script INFO: SUCCESS!@#KODE 1!@#USER_ID 90!@#ACTIVITY_CODE 2
12/21/2022 02:42:46 PM script INFO: SUCCESS!@#KODE 1!@#USER_ID 90!@#ACTIVITY_CODE 3
12/21/2022 02:42:46 PM script INFO: SUCCESS!@#KODE 1!@#USER_ID 90!@#ACTIVITY_CODE 3
12/21/2022 02:42:46 PM script INFO: SUCCESS!@#KODE 1!@#USER_ID 90!@#ACTIVITY_CODE 3
12/21/2022 02:42:46 PM script INFO: SUCCESS!@#KODE 1!@#USER_ID 90!@#ACTIVITY_CODE 2
12/21/2022 02:42:46 PM script INFO: SUCCESS!@#KODE 1!@#USER_ID 90!@#ACTIVITY_CODE 1
12/21/2022 02:42:46 PM script INFO: SUCCESS!@#KODE 1!@#USER_ID 90!@#ACTIVITY_CODE 3
12/21/2022 02:42:46 PM script INFO: SUCCESS!@#KODE 1!@#USER_ID 90!@#ACTIVITY_CODE 1
12/21/2022 02:42:47 PM script INFO: SUCCESS!@#KODE 1!@#USER_ID 90!@#ACTIVITY_CODE 2
12/21/2022 02:42:47 PM script INFO: SUCCESS!@#KODE 1!@#USER_ID 90!@#ACTIVITY_CODE 3
12/21/2022 02:42:47 PM script INFO: SUCCESS!@#KODE 1!@#USER_ID 90!@#ACTIVITY_CODE 3
12/21/2022 02:42:47 PM script INFO: SUCCESS!@#KODE 1!@#USER_ID 90!@#ACTIVITY_CODE 2
12/21/2022 02:42:47 PM script INFO: SUCCESS!@#KODE 1!@#USER_ID 90!@#ACTIVITY_CODE 1
12/21/2022 02:42:47 PM script INFO: SUCCESS!@#KODE 1!@#USER_ID 90!@#ACTIVITY_CODE 1
12/21/2022 02:42:47 PM script INFO: SUCCESS!@#KODE 1!@#USER_ID 90!@#ACTIVITY_CODE 3
12/21/2022 02:42:48 PM script INFO: SUCCESS!@#KODE 1!@#USER_ID 90!@#ACTIVITY_CODE 3
12/21/2022 02:42:48 PM script INFO: SUCCESS!@#KODE 1!@#USER_ID 90!@#ACTIVITY_CODE 3
12/21/2022 02:42:48 PM script INFO: SUCCESS!@#KODE 1!@#USER_ID 90!@#ACTIVITY_CODE 2
12/21/2022 02:42:48 PM script INFO: SUCCESS!@#KODE 1!@#USER_ID 90!@#ACTIVITY_CODE 3
12/21/2022 02:42:48 PM script INFO: SUCCESS!@#KODE 1!@#USER_ID 90!@#ACTIVITY_CODE 3
12/21/2022 02:42:48 PM script INFO: SUCCESS!@#KODE 1!@#USER_ID 90!@#ACTIVITY_CODE 1
12/21/2022 02:42:48 PM script INFO: SUCCESS!@#KODE 1!@#USER_ID 90!@#ACTIVITY_CODE 4
12/21/2022 02:42:48 PM script INFO: SUCCESS!@#KODE 1!@#USER_ID 90!@#ACTIVITY_CODE 3
12/21/2022 02:42:49 PM script INFO: SUCCESS!@#KODE 1!@#USER_ID 90!@#ACTIVITY_CODE 1
12/21/2022 02:42:49 PM script INFO: SUCCESS!@#KODE 1!@#USER_ID 90!@#ACTIVITY_CODE 3
12/21/2022 02:42:49 PM script INFO: SUCCESS!@#KODE 1!@#USER_ID 90!@#ACTIVITY_CODE 4
12/21/2022 02:42:49 PM script INFO: SUCCESS!@#KODE 1!@#USER_ID 90!@#ACTIVITY_CODE 3
12/21/2022 02:42:49 PM script INFO: SUCCESS!@#KODE 1!@#USER_ID 90!@#ACTIVITY_CODE 3
12/21/2022 02:42:49 PM script INFO: SUCCESS!@#KODE 1!@#USER_ID 90!@#ACTIVITY_CODE 3
12/21/2022 02:42:49 PM script INFO: SUCCESS!@#KODE 1!@#USER_ID 90!@#ACTIVITY_CODE 2
12/21/2022 02:42:49 PM script INFO: SUCCESS!@#KODE 1!@#USER_ID 90!@#ACTIVITY_CODE 3
12/21/2022 02:42:49 PM script INFO: SUCCESS!@#KODE 1!@#USER_ID 90!@#ACTIVITY_CODE 3
12/21/2022 02:42:50 PM script INFO: SUCCESS!@#KODE 1!@#USER_ID 90!@#ACTIVITY_CODE 3
12/21/2022 02:42:50 PM script INFO: SUCCESS!@#KODE 1!@#USER_ID 90!@#ACTIVITY_CODE 4
12/21/2022 02:42:50 PM script INFO: SUCCESS!@#KODE 1!@#USER_ID 90!@#ACTIVITY_CODE 3
12/21/2022 02:42:50 PM script INFO: SUCCESS!@#KODE 1!@#USER_ID 90!@#ACTIVITY_CODE 3
12/21/2022 02:42:50 PM script INFO: SUCCESS!@#KODE 1!@#USER_ID 90!@#ACTIVITY_CODE 3
12/21/2022 02:42:50 PM script INFO: SUCCESS!@#KODE 1!@#USER_ID 90!@#ACTIVITY_CODE 1
12/21/2022 02:42:50 PM script INFO: SUCCESS!@#KODE 1!@#USER_ID 90!@#ACTIVITY_CODE 1
12/21/2022 02:42:50 PM script INFO: SUCCESS!@#KODE 1!@#USER_ID 90!@#ACTIVITY_CODE 3
12/21/2022 02:42:50 PM script INFO: SUCCESS!@#KODE 1!@#USER_ID 90!@#ACTIVITY_CODE 4
12/21/2022 02:42:50 PM script INFO: SUCCESS!@#KODE 1!@#USER_ID 90!@#ACTIVITY_CODE 1
12/21/2022 02:42:51 PM script INFO: SUCCESS!@#KODE 1!@#USER_ID 90!@#ACTIVITY_CODE 3
12/21/2022 02:42:51 PM script INFO: SUCCESS!@#KODE 1!@#USER_ID 90!@#ACTIVITY_CODE 3
12/21/2022 02:42:51 PM script INFO: SUCCESS!@#KODE 1!@#USER_ID 90!@#ACTIVITY_CODE 3
12/21/2022 02:42:51 PM script INFO: Duration: 65.32774782180786
12/21/2022 02:42:51 PM script INFO: mengakhiri-quiz
12/21/2022 02:42:55 PM script INFO: SUCCESS!@#KODE 1!@#USER_ID 90!@#ACTIVITY_CODE 5
12/21/2022 02:42:55 PM script INFO: berhasil-submit
