12/23/2022 01:17:54 AM script INFO: Prepared chrome options..
12/23/2022 01:17:55 AM script INFO: Initialized chrome browser..
12/23/2022 01:17:55 AM script INFO: mengakses-homepage
12/23/2022 01:18:39 AM script INFO: mengakses-login-page
12/23/2022 01:19:37 AM script INFO: mengakses-site-home
12/23/2022 01:19:38 AM script INFO: mengakses-site-course
12/23/2022 01:21:08 AM script ERROR: TIMEOUT EXCEPTION!@#KODE 0!@#LOCATION mengakses-site-course
12/23/2022 01:21:08 AM main_worker ERROR: Message: None

