12/23/2022 01:17:54 AM script INFO: Prepared chrome options..
12/23/2022 01:17:55 AM script INFO: Initialized chrome browser..
12/23/2022 01:17:55 AM script INFO: mengakses-homepage
12/23/2022 01:18:33 AM script INFO: mengakses-login-page
12/23/2022 01:19:44 AM script INFO: mengakses-site-home
12/23/2022 01:19:55 AM script INFO: mengakses-site-course
12/23/2022 01:20:29 AM script INFO: mengakses-quiz
12/23/2022 01:20:38 AM script INFO: mengakses-start-quiz-page
12/23/2022 01:21:38 AM script INFO: memulai-quiz
12/23/2022 01:21:38 AM script INFO: SUCCESS!@#KODE 1!@#USER_ID 69!@#ACTIVITY_CODE 5
12/23/2022 01:21:49 AM script INFO: SUCCESS!@#KODE 1!@#USER_ID 69!@#ACTIVITY_CODE 2
12/23/2022 01:21:49 AM script INFO: SUCCESS!@#KODE 1!@#USER_ID 69!@#ACTIVITY_CODE 1
12/23/2022 01:21:49 AM script INFO: SUCCESS!@#KODE 1!@#USER_ID 69!@#ACTIVITY_CODE 5
12/23/2022 01:21:49 AM script INFO: SUCCESS!@#KODE 1!@#USER_ID 69!@#ACTIVITY_CODE 5
12/23/2022 01:21:52 AM script INFO: SUCCESS!@#KODE 1!@#USER_ID 69!@#ACTIVITY_CODE 2
12/23/2022 01:21:52 AM script INFO: SUCCESS!@#KODE 1!@#USER_ID 69!@#ACTIVITY_CODE 5
12/23/2022 01:21:52 AM script INFO: SUCCESS!@#KODE 1!@#USER_ID 69!@#ACTIVITY_CODE 5
12/23/2022 01:21:54 AM script INFO: SUCCESS!@#KODE 1!@#USER_ID 69!@#ACTIVITY_CODE 2
12/23/2022 01:21:54 AM script INFO: SUCCESS!@#KODE 1!@#USER_ID 69!@#ACTIVITY_CODE 3
12/23/2022 01:21:54 AM script INFO: SUCCESS!@#KODE 1!@#USER_ID 69!@#ACTIVITY_CODE 3
12/23/2022 01:21:54 AM script INFO: SUCCESS!@#KODE 1!@#USER_ID 69!@#ACTIVITY_CODE 1
12/23/2022 01:21:54 AM script INFO: SUCCESS!@#KODE 1!@#USER_ID 69!@#ACTIVITY_CODE 5
12/23/2022 01:21:54 AM script INFO: SUCCESS!@#KODE 1!@#USER_ID 69!@#ACTIVITY_CODE 5
12/23/2022 01:21:57 AM script INFO: SUCCESS!@#KODE 1!@#USER_ID 69!@#ACTIVITY_CODE 3
12/23/2022 01:21:57 AM script INFO: SUCCESS!@#KODE 1!@#USER_ID 69!@#ACTIVITY_CODE 5
12/23/2022 01:21:57 AM script INFO: SUCCESS!@#KODE 1!@#USER_ID 69!@#ACTIVITY_CODE 5
12/23/2022 01:22:00 AM script INFO: SUCCESS!@#KODE 1!@#USER_ID 69!@#ACTIVITY_CODE 3
12/23/2022 01:22:00 AM script INFO: SUCCESS!@#KODE 1!@#USER_ID 69!@#ACTIVITY_CODE 5
12/23/2022 01:22:00 AM script INFO: SUCCESS!@#KODE 1!@#USER_ID 69!@#ACTIVITY_CODE 5
12/23/2022 01:22:02 AM script INFO: SUCCESS!@#KODE 1!@#USER_ID 69!@#ACTIVITY_CODE 1
12/23/2022 01:22:02 AM script INFO: SUCCESS!@#KODE 1!@#USER_ID 69!@#ACTIVITY_CODE 1
12/23/2022 01:22:02 AM script INFO: SUCCESS!@#KODE 1!@#USER_ID 69!@#ACTIVITY_CODE 1
12/23/2022 01:22:02 AM script INFO: SUCCESS!@#KODE 1!@#USER_ID 69!@#ACTIVITY_CODE 3
12/23/2022 01:22:02 AM script INFO: SUCCESS!@#KODE 1!@#USER_ID 69!@#ACTIVITY_CODE 5
12/23/2022 01:22:02 AM script INFO: SUCCESS!@#KODE 1!@#USER_ID 69!@#ACTIVITY_CODE 5
12/23/2022 01:22:05 AM script INFO: SUCCESS!@#KODE 1!@#USER_ID 69!@#ACTIVITY_CODE 2
12/23/2022 01:22:05 AM script INFO: SUCCESS!@#KODE 1!@#USER_ID 69!@#ACTIVITY_CODE 1
12/23/2022 01:22:05 AM script INFO: SUCCESS!@#KODE 1!@#USER_ID 69!@#ACTIVITY_CODE 5
12/23/2022 01:22:05 AM script INFO: SUCCESS!@#KODE 1!@#USER_ID 69!@#ACTIVITY_CODE 5
12/23/2022 01:22:08 AM script INFO: SUCCESS!@#KODE 1!@#USER_ID 69!@#ACTIVITY_CODE 3
12/23/2022 01:22:08 AM script INFO: SUCCESS!@#KODE 1!@#USER_ID 69!@#ACTIVITY_CODE 1
12/23/2022 01:22:08 AM script INFO: SUCCESS!@#KODE 1!@#USER_ID 69!@#ACTIVITY_CODE 3
12/23/2022 01:22:08 AM script INFO: SUCCESS!@#KODE 1!@#USER_ID 69!@#ACTIVITY_CODE 5
12/23/2022 01:22:08 AM script INFO: SUCCESS!@#KODE 1!@#USER_ID 69!@#ACTIVITY_CODE 5
12/23/2022 01:22:10 AM script INFO: SUCCESS!@#KODE 1!@#USER_ID 69!@#ACTIVITY_CODE 1
12/23/2022 01:22:10 AM script INFO: SUCCESS!@#KODE 1!@#USER_ID 69!@#ACTIVITY_CODE 1
12/23/2022 01:22:10 AM script INFO: SUCCESS!@#KODE 1!@#USER_ID 69!@#ACTIVITY_CODE 3
12/23/2022 01:22:10 AM script INFO: SUCCESS!@#KODE 1!@#USER_ID 69!@#ACTIVITY_CODE 2
12/23/2022 01:22:10 AM script INFO: SUCCESS!@#KODE 1!@#USER_ID 69!@#ACTIVITY_CODE 1
12/23/2022 01:22:11 AM script INFO: SUCCESS!@#KODE 1!@#USER_ID 69!@#ACTIVITY_CODE 2
12/23/2022 01:22:11 AM script INFO: SUCCESS!@#KODE 1!@#USER_ID 69!@#ACTIVITY_CODE 2
12/23/2022 01:22:11 AM script INFO: SUCCESS!@#KODE 1!@#USER_ID 69!@#ACTIVITY_CODE 5
12/23/2022 01:22:11 AM script INFO: SUCCESS!@#KODE 1!@#USER_ID 69!@#ACTIVITY_CODE 5
12/23/2022 01:22:13 AM script INFO: SUCCESS!@#KODE 1!@#USER_ID 69!@#ACTIVITY_CODE 1
12/23/2022 01:22:13 AM script INFO: SUCCESS!@#KODE 1!@#USER_ID 69!@#ACTIVITY_CODE 4
12/23/2022 01:22:13 AM script INFO: SUCCESS!@#KODE 1!@#USER_ID 69!@#ACTIVITY_CODE 3
12/23/2022 01:22:13 AM script INFO: SUCCESS!@#KODE 1!@#USER_ID 69!@#ACTIVITY_CODE 5
12/23/2022 01:22:13 AM script INFO: SUCCESS!@#KODE 1!@#USER_ID 69!@#ACTIVITY_CODE 5
12/23/2022 01:22:16 AM script INFO: SUCCESS!@#KODE 1!@#USER_ID 69!@#ACTIVITY_CODE 3
12/23/2022 01:22:16 AM script INFO: SUCCESS!@#KODE 1!@#USER_ID 69!@#ACTIVITY_CODE 3
12/23/2022 01:22:16 AM script INFO: SUCCESS!@#KODE 1!@#USER_ID 69!@#ACTIVITY_CODE 5
12/23/2022 01:22:16 AM script INFO: SUCCESS!@#KODE 1!@#USER_ID 69!@#ACTIVITY_CODE 5
12/23/2022 01:22:18 AM script INFO: SUCCESS!@#KODE 1!@#USER_ID 69!@#ACTIVITY_CODE 1
12/23/2022 01:22:19 AM script INFO: SUCCESS!@#KODE 1!@#USER_ID 69!@#ACTIVITY_CODE 3
12/23/2022 01:22:19 AM script INFO: SUCCESS!@#KODE 1!@#USER_ID 69!@#ACTIVITY_CODE 1
12/23/2022 01:22:19 AM script INFO: SUCCESS!@#KODE 1!@#USER_ID 69!@#ACTIVITY_CODE 3
12/23/2022 01:22:19 AM script INFO: SUCCESS!@#KODE 1!@#USER_ID 69!@#ACTIVITY_CODE 3
12/23/2022 01:22:19 AM script INFO: SUCCESS!@#KODE 1!@#USER_ID 69!@#ACTIVITY_CODE 1
12/23/2022 01:22:19 AM script INFO: SUCCESS!@#KODE 1!@#USER_ID 69!@#ACTIVITY_CODE 4
12/23/2022 01:22:19 AM script INFO: SUCCESS!@#KODE 1!@#USER_ID 69!@#ACTIVITY_CODE 1
12/23/2022 01:22:19 AM script INFO: SUCCESS!@#KODE 1!@#USER_ID 69!@#ACTIVITY_CODE 3
12/23/2022 01:22:19 AM script INFO: SUCCESS!@#KODE 1!@#USER_ID 69!@#ACTIVITY_CODE 4
12/23/2022 01:22:19 AM script INFO: SUCCESS!@#KODE 1!@#USER_ID 69!@#ACTIVITY_CODE 1
12/23/2022 01:22:19 AM script INFO: SUCCESS!@#KODE 1!@#USER_ID 69!@#ACTIVITY_CODE 1
12/23/2022 01:22:19 AM script INFO: SUCCESS!@#KODE 1!@#USER_ID 69!@#ACTIVITY_CODE 3
12/23/2022 01:22:19 AM script INFO: SUCCESS!@#KODE 1!@#USER_ID 69!@#ACTIVITY_CODE 4
12/23/2022 01:22:19 AM script INFO: SUCCESS!@#KODE 1!@#USER_ID 69!@#ACTIVITY_CODE 1
12/23/2022 01:22:19 AM script INFO: SUCCESS!@#KODE 1!@#USER_ID 69!@#ACTIVITY_CODE 3
12/23/2022 01:22:19 AM script INFO: SUCCESS!@#KODE 1!@#USER_ID 69!@#ACTIVITY_CODE 4
12/23/2022 01:22:19 AM script INFO: SUCCESS!@#KODE 1!@#USER_ID 69!@#ACTIVITY_CODE 3
12/23/2022 01:22:19 AM script INFO: SUCCESS!@#KODE 1!@#USER_ID 69!@#ACTIVITY_CODE 3
12/23/2022 01:22:19 AM script INFO: SUCCESS!@#KODE 1!@#USER_ID 69!@#ACTIVITY_CODE 2
12/23/2022 01:22:20 AM script INFO: SUCCESS!@#KODE 1!@#USER_ID 69!@#ACTIVITY_CODE 2
12/23/2022 01:22:20 AM script INFO: SUCCESS!@#KODE 1!@#USER_ID 69!@#ACTIVITY_CODE 3
12/23/2022 01:22:20 AM script INFO: SUCCESS!@#KODE 1!@#USER_ID 69!@#ACTIVITY_CODE 2
12/23/2022 01:22:20 AM script INFO: SUCCESS!@#KODE 1!@#USER_ID 69!@#ACTIVITY_CODE 2
12/23/2022 01:22:20 AM script INFO: SUCCESS!@#KODE 1!@#USER_ID 69!@#ACTIVITY_CODE 3
12/23/2022 01:22:20 AM script INFO: SUCCESS!@#KODE 1!@#USER_ID 69!@#ACTIVITY_CODE 2
12/23/2022 01:22:20 AM script INFO: SUCCESS!@#KODE 1!@#USER_ID 69!@#ACTIVITY_CODE 1
12/23/2022 01:22:20 AM script INFO: SUCCESS!@#KODE 1!@#USER_ID 69!@#ACTIVITY_CODE 2
12/23/2022 01:22:20 AM script INFO: SUCCESS!@#KODE 1!@#USER_ID 69!@#ACTIVITY_CODE 3
12/23/2022 01:22:20 AM script INFO: SUCCESS!@#KODE 1!@#USER_ID 69!@#ACTIVITY_CODE 3
12/23/2022 01:22:20 AM script INFO: SUCCESS!@#KODE 1!@#USER_ID 69!@#ACTIVITY_CODE 3
12/23/2022 01:22:20 AM script INFO: SUCCESS!@#KODE 1!@#USER_ID 69!@#ACTIVITY_CODE 1
12/23/2022 01:22:20 AM script INFO: SUCCESS!@#KODE 1!@#USER_ID 69!@#ACTIVITY_CODE 2
12/23/2022 01:22:21 AM script INFO: SUCCESS!@#KODE 1!@#USER_ID 69!@#ACTIVITY_CODE 2
12/23/2022 01:22:21 AM script INFO: SUCCESS!@#KODE 1!@#USER_ID 69!@#ACTIVITY_CODE 1
12/23/2022 01:22:21 AM script INFO: SUCCESS!@#KODE 1!@#USER_ID 69!@#ACTIVITY_CODE 2
12/23/2022 01:22:21 AM script INFO: SUCCESS!@#KODE 1!@#USER_ID 69!@#ACTIVITY_CODE 2
12/23/2022 01:22:21 AM script INFO: SUCCESS!@#KODE 1!@#USER_ID 69!@#ACTIVITY_CODE 1
12/23/2022 01:22:21 AM script INFO: SUCCESS!@#KODE 1!@#USER_ID 69!@#ACTIVITY_CODE 3
12/23/2022 01:22:21 AM script INFO: SUCCESS!@#KODE 1!@#USER_ID 69!@#ACTIVITY_CODE 2
12/23/2022 01:22:21 AM script INFO: SUCCESS!@#KODE 1!@#USER_ID 69!@#ACTIVITY_CODE 2
12/23/2022 01:22:21 AM script INFO: SUCCESS!@#KODE 1!@#USER_ID 69!@#ACTIVITY_CODE 3
12/23/2022 01:22:21 AM script INFO: SUCCESS!@#KODE 1!@#USER_ID 69!@#ACTIVITY_CODE 1
12/23/2022 01:22:21 AM script INFO: SUCCESS!@#KODE 1!@#USER_ID 69!@#ACTIVITY_CODE 4
12/23/2022 01:22:21 AM script INFO: SUCCESS!@#KODE 1!@#USER_ID 69!@#ACTIVITY_CODE 1
12/23/2022 01:22:21 AM script INFO: SUCCESS!@#KODE 1!@#USER_ID 69!@#ACTIVITY_CODE 1
12/23/2022 01:22:21 AM script INFO: Duration: 32.613879442214966
12/23/2022 01:22:21 AM script INFO: mengakhiri-quiz
12/23/2022 01:22:29 AM script INFO: SUCCESS!@#KODE 1!@#USER_ID 69!@#ACTIVITY_CODE 5
12/23/2022 01:22:29 AM script INFO: berhasil-submit
