12/23/2022 03:34:33 AM script INFO: Prepared chrome options..
12/23/2022 03:34:34 AM script INFO: Initialized chrome browser..
12/23/2022 03:34:34 AM script INFO: mengakses-homepage
12/23/2022 03:35:14 AM script INFO: mengakses-login-page
12/23/2022 03:35:15 AM script INFO: mengakses-site-home
12/23/2022 03:35:16 AM script INFO: mengakses-site-course
12/23/2022 03:35:16 AM script INFO: mengakses-quiz
12/23/2022 03:35:17 AM script INFO: mengakses-start-quiz-page
12/23/2022 03:35:18 AM script INFO: memulai-quiz
12/23/2022 03:35:18 AM script INFO: SUCCESS!@#KODE 1!@#USER_ID 102!@#ACTIVITY_CODE 5
12/23/2022 03:35:29 AM script INFO: SUCCESS!@#KODE 1!@#USER_ID 102!@#ACTIVITY_CODE 2
12/23/2022 03:35:29 AM script INFO: SUCCESS!@#KODE 1!@#USER_ID 102!@#ACTIVITY_CODE 3
12/23/2022 03:35:29 AM script INFO: SUCCESS!@#KODE 1!@#USER_ID 102!@#ACTIVITY_CODE 3
12/23/2022 03:35:29 AM script INFO: SUCCESS!@#KODE 1!@#USER_ID 102!@#ACTIVITY_CODE 2
12/23/2022 03:35:29 AM script INFO: SUCCESS!@#KODE 1!@#USER_ID 102!@#ACTIVITY_CODE 3
12/23/2022 03:35:29 AM script INFO: SUCCESS!@#KODE 1!@#USER_ID 102!@#ACTIVITY_CODE 3
12/23/2022 03:35:29 AM script INFO: SUCCESS!@#KODE 1!@#USER_ID 102!@#ACTIVITY_CODE 2
12/23/2022 03:35:30 AM script INFO: SUCCESS!@#KODE 1!@#USER_ID 102!@#ACTIVITY_CODE 2
12/23/2022 03:35:30 AM script INFO: SUCCESS!@#KODE 1!@#USER_ID 102!@#ACTIVITY_CODE 2
12/23/2022 03:35:30 AM script INFO: SUCCESS!@#KODE 1!@#USER_ID 102!@#ACTIVITY_CODE 1
12/23/2022 03:35:30 AM script INFO: SUCCESS!@#KODE 1!@#USER_ID 102!@#ACTIVITY_CODE 1
12/23/2022 03:35:30 AM script INFO: SUCCESS!@#KODE 1!@#USER_ID 102!@#ACTIVITY_CODE 3
12/23/2022 03:35:30 AM script INFO: SUCCESS!@#KODE 1!@#USER_ID 102!@#ACTIVITY_CODE 3
12/23/2022 03:35:30 AM script INFO: SUCCESS!@#KODE 1!@#USER_ID 102!@#ACTIVITY_CODE 5
12/23/2022 03:35:30 AM script INFO: SUCCESS!@#KODE 1!@#USER_ID 102!@#ACTIVITY_CODE 5
12/23/2022 03:35:33 AM script INFO: SUCCESS!@#KODE 1!@#USER_ID 102!@#ACTIVITY_CODE 3
12/23/2022 03:35:33 AM script INFO: SUCCESS!@#KODE 1!@#USER_ID 102!@#ACTIVITY_CODE 4
12/23/2022 03:35:33 AM script INFO: SUCCESS!@#KODE 1!@#USER_ID 102!@#ACTIVITY_CODE 3
12/23/2022 03:35:33 AM script INFO: SUCCESS!@#KODE 1!@#USER_ID 102!@#ACTIVITY_CODE 2
12/23/2022 03:35:33 AM script INFO: SUCCESS!@#KODE 1!@#USER_ID 102!@#ACTIVITY_CODE 3
12/23/2022 03:35:33 AM script INFO: SUCCESS!@#KODE 1!@#USER_ID 102!@#ACTIVITY_CODE 2
12/23/2022 03:35:33 AM script INFO: SUCCESS!@#KODE 1!@#USER_ID 102!@#ACTIVITY_CODE 5
12/23/2022 03:35:33 AM script INFO: SUCCESS!@#KODE 1!@#USER_ID 102!@#ACTIVITY_CODE 5
12/23/2022 03:35:36 AM script INFO: SUCCESS!@#KODE 1!@#USER_ID 102!@#ACTIVITY_CODE 1
12/23/2022 03:35:36 AM script INFO: SUCCESS!@#KODE 1!@#USER_ID 102!@#ACTIVITY_CODE 5
12/23/2022 03:35:36 AM script INFO: SUCCESS!@#KODE 1!@#USER_ID 102!@#ACTIVITY_CODE 5
12/23/2022 03:35:38 AM script INFO: SUCCESS!@#KODE 1!@#USER_ID 102!@#ACTIVITY_CODE 1
12/23/2022 03:35:38 AM script INFO: SUCCESS!@#KODE 1!@#USER_ID 102!@#ACTIVITY_CODE 4
12/23/2022 03:35:38 AM script INFO: SUCCESS!@#KODE 1!@#USER_ID 102!@#ACTIVITY_CODE 5
12/23/2022 03:35:38 AM script INFO: SUCCESS!@#KODE 1!@#USER_ID 102!@#ACTIVITY_CODE 5
12/23/2022 03:35:41 AM script INFO: SUCCESS!@#KODE 1!@#USER_ID 102!@#ACTIVITY_CODE 1
12/23/2022 03:35:41 AM script INFO: SUCCESS!@#KODE 1!@#USER_ID 102!@#ACTIVITY_CODE 1
12/23/2022 03:35:41 AM script INFO: SUCCESS!@#KODE 1!@#USER_ID 102!@#ACTIVITY_CODE 2
12/23/2022 03:35:41 AM script INFO: SUCCESS!@#KODE 1!@#USER_ID 102!@#ACTIVITY_CODE 1
12/23/2022 03:35:41 AM script INFO: SUCCESS!@#KODE 1!@#USER_ID 102!@#ACTIVITY_CODE 5
12/23/2022 03:35:41 AM script INFO: SUCCESS!@#KODE 1!@#USER_ID 102!@#ACTIVITY_CODE 5
12/23/2022 03:35:44 AM script INFO: SUCCESS!@#KODE 1!@#USER_ID 102!@#ACTIVITY_CODE 2
12/23/2022 03:35:44 AM script INFO: SUCCESS!@#KODE 1!@#USER_ID 102!@#ACTIVITY_CODE 5
12/23/2022 03:35:44 AM script INFO: SUCCESS!@#KODE 1!@#USER_ID 102!@#ACTIVITY_CODE 5
12/23/2022 03:35:46 AM script INFO: SUCCESS!@#KODE 1!@#USER_ID 102!@#ACTIVITY_CODE 5
12/23/2022 03:35:46 AM script INFO: SUCCESS!@#KODE 1!@#USER_ID 102!@#ACTIVITY_CODE 5
12/23/2022 03:35:49 AM script INFO: SUCCESS!@#KODE 1!@#USER_ID 102!@#ACTIVITY_CODE 4
12/23/2022 03:35:49 AM script INFO: SUCCESS!@#KODE 1!@#USER_ID 102!@#ACTIVITY_CODE 2
12/23/2022 03:35:49 AM script INFO: SUCCESS!@#KODE 1!@#USER_ID 102!@#ACTIVITY_CODE 3
12/23/2022 03:35:49 AM script INFO: SUCCESS!@#KODE 1!@#USER_ID 102!@#ACTIVITY_CODE 5
12/23/2022 03:35:49 AM script INFO: SUCCESS!@#KODE 1!@#USER_ID 102!@#ACTIVITY_CODE 5
12/23/2022 03:35:52 AM script INFO: SUCCESS!@#KODE 1!@#USER_ID 102!@#ACTIVITY_CODE 3
12/23/2022 03:35:52 AM script INFO: SUCCESS!@#KODE 1!@#USER_ID 102!@#ACTIVITY_CODE 1
12/23/2022 03:35:52 AM script INFO: SUCCESS!@#KODE 1!@#USER_ID 102!@#ACTIVITY_CODE 2
12/23/2022 03:35:52 AM script INFO: SUCCESS!@#KODE 1!@#USER_ID 102!@#ACTIVITY_CODE 4
12/23/2022 03:35:52 AM script INFO: SUCCESS!@#KODE 1!@#USER_ID 102!@#ACTIVITY_CODE 1
12/23/2022 03:35:52 AM script INFO: SUCCESS!@#KODE 1!@#USER_ID 102!@#ACTIVITY_CODE 5
12/23/2022 03:35:52 AM script INFO: SUCCESS!@#KODE 1!@#USER_ID 102!@#ACTIVITY_CODE 5
12/23/2022 03:35:54 AM script INFO: SUCCESS!@#KODE 1!@#USER_ID 102!@#ACTIVITY_CODE 5
12/23/2022 03:35:54 AM script INFO: SUCCESS!@#KODE 1!@#USER_ID 102!@#ACTIVITY_CODE 5
12/23/2022 03:35:57 AM script INFO: SUCCESS!@#KODE 1!@#USER_ID 102!@#ACTIVITY_CODE 2
12/23/2022 03:35:57 AM script INFO: SUCCESS!@#KODE 1!@#USER_ID 102!@#ACTIVITY_CODE 1
12/23/2022 03:35:57 AM script INFO: SUCCESS!@#KODE 1!@#USER_ID 102!@#ACTIVITY_CODE 4
12/23/2022 03:35:57 AM script INFO: SUCCESS!@#KODE 1!@#USER_ID 102!@#ACTIVITY_CODE 2
12/23/2022 03:35:57 AM script INFO: SUCCESS!@#KODE 1!@#USER_ID 102!@#ACTIVITY_CODE 1
12/23/2022 03:35:57 AM script INFO: SUCCESS!@#KODE 1!@#USER_ID 102!@#ACTIVITY_CODE 1
12/23/2022 03:35:58 AM script INFO: SUCCESS!@#KODE 1!@#USER_ID 102!@#ACTIVITY_CODE 1
12/23/2022 03:35:58 AM script INFO: SUCCESS!@#KODE 1!@#USER_ID 102!@#ACTIVITY_CODE 1
12/23/2022 03:35:58 AM script INFO: SUCCESS!@#KODE 1!@#USER_ID 102!@#ACTIVITY_CODE 3
12/23/2022 03:35:58 AM script INFO: SUCCESS!@#KODE 1!@#USER_ID 102!@#ACTIVITY_CODE 3
12/23/2022 03:35:58 AM script INFO: SUCCESS!@#KODE 1!@#USER_ID 102!@#ACTIVITY_CODE 3
12/23/2022 03:35:58 AM script INFO: SUCCESS!@#KODE 1!@#USER_ID 102!@#ACTIVITY_CODE 1
12/23/2022 03:35:58 AM script INFO: SUCCESS!@#KODE 1!@#USER_ID 102!@#ACTIVITY_CODE 3
12/23/2022 03:35:58 AM script INFO: SUCCESS!@#KODE 1!@#USER_ID 102!@#ACTIVITY_CODE 2
12/23/2022 03:35:58 AM script INFO: SUCCESS!@#KODE 1!@#USER_ID 102!@#ACTIVITY_CODE 5
12/23/2022 03:35:58 AM script INFO: SUCCESS!@#KODE 1!@#USER_ID 102!@#ACTIVITY_CODE 5
12/23/2022 03:36:01 AM script INFO: SUCCESS!@#KODE 1!@#USER_ID 102!@#ACTIVITY_CODE 3
12/23/2022 03:36:01 AM script INFO: SUCCESS!@#KODE 1!@#USER_ID 102!@#ACTIVITY_CODE 2
12/23/2022 03:36:01 AM script INFO: SUCCESS!@#KODE 1!@#USER_ID 102!@#ACTIVITY_CODE 1
12/23/2022 03:36:01 AM script INFO: SUCCESS!@#KODE 1!@#USER_ID 102!@#ACTIVITY_CODE 3
12/23/2022 03:36:01 AM script INFO: SUCCESS!@#KODE 1!@#USER_ID 102!@#ACTIVITY_CODE 4
12/23/2022 03:36:01 AM script INFO: SUCCESS!@#KODE 1!@#USER_ID 102!@#ACTIVITY_CODE 5
12/23/2022 03:36:01 AM script INFO: SUCCESS!@#KODE 1!@#USER_ID 102!@#ACTIVITY_CODE 5
12/23/2022 03:36:03 AM script INFO: SUCCESS!@#KODE 1!@#USER_ID 102!@#ACTIVITY_CODE 1
12/23/2022 03:36:03 AM script INFO: SUCCESS!@#KODE 1!@#USER_ID 102!@#ACTIVITY_CODE 5
12/23/2022 03:36:03 AM script INFO: SUCCESS!@#KODE 1!@#USER_ID 102!@#ACTIVITY_CODE 5
12/23/2022 03:36:06 AM script INFO: SUCCESS!@#KODE 1!@#USER_ID 102!@#ACTIVITY_CODE 1
12/23/2022 03:36:06 AM script INFO: SUCCESS!@#KODE 1!@#USER_ID 102!@#ACTIVITY_CODE 3
12/23/2022 03:36:06 AM script INFO: SUCCESS!@#KODE 1!@#USER_ID 102!@#ACTIVITY_CODE 2
12/23/2022 03:36:06 AM script INFO: SUCCESS!@#KODE 1!@#USER_ID 102!@#ACTIVITY_CODE 1
12/23/2022 03:36:06 AM script INFO: SUCCESS!@#KODE 1!@#USER_ID 102!@#ACTIVITY_CODE 3
12/23/2022 03:36:06 AM script INFO: SUCCESS!@#KODE 1!@#USER_ID 102!@#ACTIVITY_CODE 2
12/23/2022 03:36:07 AM script INFO: SUCCESS!@#KODE 1!@#USER_ID 102!@#ACTIVITY_CODE 3
12/23/2022 03:36:07 AM script INFO: SUCCESS!@#KODE 1!@#USER_ID 102!@#ACTIVITY_CODE 1
12/23/2022 03:36:07 AM script INFO: SUCCESS!@#KODE 1!@#USER_ID 102!@#ACTIVITY_CODE 1
12/23/2022 03:36:07 AM script INFO: SUCCESS!@#KODE 1!@#USER_ID 102!@#ACTIVITY_CODE 3
12/23/2022 03:36:07 AM script INFO: SUCCESS!@#KODE 1!@#USER_ID 102!@#ACTIVITY_CODE 5
12/23/2022 03:36:07 AM script INFO: SUCCESS!@#KODE 1!@#USER_ID 102!@#ACTIVITY_CODE 5
12/23/2022 03:36:09 AM script INFO: SUCCESS!@#KODE 1!@#USER_ID 102!@#ACTIVITY_CODE 1
12/23/2022 03:36:09 AM script INFO: SUCCESS!@#KODE 1!@#USER_ID 102!@#ACTIVITY_CODE 3
12/23/2022 03:36:09 AM script INFO: SUCCESS!@#KODE 1!@#USER_ID 102!@#ACTIVITY_CODE 5
12/23/2022 03:36:09 AM script INFO: SUCCESS!@#KODE 1!@#USER_ID 102!@#ACTIVITY_CODE 5
12/23/2022 03:36:12 AM script INFO: SUCCESS!@#KODE 1!@#USER_ID 102!@#ACTIVITY_CODE 3
12/23/2022 03:36:12 AM script INFO: SUCCESS!@#KODE 1!@#USER_ID 102!@#ACTIVITY_CODE 1
12/23/2022 03:36:12 AM script INFO: SUCCESS!@#KODE 1!@#USER_ID 102!@#ACTIVITY_CODE 1
12/23/2022 03:36:12 AM script INFO: SUCCESS!@#KODE 1!@#USER_ID 102!@#ACTIVITY_CODE 5
12/23/2022 03:36:12 AM script INFO: SUCCESS!@#KODE 1!@#USER_ID 102!@#ACTIVITY_CODE 5
12/23/2022 03:36:15 AM script INFO: SUCCESS!@#KODE 1!@#USER_ID 102!@#ACTIVITY_CODE 2
12/23/2022 03:36:15 AM script INFO: SUCCESS!@#KODE 1!@#USER_ID 102!@#ACTIVITY_CODE 4
12/23/2022 03:36:15 AM script INFO: SUCCESS!@#KODE 1!@#USER_ID 102!@#ACTIVITY_CODE 5
12/23/2022 03:36:15 AM script INFO: SUCCESS!@#KODE 1!@#USER_ID 102!@#ACTIVITY_CODE 5
12/23/2022 03:36:17 AM script INFO: SUCCESS!@#KODE 1!@#USER_ID 102!@#ACTIVITY_CODE 2
12/23/2022 03:36:17 AM script INFO: SUCCESS!@#KODE 1!@#USER_ID 102!@#ACTIVITY_CODE 5
12/23/2022 03:36:17 AM script INFO: SUCCESS!@#KODE 1!@#USER_ID 102!@#ACTIVITY_CODE 5
12/23/2022 03:36:20 AM script INFO: SUCCESS!@#KODE 1!@#USER_ID 102!@#ACTIVITY_CODE 1
12/23/2022 03:36:20 AM script INFO: SUCCESS!@#KODE 1!@#USER_ID 102!@#ACTIVITY_CODE 1
12/23/2022 03:36:20 AM script INFO: SUCCESS!@#KODE 1!@#USER_ID 102!@#ACTIVITY_CODE 5
12/23/2022 03:36:20 AM script INFO: SUCCESS!@#KODE 1!@#USER_ID 102!@#ACTIVITY_CODE 5
12/23/2022 03:36:23 AM script INFO: SUCCESS!@#KODE 1!@#USER_ID 102!@#ACTIVITY_CODE 2
12/23/2022 03:36:23 AM script INFO: SUCCESS!@#KODE 1!@#USER_ID 102!@#ACTIVITY_CODE 5
12/23/2022 03:36:23 AM script INFO: SUCCESS!@#KODE 1!@#USER_ID 102!@#ACTIVITY_CODE 5
12/23/2022 03:36:26 AM script INFO: SUCCESS!@#KODE 1!@#USER_ID 102!@#ACTIVITY_CODE 4
12/23/2022 03:36:26 AM script INFO: SUCCESS!@#KODE 1!@#USER_ID 102!@#ACTIVITY_CODE 5
12/23/2022 03:36:26 AM script INFO: SUCCESS!@#KODE 1!@#USER_ID 102!@#ACTIVITY_CODE 5
12/23/2022 03:36:28 AM script INFO: SUCCESS!@#KODE 1!@#USER_ID 102!@#ACTIVITY_CODE 2
12/23/2022 03:36:29 AM script INFO: SUCCESS!@#KODE 1!@#USER_ID 102!@#ACTIVITY_CODE 1
12/23/2022 03:36:29 AM script INFO: SUCCESS!@#KODE 1!@#USER_ID 102!@#ACTIVITY_CODE 3
12/23/2022 03:36:29 AM script INFO: SUCCESS!@#KODE 1!@#USER_ID 102!@#ACTIVITY_CODE 4
12/23/2022 03:36:29 AM script INFO: SUCCESS!@#KODE 1!@#USER_ID 102!@#ACTIVITY_CODE 2
12/23/2022 03:36:30 AM script INFO: SUCCESS!@#KODE 1!@#USER_ID 102!@#ACTIVITY_CODE 2
12/23/2022 03:36:30 AM script INFO: SUCCESS!@#KODE 1!@#USER_ID 102!@#ACTIVITY_CODE 2
12/23/2022 03:36:30 AM script INFO: SUCCESS!@#KODE 1!@#USER_ID 102!@#ACTIVITY_CODE 3
12/23/2022 03:36:30 AM script INFO: SUCCESS!@#KODE 1!@#USER_ID 102!@#ACTIVITY_CODE 2
12/23/2022 03:36:31 AM script INFO: SUCCESS!@#KODE 1!@#USER_ID 102!@#ACTIVITY_CODE 2
12/23/2022 03:36:31 AM script INFO: SUCCESS!@#KODE 1!@#USER_ID 102!@#ACTIVITY_CODE 4
12/23/2022 03:36:31 AM script INFO: SUCCESS!@#KODE 1!@#USER_ID 102!@#ACTIVITY_CODE 2
12/23/2022 03:36:31 AM script INFO: SUCCESS!@#KODE 1!@#USER_ID 102!@#ACTIVITY_CODE 3
12/23/2022 03:36:32 AM script INFO: SUCCESS!@#KODE 1!@#USER_ID 102!@#ACTIVITY_CODE 2
12/23/2022 03:36:32 AM script INFO: SUCCESS!@#KODE 1!@#USER_ID 102!@#ACTIVITY_CODE 3
12/23/2022 03:36:32 AM script INFO: SUCCESS!@#KODE 1!@#USER_ID 102!@#ACTIVITY_CODE 1
12/23/2022 03:36:32 AM script INFO: SUCCESS!@#KODE 1!@#USER_ID 102!@#ACTIVITY_CODE 3
12/23/2022 03:36:32 AM script INFO: SUCCESS!@#KODE 1!@#USER_ID 102!@#ACTIVITY_CODE 1
12/23/2022 03:36:32 AM script INFO: SUCCESS!@#KODE 1!@#USER_ID 102!@#ACTIVITY_CODE 3
12/23/2022 03:36:33 AM script INFO: SUCCESS!@#KODE 1!@#USER_ID 102!@#ACTIVITY_CODE 2
12/23/2022 03:36:33 AM script INFO: SUCCESS!@#KODE 1!@#USER_ID 102!@#ACTIVITY_CODE 2
12/23/2022 03:36:33 AM script INFO: SUCCESS!@#KODE 1!@#USER_ID 102!@#ACTIVITY_CODE 2
12/23/2022 03:36:33 AM script INFO: SUCCESS!@#KODE 1!@#USER_ID 102!@#ACTIVITY_CODE 1
12/23/2022 03:36:33 AM script INFO: SUCCESS!@#KODE 1!@#USER_ID 102!@#ACTIVITY_CODE 1
12/23/2022 03:36:33 AM script INFO: SUCCESS!@#KODE 1!@#USER_ID 102!@#ACTIVITY_CODE 1
12/23/2022 03:36:34 AM script INFO: SUCCESS!@#KODE 1!@#USER_ID 102!@#ACTIVITY_CODE 3
12/23/2022 03:36:34 AM script INFO: SUCCESS!@#KODE 1!@#USER_ID 102!@#ACTIVITY_CODE 2
12/23/2022 03:36:34 AM script INFO: SUCCESS!@#KODE 1!@#USER_ID 102!@#ACTIVITY_CODE 1
12/23/2022 03:36:34 AM script INFO: SUCCESS!@#KODE 1!@#USER_ID 102!@#ACTIVITY_CODE 4
12/23/2022 03:36:34 AM script INFO: SUCCESS!@#KODE 1!@#USER_ID 102!@#ACTIVITY_CODE 3
12/23/2022 03:36:34 AM script INFO: SUCCESS!@#KODE 1!@#USER_ID 102!@#ACTIVITY_CODE 1
12/23/2022 03:36:35 AM script INFO: SUCCESS!@#KODE 1!@#USER_ID 102!@#ACTIVITY_CODE 3
12/23/2022 03:36:35 AM script INFO: SUCCESS!@#KODE 1!@#USER_ID 102!@#ACTIVITY_CODE 3
12/23/2022 03:36:35 AM script INFO: SUCCESS!@#KODE 1!@#USER_ID 102!@#ACTIVITY_CODE 4
12/23/2022 03:36:35 AM script INFO: SUCCESS!@#KODE 1!@#USER_ID 102!@#ACTIVITY_CODE 2
12/23/2022 03:36:35 AM script INFO: SUCCESS!@#KODE 1!@#USER_ID 102!@#ACTIVITY_CODE 2
12/23/2022 03:36:35 AM script INFO: SUCCESS!@#KODE 1!@#USER_ID 102!@#ACTIVITY_CODE 1
12/23/2022 03:36:36 AM script INFO: SUCCESS!@#KODE 1!@#USER_ID 102!@#ACTIVITY_CODE 1
12/23/2022 03:36:36 AM script INFO: SUCCESS!@#KODE 1!@#USER_ID 102!@#ACTIVITY_CODE 2
12/23/2022 03:36:36 AM script INFO: SUCCESS!@#KODE 1!@#USER_ID 102!@#ACTIVITY_CODE 1
12/23/2022 03:36:36 AM script INFO: SUCCESS!@#KODE 1!@#USER_ID 102!@#ACTIVITY_CODE 2
12/23/2022 03:36:37 AM script INFO: SUCCESS!@#KODE 1!@#USER_ID 102!@#ACTIVITY_CODE 2
12/23/2022 03:36:37 AM script INFO: SUCCESS!@#KODE 1!@#USER_ID 102!@#ACTIVITY_CODE 1
12/23/2022 03:36:37 AM script INFO: SUCCESS!@#KODE 1!@#USER_ID 102!@#ACTIVITY_CODE 3
12/23/2022 03:36:37 AM script INFO: SUCCESS!@#KODE 1!@#USER_ID 102!@#ACTIVITY_CODE 3
12/23/2022 03:36:37 AM script INFO: SUCCESS!@#KODE 1!@#USER_ID 102!@#ACTIVITY_CODE 3
12/23/2022 03:36:37 AM script INFO: SUCCESS!@#KODE 1!@#USER_ID 102!@#ACTIVITY_CODE 2
12/23/2022 03:36:38 AM script INFO: SUCCESS!@#KODE 1!@#USER_ID 102!@#ACTIVITY_CODE 2
12/23/2022 03:36:38 AM script INFO: SUCCESS!@#KODE 1!@#USER_ID 102!@#ACTIVITY_CODE 3
12/23/2022 03:36:38 AM script INFO: SUCCESS!@#KODE 1!@#USER_ID 102!@#ACTIVITY_CODE 1
12/23/2022 03:36:38 AM script INFO: SUCCESS!@#KODE 1!@#USER_ID 102!@#ACTIVITY_CODE 3
12/23/2022 03:36:38 AM script INFO: SUCCESS!@#KODE 1!@#USER_ID 102!@#ACTIVITY_CODE 3
12/23/2022 03:36:38 AM script INFO: SUCCESS!@#KODE 1!@#USER_ID 102!@#ACTIVITY_CODE 3
12/23/2022 03:36:39 AM script INFO: SUCCESS!@#KODE 1!@#USER_ID 102!@#ACTIVITY_CODE 1
12/23/2022 03:36:39 AM script INFO: SUCCESS!@#KODE 1!@#USER_ID 102!@#ACTIVITY_CODE 2
12/23/2022 03:36:39 AM script INFO: SUCCESS!@#KODE 1!@#USER_ID 102!@#ACTIVITY_CODE 2
12/23/2022 03:36:39 AM script INFO: SUCCESS!@#KODE 1!@#USER_ID 102!@#ACTIVITY_CODE 3
12/23/2022 03:36:39 AM script INFO: SUCCESS!@#KODE 1!@#USER_ID 102!@#ACTIVITY_CODE 1
12/23/2022 03:36:40 AM script INFO: SUCCESS!@#KODE 1!@#USER_ID 102!@#ACTIVITY_CODE 1
12/23/2022 03:36:40 AM script INFO: SUCCESS!@#KODE 1!@#USER_ID 102!@#ACTIVITY_CODE 3
12/23/2022 03:36:40 AM script INFO: SUCCESS!@#KODE 1!@#USER_ID 102!@#ACTIVITY_CODE 3
12/23/2022 03:36:40 AM script INFO: SUCCESS!@#KODE 1!@#USER_ID 102!@#ACTIVITY_CODE 2
12/23/2022 03:36:40 AM script INFO: SUCCESS!@#KODE 1!@#USER_ID 102!@#ACTIVITY_CODE 4
12/23/2022 03:36:40 AM script INFO: SUCCESS!@#KODE 1!@#USER_ID 102!@#ACTIVITY_CODE 1
12/23/2022 03:36:41 AM script INFO: SUCCESS!@#KODE 1!@#USER_ID 102!@#ACTIVITY_CODE 3
12/23/2022 03:36:41 AM script INFO: SUCCESS!@#KODE 1!@#USER_ID 102!@#ACTIVITY_CODE 4
12/23/2022 03:36:41 AM script INFO: SUCCESS!@#KODE 1!@#USER_ID 102!@#ACTIVITY_CODE 3
12/23/2022 03:36:41 AM script INFO: SUCCESS!@#KODE 1!@#USER_ID 102!@#ACTIVITY_CODE 2
12/23/2022 03:36:41 AM script INFO: SUCCESS!@#KODE 1!@#USER_ID 102!@#ACTIVITY_CODE 3
12/23/2022 03:36:42 AM script INFO: SUCCESS!@#KODE 1!@#USER_ID 102!@#ACTIVITY_CODE 4
12/23/2022 03:36:42 AM script INFO: SUCCESS!@#KODE 1!@#USER_ID 102!@#ACTIVITY_CODE 3
12/23/2022 03:36:42 AM script INFO: SUCCESS!@#KODE 1!@#USER_ID 102!@#ACTIVITY_CODE 1
12/23/2022 03:36:42 AM script INFO: SUCCESS!@#KODE 1!@#USER_ID 102!@#ACTIVITY_CODE 1
12/23/2022 03:36:42 AM script INFO: SUCCESS!@#KODE 1!@#USER_ID 102!@#ACTIVITY_CODE 3
12/23/2022 03:36:42 AM script INFO: SUCCESS!@#KODE 1!@#USER_ID 102!@#ACTIVITY_CODE 2
12/23/2022 03:36:42 AM script INFO: SUCCESS!@#KODE 1!@#USER_ID 102!@#ACTIVITY_CODE 1
12/23/2022 03:36:43 AM script INFO: SUCCESS!@#KODE 1!@#USER_ID 102!@#ACTIVITY_CODE 3
12/23/2022 03:36:43 AM script INFO: SUCCESS!@#KODE 1!@#USER_ID 102!@#ACTIVITY_CODE 3
12/23/2022 03:36:43 AM script INFO: SUCCESS!@#KODE 1!@#USER_ID 102!@#ACTIVITY_CODE 4
12/23/2022 03:36:43 AM script INFO: SUCCESS!@#KODE 1!@#USER_ID 102!@#ACTIVITY_CODE 1
12/23/2022 03:36:43 AM script INFO: SUCCESS!@#KODE 1!@#USER_ID 102!@#ACTIVITY_CODE 4
12/23/2022 03:36:43 AM script INFO: SUCCESS!@#KODE 1!@#USER_ID 102!@#ACTIVITY_CODE 2
12/23/2022 03:36:43 AM script INFO: SUCCESS!@#KODE 1!@#USER_ID 102!@#ACTIVITY_CODE 4
12/23/2022 03:36:44 AM script INFO: SUCCESS!@#KODE 1!@#USER_ID 102!@#ACTIVITY_CODE 2
12/23/2022 03:36:44 AM script INFO: SUCCESS!@#KODE 1!@#USER_ID 102!@#ACTIVITY_CODE 1
12/23/2022 03:36:44 AM script INFO: SUCCESS!@#KODE 1!@#USER_ID 102!@#ACTIVITY_CODE 2
12/23/2022 03:36:44 AM script INFO: SUCCESS!@#KODE 1!@#USER_ID 102!@#ACTIVITY_CODE 4
12/23/2022 03:36:44 AM script INFO: SUCCESS!@#KODE 1!@#USER_ID 102!@#ACTIVITY_CODE 1
12/23/2022 03:36:45 AM script INFO: SUCCESS!@#KODE 1!@#USER_ID 102!@#ACTIVITY_CODE 2
12/23/2022 03:36:45 AM script INFO: SUCCESS!@#KODE 1!@#USER_ID 102!@#ACTIVITY_CODE 3
12/23/2022 03:36:45 AM script INFO: SUCCESS!@#KODE 1!@#USER_ID 102!@#ACTIVITY_CODE 1
12/23/2022 03:36:45 AM script INFO: SUCCESS!@#KODE 1!@#USER_ID 102!@#ACTIVITY_CODE 3
12/23/2022 03:36:45 AM script INFO: SUCCESS!@#KODE 1!@#USER_ID 102!@#ACTIVITY_CODE 1
12/23/2022 03:36:45 AM script INFO: SUCCESS!@#KODE 1!@#USER_ID 102!@#ACTIVITY_CODE 3
12/23/2022 03:36:45 AM script INFO: SUCCESS!@#KODE 1!@#USER_ID 102!@#ACTIVITY_CODE 4
12/23/2022 03:36:46 AM script INFO: SUCCESS!@#KODE 1!@#USER_ID 102!@#ACTIVITY_CODE 2
12/23/2022 03:36:46 AM script INFO: SUCCESS!@#KODE 1!@#USER_ID 102!@#ACTIVITY_CODE 1
12/23/2022 03:36:46 AM script INFO: SUCCESS!@#KODE 1!@#USER_ID 102!@#ACTIVITY_CODE 1
12/23/2022 03:36:46 AM script INFO: SUCCESS!@#KODE 1!@#USER_ID 102!@#ACTIVITY_CODE 3
12/23/2022 03:36:46 AM script INFO: SUCCESS!@#KODE 1!@#USER_ID 102!@#ACTIVITY_CODE 4
12/23/2022 03:36:46 AM script INFO: SUCCESS!@#KODE 1!@#USER_ID 102!@#ACTIVITY_CODE 3
12/23/2022 03:36:46 AM script INFO: SUCCESS!@#KODE 1!@#USER_ID 102!@#ACTIVITY_CODE 1
12/23/2022 03:36:46 AM script INFO: SUCCESS!@#KODE 1!@#USER_ID 102!@#ACTIVITY_CODE 1
12/23/2022 03:36:47 AM script INFO: SUCCESS!@#KODE 1!@#USER_ID 102!@#ACTIVITY_CODE 4
12/23/2022 03:36:47 AM script INFO: SUCCESS!@#KODE 1!@#USER_ID 102!@#ACTIVITY_CODE 3
12/23/2022 03:36:47 AM script INFO: SUCCESS!@#KODE 1!@#USER_ID 102!@#ACTIVITY_CODE 3
12/23/2022 03:36:47 AM script INFO: SUCCESS!@#KODE 1!@#USER_ID 102!@#ACTIVITY_CODE 1
12/23/2022 03:36:47 AM script INFO: SUCCESS!@#KODE 1!@#USER_ID 102!@#ACTIVITY_CODE 1
12/23/2022 03:36:47 AM script INFO: SUCCESS!@#KODE 1!@#USER_ID 102!@#ACTIVITY_CODE 4
12/23/2022 03:36:47 AM script INFO: SUCCESS!@#KODE 1!@#USER_ID 102!@#ACTIVITY_CODE 1
12/23/2022 03:36:47 AM script INFO: SUCCESS!@#KODE 1!@#USER_ID 102!@#ACTIVITY_CODE 4
12/23/2022 03:36:48 AM script INFO: SUCCESS!@#KODE 1!@#USER_ID 102!@#ACTIVITY_CODE 2
12/23/2022 03:36:48 AM script INFO: SUCCESS!@#KODE 1!@#USER_ID 102!@#ACTIVITY_CODE 2
12/23/2022 03:36:48 AM script INFO: SUCCESS!@#KODE 1!@#USER_ID 102!@#ACTIVITY_CODE 4
12/23/2022 03:36:48 AM script INFO: SUCCESS!@#KODE 1!@#USER_ID 102!@#ACTIVITY_CODE 1
12/23/2022 03:36:49 AM script INFO: SUCCESS!@#KODE 1!@#USER_ID 102!@#ACTIVITY_CODE 2
12/23/2022 03:36:49 AM script INFO: SUCCESS!@#KODE 1!@#USER_ID 102!@#ACTIVITY_CODE 3
12/23/2022 03:36:49 AM script INFO: SUCCESS!@#KODE 1!@#USER_ID 102!@#ACTIVITY_CODE 2
12/23/2022 03:36:49 AM script INFO: SUCCESS!@#KODE 1!@#USER_ID 102!@#ACTIVITY_CODE 2
12/23/2022 03:36:49 AM script INFO: SUCCESS!@#KODE 1!@#USER_ID 102!@#ACTIVITY_CODE 3
12/23/2022 03:36:50 AM script INFO: SUCCESS!@#KODE 1!@#USER_ID 102!@#ACTIVITY_CODE 1
12/23/2022 03:36:50 AM script INFO: SUCCESS!@#KODE 1!@#USER_ID 102!@#ACTIVITY_CODE 4
12/23/2022 03:36:50 AM script INFO: SUCCESS!@#KODE 1!@#USER_ID 102!@#ACTIVITY_CODE 3
12/23/2022 03:36:50 AM script INFO: SUCCESS!@#KODE 1!@#USER_ID 102!@#ACTIVITY_CODE 2
12/23/2022 03:36:50 AM script INFO: SUCCESS!@#KODE 1!@#USER_ID 102!@#ACTIVITY_CODE 1
12/23/2022 03:36:50 AM script INFO: SUCCESS!@#KODE 1!@#USER_ID 102!@#ACTIVITY_CODE 1
12/23/2022 03:36:50 AM script INFO: SUCCESS!@#KODE 1!@#USER_ID 102!@#ACTIVITY_CODE 1
12/23/2022 03:36:51 AM script INFO: SUCCESS!@#KODE 1!@#USER_ID 102!@#ACTIVITY_CODE 4
12/23/2022 03:36:51 AM script INFO: SUCCESS!@#KODE 1!@#USER_ID 102!@#ACTIVITY_CODE 3
12/23/2022 03:36:51 AM script INFO: SUCCESS!@#KODE 1!@#USER_ID 102!@#ACTIVITY_CODE 2
12/23/2022 03:36:51 AM script INFO: SUCCESS!@#KODE 1!@#USER_ID 102!@#ACTIVITY_CODE 1
12/23/2022 03:36:51 AM script INFO: SUCCESS!@#KODE 1!@#USER_ID 102!@#ACTIVITY_CODE 2
12/23/2022 03:36:52 AM script INFO: SUCCESS!@#KODE 1!@#USER_ID 102!@#ACTIVITY_CODE 1
12/23/2022 03:36:52 AM script INFO: SUCCESS!@#KODE 1!@#USER_ID 102!@#ACTIVITY_CODE 4
12/23/2022 03:36:52 AM script INFO: SUCCESS!@#KODE 1!@#USER_ID 102!@#ACTIVITY_CODE 1
12/23/2022 03:36:52 AM script INFO: SUCCESS!@#KODE 1!@#USER_ID 102!@#ACTIVITY_CODE 3
12/23/2022 03:36:52 AM script INFO: SUCCESS!@#KODE 1!@#USER_ID 102!@#ACTIVITY_CODE 3
12/23/2022 03:36:53 AM script INFO: SUCCESS!@#KODE 1!@#USER_ID 102!@#ACTIVITY_CODE 2
12/23/2022 03:36:53 AM script INFO: SUCCESS!@#KODE 1!@#USER_ID 102!@#ACTIVITY_CODE 1
12/23/2022 03:36:53 AM script INFO: SUCCESS!@#KODE 1!@#USER_ID 102!@#ACTIVITY_CODE 4
12/23/2022 03:36:53 AM script INFO: SUCCESS!@#KODE 1!@#USER_ID 102!@#ACTIVITY_CODE 3
12/23/2022 03:36:53 AM script INFO: SUCCESS!@#KODE 1!@#USER_ID 102!@#ACTIVITY_CODE 1
12/23/2022 03:36:53 AM script INFO: SUCCESS!@#KODE 1!@#USER_ID 102!@#ACTIVITY_CODE 1
12/23/2022 03:36:53 AM script INFO: SUCCESS!@#KODE 1!@#USER_ID 102!@#ACTIVITY_CODE 1
12/23/2022 03:36:53 AM script INFO: SUCCESS!@#KODE 1!@#USER_ID 102!@#ACTIVITY_CODE 3
12/23/2022 03:36:54 AM script INFO: SUCCESS!@#KODE 1!@#USER_ID 102!@#ACTIVITY_CODE 4
12/23/2022 03:36:54 AM script INFO: SUCCESS!@#KODE 1!@#USER_ID 102!@#ACTIVITY_CODE 2
12/23/2022 03:36:54 AM script INFO: SUCCESS!@#KODE 1!@#USER_ID 102!@#ACTIVITY_CODE 1
12/23/2022 03:36:54 AM script INFO: SUCCESS!@#KODE 1!@#USER_ID 102!@#ACTIVITY_CODE 1
12/23/2022 03:36:54 AM script INFO: SUCCESS!@#KODE 1!@#USER_ID 102!@#ACTIVITY_CODE 3
12/23/2022 03:36:54 AM script INFO: SUCCESS!@#KODE 1!@#USER_ID 102!@#ACTIVITY_CODE 2
12/23/2022 03:36:55 AM script INFO: SUCCESS!@#KODE 1!@#USER_ID 102!@#ACTIVITY_CODE 2
12/23/2022 03:36:55 AM script INFO: SUCCESS!@#KODE 1!@#USER_ID 102!@#ACTIVITY_CODE 3
12/23/2022 03:36:55 AM script INFO: SUCCESS!@#KODE 1!@#USER_ID 102!@#ACTIVITY_CODE 4
12/23/2022 03:36:55 AM script INFO: SUCCESS!@#KODE 1!@#USER_ID 102!@#ACTIVITY_CODE 3
12/23/2022 03:36:55 AM script INFO: SUCCESS!@#KODE 1!@#USER_ID 102!@#ACTIVITY_CODE 1
12/23/2022 03:36:56 AM script INFO: SUCCESS!@#KODE 1!@#USER_ID 102!@#ACTIVITY_CODE 2
12/23/2022 03:36:56 AM script INFO: SUCCESS!@#KODE 1!@#USER_ID 102!@#ACTIVITY_CODE 3
12/23/2022 03:36:56 AM script INFO: SUCCESS!@#KODE 1!@#USER_ID 102!@#ACTIVITY_CODE 2
12/23/2022 03:36:56 AM script INFO: SUCCESS!@#KODE 1!@#USER_ID 102!@#ACTIVITY_CODE 1
12/23/2022 03:36:56 AM script INFO: SUCCESS!@#KODE 1!@#USER_ID 102!@#ACTIVITY_CODE 1
12/23/2022 03:36:56 AM script INFO: SUCCESS!@#KODE 1!@#USER_ID 102!@#ACTIVITY_CODE 3
12/23/2022 03:36:57 AM script INFO: SUCCESS!@#KODE 1!@#USER_ID 102!@#ACTIVITY_CODE 4
12/23/2022 03:36:57 AM script INFO: SUCCESS!@#KODE 1!@#USER_ID 102!@#ACTIVITY_CODE 1
12/23/2022 03:36:57 AM script INFO: SUCCESS!@#KODE 1!@#USER_ID 102!@#ACTIVITY_CODE 4
12/23/2022 03:36:57 AM script INFO: SUCCESS!@#KODE 1!@#USER_ID 102!@#ACTIVITY_CODE 1
12/23/2022 03:36:57 AM script INFO: SUCCESS!@#KODE 1!@#USER_ID 102!@#ACTIVITY_CODE 2
12/23/2022 03:36:57 AM script INFO: SUCCESS!@#KODE 1!@#USER_ID 102!@#ACTIVITY_CODE 3
12/23/2022 03:36:58 AM script INFO: SUCCESS!@#KODE 1!@#USER_ID 102!@#ACTIVITY_CODE 4
12/23/2022 03:36:58 AM script INFO: SUCCESS!@#KODE 1!@#USER_ID 102!@#ACTIVITY_CODE 2
12/23/2022 03:36:58 AM script INFO: SUCCESS!@#KODE 1!@#USER_ID 102!@#ACTIVITY_CODE 1
12/23/2022 03:36:58 AM script INFO: SUCCESS!@#KODE 1!@#USER_ID 102!@#ACTIVITY_CODE 1
12/23/2022 03:36:58 AM script INFO: SUCCESS!@#KODE 1!@#USER_ID 102!@#ACTIVITY_CODE 3
12/23/2022 03:36:58 AM script INFO: SUCCESS!@#KODE 1!@#USER_ID 102!@#ACTIVITY_CODE 1
12/23/2022 03:36:58 AM script INFO: SUCCESS!@#KODE 1!@#USER_ID 102!@#ACTIVITY_CODE 1
12/23/2022 03:36:58 AM script INFO: SUCCESS!@#KODE 1!@#USER_ID 102!@#ACTIVITY_CODE 3
12/23/2022 03:36:59 AM script INFO: SUCCESS!@#KODE 1!@#USER_ID 102!@#ACTIVITY_CODE 1
12/23/2022 03:36:59 AM script INFO: SUCCESS!@#KODE 1!@#USER_ID 102!@#ACTIVITY_CODE 1
12/23/2022 03:36:59 AM script INFO: SUCCESS!@#KODE 1!@#USER_ID 102!@#ACTIVITY_CODE 3
12/23/2022 03:36:59 AM script INFO: SUCCESS!@#KODE 1!@#USER_ID 102!@#ACTIVITY_CODE 1
12/23/2022 03:36:59 AM script INFO: SUCCESS!@#KODE 1!@#USER_ID 102!@#ACTIVITY_CODE 2
12/23/2022 03:36:59 AM script INFO: SUCCESS!@#KODE 1!@#USER_ID 102!@#ACTIVITY_CODE 1
12/23/2022 03:37:00 AM script INFO: SUCCESS!@#KODE 1!@#USER_ID 102!@#ACTIVITY_CODE 2
12/23/2022 03:37:00 AM script INFO: SUCCESS!@#KODE 1!@#USER_ID 102!@#ACTIVITY_CODE 3
12/23/2022 03:37:00 AM script INFO: SUCCESS!@#KODE 1!@#USER_ID 102!@#ACTIVITY_CODE 2
12/23/2022 03:37:00 AM script INFO: SUCCESS!@#KODE 1!@#USER_ID 102!@#ACTIVITY_CODE 1
12/23/2022 03:37:00 AM script INFO: SUCCESS!@#KODE 1!@#USER_ID 102!@#ACTIVITY_CODE 2
12/23/2022 03:37:00 AM script INFO: SUCCESS!@#KODE 1!@#USER_ID 102!@#ACTIVITY_CODE 1
12/23/2022 03:37:01 AM script INFO: SUCCESS!@#KODE 1!@#USER_ID 102!@#ACTIVITY_CODE 1
12/23/2022 03:37:01 AM script INFO: SUCCESS!@#KODE 1!@#USER_ID 102!@#ACTIVITY_CODE 2
12/23/2022 03:37:01 AM script INFO: SUCCESS!@#KODE 1!@#USER_ID 102!@#ACTIVITY_CODE 1
12/23/2022 03:37:01 AM script INFO: SUCCESS!@#KODE 1!@#USER_ID 102!@#ACTIVITY_CODE 1
12/23/2022 03:37:01 AM script INFO: SUCCESS!@#KODE 1!@#USER_ID 102!@#ACTIVITY_CODE 4
12/23/2022 03:37:02 AM script INFO: SUCCESS!@#KODE 1!@#USER_ID 102!@#ACTIVITY_CODE 2
12/23/2022 03:37:02 AM script INFO: SUCCESS!@#KODE 1!@#USER_ID 102!@#ACTIVITY_CODE 3
12/23/2022 03:37:02 AM script INFO: SUCCESS!@#KODE 1!@#USER_ID 102!@#ACTIVITY_CODE 2
12/23/2022 03:37:02 AM script INFO: SUCCESS!@#KODE 1!@#USER_ID 102!@#ACTIVITY_CODE 1
12/23/2022 03:37:03 AM script INFO: SUCCESS!@#KODE 1!@#USER_ID 102!@#ACTIVITY_CODE 2
12/23/2022 03:37:03 AM script INFO: SUCCESS!@#KODE 1!@#USER_ID 102!@#ACTIVITY_CODE 3
12/23/2022 03:37:03 AM script INFO: SUCCESS!@#KODE 1!@#USER_ID 102!@#ACTIVITY_CODE 2
12/23/2022 03:37:03 AM script INFO: SUCCESS!@#KODE 1!@#USER_ID 102!@#ACTIVITY_CODE 1
12/23/2022 03:37:04 AM script INFO: SUCCESS!@#KODE 1!@#USER_ID 102!@#ACTIVITY_CODE 2
12/23/2022 03:37:04 AM script INFO: SUCCESS!@#KODE 1!@#USER_ID 102!@#ACTIVITY_CODE 1
12/23/2022 03:37:04 AM script INFO: SUCCESS!@#KODE 1!@#USER_ID 102!@#ACTIVITY_CODE 2
12/23/2022 03:37:04 AM script INFO: SUCCESS!@#KODE 1!@#USER_ID 102!@#ACTIVITY_CODE 2
12/23/2022 03:37:05 AM script INFO: SUCCESS!@#KODE 1!@#USER_ID 102!@#ACTIVITY_CODE 1
12/23/2022 03:37:05 AM script INFO: SUCCESS!@#KODE 1!@#USER_ID 102!@#ACTIVITY_CODE 3
12/23/2022 03:37:05 AM script INFO: SUCCESS!@#KODE 1!@#USER_ID 102!@#ACTIVITY_CODE 3
12/23/2022 03:37:05 AM script INFO: SUCCESS!@#KODE 1!@#USER_ID 102!@#ACTIVITY_CODE 2
12/23/2022 03:37:05 AM script INFO: SUCCESS!@#KODE 1!@#USER_ID 102!@#ACTIVITY_CODE 3
12/23/2022 03:37:06 AM script INFO: SUCCESS!@#KODE 1!@#USER_ID 102!@#ACTIVITY_CODE 3
12/23/2022 03:37:06 AM script INFO: SUCCESS!@#KODE 1!@#USER_ID 102!@#ACTIVITY_CODE 4
12/23/2022 03:37:06 AM script INFO: SUCCESS!@#KODE 1!@#USER_ID 102!@#ACTIVITY_CODE 3
12/23/2022 03:37:06 AM script INFO: SUCCESS!@#KODE 1!@#USER_ID 102!@#ACTIVITY_CODE 1
12/23/2022 03:37:06 AM script INFO: SUCCESS!@#KODE 1!@#USER_ID 102!@#ACTIVITY_CODE 3
12/23/2022 03:37:06 AM script INFO: SUCCESS!@#KODE 1!@#USER_ID 102!@#ACTIVITY_CODE 1
12/23/2022 03:37:06 AM script INFO: SUCCESS!@#KODE 1!@#USER_ID 102!@#ACTIVITY_CODE 1
12/23/2022 03:37:07 AM script INFO: SUCCESS!@#KODE 1!@#USER_ID 102!@#ACTIVITY_CODE 2
12/23/2022 03:37:07 AM script INFO: SUCCESS!@#KODE 1!@#USER_ID 102!@#ACTIVITY_CODE 3
12/23/2022 03:37:07 AM script INFO: SUCCESS!@#KODE 1!@#USER_ID 102!@#ACTIVITY_CODE 2
12/23/2022 03:37:07 AM script INFO: SUCCESS!@#KODE 1!@#USER_ID 102!@#ACTIVITY_CODE 3
12/23/2022 03:37:08 AM script INFO: SUCCESS!@#KODE 1!@#USER_ID 102!@#ACTIVITY_CODE 2
12/23/2022 03:37:08 AM script INFO: SUCCESS!@#KODE 1!@#USER_ID 102!@#ACTIVITY_CODE 2
12/23/2022 03:37:08 AM script INFO: SUCCESS!@#KODE 1!@#USER_ID 102!@#ACTIVITY_CODE 4
12/23/2022 03:37:09 AM script INFO: SUCCESS!@#KODE 1!@#USER_ID 102!@#ACTIVITY_CODE 2
12/23/2022 03:37:09 AM script INFO: SUCCESS!@#KODE 1!@#USER_ID 102!@#ACTIVITY_CODE 3
12/23/2022 03:37:09 AM script INFO: SUCCESS!@#KODE 1!@#USER_ID 102!@#ACTIVITY_CODE 4
12/23/2022 03:37:09 AM script INFO: SUCCESS!@#KODE 1!@#USER_ID 102!@#ACTIVITY_CODE 1
12/23/2022 03:37:09 AM script INFO: SUCCESS!@#KODE 1!@#USER_ID 102!@#ACTIVITY_CODE 1
12/23/2022 03:37:09 AM script INFO: SUCCESS!@#KODE 1!@#USER_ID 102!@#ACTIVITY_CODE 3
12/23/2022 03:37:10 AM script INFO: SUCCESS!@#KODE 1!@#USER_ID 102!@#ACTIVITY_CODE 4
12/23/2022 03:37:10 AM script INFO: SUCCESS!@#KODE 1!@#USER_ID 102!@#ACTIVITY_CODE 2
12/23/2022 03:37:10 AM script INFO: SUCCESS!@#KODE 1!@#USER_ID 102!@#ACTIVITY_CODE 3
12/23/2022 03:37:11 AM script INFO: SUCCESS!@#KODE 1!@#USER_ID 102!@#ACTIVITY_CODE 3
12/23/2022 03:37:11 AM script INFO: SUCCESS!@#KODE 1!@#USER_ID 102!@#ACTIVITY_CODE 1
12/23/2022 03:37:11 AM script INFO: SUCCESS!@#KODE 1!@#USER_ID 102!@#ACTIVITY_CODE 3
12/23/2022 03:37:11 AM script INFO: SUCCESS!@#KODE 1!@#USER_ID 102!@#ACTIVITY_CODE 4
12/23/2022 03:37:11 AM script INFO: SUCCESS!@#KODE 1!@#USER_ID 102!@#ACTIVITY_CODE 2
12/23/2022 03:37:12 AM script INFO: SUCCESS!@#KODE 1!@#USER_ID 102!@#ACTIVITY_CODE 2
12/23/2022 03:37:12 AM script INFO: SUCCESS!@#KODE 1!@#USER_ID 102!@#ACTIVITY_CODE 3
12/23/2022 03:37:12 AM script INFO: SUCCESS!@#KODE 1!@#USER_ID 102!@#ACTIVITY_CODE 2
12/23/2022 03:37:12 AM script INFO: SUCCESS!@#KODE 1!@#USER_ID 102!@#ACTIVITY_CODE 1
12/23/2022 03:37:12 AM script INFO: SUCCESS!@#KODE 1!@#USER_ID 102!@#ACTIVITY_CODE 4
12/23/2022 03:37:13 AM script INFO: SUCCESS!@#KODE 1!@#USER_ID 102!@#ACTIVITY_CODE 2
12/23/2022 03:37:13 AM script INFO: SUCCESS!@#KODE 1!@#USER_ID 102!@#ACTIVITY_CODE 3
12/23/2022 03:37:13 AM script INFO: SUCCESS!@#KODE 1!@#USER_ID 102!@#ACTIVITY_CODE 2
12/23/2022 03:37:13 AM script INFO: SUCCESS!@#KODE 1!@#USER_ID 102!@#ACTIVITY_CODE 3
12/23/2022 03:37:14 AM script INFO: SUCCESS!@#KODE 1!@#USER_ID 102!@#ACTIVITY_CODE 2
12/23/2022 03:37:14 AM script INFO: SUCCESS!@#KODE 1!@#USER_ID 102!@#ACTIVITY_CODE 3
12/23/2022 03:37:14 AM script INFO: SUCCESS!@#KODE 1!@#USER_ID 102!@#ACTIVITY_CODE 3
12/23/2022 03:37:14 AM script INFO: SUCCESS!@#KODE 1!@#USER_ID 102!@#ACTIVITY_CODE 2
12/23/2022 03:37:14 AM script INFO: SUCCESS!@#KODE 1!@#USER_ID 102!@#ACTIVITY_CODE 2
12/23/2022 03:37:15 AM script INFO: SUCCESS!@#KODE 1!@#USER_ID 102!@#ACTIVITY_CODE 2
12/23/2022 03:37:15 AM script INFO: SUCCESS!@#KODE 1!@#USER_ID 102!@#ACTIVITY_CODE 2
12/23/2022 03:37:15 AM script INFO: SUCCESS!@#KODE 1!@#USER_ID 102!@#ACTIVITY_CODE 1
12/23/2022 03:37:15 AM script INFO: SUCCESS!@#KODE 1!@#USER_ID 102!@#ACTIVITY_CODE 3
12/23/2022 03:37:15 AM script INFO: SUCCESS!@#KODE 1!@#USER_ID 102!@#ACTIVITY_CODE 3
12/23/2022 03:37:16 AM script INFO: SUCCESS!@#KODE 1!@#USER_ID 102!@#ACTIVITY_CODE 3
12/23/2022 03:37:16 AM script INFO: SUCCESS!@#KODE 1!@#USER_ID 102!@#ACTIVITY_CODE 3
12/23/2022 03:37:16 AM script INFO: SUCCESS!@#KODE 1!@#USER_ID 102!@#ACTIVITY_CODE 3
12/23/2022 03:37:16 AM script INFO: SUCCESS!@#KODE 1!@#USER_ID 102!@#ACTIVITY_CODE 2
12/23/2022 03:37:16 AM script INFO: SUCCESS!@#KODE 1!@#USER_ID 102!@#ACTIVITY_CODE 1
12/23/2022 03:37:16 AM script INFO: SUCCESS!@#KODE 1!@#USER_ID 102!@#ACTIVITY_CODE 4
12/23/2022 03:37:16 AM script INFO: SUCCESS!@#KODE 1!@#USER_ID 102!@#ACTIVITY_CODE 1
12/23/2022 03:37:17 AM script INFO: SUCCESS!@#KODE 1!@#USER_ID 102!@#ACTIVITY_CODE 1
12/23/2022 03:37:17 AM script INFO: SUCCESS!@#KODE 1!@#USER_ID 102!@#ACTIVITY_CODE 2
12/23/2022 03:37:17 AM script INFO: SUCCESS!@#KODE 1!@#USER_ID 102!@#ACTIVITY_CODE 1
12/23/2022 03:37:17 AM script INFO: SUCCESS!@#KODE 1!@#USER_ID 102!@#ACTIVITY_CODE 4
12/23/2022 03:37:17 AM script INFO: SUCCESS!@#KODE 1!@#USER_ID 102!@#ACTIVITY_CODE 3
12/23/2022 03:37:17 AM script INFO: SUCCESS!@#KODE 1!@#USER_ID 102!@#ACTIVITY_CODE 3
12/23/2022 03:37:18 AM script INFO: SUCCESS!@#KODE 1!@#USER_ID 102!@#ACTIVITY_CODE 2
12/23/2022 03:37:18 AM script INFO: SUCCESS!@#KODE 1!@#USER_ID 102!@#ACTIVITY_CODE 2
12/23/2022 03:37:18 AM script INFO: SUCCESS!@#KODE 1!@#USER_ID 102!@#ACTIVITY_CODE 3
12/23/2022 03:37:19 AM script INFO: SUCCESS!@#KODE 1!@#USER_ID 102!@#ACTIVITY_CODE 2
12/23/2022 03:37:19 AM script INFO: SUCCESS!@#KODE 1!@#USER_ID 102!@#ACTIVITY_CODE 3
12/23/2022 03:37:19 AM script INFO: SUCCESS!@#KODE 1!@#USER_ID 102!@#ACTIVITY_CODE 1
12/23/2022 03:37:19 AM script INFO: SUCCESS!@#KODE 1!@#USER_ID 102!@#ACTIVITY_CODE 4
12/23/2022 03:37:19 AM script INFO: SUCCESS!@#KODE 1!@#USER_ID 102!@#ACTIVITY_CODE 1
12/23/2022 03:37:19 AM script INFO: SUCCESS!@#KODE 1!@#USER_ID 102!@#ACTIVITY_CODE 4
12/23/2022 03:37:19 AM script INFO: SUCCESS!@#KODE 1!@#USER_ID 102!@#ACTIVITY_CODE 1
12/23/2022 03:37:20 AM script INFO: SUCCESS!@#KODE 1!@#USER_ID 102!@#ACTIVITY_CODE 3
12/23/2022 03:37:20 AM script INFO: SUCCESS!@#KODE 1!@#USER_ID 102!@#ACTIVITY_CODE 1
12/23/2022 03:37:20 AM script INFO: SUCCESS!@#KODE 1!@#USER_ID 102!@#ACTIVITY_CODE 4
12/23/2022 03:37:20 AM script INFO: SUCCESS!@#KODE 1!@#USER_ID 102!@#ACTIVITY_CODE 3
12/23/2022 03:37:21 AM script INFO: SUCCESS!@#KODE 1!@#USER_ID 102!@#ACTIVITY_CODE 1
12/23/2022 03:37:21 AM script INFO: SUCCESS!@#KODE 1!@#USER_ID 102!@#ACTIVITY_CODE 2
12/23/2022 03:37:21 AM script INFO: SUCCESS!@#KODE 1!@#USER_ID 102!@#ACTIVITY_CODE 3
12/23/2022 03:37:21 AM script INFO: SUCCESS!@#KODE 1!@#USER_ID 102!@#ACTIVITY_CODE 1
12/23/2022 03:37:21 AM script INFO: SUCCESS!@#KODE 1!@#USER_ID 102!@#ACTIVITY_CODE 2
12/23/2022 03:37:22 AM script INFO: SUCCESS!@#KODE 1!@#USER_ID 102!@#ACTIVITY_CODE 2
12/23/2022 03:37:22 AM script INFO: SUCCESS!@#KODE 1!@#USER_ID 102!@#ACTIVITY_CODE 3
12/23/2022 03:37:22 AM script INFO: SUCCESS!@#KODE 1!@#USER_ID 102!@#ACTIVITY_CODE 3
12/23/2022 03:37:22 AM script INFO: SUCCESS!@#KODE 1!@#USER_ID 102!@#ACTIVITY_CODE 4
12/23/2022 03:37:22 AM script INFO: SUCCESS!@#KODE 1!@#USER_ID 102!@#ACTIVITY_CODE 2
12/23/2022 03:37:23 AM script INFO: SUCCESS!@#KODE 1!@#USER_ID 102!@#ACTIVITY_CODE 1
12/23/2022 03:37:23 AM script INFO: SUCCESS!@#KODE 1!@#USER_ID 102!@#ACTIVITY_CODE 3
12/23/2022 03:37:23 AM script INFO: SUCCESS!@#KODE 1!@#USER_ID 102!@#ACTIVITY_CODE 3
12/23/2022 03:37:23 AM script INFO: SUCCESS!@#KODE 1!@#USER_ID 102!@#ACTIVITY_CODE 2
12/23/2022 03:37:23 AM script INFO: SUCCESS!@#KODE 1!@#USER_ID 102!@#ACTIVITY_CODE 1
12/23/2022 03:37:24 AM script INFO: SUCCESS!@#KODE 1!@#USER_ID 102!@#ACTIVITY_CODE 4
12/23/2022 03:37:24 AM script INFO: SUCCESS!@#KODE 1!@#USER_ID 102!@#ACTIVITY_CODE 3
12/23/2022 03:37:24 AM script INFO: SUCCESS!@#KODE 1!@#USER_ID 102!@#ACTIVITY_CODE 2
12/23/2022 03:37:24 AM script INFO: SUCCESS!@#KODE 1!@#USER_ID 102!@#ACTIVITY_CODE 1
12/23/2022 03:37:24 AM script INFO: SUCCESS!@#KODE 1!@#USER_ID 102!@#ACTIVITY_CODE 4
12/23/2022 03:37:25 AM script INFO: SUCCESS!@#KODE 1!@#USER_ID 102!@#ACTIVITY_CODE 2
12/23/2022 03:37:25 AM script INFO: SUCCESS!@#KODE 1!@#USER_ID 102!@#ACTIVITY_CODE 1
12/23/2022 03:37:25 AM script INFO: SUCCESS!@#KODE 1!@#USER_ID 102!@#ACTIVITY_CODE 1
12/23/2022 03:37:25 AM script INFO: SUCCESS!@#KODE 1!@#USER_ID 102!@#ACTIVITY_CODE 3
12/23/2022 03:37:25 AM script INFO: SUCCESS!@#KODE 1!@#USER_ID 102!@#ACTIVITY_CODE 3
12/23/2022 03:37:25 AM script INFO: SUCCESS!@#KODE 1!@#USER_ID 102!@#ACTIVITY_CODE 2
12/23/2022 03:37:25 AM script INFO: SUCCESS!@#KODE 1!@#USER_ID 102!@#ACTIVITY_CODE 1
12/23/2022 03:37:26 AM script INFO: SUCCESS!@#KODE 1!@#USER_ID 102!@#ACTIVITY_CODE 1
12/23/2022 03:37:26 AM script INFO: SUCCESS!@#KODE 1!@#USER_ID 102!@#ACTIVITY_CODE 3
12/23/2022 03:37:26 AM script INFO: SUCCESS!@#KODE 1!@#USER_ID 102!@#ACTIVITY_CODE 3
12/23/2022 03:37:26 AM script INFO: SUCCESS!@#KODE 1!@#USER_ID 102!@#ACTIVITY_CODE 2
12/23/2022 03:37:26 AM script INFO: SUCCESS!@#KODE 1!@#USER_ID 102!@#ACTIVITY_CODE 3
12/23/2022 03:37:27 AM script INFO: SUCCESS!@#KODE 1!@#USER_ID 102!@#ACTIVITY_CODE 2
12/23/2022 03:37:27 AM script INFO: SUCCESS!@#KODE 1!@#USER_ID 102!@#ACTIVITY_CODE 2
12/23/2022 03:37:27 AM script INFO: SUCCESS!@#KODE 1!@#USER_ID 102!@#ACTIVITY_CODE 1
12/23/2022 03:37:27 AM script INFO: SUCCESS!@#KODE 1!@#USER_ID 102!@#ACTIVITY_CODE 3
12/23/2022 03:37:27 AM script INFO: SUCCESS!@#KODE 1!@#USER_ID 102!@#ACTIVITY_CODE 2
12/23/2022 03:37:27 AM script INFO: SUCCESS!@#KODE 1!@#USER_ID 102!@#ACTIVITY_CODE 3
12/23/2022 03:37:27 AM script INFO: SUCCESS!@#KODE 1!@#USER_ID 102!@#ACTIVITY_CODE 3
12/23/2022 03:37:27 AM script INFO: SUCCESS!@#KODE 1!@#USER_ID 102!@#ACTIVITY_CODE 1
12/23/2022 03:37:28 AM script INFO: SUCCESS!@#KODE 1!@#USER_ID 102!@#ACTIVITY_CODE 1
12/23/2022 03:37:28 AM script INFO: SUCCESS!@#KODE 1!@#USER_ID 102!@#ACTIVITY_CODE 1
12/23/2022 03:37:28 AM script INFO: SUCCESS!@#KODE 1!@#USER_ID 102!@#ACTIVITY_CODE 2
12/23/2022 03:37:28 AM script INFO: SUCCESS!@#KODE 1!@#USER_ID 102!@#ACTIVITY_CODE 4
12/23/2022 03:37:28 AM script INFO: SUCCESS!@#KODE 1!@#USER_ID 102!@#ACTIVITY_CODE 2
12/23/2022 03:37:28 AM script INFO: SUCCESS!@#KODE 1!@#USER_ID 102!@#ACTIVITY_CODE 1
12/23/2022 03:37:29 AM script INFO: SUCCESS!@#KODE 1!@#USER_ID 102!@#ACTIVITY_CODE 3
12/23/2022 03:37:29 AM script INFO: SUCCESS!@#KODE 1!@#USER_ID 102!@#ACTIVITY_CODE 2
12/23/2022 03:37:29 AM script INFO: SUCCESS!@#KODE 1!@#USER_ID 102!@#ACTIVITY_CODE 2
12/23/2022 03:37:29 AM script INFO: SUCCESS!@#KODE 1!@#USER_ID 102!@#ACTIVITY_CODE 3
12/23/2022 03:37:29 AM script INFO: SUCCESS!@#KODE 1!@#USER_ID 102!@#ACTIVITY_CODE 2
12/23/2022 03:37:29 AM script INFO: SUCCESS!@#KODE 1!@#USER_ID 102!@#ACTIVITY_CODE 1
12/23/2022 03:37:29 AM script INFO: SUCCESS!@#KODE 1!@#USER_ID 102!@#ACTIVITY_CODE 3
12/23/2022 03:37:30 AM script INFO: SUCCESS!@#KODE 1!@#USER_ID 102!@#ACTIVITY_CODE 2
12/23/2022 03:37:30 AM script INFO: SUCCESS!@#KODE 1!@#USER_ID 102!@#ACTIVITY_CODE 3
12/23/2022 03:37:30 AM script INFO: SUCCESS!@#KODE 1!@#USER_ID 102!@#ACTIVITY_CODE 1
12/23/2022 03:37:30 AM script INFO: SUCCESS!@#KODE 1!@#USER_ID 102!@#ACTIVITY_CODE 3
12/23/2022 03:37:30 AM script INFO: SUCCESS!@#KODE 1!@#USER_ID 102!@#ACTIVITY_CODE 4
12/23/2022 03:37:30 AM script INFO: SUCCESS!@#KODE 1!@#USER_ID 102!@#ACTIVITY_CODE 3
12/23/2022 03:37:30 AM script INFO: SUCCESS!@#KODE 1!@#USER_ID 102!@#ACTIVITY_CODE 3
12/23/2022 03:37:30 AM script INFO: SUCCESS!@#KODE 1!@#USER_ID 102!@#ACTIVITY_CODE 2
12/23/2022 03:37:31 AM script INFO: SUCCESS!@#KODE 1!@#USER_ID 102!@#ACTIVITY_CODE 3
12/23/2022 03:37:31 AM script INFO: SUCCESS!@#KODE 1!@#USER_ID 102!@#ACTIVITY_CODE 3
12/23/2022 03:37:31 AM script INFO: SUCCESS!@#KODE 1!@#USER_ID 102!@#ACTIVITY_CODE 3
12/23/2022 03:37:31 AM script INFO: SUCCESS!@#KODE 1!@#USER_ID 102!@#ACTIVITY_CODE 1
12/23/2022 03:37:31 AM script INFO: SUCCESS!@#KODE 1!@#USER_ID 102!@#ACTIVITY_CODE 2
12/23/2022 03:37:31 AM script INFO: SUCCESS!@#KODE 1!@#USER_ID 102!@#ACTIVITY_CODE 2
12/23/2022 03:37:31 AM script INFO: SUCCESS!@#KODE 1!@#USER_ID 102!@#ACTIVITY_CODE 2
12/23/2022 03:37:31 AM script INFO: SUCCESS!@#KODE 1!@#USER_ID 102!@#ACTIVITY_CODE 3
12/23/2022 03:37:31 AM script INFO: SUCCESS!@#KODE 1!@#USER_ID 102!@#ACTIVITY_CODE 1
12/23/2022 03:37:32 AM script INFO: SUCCESS!@#KODE 1!@#USER_ID 102!@#ACTIVITY_CODE 1
12/23/2022 03:37:32 AM script INFO: SUCCESS!@#KODE 1!@#USER_ID 102!@#ACTIVITY_CODE 3
12/23/2022 03:37:32 AM script INFO: SUCCESS!@#KODE 1!@#USER_ID 102!@#ACTIVITY_CODE 1
12/23/2022 03:37:32 AM script INFO: SUCCESS!@#KODE 1!@#USER_ID 102!@#ACTIVITY_CODE 3
12/23/2022 03:37:32 AM script INFO: SUCCESS!@#KODE 1!@#USER_ID 102!@#ACTIVITY_CODE 2
12/23/2022 03:37:32 AM script INFO: SUCCESS!@#KODE 1!@#USER_ID 102!@#ACTIVITY_CODE 2
12/23/2022 03:37:32 AM script INFO: SUCCESS!@#KODE 1!@#USER_ID 102!@#ACTIVITY_CODE 1
12/23/2022 03:37:32 AM script INFO: SUCCESS!@#KODE 1!@#USER_ID 102!@#ACTIVITY_CODE 1
12/23/2022 03:37:32 AM script INFO: SUCCESS!@#KODE 1!@#USER_ID 102!@#ACTIVITY_CODE 3
12/23/2022 03:37:32 AM script INFO: SUCCESS!@#KODE 1!@#USER_ID 102!@#ACTIVITY_CODE 1
12/23/2022 03:37:33 AM script INFO: SUCCESS!@#KODE 1!@#USER_ID 102!@#ACTIVITY_CODE 3
12/23/2022 03:37:33 AM script INFO: SUCCESS!@#KODE 1!@#USER_ID 102!@#ACTIVITY_CODE 4
12/23/2022 03:37:33 AM script INFO: SUCCESS!@#KODE 1!@#USER_ID 102!@#ACTIVITY_CODE 3
12/23/2022 03:37:33 AM script INFO: SUCCESS!@#KODE 1!@#USER_ID 102!@#ACTIVITY_CODE 3
12/23/2022 03:37:33 AM script INFO: SUCCESS!@#KODE 1!@#USER_ID 102!@#ACTIVITY_CODE 1
12/23/2022 03:37:33 AM script INFO: SUCCESS!@#KODE 1!@#USER_ID 102!@#ACTIVITY_CODE 4
12/23/2022 03:37:33 AM script INFO: SUCCESS!@#KODE 1!@#USER_ID 102!@#ACTIVITY_CODE 1
12/23/2022 03:37:33 AM script INFO: SUCCESS!@#KODE 1!@#USER_ID 102!@#ACTIVITY_CODE 1
12/23/2022 03:37:33 AM script INFO: SUCCESS!@#KODE 1!@#USER_ID 102!@#ACTIVITY_CODE 3
12/23/2022 03:37:33 AM script INFO: SUCCESS!@#KODE 1!@#USER_ID 102!@#ACTIVITY_CODE 4
12/23/2022 03:37:33 AM script INFO: SUCCESS!@#KODE 1!@#USER_ID 102!@#ACTIVITY_CODE 3
12/23/2022 03:37:33 AM script INFO: SUCCESS!@#KODE 1!@#USER_ID 102!@#ACTIVITY_CODE 1
12/23/2022 03:37:33 AM script INFO: SUCCESS!@#KODE 1!@#USER_ID 102!@#ACTIVITY_CODE 1
12/23/2022 03:37:34 AM script INFO: SUCCESS!@#KODE 1!@#USER_ID 102!@#ACTIVITY_CODE 3
12/23/2022 03:37:34 AM script INFO: SUCCESS!@#KODE 1!@#USER_ID 102!@#ACTIVITY_CODE 3
12/23/2022 03:37:34 AM script INFO: Duration: 125.10742664337158
12/23/2022 03:37:34 AM script INFO: mengakhiri-quiz
12/23/2022 03:37:48 AM script INFO: SUCCESS!@#KODE 1!@#USER_ID 102!@#ACTIVITY_CODE 5
12/23/2022 03:37:48 AM script INFO: berhasil-submit
