12/10/2022 09:12:07 AM script INFO: Prepared chrome options..
12/10/2022 09:12:08 AM script INFO: Initialized chrome browser..
12/10/2022 09:12:08 AM script INFO: mengakses-homepage
12/10/2022 09:12:20 AM script INFO: mengakses-login-page
12/10/2022 09:12:24 AM script INFO: mengakses-site-home
12/10/2022 09:12:27 AM script INFO: mengakses-site-course
12/10/2022 09:12:53 AM script INFO: mengakses-quiz
12/10/2022 09:13:15 AM script INFO: mengakses-start-quiz-page
12/10/2022 09:13:21 AM script INFO: memulai-quiz
12/10/2022 09:13:21 AM script INFO: SUCCESS!@#KODE 1!@#USER_ID 27!@#ACTIVITY_CODE 5
12/10/2022 09:18:21 AM main_worker ERROR: Message: mengakses-quiz

