12/23/2022 07:11:47 AM script INFO: Prepared chrome options..
12/23/2022 07:11:48 AM script INFO: Initialized chrome browser..
12/23/2022 07:11:48 AM script INFO: mengakses-homepage
12/23/2022 07:12:27 AM script INFO: mengakses-login-page
12/23/2022 07:12:28 AM script INFO: mengakses-site-home
12/23/2022 07:12:29 AM script INFO: mengakses-site-course
12/23/2022 07:12:30 AM script INFO: mengakses-quiz
12/23/2022 07:12:30 AM script INFO: mengakses-start-quiz-page
12/23/2022 07:12:31 AM script INFO: memulai-quiz
12/23/2022 07:12:31 AM script INFO: SUCCESS!@#KODE 1!@#USER_ID 97!@#ACTIVITY_CODE 5
12/23/2022 07:12:42 AM script INFO: SUCCESS!@#KODE 1!@#USER_ID 97!@#ACTIVITY_CODE 5
12/23/2022 07:12:42 AM script INFO: SUCCESS!@#KODE 1!@#USER_ID 97!@#ACTIVITY_CODE 5
12/23/2022 07:12:45 AM script INFO: SUCCESS!@#KODE 1!@#USER_ID 97!@#ACTIVITY_CODE 3
12/23/2022 07:12:45 AM script INFO: SUCCESS!@#KODE 1!@#USER_ID 97!@#ACTIVITY_CODE 5
12/23/2022 07:12:45 AM script INFO: SUCCESS!@#KODE 1!@#USER_ID 97!@#ACTIVITY_CODE 5
12/23/2022 07:12:47 AM script INFO: SUCCESS!@#KODE 1!@#USER_ID 97!@#ACTIVITY_CODE 5
12/23/2022 07:12:47 AM script INFO: SUCCESS!@#KODE 1!@#USER_ID 97!@#ACTIVITY_CODE 5
12/23/2022 07:12:50 AM script INFO: SUCCESS!@#KODE 1!@#USER_ID 97!@#ACTIVITY_CODE 1
12/23/2022 07:12:50 AM script INFO: SUCCESS!@#KODE 1!@#USER_ID 97!@#ACTIVITY_CODE 3
12/23/2022 07:12:50 AM script INFO: SUCCESS!@#KODE 1!@#USER_ID 97!@#ACTIVITY_CODE 5
12/23/2022 07:12:50 AM script INFO: SUCCESS!@#KODE 1!@#USER_ID 97!@#ACTIVITY_CODE 5
12/23/2022 07:12:52 AM script INFO: SUCCESS!@#KODE 1!@#USER_ID 97!@#ACTIVITY_CODE 3
12/23/2022 07:12:53 AM script INFO: SUCCESS!@#KODE 1!@#USER_ID 97!@#ACTIVITY_CODE 3
12/23/2022 07:12:53 AM script INFO: SUCCESS!@#KODE 1!@#USER_ID 97!@#ACTIVITY_CODE 3
12/23/2022 07:12:53 AM script INFO: SUCCESS!@#KODE 1!@#USER_ID 97!@#ACTIVITY_CODE 4
12/23/2022 07:12:53 AM script INFO: SUCCESS!@#KODE 1!@#USER_ID 97!@#ACTIVITY_CODE 1
12/23/2022 07:12:53 AM script INFO: SUCCESS!@#KODE 1!@#USER_ID 97!@#ACTIVITY_CODE 2
12/23/2022 07:12:53 AM script INFO: SUCCESS!@#KODE 1!@#USER_ID 97!@#ACTIVITY_CODE 2
12/23/2022 07:12:53 AM script INFO: SUCCESS!@#KODE 1!@#USER_ID 97!@#ACTIVITY_CODE 1
12/23/2022 07:12:53 AM script INFO: SUCCESS!@#KODE 1!@#USER_ID 97!@#ACTIVITY_CODE 3
12/23/2022 07:12:53 AM script INFO: SUCCESS!@#KODE 1!@#USER_ID 97!@#ACTIVITY_CODE 5
12/23/2022 07:12:53 AM script INFO: SUCCESS!@#KODE 1!@#USER_ID 97!@#ACTIVITY_CODE 5
12/23/2022 07:12:56 AM script INFO: SUCCESS!@#KODE 1!@#USER_ID 97!@#ACTIVITY_CODE 2
12/23/2022 07:12:56 AM script INFO: SUCCESS!@#KODE 1!@#USER_ID 97!@#ACTIVITY_CODE 3
12/23/2022 07:12:56 AM script INFO: SUCCESS!@#KODE 1!@#USER_ID 97!@#ACTIVITY_CODE 2
12/23/2022 07:12:56 AM script INFO: SUCCESS!@#KODE 1!@#USER_ID 97!@#ACTIVITY_CODE 3
12/23/2022 07:12:56 AM script INFO: SUCCESS!@#KODE 1!@#USER_ID 97!@#ACTIVITY_CODE 3
12/23/2022 07:12:56 AM script INFO: SUCCESS!@#KODE 1!@#USER_ID 97!@#ACTIVITY_CODE 3
12/23/2022 07:12:56 AM script INFO: SUCCESS!@#KODE 1!@#USER_ID 97!@#ACTIVITY_CODE 5
12/23/2022 07:12:56 AM script INFO: SUCCESS!@#KODE 1!@#USER_ID 97!@#ACTIVITY_CODE 5
12/23/2022 07:12:59 AM script INFO: SUCCESS!@#KODE 1!@#USER_ID 97!@#ACTIVITY_CODE 3
12/23/2022 07:12:59 AM script INFO: SUCCESS!@#KODE 1!@#USER_ID 97!@#ACTIVITY_CODE 2
12/23/2022 07:12:59 AM script INFO: SUCCESS!@#KODE 1!@#USER_ID 97!@#ACTIVITY_CODE 5
12/23/2022 07:12:59 AM script INFO: SUCCESS!@#KODE 1!@#USER_ID 97!@#ACTIVITY_CODE 5
12/23/2022 07:13:01 AM script INFO: SUCCESS!@#KODE 1!@#USER_ID 97!@#ACTIVITY_CODE 3
12/23/2022 07:13:02 AM script INFO: SUCCESS!@#KODE 1!@#USER_ID 97!@#ACTIVITY_CODE 2
12/23/2022 07:13:02 AM script INFO: SUCCESS!@#KODE 1!@#USER_ID 97!@#ACTIVITY_CODE 1
12/23/2022 07:13:02 AM script INFO: SUCCESS!@#KODE 1!@#USER_ID 97!@#ACTIVITY_CODE 3
12/23/2022 07:13:02 AM script INFO: SUCCESS!@#KODE 1!@#USER_ID 97!@#ACTIVITY_CODE 4
12/23/2022 07:13:02 AM script INFO: SUCCESS!@#KODE 1!@#USER_ID 97!@#ACTIVITY_CODE 2
12/23/2022 07:13:02 AM script INFO: SUCCESS!@#KODE 1!@#USER_ID 97!@#ACTIVITY_CODE 2
12/23/2022 07:13:02 AM script INFO: SUCCESS!@#KODE 1!@#USER_ID 97!@#ACTIVITY_CODE 5
12/23/2022 07:13:02 AM script INFO: SUCCESS!@#KODE 1!@#USER_ID 97!@#ACTIVITY_CODE 5
12/23/2022 07:13:05 AM script INFO: SUCCESS!@#KODE 1!@#USER_ID 97!@#ACTIVITY_CODE 3
12/23/2022 07:13:05 AM script INFO: SUCCESS!@#KODE 1!@#USER_ID 97!@#ACTIVITY_CODE 1
12/23/2022 07:13:05 AM script INFO: SUCCESS!@#KODE 1!@#USER_ID 97!@#ACTIVITY_CODE 1
12/23/2022 07:13:05 AM script INFO: SUCCESS!@#KODE 1!@#USER_ID 97!@#ACTIVITY_CODE 4
12/23/2022 07:13:05 AM script INFO: SUCCESS!@#KODE 1!@#USER_ID 97!@#ACTIVITY_CODE 5
12/23/2022 07:13:05 AM script INFO: SUCCESS!@#KODE 1!@#USER_ID 97!@#ACTIVITY_CODE 5
12/23/2022 07:13:08 AM script INFO: SUCCESS!@#KODE 1!@#USER_ID 97!@#ACTIVITY_CODE 3
12/23/2022 07:13:08 AM script INFO: SUCCESS!@#KODE 1!@#USER_ID 97!@#ACTIVITY_CODE 3
12/23/2022 07:13:08 AM script INFO: SUCCESS!@#KODE 1!@#USER_ID 97!@#ACTIVITY_CODE 5
12/23/2022 07:13:08 AM script INFO: SUCCESS!@#KODE 1!@#USER_ID 97!@#ACTIVITY_CODE 5
12/23/2022 07:13:10 AM script INFO: SUCCESS!@#KODE 1!@#USER_ID 97!@#ACTIVITY_CODE 5
12/23/2022 07:13:10 AM script INFO: SUCCESS!@#KODE 1!@#USER_ID 97!@#ACTIVITY_CODE 5
12/23/2022 07:13:13 AM script INFO: SUCCESS!@#KODE 1!@#USER_ID 97!@#ACTIVITY_CODE 3
12/23/2022 07:13:13 AM script INFO: SUCCESS!@#KODE 1!@#USER_ID 97!@#ACTIVITY_CODE 1
12/23/2022 07:13:13 AM script INFO: SUCCESS!@#KODE 1!@#USER_ID 97!@#ACTIVITY_CODE 2
12/23/2022 07:13:13 AM script INFO: SUCCESS!@#KODE 1!@#USER_ID 97!@#ACTIVITY_CODE 2
12/23/2022 07:13:13 AM script INFO: SUCCESS!@#KODE 1!@#USER_ID 97!@#ACTIVITY_CODE 3
12/23/2022 07:13:13 AM script INFO: SUCCESS!@#KODE 1!@#USER_ID 97!@#ACTIVITY_CODE 1
12/23/2022 07:13:13 AM script INFO: SUCCESS!@#KODE 1!@#USER_ID 97!@#ACTIVITY_CODE 3
12/23/2022 07:13:13 AM script INFO: SUCCESS!@#KODE 1!@#USER_ID 97!@#ACTIVITY_CODE 1
12/23/2022 07:13:13 AM script INFO: SUCCESS!@#KODE 1!@#USER_ID 97!@#ACTIVITY_CODE 3
12/23/2022 07:13:13 AM script INFO: SUCCESS!@#KODE 1!@#USER_ID 97!@#ACTIVITY_CODE 4
12/23/2022 07:13:13 AM script INFO: SUCCESS!@#KODE 1!@#USER_ID 97!@#ACTIVITY_CODE 2
12/23/2022 07:13:14 AM script INFO: SUCCESS!@#KODE 1!@#USER_ID 97!@#ACTIVITY_CODE 3
12/23/2022 07:13:14 AM script INFO: SUCCESS!@#KODE 1!@#USER_ID 97!@#ACTIVITY_CODE 2
12/23/2022 07:13:14 AM script INFO: SUCCESS!@#KODE 1!@#USER_ID 97!@#ACTIVITY_CODE 1
12/23/2022 07:13:14 AM script INFO: SUCCESS!@#KODE 1!@#USER_ID 97!@#ACTIVITY_CODE 4
12/23/2022 07:13:14 AM script INFO: SUCCESS!@#KODE 1!@#USER_ID 97!@#ACTIVITY_CODE 1
12/23/2022 07:13:14 AM script INFO: SUCCESS!@#KODE 1!@#USER_ID 97!@#ACTIVITY_CODE 3
12/23/2022 07:13:14 AM script INFO: SUCCESS!@#KODE 1!@#USER_ID 97!@#ACTIVITY_CODE 4
12/23/2022 07:13:14 AM script INFO: SUCCESS!@#KODE 1!@#USER_ID 97!@#ACTIVITY_CODE 3
12/23/2022 07:13:14 AM script INFO: SUCCESS!@#KODE 1!@#USER_ID 97!@#ACTIVITY_CODE 1
12/23/2022 07:13:14 AM script INFO: SUCCESS!@#KODE 1!@#USER_ID 97!@#ACTIVITY_CODE 4
12/23/2022 07:13:14 AM script INFO: SUCCESS!@#KODE 1!@#USER_ID 97!@#ACTIVITY_CODE 3
12/23/2022 07:13:14 AM script INFO: SUCCESS!@#KODE 1!@#USER_ID 97!@#ACTIVITY_CODE 2
12/23/2022 07:13:14 AM script INFO: SUCCESS!@#KODE 1!@#USER_ID 97!@#ACTIVITY_CODE 1
12/23/2022 07:13:14 AM script INFO: SUCCESS!@#KODE 1!@#USER_ID 97!@#ACTIVITY_CODE 3
12/23/2022 07:13:14 AM script INFO: SUCCESS!@#KODE 1!@#USER_ID 97!@#ACTIVITY_CODE 3
12/23/2022 07:13:15 AM script INFO: SUCCESS!@#KODE 1!@#USER_ID 97!@#ACTIVITY_CODE 4
12/23/2022 07:13:15 AM script INFO: SUCCESS!@#KODE 1!@#USER_ID 97!@#ACTIVITY_CODE 2
12/23/2022 07:13:15 AM script INFO: SUCCESS!@#KODE 1!@#USER_ID 97!@#ACTIVITY_CODE 3
12/23/2022 07:13:15 AM script INFO: SUCCESS!@#KODE 1!@#USER_ID 97!@#ACTIVITY_CODE 2
12/23/2022 07:13:15 AM script INFO: SUCCESS!@#KODE 1!@#USER_ID 97!@#ACTIVITY_CODE 3
12/23/2022 07:13:15 AM script INFO: SUCCESS!@#KODE 1!@#USER_ID 97!@#ACTIVITY_CODE 2
12/23/2022 07:13:15 AM script INFO: SUCCESS!@#KODE 1!@#USER_ID 97!@#ACTIVITY_CODE 2
12/23/2022 07:13:15 AM script INFO: SUCCESS!@#KODE 1!@#USER_ID 97!@#ACTIVITY_CODE 3
12/23/2022 07:13:15 AM script INFO: SUCCESS!@#KODE 1!@#USER_ID 97!@#ACTIVITY_CODE 1
12/23/2022 07:13:15 AM script INFO: SUCCESS!@#KODE 1!@#USER_ID 97!@#ACTIVITY_CODE 3
12/23/2022 07:13:15 AM script INFO: SUCCESS!@#KODE 1!@#USER_ID 97!@#ACTIVITY_CODE 2
12/23/2022 07:13:15 AM script INFO: SUCCESS!@#KODE 1!@#USER_ID 97!@#ACTIVITY_CODE 3
12/23/2022 07:13:15 AM script INFO: SUCCESS!@#KODE 1!@#USER_ID 97!@#ACTIVITY_CODE 3
12/23/2022 07:13:16 AM script INFO: SUCCESS!@#KODE 1!@#USER_ID 97!@#ACTIVITY_CODE 1
12/23/2022 07:13:16 AM script INFO: SUCCESS!@#KODE 1!@#USER_ID 97!@#ACTIVITY_CODE 3
12/23/2022 07:13:16 AM script INFO: SUCCESS!@#KODE 1!@#USER_ID 97!@#ACTIVITY_CODE 2
12/23/2022 07:13:16 AM script INFO: SUCCESS!@#KODE 1!@#USER_ID 97!@#ACTIVITY_CODE 3
12/23/2022 07:13:16 AM script INFO: Duration: 33.60426568984985
12/23/2022 07:13:16 AM script INFO: mengakhiri-quiz
12/23/2022 07:13:16 AM script INFO: SUCCESS!@#KODE 1!@#USER_ID 97!@#ACTIVITY_CODE 5
12/23/2022 07:13:16 AM script INFO: berhasil-submit
