12/11/2022 03:11:15 PM script INFO: Prepared chrome options..
12/11/2022 03:11:16 PM script INFO: Initialized chrome browser..
12/11/2022 03:11:16 PM script INFO: mengakses-homepage
12/11/2022 03:11:48 PM script INFO: mengakses-login-page
12/11/2022 03:11:49 PM script INFO: mengakses-site-home
12/11/2022 03:11:50 PM script INFO: mengakses-site-course
12/11/2022 03:11:51 PM script INFO: mengakses-quiz
12/11/2022 03:11:51 PM script INFO: mengakses-start-quiz-page
12/11/2022 03:11:53 PM script INFO: memulai-quiz
12/11/2022 03:11:53 PM script INFO: SUCCESS!@#KODE 1!@#USER_ID 3!@#ACTIVITY_CODE 5
12/11/2022 03:12:03 PM script INFO: SUCCESS!@#KODE 1!@#USER_ID 3!@#ACTIVITY_CODE 5
12/11/2022 03:12:03 PM script INFO: SUCCESS!@#KODE 1!@#USER_ID 3!@#ACTIVITY_CODE 5
12/11/2022 03:12:06 PM script INFO: SUCCESS!@#KODE 1!@#USER_ID 3!@#ACTIVITY_CODE 1
12/11/2022 03:12:06 PM script INFO: SUCCESS!@#KODE 1!@#USER_ID 3!@#ACTIVITY_CODE 2
12/11/2022 03:12:06 PM script INFO: SUCCESS!@#KODE 1!@#USER_ID 3!@#ACTIVITY_CODE 3
12/11/2022 03:12:06 PM script INFO: SUCCESS!@#KODE 1!@#USER_ID 3!@#ACTIVITY_CODE 3
12/11/2022 03:12:07 PM script INFO: SUCCESS!@#KODE 1!@#USER_ID 3!@#ACTIVITY_CODE 2
12/11/2022 03:12:07 PM script INFO: SUCCESS!@#KODE 1!@#USER_ID 3!@#ACTIVITY_CODE 1
12/11/2022 03:12:07 PM script INFO: SUCCESS!@#KODE 1!@#USER_ID 3!@#ACTIVITY_CODE 2
12/11/2022 03:12:07 PM script INFO: SUCCESS!@#KODE 1!@#USER_ID 3!@#ACTIVITY_CODE 1
12/11/2022 03:12:07 PM script INFO: SUCCESS!@#KODE 1!@#USER_ID 3!@#ACTIVITY_CODE 2
12/11/2022 03:12:07 PM script INFO: SUCCESS!@#KODE 1!@#USER_ID 3!@#ACTIVITY_CODE 1
12/11/2022 03:12:07 PM script INFO: SUCCESS!@#KODE 1!@#USER_ID 3!@#ACTIVITY_CODE 5
12/11/2022 03:12:07 PM script INFO: SUCCESS!@#KODE 1!@#USER_ID 3!@#ACTIVITY_CODE 5
12/11/2022 03:12:10 PM script INFO: SUCCESS!@#KODE 1!@#USER_ID 3!@#ACTIVITY_CODE 1
12/11/2022 03:12:10 PM script INFO: SUCCESS!@#KODE 1!@#USER_ID 3!@#ACTIVITY_CODE 1
12/11/2022 03:12:10 PM script INFO: SUCCESS!@#KODE 1!@#USER_ID 3!@#ACTIVITY_CODE 2
12/11/2022 03:12:10 PM script INFO: SUCCESS!@#KODE 1!@#USER_ID 3!@#ACTIVITY_CODE 1
12/11/2022 03:12:10 PM script INFO: SUCCESS!@#KODE 1!@#USER_ID 3!@#ACTIVITY_CODE 1
12/11/2022 03:12:10 PM script INFO: SUCCESS!@#KODE 1!@#USER_ID 3!@#ACTIVITY_CODE 3
12/11/2022 03:12:10 PM script INFO: SUCCESS!@#KODE 1!@#USER_ID 3!@#ACTIVITY_CODE 1
12/11/2022 03:12:10 PM script INFO: SUCCESS!@#KODE 1!@#USER_ID 3!@#ACTIVITY_CODE 4
12/11/2022 03:12:10 PM script INFO: SUCCESS!@#KODE 1!@#USER_ID 3!@#ACTIVITY_CODE 1
12/11/2022 03:12:10 PM script INFO: SUCCESS!@#KODE 1!@#USER_ID 3!@#ACTIVITY_CODE 3
12/11/2022 03:12:10 PM script INFO: SUCCESS!@#KODE 1!@#USER_ID 3!@#ACTIVITY_CODE 2
12/11/2022 03:12:11 PM script INFO: SUCCESS!@#KODE 1!@#USER_ID 3!@#ACTIVITY_CODE 3
12/11/2022 03:12:11 PM script INFO: SUCCESS!@#KODE 1!@#USER_ID 3!@#ACTIVITY_CODE 5
12/11/2022 03:12:11 PM script INFO: SUCCESS!@#KODE 1!@#USER_ID 3!@#ACTIVITY_CODE 5
12/11/2022 03:12:13 PM script INFO: SUCCESS!@#KODE 1!@#USER_ID 3!@#ACTIVITY_CODE 3
12/11/2022 03:12:13 PM script INFO: SUCCESS!@#KODE 1!@#USER_ID 3!@#ACTIVITY_CODE 3
12/11/2022 03:12:13 PM script INFO: SUCCESS!@#KODE 1!@#USER_ID 3!@#ACTIVITY_CODE 5
12/11/2022 03:12:13 PM script INFO: SUCCESS!@#KODE 1!@#USER_ID 3!@#ACTIVITY_CODE 5
12/11/2022 03:12:16 PM script INFO: SUCCESS!@#KODE 1!@#USER_ID 3!@#ACTIVITY_CODE 1
12/11/2022 03:12:16 PM script INFO: SUCCESS!@#KODE 1!@#USER_ID 3!@#ACTIVITY_CODE 3
12/11/2022 03:12:16 PM script INFO: SUCCESS!@#KODE 1!@#USER_ID 3!@#ACTIVITY_CODE 3
12/11/2022 03:12:16 PM script INFO: SUCCESS!@#KODE 1!@#USER_ID 3!@#ACTIVITY_CODE 1
12/11/2022 03:12:16 PM script INFO: SUCCESS!@#KODE 1!@#USER_ID 3!@#ACTIVITY_CODE 2
12/11/2022 03:12:16 PM script INFO: SUCCESS!@#KODE 1!@#USER_ID 3!@#ACTIVITY_CODE 5
12/11/2022 03:12:16 PM script INFO: SUCCESS!@#KODE 1!@#USER_ID 3!@#ACTIVITY_CODE 5
12/11/2022 03:12:19 PM script INFO: SUCCESS!@#KODE 1!@#USER_ID 3!@#ACTIVITY_CODE 2
12/11/2022 03:12:19 PM script INFO: SUCCESS!@#KODE 1!@#USER_ID 3!@#ACTIVITY_CODE 4
12/11/2022 03:12:19 PM script INFO: SUCCESS!@#KODE 1!@#USER_ID 3!@#ACTIVITY_CODE 5
12/11/2022 03:12:19 PM script INFO: SUCCESS!@#KODE 1!@#USER_ID 3!@#ACTIVITY_CODE 5
12/11/2022 03:12:21 PM script INFO: SUCCESS!@#KODE 1!@#USER_ID 3!@#ACTIVITY_CODE 3
12/11/2022 03:12:21 PM script INFO: SUCCESS!@#KODE 1!@#USER_ID 3!@#ACTIVITY_CODE 1
12/11/2022 03:12:22 PM script INFO: SUCCESS!@#KODE 1!@#USER_ID 3!@#ACTIVITY_CODE 4
12/11/2022 03:12:22 PM script INFO: SUCCESS!@#KODE 1!@#USER_ID 3!@#ACTIVITY_CODE 2
12/11/2022 03:12:22 PM script INFO: SUCCESS!@#KODE 1!@#USER_ID 3!@#ACTIVITY_CODE 1
12/11/2022 03:12:22 PM script INFO: SUCCESS!@#KODE 1!@#USER_ID 3!@#ACTIVITY_CODE 3
12/11/2022 03:12:22 PM script INFO: SUCCESS!@#KODE 1!@#USER_ID 3!@#ACTIVITY_CODE 3
12/11/2022 03:12:22 PM script INFO: SUCCESS!@#KODE 1!@#USER_ID 3!@#ACTIVITY_CODE 5
12/11/2022 03:12:22 PM script INFO: SUCCESS!@#KODE 1!@#USER_ID 3!@#ACTIVITY_CODE 5
12/11/2022 03:12:24 PM script INFO: SUCCESS!@#KODE 1!@#USER_ID 3!@#ACTIVITY_CODE 4
12/11/2022 03:12:25 PM script INFO: SUCCESS!@#KODE 1!@#USER_ID 3!@#ACTIVITY_CODE 1
12/11/2022 03:12:25 PM script INFO: SUCCESS!@#KODE 1!@#USER_ID 3!@#ACTIVITY_CODE 1
12/11/2022 03:12:25 PM script INFO: SUCCESS!@#KODE 1!@#USER_ID 3!@#ACTIVITY_CODE 2
12/11/2022 03:12:25 PM script INFO: SUCCESS!@#KODE 1!@#USER_ID 3!@#ACTIVITY_CODE 1
12/11/2022 03:12:25 PM script INFO: SUCCESS!@#KODE 1!@#USER_ID 3!@#ACTIVITY_CODE 1
12/11/2022 03:12:25 PM script INFO: SUCCESS!@#KODE 1!@#USER_ID 3!@#ACTIVITY_CODE 3
12/11/2022 03:12:25 PM script INFO: SUCCESS!@#KODE 1!@#USER_ID 3!@#ACTIVITY_CODE 1
12/11/2022 03:12:25 PM script INFO: SUCCESS!@#KODE 1!@#USER_ID 3!@#ACTIVITY_CODE 4
12/11/2022 03:12:25 PM script INFO: SUCCESS!@#KODE 1!@#USER_ID 3!@#ACTIVITY_CODE 3
12/11/2022 03:12:26 PM script INFO: SUCCESS!@#KODE 1!@#USER_ID 3!@#ACTIVITY_CODE 2
12/11/2022 03:12:26 PM script INFO: SUCCESS!@#KODE 1!@#USER_ID 3!@#ACTIVITY_CODE 5
12/11/2022 03:12:26 PM script INFO: SUCCESS!@#KODE 1!@#USER_ID 3!@#ACTIVITY_CODE 5
12/11/2022 03:12:28 PM script INFO: SUCCESS!@#KODE 1!@#USER_ID 3!@#ACTIVITY_CODE 3
12/11/2022 03:12:28 PM script INFO: SUCCESS!@#KODE 1!@#USER_ID 3!@#ACTIVITY_CODE 5
12/11/2022 03:12:28 PM script INFO: SUCCESS!@#KODE 1!@#USER_ID 3!@#ACTIVITY_CODE 5
12/11/2022 03:12:31 PM script INFO: SUCCESS!@#KODE 1!@#USER_ID 3!@#ACTIVITY_CODE 3
12/11/2022 03:12:31 PM script INFO: SUCCESS!@#KODE 1!@#USER_ID 3!@#ACTIVITY_CODE 3
12/11/2022 03:12:31 PM script INFO: SUCCESS!@#KODE 1!@#USER_ID 3!@#ACTIVITY_CODE 2
12/11/2022 03:12:31 PM script INFO: SUCCESS!@#KODE 1!@#USER_ID 3!@#ACTIVITY_CODE 5
12/11/2022 03:12:31 PM script INFO: SUCCESS!@#KODE 1!@#USER_ID 3!@#ACTIVITY_CODE 5
12/11/2022 03:12:34 PM script INFO: SUCCESS!@#KODE 1!@#USER_ID 3!@#ACTIVITY_CODE 2
12/11/2022 03:12:34 PM script INFO: SUCCESS!@#KODE 1!@#USER_ID 3!@#ACTIVITY_CODE 5
12/11/2022 03:12:34 PM script INFO: SUCCESS!@#KODE 1!@#USER_ID 3!@#ACTIVITY_CODE 5
12/11/2022 03:12:36 PM script INFO: SUCCESS!@#KODE 1!@#USER_ID 3!@#ACTIVITY_CODE 2
12/11/2022 03:12:36 PM script INFO: SUCCESS!@#KODE 1!@#USER_ID 3!@#ACTIVITY_CODE 1
12/11/2022 03:12:37 PM script INFO: SUCCESS!@#KODE 1!@#USER_ID 3!@#ACTIVITY_CODE 1
12/11/2022 03:12:37 PM script INFO: SUCCESS!@#KODE 1!@#USER_ID 3!@#ACTIVITY_CODE 4
12/11/2022 03:12:37 PM script INFO: SUCCESS!@#KODE 1!@#USER_ID 3!@#ACTIVITY_CODE 1
12/11/2022 03:12:37 PM script INFO: SUCCESS!@#KODE 1!@#USER_ID 3!@#ACTIVITY_CODE 1
12/11/2022 03:12:37 PM script INFO: SUCCESS!@#KODE 1!@#USER_ID 3!@#ACTIVITY_CODE 2
12/11/2022 03:12:37 PM script INFO: SUCCESS!@#KODE 1!@#USER_ID 3!@#ACTIVITY_CODE 2
12/11/2022 03:12:37 PM script INFO: SUCCESS!@#KODE 1!@#USER_ID 3!@#ACTIVITY_CODE 2
12/11/2022 03:12:37 PM script INFO: SUCCESS!@#KODE 1!@#USER_ID 3!@#ACTIVITY_CODE 1
12/11/2022 03:12:37 PM script INFO: SUCCESS!@#KODE 1!@#USER_ID 3!@#ACTIVITY_CODE 3
12/11/2022 03:12:37 PM script INFO: SUCCESS!@#KODE 1!@#USER_ID 3!@#ACTIVITY_CODE 1
12/11/2022 03:12:38 PM script INFO: SUCCESS!@#KODE 1!@#USER_ID 3!@#ACTIVITY_CODE 2
12/11/2022 03:12:38 PM script INFO: SUCCESS!@#KODE 1!@#USER_ID 3!@#ACTIVITY_CODE 1
12/11/2022 03:12:38 PM script INFO: SUCCESS!@#KODE 1!@#USER_ID 3!@#ACTIVITY_CODE 2
12/11/2022 03:12:38 PM script INFO: SUCCESS!@#KODE 1!@#USER_ID 3!@#ACTIVITY_CODE 3
12/11/2022 03:12:38 PM script INFO: SUCCESS!@#KODE 1!@#USER_ID 3!@#ACTIVITY_CODE 4
12/11/2022 03:12:38 PM script INFO: SUCCESS!@#KODE 1!@#USER_ID 3!@#ACTIVITY_CODE 1
12/11/2022 03:12:38 PM script INFO: SUCCESS!@#KODE 1!@#USER_ID 3!@#ACTIVITY_CODE 1
12/11/2022 03:12:38 PM script INFO: SUCCESS!@#KODE 1!@#USER_ID 3!@#ACTIVITY_CODE 1
12/11/2022 03:12:38 PM script INFO: SUCCESS!@#KODE 1!@#USER_ID 3!@#ACTIVITY_CODE 3
12/11/2022 03:12:38 PM script INFO: SUCCESS!@#KODE 1!@#USER_ID 3!@#ACTIVITY_CODE 1
12/11/2022 03:12:38 PM script INFO: Duration: 34.68094205856323
12/11/2022 03:12:38 PM script INFO: mengakhiri-quiz
12/11/2022 03:12:47 PM script INFO: SUCCESS!@#KODE 1!@#USER_ID 3!@#ACTIVITY_CODE 5
12/11/2022 03:12:47 PM script INFO: berhasil-submit
