12/21/2022 02:29:40 PM script INFO: Prepared chrome options..
12/21/2022 02:29:42 PM script INFO: Initialized chrome browser..
12/21/2022 02:29:42 PM script INFO: mengakses-homepage
12/21/2022 02:30:19 PM script INFO: mengakses-login-page
12/21/2022 02:30:23 PM script INFO: mengakses-site-home
12/21/2022 02:30:25 PM script INFO: mengakses-site-course
12/21/2022 02:30:41 PM script INFO: mengakses-quiz
12/21/2022 02:30:43 PM script INFO: mengakses-start-quiz-page
12/21/2022 02:30:44 PM script INFO: memulai-quiz
12/21/2022 02:30:44 PM script INFO: SUCCESS!@#KODE 1!@#USER_ID 34!@#ACTIVITY_CODE 5
12/21/2022 02:30:55 PM script INFO: SUCCESS!@#KODE 1!@#USER_ID 34!@#ACTIVITY_CODE 1
12/21/2022 02:30:55 PM script INFO: SUCCESS!@#KODE 1!@#USER_ID 34!@#ACTIVITY_CODE 3
12/21/2022 02:30:55 PM script INFO: SUCCESS!@#KODE 1!@#USER_ID 34!@#ACTIVITY_CODE 3
12/21/2022 02:30:55 PM script INFO: SUCCESS!@#KODE 1!@#USER_ID 34!@#ACTIVITY_CODE 1
12/21/2022 02:30:55 PM script INFO: SUCCESS!@#KODE 1!@#USER_ID 34!@#ACTIVITY_CODE 2
12/21/2022 02:30:55 PM script INFO: SUCCESS!@#KODE 1!@#USER_ID 34!@#ACTIVITY_CODE 5
12/21/2022 02:30:55 PM script INFO: SUCCESS!@#KODE 1!@#USER_ID 34!@#ACTIVITY_CODE 5
12/21/2022 02:30:58 PM script INFO: SUCCESS!@#KODE 1!@#USER_ID 34!@#ACTIVITY_CODE 2
12/21/2022 02:30:58 PM script INFO: SUCCESS!@#KODE 1!@#USER_ID 34!@#ACTIVITY_CODE 3
12/21/2022 02:30:58 PM script INFO: SUCCESS!@#KODE 1!@#USER_ID 34!@#ACTIVITY_CODE 5
12/21/2022 02:30:58 PM script INFO: SUCCESS!@#KODE 1!@#USER_ID 34!@#ACTIVITY_CODE 5
12/21/2022 02:31:01 PM script INFO: SUCCESS!@#KODE 1!@#USER_ID 34!@#ACTIVITY_CODE 5
12/21/2022 02:31:01 PM script INFO: SUCCESS!@#KODE 1!@#USER_ID 34!@#ACTIVITY_CODE 5
12/21/2022 02:31:03 PM script INFO: SUCCESS!@#KODE 1!@#USER_ID 34!@#ACTIVITY_CODE 2
12/21/2022 02:31:03 PM script INFO: SUCCESS!@#KODE 1!@#USER_ID 34!@#ACTIVITY_CODE 2
12/21/2022 02:31:04 PM script INFO: SUCCESS!@#KODE 1!@#USER_ID 34!@#ACTIVITY_CODE 2
12/21/2022 02:31:04 PM script INFO: SUCCESS!@#KODE 1!@#USER_ID 34!@#ACTIVITY_CODE 5
12/21/2022 02:31:04 PM script INFO: SUCCESS!@#KODE 1!@#USER_ID 34!@#ACTIVITY_CODE 5
12/21/2022 02:31:06 PM script INFO: SUCCESS!@#KODE 1!@#USER_ID 34!@#ACTIVITY_CODE 1
12/21/2022 02:31:06 PM script INFO: SUCCESS!@#KODE 1!@#USER_ID 34!@#ACTIVITY_CODE 4
12/21/2022 02:31:06 PM script INFO: SUCCESS!@#KODE 1!@#USER_ID 34!@#ACTIVITY_CODE 3
12/21/2022 02:31:06 PM script INFO: SUCCESS!@#KODE 1!@#USER_ID 34!@#ACTIVITY_CODE 3
12/21/2022 02:31:07 PM script INFO: SUCCESS!@#KODE 1!@#USER_ID 34!@#ACTIVITY_CODE 1
12/21/2022 02:31:07 PM script INFO: SUCCESS!@#KODE 1!@#USER_ID 34!@#ACTIVITY_CODE 2
12/21/2022 02:31:07 PM script INFO: SUCCESS!@#KODE 1!@#USER_ID 34!@#ACTIVITY_CODE 2
12/21/2022 02:31:07 PM script INFO: SUCCESS!@#KODE 1!@#USER_ID 34!@#ACTIVITY_CODE 1
12/21/2022 02:31:07 PM script INFO: SUCCESS!@#KODE 1!@#USER_ID 34!@#ACTIVITY_CODE 1
12/21/2022 02:31:07 PM script INFO: SUCCESS!@#KODE 1!@#USER_ID 34!@#ACTIVITY_CODE 1
12/21/2022 02:31:07 PM script INFO: SUCCESS!@#KODE 1!@#USER_ID 34!@#ACTIVITY_CODE 2
12/21/2022 02:31:07 PM script INFO: SUCCESS!@#KODE 1!@#USER_ID 34!@#ACTIVITY_CODE 5
12/21/2022 02:31:07 PM script INFO: SUCCESS!@#KODE 1!@#USER_ID 34!@#ACTIVITY_CODE 5
12/21/2022 02:31:10 PM script INFO: SUCCESS!@#KODE 1!@#USER_ID 34!@#ACTIVITY_CODE 3
12/21/2022 02:31:10 PM script INFO: SUCCESS!@#KODE 1!@#USER_ID 34!@#ACTIVITY_CODE 3
12/21/2022 02:31:10 PM script INFO: SUCCESS!@#KODE 1!@#USER_ID 34!@#ACTIVITY_CODE 5
12/21/2022 02:31:10 PM script INFO: SUCCESS!@#KODE 1!@#USER_ID 34!@#ACTIVITY_CODE 5
12/21/2022 02:31:13 PM script INFO: SUCCESS!@#KODE 1!@#USER_ID 34!@#ACTIVITY_CODE 2
12/21/2022 02:31:13 PM script INFO: SUCCESS!@#KODE 1!@#USER_ID 34!@#ACTIVITY_CODE 3
12/21/2022 02:31:13 PM script INFO: SUCCESS!@#KODE 1!@#USER_ID 34!@#ACTIVITY_CODE 1
12/21/2022 02:31:13 PM script INFO: SUCCESS!@#KODE 1!@#USER_ID 34!@#ACTIVITY_CODE 2
12/21/2022 02:31:13 PM script INFO: SUCCESS!@#KODE 1!@#USER_ID 34!@#ACTIVITY_CODE 1
12/21/2022 02:31:13 PM script INFO: SUCCESS!@#KODE 1!@#USER_ID 34!@#ACTIVITY_CODE 2
12/21/2022 02:31:13 PM script INFO: SUCCESS!@#KODE 1!@#USER_ID 34!@#ACTIVITY_CODE 3
12/21/2022 02:31:13 PM script INFO: SUCCESS!@#KODE 1!@#USER_ID 34!@#ACTIVITY_CODE 3
12/21/2022 02:31:13 PM script INFO: SUCCESS!@#KODE 1!@#USER_ID 34!@#ACTIVITY_CODE 2
12/21/2022 02:31:13 PM script INFO: SUCCESS!@#KODE 1!@#USER_ID 34!@#ACTIVITY_CODE 2
12/21/2022 02:31:13 PM script INFO: SUCCESS!@#KODE 1!@#USER_ID 34!@#ACTIVITY_CODE 1
12/21/2022 02:31:14 PM script INFO: SUCCESS!@#KODE 1!@#USER_ID 34!@#ACTIVITY_CODE 3
12/21/2022 02:31:14 PM script INFO: SUCCESS!@#KODE 1!@#USER_ID 34!@#ACTIVITY_CODE 4
12/21/2022 02:31:14 PM script INFO: Duration: 18.717881441116333
12/21/2022 02:31:14 PM script INFO: mengakhiri-quiz
12/21/2022 02:31:15 PM script INFO: SUCCESS!@#KODE 1!@#USER_ID 34!@#ACTIVITY_CODE 5
12/21/2022 02:31:15 PM script INFO: berhasil-submit
