12/11/2022 03:05:19 PM script INFO: Prepared chrome options..
12/11/2022 03:05:20 PM script INFO: Initialized chrome browser..
12/11/2022 03:05:20 PM script INFO: mengakses-homepage
12/11/2022 03:05:32 PM script INFO: mengakses-login-page
12/11/2022 03:05:33 PM script INFO: mengakses-site-home
12/11/2022 03:05:34 PM script INFO: mengakses-site-course
12/11/2022 03:05:34 PM script INFO: mengakses-quiz
12/11/2022 03:05:35 PM script INFO: mengakses-start-quiz-page
12/11/2022 03:05:37 PM script INFO: memulai-quiz
12/11/2022 03:05:37 PM script INFO: SUCCESS!@#KODE 1!@#USER_ID 23!@#ACTIVITY_CODE 5
12/11/2022 03:05:48 PM script INFO: SUCCESS!@#KODE 1!@#USER_ID 23!@#ACTIVITY_CODE 3
12/11/2022 03:05:48 PM script INFO: SUCCESS!@#KODE 1!@#USER_ID 23!@#ACTIVITY_CODE 1
12/11/2022 03:05:48 PM script INFO: SUCCESS!@#KODE 1!@#USER_ID 23!@#ACTIVITY_CODE 2
12/11/2022 03:05:48 PM script INFO: SUCCESS!@#KODE 1!@#USER_ID 23!@#ACTIVITY_CODE 1
12/11/2022 03:05:48 PM script INFO: SUCCESS!@#KODE 1!@#USER_ID 23!@#ACTIVITY_CODE 3
12/11/2022 03:05:48 PM script INFO: SUCCESS!@#KODE 1!@#USER_ID 23!@#ACTIVITY_CODE 4
12/11/2022 03:05:48 PM script INFO: SUCCESS!@#KODE 1!@#USER_ID 23!@#ACTIVITY_CODE 2
12/11/2022 03:05:49 PM script INFO: SUCCESS!@#KODE 1!@#USER_ID 23!@#ACTIVITY_CODE 2
12/11/2022 03:05:49 PM script INFO: SUCCESS!@#KODE 1!@#USER_ID 23!@#ACTIVITY_CODE 1
12/11/2022 03:05:49 PM script INFO: SUCCESS!@#KODE 1!@#USER_ID 23!@#ACTIVITY_CODE 5
12/11/2022 03:05:49 PM script INFO: SUCCESS!@#KODE 1!@#USER_ID 23!@#ACTIVITY_CODE 5
12/11/2022 03:05:51 PM script INFO: SUCCESS!@#KODE 1!@#USER_ID 23!@#ACTIVITY_CODE 5
12/11/2022 03:05:51 PM script INFO: SUCCESS!@#KODE 1!@#USER_ID 23!@#ACTIVITY_CODE 5
12/11/2022 03:05:54 PM script INFO: SUCCESS!@#KODE 1!@#USER_ID 23!@#ACTIVITY_CODE 5
12/11/2022 03:05:54 PM script INFO: SUCCESS!@#KODE 1!@#USER_ID 23!@#ACTIVITY_CODE 5
12/11/2022 03:05:56 PM script INFO: SUCCESS!@#KODE 1!@#USER_ID 23!@#ACTIVITY_CODE 4
12/11/2022 03:05:56 PM script INFO: SUCCESS!@#KODE 1!@#USER_ID 23!@#ACTIVITY_CODE 1
12/11/2022 03:05:56 PM script INFO: SUCCESS!@#KODE 1!@#USER_ID 23!@#ACTIVITY_CODE 1
12/11/2022 03:05:56 PM script INFO: SUCCESS!@#KODE 1!@#USER_ID 23!@#ACTIVITY_CODE 2
12/11/2022 03:05:56 PM script INFO: SUCCESS!@#KODE 1!@#USER_ID 23!@#ACTIVITY_CODE 5
12/11/2022 03:05:56 PM script INFO: SUCCESS!@#KODE 1!@#USER_ID 23!@#ACTIVITY_CODE 5
12/11/2022 03:05:59 PM script INFO: SUCCESS!@#KODE 1!@#USER_ID 23!@#ACTIVITY_CODE 2
12/11/2022 03:05:59 PM script INFO: SUCCESS!@#KODE 1!@#USER_ID 23!@#ACTIVITY_CODE 5
12/11/2022 03:05:59 PM script INFO: SUCCESS!@#KODE 1!@#USER_ID 23!@#ACTIVITY_CODE 5
12/11/2022 03:06:02 PM script INFO: SUCCESS!@#KODE 1!@#USER_ID 23!@#ACTIVITY_CODE 4
12/11/2022 03:06:02 PM script INFO: SUCCESS!@#KODE 1!@#USER_ID 23!@#ACTIVITY_CODE 3
12/11/2022 03:06:02 PM script INFO: SUCCESS!@#KODE 1!@#USER_ID 23!@#ACTIVITY_CODE 3
12/11/2022 03:06:02 PM script INFO: SUCCESS!@#KODE 1!@#USER_ID 23!@#ACTIVITY_CODE 1
12/11/2022 03:06:02 PM script INFO: SUCCESS!@#KODE 1!@#USER_ID 23!@#ACTIVITY_CODE 1
12/11/2022 03:06:02 PM script INFO: SUCCESS!@#KODE 1!@#USER_ID 23!@#ACTIVITY_CODE 2
12/11/2022 03:06:02 PM script INFO: SUCCESS!@#KODE 1!@#USER_ID 23!@#ACTIVITY_CODE 2
12/11/2022 03:06:02 PM script INFO: SUCCESS!@#KODE 1!@#USER_ID 23!@#ACTIVITY_CODE 1
12/11/2022 03:06:02 PM script INFO: SUCCESS!@#KODE 1!@#USER_ID 23!@#ACTIVITY_CODE 4
12/11/2022 03:06:03 PM script INFO: SUCCESS!@#KODE 1!@#USER_ID 23!@#ACTIVITY_CODE 2
12/11/2022 03:06:03 PM script INFO: SUCCESS!@#KODE 1!@#USER_ID 23!@#ACTIVITY_CODE 5
12/11/2022 03:06:03 PM script INFO: SUCCESS!@#KODE 1!@#USER_ID 23!@#ACTIVITY_CODE 5
12/11/2022 03:06:05 PM script INFO: SUCCESS!@#KODE 1!@#USER_ID 23!@#ACTIVITY_CODE 3
12/11/2022 03:06:05 PM script INFO: SUCCESS!@#KODE 1!@#USER_ID 23!@#ACTIVITY_CODE 1
12/11/2022 03:06:05 PM script INFO: SUCCESS!@#KODE 1!@#USER_ID 23!@#ACTIVITY_CODE 1
12/11/2022 03:06:05 PM script INFO: SUCCESS!@#KODE 1!@#USER_ID 23!@#ACTIVITY_CODE 3
12/11/2022 03:06:05 PM script INFO: SUCCESS!@#KODE 1!@#USER_ID 23!@#ACTIVITY_CODE 1
12/11/2022 03:06:05 PM script INFO: SUCCESS!@#KODE 1!@#USER_ID 23!@#ACTIVITY_CODE 1
12/11/2022 03:06:05 PM script INFO: SUCCESS!@#KODE 1!@#USER_ID 23!@#ACTIVITY_CODE 4
12/11/2022 03:06:06 PM script INFO: SUCCESS!@#KODE 1!@#USER_ID 23!@#ACTIVITY_CODE 2
12/11/2022 03:06:06 PM script INFO: SUCCESS!@#KODE 1!@#USER_ID 23!@#ACTIVITY_CODE 3
12/11/2022 03:06:06 PM script INFO: SUCCESS!@#KODE 1!@#USER_ID 23!@#ACTIVITY_CODE 1
12/11/2022 03:06:06 PM script INFO: SUCCESS!@#KODE 1!@#USER_ID 23!@#ACTIVITY_CODE 4
12/11/2022 03:06:06 PM script INFO: SUCCESS!@#KODE 1!@#USER_ID 23!@#ACTIVITY_CODE 3
12/11/2022 03:06:06 PM script INFO: Duration: 18.052277326583862
12/11/2022 03:06:06 PM script INFO: mengakhiri-quiz
12/11/2022 03:06:09 PM script INFO: SUCCESS!@#KODE 1!@#USER_ID 23!@#ACTIVITY_CODE 5
12/11/2022 03:06:09 PM script INFO: berhasil-submit
