ASLI
index,jumlah_aktivitas,rata-rata,median,max,min,jangkauan,variance,standar_deviasi
0,asli-50action,4.571,2.322,32.596,-0.878,33.474,37.453,6.120
1,asli-100action,4.285,1.561,37.882,-0.791,38.673,38.741,6.224
2,asli-250action,8.215,4.732,64.851,-0.930,65.781,103.336,10.165
3,asli-500action,16.456,11.888,93.927,-0.910,94.837,270.852,16.458


VERTICAL 4 VCPU
index,jumlah_aktivitas,rata-rata,median,max,min,jangkauan,variance,standar_deviasi
0,vertical-4vcpu-50action,2.751,0.648,26.896,-0.874,27.770,18.832,4.340
1,vertical-4vcpu-100action,6.614,3.304,60.325,-0.845,61.170,78.658,8.869
2,vertical-4vcpu-250action,17.859,11.469,125.532,-0.861,126.393,394.384,19.859
3,vertical-4vcpu-500action,45.394,26.818,259.749,-0.887,260.636,2347.958,48.456


VERTICAL 8 VCPU
index,jumlah_aktivitas,rata-rata,median,max,min,jangkauan,variance,standar_deviasi
0,vertical-8vcpu-50action,1.185,0.442,23.830,-0.521,24.351,7.696,2.774
1,vertical-8vcpu-100action,1.442,0.492,23.589,-0.506,24.095,11.033,3.322
2,vertical-8vcpu-250action,4.431,1.637,51.594,-0.514,52.108,38.777,6.227
3,vertical-8vcpu-500action,16.227,8.463,113.341,-0.516,113.857,391.845,19.795


VERTICAL 16 VCPU
index,jumlah_aktivitas,rata-rata,median,max,min,jangkauan,variance,standar_deviasi
0,vertical-16vcpu-50action,0.959,0.139,18.466,-0.710,19.176,7.435,2.727
1,vertical-16vcpu-100action,1.668,0.182,22.060,-0.745,22.805,16.634,4.079
2,vertical-16vcpu-250action,3.604,1.448,33.392,-0.705,34.097,32.145,5.670
3,vertical-16vcpu-500action,13.032,9.184,102.212,-0.731,102.943,240.590,15.511


VERTICAL 32 VCPU
index,jumlah_aktivitas,rata-rata,median,max,min,jangkauan,variance,standar_deviasi
0,vertical-32vcpu-50action,1.277,0.203,20.167,-0.661,20.828,10.406,3.226
1,vertical-32vcpu-100action,1.446,0.173,21.566,-0.685,22.251,15.068,3.882
2,vertical-32vcpu-250action,2.991,1.110,28.543,-0.688,29.231,18.796,4.335
3,vertical-32vcpu-500action,12.467,10.711,55.812,-0.696,56.508,119.865,10.948


MICROSERVICE
index,jumlah_aktivitas,rata-rata,median,max,min,jangkauan,variance,standar_deviasi
0,microservices-2vcpu-50action,3.074,1.523,24.024,-0.729,24.753,16.260,4.032
1,microservices-2vcpu-100action,3.564,1.574,33.164,-0.782,33.946,26.080,5.107
2,microservices-2vcpu-250action,8.535,5.154,72.747,-0.769,73.516,105.373,10.265
3,microservices-2vcpu-500action,12.084,7.906,96.652,-0.776,97.428,202.944,14.246


MICRO + VERTICAL 4 VCPU
index,jumlah_aktivitas,rata-rata,median,max,min,jangkauan,variance,standar_deviasi
0,microservices-4vcpu-50action,3.913,1.653,25.503,-0.794,26.297,25.481,5.048
1,microservices-4vcpu-100action,4.550,1.312,35.635,-0.834,36.469,49.886,7.063
2,microservices-4vcpu-250action,10.759,6.555,82.295,-0.811,83.106,175.989,13.266
3,microservices-4vcpu-500action,20.059,8.532,134.931,-0.807,135.738,634.583,25.191


MICRO + VERTICAL 8 VCPU
index,jumlah_aktivitas,rata-rata,median,max,min,jangkauan,variance,standar_deviasi
0,microservices-8vcpu-50action,1.526,0.431,18.320,-0.455,18.775,10.887,3.300
1,microservices-8vcpu-100action,1.364,0.437,22.893,-0.483,23.376,10.308,3.211
2,microservices-8vcpu-250action,3.935,1.213,53.792,-0.479,54.271,33.164,5.759
3,microservices-8vcpu-500action,13.071,6.981,98.034,-0.704,98.738,252.263,15.883


MICRO + VERTICAL 16 VCPU
index,jumlah_aktivitas,rata-rata,median,max,min,jangkauan,variance,standar_deviasi
0,microservices-16vcpu-50action,1.295,0.267,18.450,-0.600,19.050,10.167,3.189
1,microservices-16vcpu-100action,1.671,0.264,23.645,-0.614,24.259,16.159,4.020
2,microservices-16vcpu-250action,3.250,0.505,40.079,-0.602,40.681,31.912,5.649
3,microservices-16vcpu-500action,8.187,0.804,77.902,-0.621,78.523,179.804,13.409

