Nmap scan report for 10.96.0.1
Nmap scan report for 10.96.0.2
Nmap scan report for 10.96.0.3
Nmap scan report for 10.96.0.4
Nmap scan report for 10.96.0.5
Nmap scan report for 10.96.0.6
Nmap scan report for 10.96.0.7
Nmap scan report for 10.96.0.8
Nmap scan report for 10.96.0.9
Nmap scan report for 10.96.1.2
Nmap scan report for kube-dns-598f9895c6-bh7h8 (10.96.1.3)
Nmap scan report for 10.96.1.4
Nmap scan report for 10.96.1.5
Nmap scan report for 10.96.1.6
Nmap scan report for 10.96.1.8
Nmap scan report for 10.96.1.9
Nmap scan report for 10.96.1.10
Nmap scan report for 10.96.1.11
Nmap scan report for 10.96.1.12
Nmap scan report for 10.96.1.13
Nmap scan report for 10.96.1.14
Nmap scan report for 10.96.1.15
Nmap scan report for 10.96.1.16
Nmap scan report for 10.96.1.17
Nmap scan report for 10.96.1.18
Nmap scan report for 10.96.1.19
Nmap scan report for 10.96.1.20
Nmap scan report for 10.96.1.21
Nmap scan report for 10.96.1.22
Nmap scan report for 10.96.1.23
Nmap scan report for 10.96.1.24
Nmap scan report for 10.96.1.26
Nmap scan report for 10.96.1.27
Nmap scan report for 10.96.1.28
Nmap scan report for 10.96.1.29
Nmap scan report for 10.96.1.30
Nmap scan report for 10.96.1.31
Nmap scan report for 10.96.1.32
Nmap scan report for 10.96.1.33
Nmap scan report for 10.96.1.34
Nmap scan report for 10.96.1.35
Nmap scan report for 10.96.1.36
Nmap scan report for 10.96.1.37
Nmap scan report for 10.96.1.38
Nmap scan report for 10.96.1.39
Nmap scan report for 10.96.1.40
Nmap scan report for 10.96.1.41
Nmap scan report for 10.96.1.42
Nmap scan report for 10.96.1.44
Nmap scan report for 10.96.1.45
Nmap scan report for 10.96.1.46
Nmap scan report for 10.96.1.47
Nmap scan report for 10.96.1.48
Nmap scan report for 10.96.1.49
Nmap scan report for 10.96.1.50
Nmap scan report for 10.96.1.51
Nmap scan report for 10.96.1.52
Nmap scan report for 10.96.1.53
Nmap scan report for 10.96.1.54
Nmap scan report for 10.96.1.55
Nmap scan report for 10.96.1.56
Nmap scan report for 10.96.1.57
Nmap scan report for 10.96.1.58
Nmap scan report for 10.96.1.59
Nmap scan report for 10.96.1.60
Nmap scan report for 10.96.1.61
Nmap scan report for 10.96.1.62
Nmap scan report for 10.96.1.63
Nmap scan report for 10.96.1.65
Nmap scan report for 10.96.1.66
Nmap scan report for 10.96.1.67
Nmap scan report for 10.96.1.68
Nmap scan report for 10.96.1.69
Nmap scan report for 10.96.1.70
Nmap scan report for 10.96.1.71
Nmap scan report for 10.96.1.72
Nmap scan report for 10.96.1.73
Nmap scan report for 10.96.1.74
Nmap scan report for 10.96.1.75
Nmap scan report for 10.96.1.76
Nmap scan report for 10.96.1.77
Nmap scan report for 10.96.1.78
Nmap scan report for 10.96.1.79
Nmap scan report for 10.96.1.80
Nmap scan report for 10.96.1.81
Nmap scan report for 10.96.1.82
Nmap scan report for 10.96.1.83
Nmap scan report for 10.96.1.84
Nmap scan report for 10.96.1.85
Nmap scan report for 10.96.1.86
Nmap scan report for 10.96.1.87
Nmap scan report for 10.96.1.88
Nmap scan report for 10.96.1.89
Nmap scan report for 10.96.1.90
Nmap scan report for 10.96.1.91
Nmap scan report for 10.96.1.92
Nmap scan report for 10.96.1.93
Nmap scan report for 10.96.1.94
Nmap scan report for 10.96.1.95
Nmap scan report for 10.96.1.96
Nmap scan report for 10.96.1.97
Nmap scan report for 10.96.1.98
Nmap scan report for 10.96.1.100
Nmap scan report for 10.96.1.101
Nmap scan report for 10.96.1.102
Nmap scan report for 10.96.1.103
Nmap scan report for 10.96.1.104
Nmap scan report for 10.96.1.105
Nmap scan report for 10.96.1.106
Nmap scan report for 10.96.1.107
Nmap scan report for 10.96.1.1
Nmap scan report for master-76d459876-jgr8f (10.96.1.7)
