12/21/2022 02:29:40 PM script INFO: Prepared chrome options..
12/21/2022 02:29:41 PM script INFO: Initialized chrome browser..
12/21/2022 02:29:41 PM script INFO: mengakses-homepage
12/21/2022 02:30:09 PM script INFO: mengakses-login-page
12/21/2022 02:30:11 PM script INFO: mengakses-site-home
12/21/2022 02:30:12 PM script INFO: mengakses-site-course
12/21/2022 02:30:13 PM script INFO: mengakses-quiz
12/21/2022 02:30:14 PM script INFO: mengakses-start-quiz-page
12/21/2022 02:30:15 PM script INFO: memulai-quiz
12/21/2022 02:30:15 PM script INFO: SUCCESS!@#KODE 1!@#USER_ID 49!@#ACTIVITY_CODE 5
12/21/2022 02:30:27 PM script INFO: SUCCESS!@#KODE 1!@#USER_ID 49!@#ACTIVITY_CODE 2
12/21/2022 02:30:27 PM script INFO: SUCCESS!@#KODE 1!@#USER_ID 49!@#ACTIVITY_CODE 1
12/21/2022 02:30:27 PM script INFO: SUCCESS!@#KODE 1!@#USER_ID 49!@#ACTIVITY_CODE 1
12/21/2022 02:30:27 PM script INFO: SUCCESS!@#KODE 1!@#USER_ID 49!@#ACTIVITY_CODE 5
12/21/2022 02:30:27 PM script INFO: SUCCESS!@#KODE 1!@#USER_ID 49!@#ACTIVITY_CODE 5
12/21/2022 02:30:29 PM script INFO: SUCCESS!@#KODE 1!@#USER_ID 49!@#ACTIVITY_CODE 4
12/21/2022 02:30:29 PM script INFO: SUCCESS!@#KODE 1!@#USER_ID 49!@#ACTIVITY_CODE 1
12/21/2022 02:30:29 PM script INFO: SUCCESS!@#KODE 1!@#USER_ID 49!@#ACTIVITY_CODE 5
12/21/2022 02:30:29 PM script INFO: SUCCESS!@#KODE 1!@#USER_ID 49!@#ACTIVITY_CODE 5
12/21/2022 02:30:32 PM script INFO: SUCCESS!@#KODE 1!@#USER_ID 49!@#ACTIVITY_CODE 5
12/21/2022 02:30:32 PM script INFO: SUCCESS!@#KODE 1!@#USER_ID 49!@#ACTIVITY_CODE 5
12/21/2022 02:30:35 PM script INFO: SUCCESS!@#KODE 1!@#USER_ID 49!@#ACTIVITY_CODE 4
12/21/2022 02:30:35 PM script INFO: SUCCESS!@#KODE 1!@#USER_ID 49!@#ACTIVITY_CODE 3
12/21/2022 02:30:35 PM script INFO: SUCCESS!@#KODE 1!@#USER_ID 49!@#ACTIVITY_CODE 3
12/21/2022 02:30:35 PM script INFO: SUCCESS!@#KODE 1!@#USER_ID 49!@#ACTIVITY_CODE 5
12/21/2022 02:30:35 PM script INFO: SUCCESS!@#KODE 1!@#USER_ID 49!@#ACTIVITY_CODE 5
12/21/2022 02:30:37 PM script INFO: SUCCESS!@#KODE 1!@#USER_ID 49!@#ACTIVITY_CODE 5
12/21/2022 02:30:37 PM script INFO: SUCCESS!@#KODE 1!@#USER_ID 49!@#ACTIVITY_CODE 5
12/21/2022 02:30:40 PM script INFO: SUCCESS!@#KODE 1!@#USER_ID 49!@#ACTIVITY_CODE 1
12/21/2022 02:30:40 PM script INFO: SUCCESS!@#KODE 1!@#USER_ID 49!@#ACTIVITY_CODE 3
12/21/2022 02:30:40 PM script INFO: SUCCESS!@#KODE 1!@#USER_ID 49!@#ACTIVITY_CODE 4
12/21/2022 02:30:40 PM script INFO: SUCCESS!@#KODE 1!@#USER_ID 49!@#ACTIVITY_CODE 1
12/21/2022 02:30:40 PM script INFO: SUCCESS!@#KODE 1!@#USER_ID 49!@#ACTIVITY_CODE 5
12/21/2022 02:30:40 PM script INFO: SUCCESS!@#KODE 1!@#USER_ID 49!@#ACTIVITY_CODE 5
12/21/2022 02:30:43 PM script INFO: SUCCESS!@#KODE 1!@#USER_ID 49!@#ACTIVITY_CODE 4
12/21/2022 02:30:43 PM script INFO: SUCCESS!@#KODE 1!@#USER_ID 49!@#ACTIVITY_CODE 1
12/21/2022 02:30:44 PM script INFO: SUCCESS!@#KODE 1!@#USER_ID 49!@#ACTIVITY_CODE 2
12/21/2022 02:30:44 PM script INFO: SUCCESS!@#KODE 1!@#USER_ID 49!@#ACTIVITY_CODE 3
12/21/2022 02:30:44 PM script INFO: SUCCESS!@#KODE 1!@#USER_ID 49!@#ACTIVITY_CODE 1
12/21/2022 02:30:44 PM script INFO: SUCCESS!@#KODE 1!@#USER_ID 49!@#ACTIVITY_CODE 3
12/21/2022 02:30:44 PM script INFO: SUCCESS!@#KODE 1!@#USER_ID 49!@#ACTIVITY_CODE 1
12/21/2022 02:30:44 PM script INFO: SUCCESS!@#KODE 1!@#USER_ID 49!@#ACTIVITY_CODE 2
12/21/2022 02:30:45 PM script INFO: SUCCESS!@#KODE 1!@#USER_ID 49!@#ACTIVITY_CODE 2
12/21/2022 02:30:45 PM script INFO: SUCCESS!@#KODE 1!@#USER_ID 49!@#ACTIVITY_CODE 3
12/21/2022 02:30:45 PM script INFO: SUCCESS!@#KODE 1!@#USER_ID 49!@#ACTIVITY_CODE 3
12/21/2022 02:30:45 PM script INFO: SUCCESS!@#KODE 1!@#USER_ID 49!@#ACTIVITY_CODE 1
12/21/2022 02:30:45 PM script INFO: SUCCESS!@#KODE 1!@#USER_ID 49!@#ACTIVITY_CODE 3
12/21/2022 02:30:46 PM script INFO: SUCCESS!@#KODE 1!@#USER_ID 49!@#ACTIVITY_CODE 2
12/21/2022 02:30:46 PM script INFO: SUCCESS!@#KODE 1!@#USER_ID 49!@#ACTIVITY_CODE 3
12/21/2022 02:30:46 PM script INFO: SUCCESS!@#KODE 1!@#USER_ID 49!@#ACTIVITY_CODE 3
12/21/2022 02:30:46 PM script INFO: SUCCESS!@#KODE 1!@#USER_ID 49!@#ACTIVITY_CODE 3
12/21/2022 02:30:46 PM script INFO: SUCCESS!@#KODE 1!@#USER_ID 49!@#ACTIVITY_CODE 2
12/21/2022 02:30:46 PM script INFO: SUCCESS!@#KODE 1!@#USER_ID 49!@#ACTIVITY_CODE 1
12/21/2022 02:30:46 PM script INFO: SUCCESS!@#KODE 1!@#USER_ID 49!@#ACTIVITY_CODE 3
12/21/2022 02:30:46 PM script INFO: SUCCESS!@#KODE 1!@#USER_ID 49!@#ACTIVITY_CODE 1
12/21/2022 02:30:46 PM script INFO: SUCCESS!@#KODE 1!@#USER_ID 49!@#ACTIVITY_CODE 2
12/21/2022 02:30:47 PM script INFO: SUCCESS!@#KODE 1!@#USER_ID 49!@#ACTIVITY_CODE 3
12/21/2022 02:30:47 PM script INFO: SUCCESS!@#KODE 1!@#USER_ID 49!@#ACTIVITY_CODE 1
12/21/2022 02:30:47 PM script INFO: Duration: 20.314927101135254
12/21/2022 02:30:47 PM script INFO: mengakhiri-quiz
12/21/2022 02:30:48 PM script INFO: SUCCESS!@#KODE 1!@#USER_ID 49!@#ACTIVITY_CODE 5
12/21/2022 02:30:48 PM script INFO: berhasil-submit
