12/23/2022 04:26:04 AM script INFO: Prepared chrome options..
12/23/2022 04:26:06 AM script INFO: Initialized chrome browser..
12/23/2022 04:26:06 AM script INFO: mengakses-homepage
12/23/2022 04:26:33 AM script INFO: mengakses-login-page
12/23/2022 04:27:27 AM script INFO: mengakses-site-home
12/23/2022 04:27:36 AM script INFO: mengakses-site-course
12/23/2022 04:28:02 AM script INFO: mengakses-quiz
12/23/2022 04:28:16 AM script INFO: mengakses-start-quiz-page
12/23/2022 04:28:38 AM script INFO: memulai-quiz
12/23/2022 04:28:38 AM script INFO: SUCCESS!@#KODE 1!@#USER_ID 40!@#ACTIVITY_CODE 5
12/23/2022 04:28:49 AM script INFO: SUCCESS!@#KODE 1!@#USER_ID 40!@#ACTIVITY_CODE 5
12/23/2022 04:28:49 AM script INFO: SUCCESS!@#KODE 1!@#USER_ID 40!@#ACTIVITY_CODE 5
12/23/2022 04:28:51 AM script INFO: SUCCESS!@#KODE 1!@#USER_ID 40!@#ACTIVITY_CODE 3
12/23/2022 04:28:51 AM script INFO: SUCCESS!@#KODE 1!@#USER_ID 40!@#ACTIVITY_CODE 1
12/23/2022 04:28:52 AM script INFO: SUCCESS!@#KODE 1!@#USER_ID 40!@#ACTIVITY_CODE 2
12/23/2022 04:28:52 AM script INFO: SUCCESS!@#KODE 1!@#USER_ID 40!@#ACTIVITY_CODE 3
12/23/2022 04:28:52 AM script INFO: SUCCESS!@#KODE 1!@#USER_ID 40!@#ACTIVITY_CODE 1
12/23/2022 04:28:52 AM script INFO: SUCCESS!@#KODE 1!@#USER_ID 40!@#ACTIVITY_CODE 5
12/23/2022 04:28:52 AM script INFO: SUCCESS!@#KODE 1!@#USER_ID 40!@#ACTIVITY_CODE 5
12/23/2022 04:28:54 AM script INFO: SUCCESS!@#KODE 1!@#USER_ID 40!@#ACTIVITY_CODE 2
12/23/2022 04:28:54 AM script INFO: SUCCESS!@#KODE 1!@#USER_ID 40!@#ACTIVITY_CODE 5
12/23/2022 04:28:54 AM script INFO: SUCCESS!@#KODE 1!@#USER_ID 40!@#ACTIVITY_CODE 5
12/23/2022 04:28:57 AM script INFO: SUCCESS!@#KODE 1!@#USER_ID 40!@#ACTIVITY_CODE 3
12/23/2022 04:28:57 AM script INFO: SUCCESS!@#KODE 1!@#USER_ID 40!@#ACTIVITY_CODE 3
12/23/2022 04:28:57 AM script INFO: SUCCESS!@#KODE 1!@#USER_ID 40!@#ACTIVITY_CODE 3
12/23/2022 04:28:57 AM script INFO: SUCCESS!@#KODE 1!@#USER_ID 40!@#ACTIVITY_CODE 1
12/23/2022 04:28:57 AM script INFO: SUCCESS!@#KODE 1!@#USER_ID 40!@#ACTIVITY_CODE 4
12/23/2022 04:28:57 AM script INFO: SUCCESS!@#KODE 1!@#USER_ID 40!@#ACTIVITY_CODE 5
12/23/2022 04:28:57 AM script INFO: SUCCESS!@#KODE 1!@#USER_ID 40!@#ACTIVITY_CODE 5
12/23/2022 04:29:00 AM script INFO: SUCCESS!@#KODE 1!@#USER_ID 40!@#ACTIVITY_CODE 3
12/23/2022 04:29:00 AM script INFO: SUCCESS!@#KODE 1!@#USER_ID 40!@#ACTIVITY_CODE 1
12/23/2022 04:29:00 AM script INFO: SUCCESS!@#KODE 1!@#USER_ID 40!@#ACTIVITY_CODE 3
12/23/2022 04:29:00 AM script INFO: SUCCESS!@#KODE 1!@#USER_ID 40!@#ACTIVITY_CODE 1
12/23/2022 04:29:00 AM script INFO: SUCCESS!@#KODE 1!@#USER_ID 40!@#ACTIVITY_CODE 5
12/23/2022 04:29:00 AM script INFO: SUCCESS!@#KODE 1!@#USER_ID 40!@#ACTIVITY_CODE 5
12/23/2022 04:29:03 AM script INFO: SUCCESS!@#KODE 1!@#USER_ID 40!@#ACTIVITY_CODE 3
12/23/2022 04:29:03 AM script INFO: SUCCESS!@#KODE 1!@#USER_ID 40!@#ACTIVITY_CODE 5
12/23/2022 04:29:03 AM script INFO: SUCCESS!@#KODE 1!@#USER_ID 40!@#ACTIVITY_CODE 5
12/23/2022 04:29:05 AM script INFO: SUCCESS!@#KODE 1!@#USER_ID 40!@#ACTIVITY_CODE 4
12/23/2022 04:29:05 AM script INFO: SUCCESS!@#KODE 1!@#USER_ID 40!@#ACTIVITY_CODE 5
12/23/2022 04:29:05 AM script INFO: SUCCESS!@#KODE 1!@#USER_ID 40!@#ACTIVITY_CODE 5
12/23/2022 04:29:08 AM script INFO: SUCCESS!@#KODE 1!@#USER_ID 40!@#ACTIVITY_CODE 1
12/23/2022 04:29:08 AM script INFO: SUCCESS!@#KODE 1!@#USER_ID 40!@#ACTIVITY_CODE 2
12/23/2022 04:29:08 AM script INFO: SUCCESS!@#KODE 1!@#USER_ID 40!@#ACTIVITY_CODE 5
12/23/2022 04:29:08 AM script INFO: SUCCESS!@#KODE 1!@#USER_ID 40!@#ACTIVITY_CODE 5
12/23/2022 04:29:10 AM script INFO: SUCCESS!@#KODE 1!@#USER_ID 40!@#ACTIVITY_CODE 3
12/23/2022 04:29:11 AM script INFO: SUCCESS!@#KODE 1!@#USER_ID 40!@#ACTIVITY_CODE 2
12/23/2022 04:29:11 AM script INFO: SUCCESS!@#KODE 1!@#USER_ID 40!@#ACTIVITY_CODE 1
12/23/2022 04:29:11 AM script INFO: SUCCESS!@#KODE 1!@#USER_ID 40!@#ACTIVITY_CODE 3
12/23/2022 04:29:11 AM script INFO: SUCCESS!@#KODE 1!@#USER_ID 40!@#ACTIVITY_CODE 3
12/23/2022 04:29:11 AM script INFO: SUCCESS!@#KODE 1!@#USER_ID 40!@#ACTIVITY_CODE 3
12/23/2022 04:29:11 AM script INFO: SUCCESS!@#KODE 1!@#USER_ID 40!@#ACTIVITY_CODE 4
12/23/2022 04:29:11 AM script INFO: SUCCESS!@#KODE 1!@#USER_ID 40!@#ACTIVITY_CODE 2
12/23/2022 04:29:11 AM script INFO: SUCCESS!@#KODE 1!@#USER_ID 40!@#ACTIVITY_CODE 5
12/23/2022 04:29:11 AM script INFO: SUCCESS!@#KODE 1!@#USER_ID 40!@#ACTIVITY_CODE 5
12/23/2022 04:29:14 AM script INFO: SUCCESS!@#KODE 1!@#USER_ID 40!@#ACTIVITY_CODE 1
12/23/2022 04:29:14 AM script INFO: SUCCESS!@#KODE 1!@#USER_ID 40!@#ACTIVITY_CODE 2
12/23/2022 04:29:14 AM script INFO: SUCCESS!@#KODE 1!@#USER_ID 40!@#ACTIVITY_CODE 3
12/23/2022 04:29:14 AM script INFO: SUCCESS!@#KODE 1!@#USER_ID 40!@#ACTIVITY_CODE 5
12/23/2022 04:29:14 AM script INFO: SUCCESS!@#KODE 1!@#USER_ID 40!@#ACTIVITY_CODE 5
12/23/2022 04:29:16 AM script INFO: SUCCESS!@#KODE 1!@#USER_ID 40!@#ACTIVITY_CODE 1
12/23/2022 04:29:16 AM script INFO: SUCCESS!@#KODE 1!@#USER_ID 40!@#ACTIVITY_CODE 4
12/23/2022 04:29:16 AM script INFO: SUCCESS!@#KODE 1!@#USER_ID 40!@#ACTIVITY_CODE 5
12/23/2022 04:29:16 AM script INFO: SUCCESS!@#KODE 1!@#USER_ID 40!@#ACTIVITY_CODE 5
12/23/2022 04:29:19 AM script INFO: SUCCESS!@#KODE 1!@#USER_ID 40!@#ACTIVITY_CODE 1
12/23/2022 04:29:19 AM script INFO: SUCCESS!@#KODE 1!@#USER_ID 40!@#ACTIVITY_CODE 1
12/23/2022 04:29:19 AM script INFO: SUCCESS!@#KODE 1!@#USER_ID 40!@#ACTIVITY_CODE 1
12/23/2022 04:29:19 AM script INFO: SUCCESS!@#KODE 1!@#USER_ID 40!@#ACTIVITY_CODE 2
12/23/2022 04:29:19 AM script INFO: SUCCESS!@#KODE 1!@#USER_ID 40!@#ACTIVITY_CODE 2
12/23/2022 04:29:20 AM script INFO: SUCCESS!@#KODE 1!@#USER_ID 40!@#ACTIVITY_CODE 2
12/23/2022 04:29:20 AM script INFO: SUCCESS!@#KODE 1!@#USER_ID 40!@#ACTIVITY_CODE 3
12/23/2022 04:29:20 AM script INFO: SUCCESS!@#KODE 1!@#USER_ID 40!@#ACTIVITY_CODE 2
12/23/2022 04:29:20 AM script INFO: SUCCESS!@#KODE 1!@#USER_ID 40!@#ACTIVITY_CODE 3
12/23/2022 04:29:20 AM script INFO: SUCCESS!@#KODE 1!@#USER_ID 40!@#ACTIVITY_CODE 4
12/23/2022 04:29:20 AM script INFO: SUCCESS!@#KODE 1!@#USER_ID 40!@#ACTIVITY_CODE 3
12/23/2022 04:29:20 AM script INFO: SUCCESS!@#KODE 1!@#USER_ID 40!@#ACTIVITY_CODE 1
12/23/2022 04:29:20 AM script INFO: SUCCESS!@#KODE 1!@#USER_ID 40!@#ACTIVITY_CODE 2
12/23/2022 04:29:20 AM script INFO: SUCCESS!@#KODE 1!@#USER_ID 40!@#ACTIVITY_CODE 1
12/23/2022 04:29:20 AM script INFO: SUCCESS!@#KODE 1!@#USER_ID 40!@#ACTIVITY_CODE 1
12/23/2022 04:29:20 AM script INFO: SUCCESS!@#KODE 1!@#USER_ID 40!@#ACTIVITY_CODE 2
12/23/2022 04:29:21 AM script INFO: SUCCESS!@#KODE 1!@#USER_ID 40!@#ACTIVITY_CODE 3
12/23/2022 04:29:21 AM script INFO: SUCCESS!@#KODE 1!@#USER_ID 40!@#ACTIVITY_CODE 3
12/23/2022 04:29:21 AM script INFO: SUCCESS!@#KODE 1!@#USER_ID 40!@#ACTIVITY_CODE 3
12/23/2022 04:29:21 AM script INFO: SUCCESS!@#KODE 1!@#USER_ID 40!@#ACTIVITY_CODE 2
12/23/2022 04:29:21 AM script INFO: SUCCESS!@#KODE 1!@#USER_ID 40!@#ACTIVITY_CODE 3
12/23/2022 04:29:21 AM script INFO: SUCCESS!@#KODE 1!@#USER_ID 40!@#ACTIVITY_CODE 3
12/23/2022 04:29:21 AM script INFO: SUCCESS!@#KODE 1!@#USER_ID 40!@#ACTIVITY_CODE 1
12/23/2022 04:29:21 AM script INFO: SUCCESS!@#KODE 1!@#USER_ID 40!@#ACTIVITY_CODE 3
12/23/2022 04:29:21 AM script INFO: SUCCESS!@#KODE 1!@#USER_ID 40!@#ACTIVITY_CODE 2
12/23/2022 04:29:21 AM script INFO: SUCCESS!@#KODE 1!@#USER_ID 40!@#ACTIVITY_CODE 2
12/23/2022 04:29:22 AM script INFO: SUCCESS!@#KODE 1!@#USER_ID 40!@#ACTIVITY_CODE 2
12/23/2022 04:29:22 AM script INFO: SUCCESS!@#KODE 1!@#USER_ID 40!@#ACTIVITY_CODE 2
12/23/2022 04:29:22 AM script INFO: SUCCESS!@#KODE 1!@#USER_ID 40!@#ACTIVITY_CODE 1
12/23/2022 04:29:22 AM script INFO: SUCCESS!@#KODE 1!@#USER_ID 40!@#ACTIVITY_CODE 4
12/23/2022 04:29:22 AM script INFO: SUCCESS!@#KODE 1!@#USER_ID 40!@#ACTIVITY_CODE 1
12/23/2022 04:29:22 AM script INFO: SUCCESS!@#KODE 1!@#USER_ID 40!@#ACTIVITY_CODE 1
12/23/2022 04:29:22 AM script INFO: SUCCESS!@#KODE 1!@#USER_ID 40!@#ACTIVITY_CODE 2
12/23/2022 04:29:22 AM script INFO: SUCCESS!@#KODE 1!@#USER_ID 40!@#ACTIVITY_CODE 4
12/23/2022 04:29:22 AM script INFO: SUCCESS!@#KODE 1!@#USER_ID 40!@#ACTIVITY_CODE 3
12/23/2022 04:29:22 AM script INFO: SUCCESS!@#KODE 1!@#USER_ID 40!@#ACTIVITY_CODE 3
12/23/2022 04:29:22 AM script INFO: SUCCESS!@#KODE 1!@#USER_ID 40!@#ACTIVITY_CODE 1
12/23/2022 04:29:23 AM script INFO: SUCCESS!@#KODE 1!@#USER_ID 40!@#ACTIVITY_CODE 1
12/23/2022 04:29:23 AM script INFO: SUCCESS!@#KODE 1!@#USER_ID 40!@#ACTIVITY_CODE 4
12/23/2022 04:29:23 AM script INFO: SUCCESS!@#KODE 1!@#USER_ID 40!@#ACTIVITY_CODE 3
12/23/2022 04:29:23 AM script INFO: SUCCESS!@#KODE 1!@#USER_ID 40!@#ACTIVITY_CODE 1
12/23/2022 04:29:23 AM script INFO: SUCCESS!@#KODE 1!@#USER_ID 40!@#ACTIVITY_CODE 1
12/23/2022 04:29:23 AM script INFO: SUCCESS!@#KODE 1!@#USER_ID 40!@#ACTIVITY_CODE 4
12/23/2022 04:29:23 AM script INFO: SUCCESS!@#KODE 1!@#USER_ID 40!@#ACTIVITY_CODE 1
12/23/2022 04:29:23 AM script INFO: Duration: 34.106005907058716
12/23/2022 04:29:23 AM script INFO: mengakhiri-quiz
12/23/2022 04:29:33 AM script INFO: SUCCESS!@#KODE 1!@#USER_ID 40!@#ACTIVITY_CODE 5
12/23/2022 04:29:33 AM script INFO: berhasil-submit
12/23/2022 04:31:03 AM script ERROR: TIMEOUT EXCEPTION!@#KODE 0!@#LOCATION berhasil-submit
12/23/2022 04:31:03 AM main_worker ERROR: Message: None

