12/10/2022 08:53:26 AM script INFO: Prepared chrome options..
12/10/2022 08:53:28 AM script INFO: Initialized chrome browser..
12/10/2022 08:53:28 AM script INFO: mengakses-homepage
12/10/2022 08:53:47 AM script INFO: mengakses-login-page
12/10/2022 08:54:18 AM script INFO: mengakses-site-home
12/10/2022 08:54:23 AM script INFO: mengakses-site-course
12/10/2022 08:54:53 AM script INFO: mengakses-quiz
12/10/2022 08:54:56 AM script INFO: mengakses-start-quiz-page
12/10/2022 08:55:15 AM script INFO: memulai-quiz
12/10/2022 08:55:15 AM script INFO: SUCCESS!@#KODE 1!@#USER_ID 40!@#ACTIVITY_CODE 5
12/10/2022 08:55:26 AM script INFO: SUCCESS!@#KODE 1!@#USER_ID 40!@#ACTIVITY_CODE 2
12/10/2022 08:55:26 AM script INFO: SUCCESS!@#KODE 1!@#USER_ID 40!@#ACTIVITY_CODE 5
12/10/2022 08:55:26 AM script INFO: SUCCESS!@#KODE 1!@#USER_ID 40!@#ACTIVITY_CODE 5
12/10/2022 08:55:29 AM script INFO: SUCCESS!@#KODE 1!@#USER_ID 40!@#ACTIVITY_CODE 2
12/10/2022 08:55:29 AM script INFO: SUCCESS!@#KODE 1!@#USER_ID 40!@#ACTIVITY_CODE 3
12/10/2022 08:55:29 AM script INFO: SUCCESS!@#KODE 1!@#USER_ID 40!@#ACTIVITY_CODE 1
12/10/2022 08:55:29 AM script INFO: SUCCESS!@#KODE 1!@#USER_ID 40!@#ACTIVITY_CODE 3
12/10/2022 08:55:30 AM script INFO: SUCCESS!@#KODE 1!@#USER_ID 40!@#ACTIVITY_CODE 2
12/10/2022 08:55:30 AM script INFO: SUCCESS!@#KODE 1!@#USER_ID 40!@#ACTIVITY_CODE 3
12/10/2022 08:55:30 AM script INFO: SUCCESS!@#KODE 1!@#USER_ID 40!@#ACTIVITY_CODE 2
12/10/2022 08:55:30 AM script INFO: SUCCESS!@#KODE 1!@#USER_ID 40!@#ACTIVITY_CODE 5
12/10/2022 08:55:30 AM script INFO: SUCCESS!@#KODE 1!@#USER_ID 40!@#ACTIVITY_CODE 5
12/10/2022 08:55:33 AM script INFO: SUCCESS!@#KODE 1!@#USER_ID 40!@#ACTIVITY_CODE 3
12/10/2022 08:55:33 AM script INFO: SUCCESS!@#KODE 1!@#USER_ID 40!@#ACTIVITY_CODE 2
12/10/2022 08:55:33 AM script INFO: SUCCESS!@#KODE 1!@#USER_ID 40!@#ACTIVITY_CODE 4
12/10/2022 08:55:33 AM script INFO: SUCCESS!@#KODE 1!@#USER_ID 40!@#ACTIVITY_CODE 5
12/10/2022 08:55:33 AM script INFO: SUCCESS!@#KODE 1!@#USER_ID 40!@#ACTIVITY_CODE 5
12/10/2022 08:55:36 AM script INFO: SUCCESS!@#KODE 1!@#USER_ID 40!@#ACTIVITY_CODE 1
12/10/2022 08:55:36 AM script INFO: SUCCESS!@#KODE 1!@#USER_ID 40!@#ACTIVITY_CODE 3
12/10/2022 08:55:37 AM script INFO: SUCCESS!@#KODE 1!@#USER_ID 40!@#ACTIVITY_CODE 3
12/10/2022 08:55:37 AM script INFO: SUCCESS!@#KODE 1!@#USER_ID 40!@#ACTIVITY_CODE 3
12/10/2022 08:55:37 AM script INFO: SUCCESS!@#KODE 1!@#USER_ID 40!@#ACTIVITY_CODE 5
12/10/2022 08:55:37 AM script INFO: SUCCESS!@#KODE 1!@#USER_ID 40!@#ACTIVITY_CODE 5
12/10/2022 08:55:39 AM script INFO: SUCCESS!@#KODE 1!@#USER_ID 40!@#ACTIVITY_CODE 4
12/10/2022 08:55:39 AM script INFO: SUCCESS!@#KODE 1!@#USER_ID 40!@#ACTIVITY_CODE 5
12/10/2022 08:55:39 AM script INFO: SUCCESS!@#KODE 1!@#USER_ID 40!@#ACTIVITY_CODE 5
12/10/2022 08:55:42 AM script INFO: SUCCESS!@#KODE 1!@#USER_ID 40!@#ACTIVITY_CODE 1
12/10/2022 08:55:42 AM script INFO: SUCCESS!@#KODE 1!@#USER_ID 40!@#ACTIVITY_CODE 5
12/10/2022 08:55:42 AM script INFO: SUCCESS!@#KODE 1!@#USER_ID 40!@#ACTIVITY_CODE 5
12/10/2022 08:55:45 AM script INFO: SUCCESS!@#KODE 1!@#USER_ID 40!@#ACTIVITY_CODE 4
12/10/2022 08:55:45 AM script INFO: SUCCESS!@#KODE 1!@#USER_ID 40!@#ACTIVITY_CODE 2
12/10/2022 08:55:45 AM script INFO: SUCCESS!@#KODE 1!@#USER_ID 40!@#ACTIVITY_CODE 1
12/10/2022 08:55:45 AM script INFO: SUCCESS!@#KODE 1!@#USER_ID 40!@#ACTIVITY_CODE 3
12/10/2022 08:55:46 AM script INFO: SUCCESS!@#KODE 1!@#USER_ID 40!@#ACTIVITY_CODE 3
12/10/2022 08:55:46 AM script INFO: SUCCESS!@#KODE 1!@#USER_ID 40!@#ACTIVITY_CODE 1
12/10/2022 08:55:46 AM script INFO: SUCCESS!@#KODE 1!@#USER_ID 40!@#ACTIVITY_CODE 4
12/10/2022 08:55:46 AM script INFO: SUCCESS!@#KODE 1!@#USER_ID 40!@#ACTIVITY_CODE 1
12/10/2022 08:55:46 AM script INFO: SUCCESS!@#KODE 1!@#USER_ID 40!@#ACTIVITY_CODE 1
12/10/2022 08:55:46 AM script INFO: SUCCESS!@#KODE 1!@#USER_ID 40!@#ACTIVITY_CODE 2
12/10/2022 08:55:47 AM script INFO: SUCCESS!@#KODE 1!@#USER_ID 40!@#ACTIVITY_CODE 3
12/10/2022 08:55:47 AM script INFO: SUCCESS!@#KODE 1!@#USER_ID 40!@#ACTIVITY_CODE 1
12/10/2022 08:55:47 AM script INFO: SUCCESS!@#KODE 1!@#USER_ID 40!@#ACTIVITY_CODE 3
12/10/2022 08:55:47 AM script INFO: SUCCESS!@#KODE 1!@#USER_ID 40!@#ACTIVITY_CODE 2
12/10/2022 08:55:47 AM script INFO: SUCCESS!@#KODE 1!@#USER_ID 40!@#ACTIVITY_CODE 2
12/10/2022 08:55:47 AM script INFO: SUCCESS!@#KODE 1!@#USER_ID 40!@#ACTIVITY_CODE 3
12/10/2022 08:55:48 AM script INFO: SUCCESS!@#KODE 1!@#USER_ID 40!@#ACTIVITY_CODE 3
12/10/2022 08:55:48 AM script INFO: SUCCESS!@#KODE 1!@#USER_ID 40!@#ACTIVITY_CODE 1
12/10/2022 08:55:48 AM script INFO: SUCCESS!@#KODE 1!@#USER_ID 40!@#ACTIVITY_CODE 3
12/10/2022 08:55:48 AM script INFO: Duration: 22.055235147476196
12/10/2022 08:55:48 AM script INFO: mengakhiri-quiz
12/10/2022 08:55:49 AM script INFO: SUCCESS!@#KODE 1!@#USER_ID 40!@#ACTIVITY_CODE 5
12/10/2022 08:55:49 AM script INFO: berhasil-submit
12/10/2022 08:57:19 AM script ERROR: TIMEOUT EXCEPTION!@#KODE 0!@#LOCATION berhasil-submit
12/10/2022 08:57:19 AM main_worker ERROR: Message: None

