12/11/2022 03:05:19 PM script INFO: Prepared chrome options..
12/11/2022 03:05:20 PM script INFO: Initialized chrome browser..
12/11/2022 03:05:20 PM script INFO: mengakses-homepage
12/11/2022 03:05:26 PM script INFO: mengakses-login-page
12/11/2022 03:05:27 PM script INFO: mengakses-site-home
12/11/2022 03:05:28 PM script INFO: mengakses-site-course
12/11/2022 03:05:29 PM script INFO: mengakses-quiz
12/11/2022 03:05:30 PM script INFO: mengakses-start-quiz-page
12/11/2022 03:05:32 PM script INFO: memulai-quiz
12/11/2022 03:05:32 PM script INFO: SUCCESS!@#KODE 1!@#USER_ID 13!@#ACTIVITY_CODE 5
12/11/2022 03:05:42 PM script INFO: SUCCESS!@#KODE 1!@#USER_ID 13!@#ACTIVITY_CODE 3
12/11/2022 03:05:43 PM script INFO: SUCCESS!@#KODE 1!@#USER_ID 13!@#ACTIVITY_CODE 1
12/11/2022 03:05:43 PM script INFO: SUCCESS!@#KODE 1!@#USER_ID 13!@#ACTIVITY_CODE 1
12/11/2022 03:05:43 PM script INFO: SUCCESS!@#KODE 1!@#USER_ID 13!@#ACTIVITY_CODE 4
12/11/2022 03:05:43 PM script INFO: SUCCESS!@#KODE 1!@#USER_ID 13!@#ACTIVITY_CODE 3
12/11/2022 03:05:43 PM script INFO: SUCCESS!@#KODE 1!@#USER_ID 13!@#ACTIVITY_CODE 2
12/11/2022 03:05:43 PM script INFO: SUCCESS!@#KODE 1!@#USER_ID 13!@#ACTIVITY_CODE 1
12/11/2022 03:05:43 PM script INFO: SUCCESS!@#KODE 1!@#USER_ID 13!@#ACTIVITY_CODE 2
12/11/2022 03:05:43 PM script INFO: SUCCESS!@#KODE 1!@#USER_ID 13!@#ACTIVITY_CODE 2
12/11/2022 03:05:43 PM script INFO: SUCCESS!@#KODE 1!@#USER_ID 13!@#ACTIVITY_CODE 1
12/11/2022 03:05:43 PM script INFO: SUCCESS!@#KODE 1!@#USER_ID 13!@#ACTIVITY_CODE 3
12/11/2022 03:05:43 PM script INFO: SUCCESS!@#KODE 1!@#USER_ID 13!@#ACTIVITY_CODE 3
12/11/2022 03:05:43 PM script INFO: SUCCESS!@#KODE 1!@#USER_ID 13!@#ACTIVITY_CODE 4
12/11/2022 03:05:44 PM script INFO: SUCCESS!@#KODE 1!@#USER_ID 13!@#ACTIVITY_CODE 2
12/11/2022 03:05:44 PM script INFO: SUCCESS!@#KODE 1!@#USER_ID 13!@#ACTIVITY_CODE 2
12/11/2022 03:05:44 PM script INFO: SUCCESS!@#KODE 1!@#USER_ID 13!@#ACTIVITY_CODE 2
12/11/2022 03:05:44 PM script INFO: SUCCESS!@#KODE 1!@#USER_ID 13!@#ACTIVITY_CODE 5
12/11/2022 03:05:44 PM script INFO: SUCCESS!@#KODE 1!@#USER_ID 13!@#ACTIVITY_CODE 5
12/11/2022 03:05:47 PM script INFO: SUCCESS!@#KODE 1!@#USER_ID 13!@#ACTIVITY_CODE 2
12/11/2022 03:05:47 PM script INFO: SUCCESS!@#KODE 1!@#USER_ID 13!@#ACTIVITY_CODE 4
12/11/2022 03:05:47 PM script INFO: SUCCESS!@#KODE 1!@#USER_ID 13!@#ACTIVITY_CODE 2
12/11/2022 03:05:47 PM script INFO: SUCCESS!@#KODE 1!@#USER_ID 13!@#ACTIVITY_CODE 5
12/11/2022 03:05:47 PM script INFO: SUCCESS!@#KODE 1!@#USER_ID 13!@#ACTIVITY_CODE 5
12/11/2022 03:05:49 PM script INFO: SUCCESS!@#KODE 1!@#USER_ID 13!@#ACTIVITY_CODE 2
12/11/2022 03:05:50 PM script INFO: SUCCESS!@#KODE 1!@#USER_ID 13!@#ACTIVITY_CODE 1
12/11/2022 03:05:50 PM script INFO: SUCCESS!@#KODE 1!@#USER_ID 13!@#ACTIVITY_CODE 5
12/11/2022 03:05:50 PM script INFO: SUCCESS!@#KODE 1!@#USER_ID 13!@#ACTIVITY_CODE 5
12/11/2022 03:05:52 PM script INFO: SUCCESS!@#KODE 1!@#USER_ID 13!@#ACTIVITY_CODE 1
12/11/2022 03:05:52 PM script INFO: SUCCESS!@#KODE 1!@#USER_ID 13!@#ACTIVITY_CODE 2
12/11/2022 03:05:52 PM script INFO: SUCCESS!@#KODE 1!@#USER_ID 13!@#ACTIVITY_CODE 3
12/11/2022 03:05:52 PM script INFO: SUCCESS!@#KODE 1!@#USER_ID 13!@#ACTIVITY_CODE 1
12/11/2022 03:05:52 PM script INFO: SUCCESS!@#KODE 1!@#USER_ID 13!@#ACTIVITY_CODE 4
12/11/2022 03:05:52 PM script INFO: SUCCESS!@#KODE 1!@#USER_ID 13!@#ACTIVITY_CODE 3
12/11/2022 03:05:53 PM script INFO: SUCCESS!@#KODE 1!@#USER_ID 13!@#ACTIVITY_CODE 3
12/11/2022 03:05:53 PM script INFO: SUCCESS!@#KODE 1!@#USER_ID 13!@#ACTIVITY_CODE 2
12/11/2022 03:05:53 PM script INFO: SUCCESS!@#KODE 1!@#USER_ID 13!@#ACTIVITY_CODE 1
12/11/2022 03:05:53 PM script INFO: SUCCESS!@#KODE 1!@#USER_ID 13!@#ACTIVITY_CODE 3
12/11/2022 03:05:53 PM script INFO: SUCCESS!@#KODE 1!@#USER_ID 13!@#ACTIVITY_CODE 2
12/11/2022 03:05:53 PM script INFO: SUCCESS!@#KODE 1!@#USER_ID 13!@#ACTIVITY_CODE 3
12/11/2022 03:05:53 PM script INFO: SUCCESS!@#KODE 1!@#USER_ID 13!@#ACTIVITY_CODE 2
12/11/2022 03:05:53 PM script INFO: SUCCESS!@#KODE 1!@#USER_ID 13!@#ACTIVITY_CODE 4
12/11/2022 03:05:53 PM script INFO: SUCCESS!@#KODE 1!@#USER_ID 13!@#ACTIVITY_CODE 3
12/11/2022 03:05:53 PM script INFO: SUCCESS!@#KODE 1!@#USER_ID 13!@#ACTIVITY_CODE 1
12/11/2022 03:05:53 PM script INFO: SUCCESS!@#KODE 1!@#USER_ID 13!@#ACTIVITY_CODE 5
12/11/2022 03:05:53 PM script INFO: SUCCESS!@#KODE 1!@#USER_ID 13!@#ACTIVITY_CODE 5
12/11/2022 03:05:56 PM script INFO: SUCCESS!@#KODE 1!@#USER_ID 13!@#ACTIVITY_CODE 5
12/11/2022 03:05:56 PM script INFO: SUCCESS!@#KODE 1!@#USER_ID 13!@#ACTIVITY_CODE 5
12/11/2022 03:05:58 PM script INFO: SUCCESS!@#KODE 1!@#USER_ID 13!@#ACTIVITY_CODE 2
12/11/2022 03:05:58 PM script INFO: Duration: 16.115797758102417
12/11/2022 03:05:58 PM script INFO: mengakhiri-quiz
12/11/2022 03:06:16 PM script INFO: SUCCESS!@#KODE 1!@#USER_ID 13!@#ACTIVITY_CODE 5
12/11/2022 03:06:16 PM script INFO: berhasil-submit
