12/23/2022 03:16:01 AM script INFO: Prepared chrome options..
12/23/2022 03:16:03 AM script INFO: Initialized chrome browser..
12/23/2022 03:16:03 AM script INFO: mengakses-homepage
12/23/2022 03:16:28 AM script INFO: mengakses-login-page
12/23/2022 03:16:29 AM script INFO: mengakses-site-home
12/23/2022 03:16:30 AM script INFO: mengakses-site-course
12/23/2022 03:16:30 AM script INFO: mengakses-quiz
12/23/2022 03:16:31 AM script INFO: mengakses-start-quiz-page
12/23/2022 03:16:32 AM script INFO: memulai-quiz
12/23/2022 03:16:32 AM script INFO: SUCCESS!@#KODE 1!@#USER_ID 15!@#ACTIVITY_CODE 5
12/23/2022 03:16:43 AM script INFO: SUCCESS!@#KODE 1!@#USER_ID 15!@#ACTIVITY_CODE 1
12/23/2022 03:16:43 AM script INFO: SUCCESS!@#KODE 1!@#USER_ID 15!@#ACTIVITY_CODE 2
12/23/2022 03:16:43 AM script INFO: SUCCESS!@#KODE 1!@#USER_ID 15!@#ACTIVITY_CODE 1
12/23/2022 03:16:43 AM script INFO: SUCCESS!@#KODE 1!@#USER_ID 15!@#ACTIVITY_CODE 5
12/23/2022 03:16:43 AM script INFO: SUCCESS!@#KODE 1!@#USER_ID 15!@#ACTIVITY_CODE 5
12/23/2022 03:16:46 AM script INFO: SUCCESS!@#KODE 1!@#USER_ID 15!@#ACTIVITY_CODE 3
12/23/2022 03:16:46 AM script INFO: SUCCESS!@#KODE 1!@#USER_ID 15!@#ACTIVITY_CODE 2
12/23/2022 03:16:46 AM script INFO: SUCCESS!@#KODE 1!@#USER_ID 15!@#ACTIVITY_CODE 5
12/23/2022 03:16:46 AM script INFO: SUCCESS!@#KODE 1!@#USER_ID 15!@#ACTIVITY_CODE 5
12/23/2022 03:16:49 AM script INFO: SUCCESS!@#KODE 1!@#USER_ID 15!@#ACTIVITY_CODE 5
12/23/2022 03:16:49 AM script INFO: SUCCESS!@#KODE 1!@#USER_ID 15!@#ACTIVITY_CODE 5
12/23/2022 03:16:51 AM script INFO: SUCCESS!@#KODE 1!@#USER_ID 15!@#ACTIVITY_CODE 4
12/23/2022 03:16:51 AM script INFO: SUCCESS!@#KODE 1!@#USER_ID 15!@#ACTIVITY_CODE 5
12/23/2022 03:16:51 AM script INFO: SUCCESS!@#KODE 1!@#USER_ID 15!@#ACTIVITY_CODE 5
12/23/2022 03:16:54 AM script INFO: SUCCESS!@#KODE 1!@#USER_ID 15!@#ACTIVITY_CODE 3
12/23/2022 03:16:54 AM script INFO: SUCCESS!@#KODE 1!@#USER_ID 15!@#ACTIVITY_CODE 1
12/23/2022 03:16:54 AM script INFO: SUCCESS!@#KODE 1!@#USER_ID 15!@#ACTIVITY_CODE 5
12/23/2022 03:16:54 AM script INFO: SUCCESS!@#KODE 1!@#USER_ID 15!@#ACTIVITY_CODE 5
12/23/2022 03:16:57 AM script INFO: SUCCESS!@#KODE 1!@#USER_ID 15!@#ACTIVITY_CODE 5
12/23/2022 03:16:57 AM script INFO: SUCCESS!@#KODE 1!@#USER_ID 15!@#ACTIVITY_CODE 5
12/23/2022 03:16:59 AM script INFO: SUCCESS!@#KODE 1!@#USER_ID 15!@#ACTIVITY_CODE 2
12/23/2022 03:17:00 AM script INFO: SUCCESS!@#KODE 1!@#USER_ID 15!@#ACTIVITY_CODE 1
12/23/2022 03:17:00 AM script INFO: SUCCESS!@#KODE 1!@#USER_ID 15!@#ACTIVITY_CODE 4
12/23/2022 03:17:00 AM script INFO: SUCCESS!@#KODE 1!@#USER_ID 15!@#ACTIVITY_CODE 2
12/23/2022 03:17:00 AM script INFO: SUCCESS!@#KODE 1!@#USER_ID 15!@#ACTIVITY_CODE 1
12/23/2022 03:17:00 AM script INFO: SUCCESS!@#KODE 1!@#USER_ID 15!@#ACTIVITY_CODE 3
12/23/2022 03:17:00 AM script INFO: SUCCESS!@#KODE 1!@#USER_ID 15!@#ACTIVITY_CODE 2
12/23/2022 03:17:00 AM script INFO: SUCCESS!@#KODE 1!@#USER_ID 15!@#ACTIVITY_CODE 2
12/23/2022 03:17:01 AM script INFO: SUCCESS!@#KODE 1!@#USER_ID 15!@#ACTIVITY_CODE 2
12/23/2022 03:17:01 AM script INFO: SUCCESS!@#KODE 1!@#USER_ID 15!@#ACTIVITY_CODE 3
12/23/2022 03:17:01 AM script INFO: SUCCESS!@#KODE 1!@#USER_ID 15!@#ACTIVITY_CODE 2
12/23/2022 03:17:01 AM script INFO: SUCCESS!@#KODE 1!@#USER_ID 15!@#ACTIVITY_CODE 1
12/23/2022 03:17:01 AM script INFO: SUCCESS!@#KODE 1!@#USER_ID 15!@#ACTIVITY_CODE 3
12/23/2022 03:17:01 AM script INFO: SUCCESS!@#KODE 1!@#USER_ID 15!@#ACTIVITY_CODE 2
12/23/2022 03:17:01 AM script INFO: SUCCESS!@#KODE 1!@#USER_ID 15!@#ACTIVITY_CODE 3
12/23/2022 03:17:02 AM script INFO: SUCCESS!@#KODE 1!@#USER_ID 15!@#ACTIVITY_CODE 2
12/23/2022 03:17:02 AM script INFO: SUCCESS!@#KODE 1!@#USER_ID 15!@#ACTIVITY_CODE 4
12/23/2022 03:17:02 AM script INFO: SUCCESS!@#KODE 1!@#USER_ID 15!@#ACTIVITY_CODE 2
12/23/2022 03:17:02 AM script INFO: SUCCESS!@#KODE 1!@#USER_ID 15!@#ACTIVITY_CODE 3
12/23/2022 03:17:02 AM script INFO: SUCCESS!@#KODE 1!@#USER_ID 15!@#ACTIVITY_CODE 3
12/23/2022 03:17:02 AM script INFO: SUCCESS!@#KODE 1!@#USER_ID 15!@#ACTIVITY_CODE 4
12/23/2022 03:17:02 AM script INFO: SUCCESS!@#KODE 1!@#USER_ID 15!@#ACTIVITY_CODE 1
12/23/2022 03:17:02 AM script INFO: SUCCESS!@#KODE 1!@#USER_ID 15!@#ACTIVITY_CODE 4
12/23/2022 03:17:02 AM script INFO: SUCCESS!@#KODE 1!@#USER_ID 15!@#ACTIVITY_CODE 2
12/23/2022 03:17:03 AM script INFO: SUCCESS!@#KODE 1!@#USER_ID 15!@#ACTIVITY_CODE 3
12/23/2022 03:17:03 AM script INFO: SUCCESS!@#KODE 1!@#USER_ID 15!@#ACTIVITY_CODE 2
12/23/2022 03:17:03 AM script INFO: SUCCESS!@#KODE 1!@#USER_ID 15!@#ACTIVITY_CODE 1
12/23/2022 03:17:03 AM script INFO: SUCCESS!@#KODE 1!@#USER_ID 15!@#ACTIVITY_CODE 1
12/23/2022 03:17:03 AM script INFO: Duration: 19.901052713394165
12/23/2022 03:17:03 AM script INFO: mengakhiri-quiz
12/23/2022 03:17:04 AM script INFO: SUCCESS!@#KODE 1!@#USER_ID 15!@#ACTIVITY_CODE 5
12/23/2022 03:17:04 AM script INFO: berhasil-submit
