12/21/2022 02:29:40 PM script INFO: Prepared chrome options..
12/21/2022 02:29:42 PM script INFO: Initialized chrome browser..
12/21/2022 02:29:42 PM script INFO: mengakses-homepage
12/21/2022 02:30:13 PM script INFO: mengakses-login-page
12/21/2022 02:30:15 PM script INFO: mengakses-site-home
12/21/2022 02:30:15 PM script INFO: mengakses-site-course
12/21/2022 02:30:17 PM script INFO: mengakses-quiz
12/21/2022 02:30:17 PM script INFO: mengakses-start-quiz-page
12/21/2022 02:30:19 PM script INFO: memulai-quiz
12/21/2022 02:30:19 PM script INFO: SUCCESS!@#KODE 1!@#USER_ID 45!@#ACTIVITY_CODE 5
12/21/2022 02:30:30 PM script INFO: SUCCESS!@#KODE 1!@#USER_ID 45!@#ACTIVITY_CODE 2
12/21/2022 02:30:30 PM script INFO: SUCCESS!@#KODE 1!@#USER_ID 45!@#ACTIVITY_CODE 1
12/21/2022 02:30:30 PM script INFO: SUCCESS!@#KODE 1!@#USER_ID 45!@#ACTIVITY_CODE 1
12/21/2022 02:30:30 PM script INFO: SUCCESS!@#KODE 1!@#USER_ID 45!@#ACTIVITY_CODE 5
12/21/2022 02:30:30 PM script INFO: SUCCESS!@#KODE 1!@#USER_ID 45!@#ACTIVITY_CODE 5
12/21/2022 02:30:33 PM script INFO: SUCCESS!@#KODE 1!@#USER_ID 45!@#ACTIVITY_CODE 2
12/21/2022 02:30:33 PM script INFO: SUCCESS!@#KODE 1!@#USER_ID 45!@#ACTIVITY_CODE 2
12/21/2022 02:30:33 PM script INFO: SUCCESS!@#KODE 1!@#USER_ID 45!@#ACTIVITY_CODE 2
12/21/2022 02:30:34 PM script INFO: SUCCESS!@#KODE 1!@#USER_ID 45!@#ACTIVITY_CODE 3
12/21/2022 02:30:34 PM script INFO: SUCCESS!@#KODE 1!@#USER_ID 45!@#ACTIVITY_CODE 3
12/21/2022 02:30:34 PM script INFO: SUCCESS!@#KODE 1!@#USER_ID 45!@#ACTIVITY_CODE 1
12/21/2022 02:30:34 PM script INFO: SUCCESS!@#KODE 1!@#USER_ID 45!@#ACTIVITY_CODE 5
12/21/2022 02:30:34 PM script INFO: SUCCESS!@#KODE 1!@#USER_ID 45!@#ACTIVITY_CODE 5
12/21/2022 02:30:36 PM script INFO: SUCCESS!@#KODE 1!@#USER_ID 45!@#ACTIVITY_CODE 1
12/21/2022 02:30:36 PM script INFO: SUCCESS!@#KODE 1!@#USER_ID 45!@#ACTIVITY_CODE 4
12/21/2022 02:30:36 PM script INFO: SUCCESS!@#KODE 1!@#USER_ID 45!@#ACTIVITY_CODE 5
12/21/2022 02:30:36 PM script INFO: SUCCESS!@#KODE 1!@#USER_ID 45!@#ACTIVITY_CODE 5
12/21/2022 02:30:39 PM script INFO: SUCCESS!@#KODE 1!@#USER_ID 45!@#ACTIVITY_CODE 1
12/21/2022 02:30:39 PM script INFO: SUCCESS!@#KODE 1!@#USER_ID 45!@#ACTIVITY_CODE 3
12/21/2022 02:30:39 PM script INFO: SUCCESS!@#KODE 1!@#USER_ID 45!@#ACTIVITY_CODE 4
12/21/2022 02:30:39 PM script INFO: SUCCESS!@#KODE 1!@#USER_ID 45!@#ACTIVITY_CODE 3
12/21/2022 02:30:39 PM script INFO: SUCCESS!@#KODE 1!@#USER_ID 45!@#ACTIVITY_CODE 3
12/21/2022 02:30:39 PM script INFO: SUCCESS!@#KODE 1!@#USER_ID 45!@#ACTIVITY_CODE 5
12/21/2022 02:30:39 PM script INFO: SUCCESS!@#KODE 1!@#USER_ID 45!@#ACTIVITY_CODE 5
12/21/2022 02:30:42 PM script INFO: SUCCESS!@#KODE 1!@#USER_ID 45!@#ACTIVITY_CODE 1
12/21/2022 02:30:43 PM script INFO: SUCCESS!@#KODE 1!@#USER_ID 45!@#ACTIVITY_CODE 2
12/21/2022 02:30:43 PM script INFO: SUCCESS!@#KODE 1!@#USER_ID 45!@#ACTIVITY_CODE 1
12/21/2022 02:30:43 PM script INFO: SUCCESS!@#KODE 1!@#USER_ID 45!@#ACTIVITY_CODE 2
12/21/2022 02:30:43 PM script INFO: SUCCESS!@#KODE 1!@#USER_ID 45!@#ACTIVITY_CODE 3
12/21/2022 02:30:44 PM script INFO: SUCCESS!@#KODE 1!@#USER_ID 45!@#ACTIVITY_CODE 3
12/21/2022 02:30:44 PM script INFO: SUCCESS!@#KODE 1!@#USER_ID 45!@#ACTIVITY_CODE 5
12/21/2022 02:30:44 PM script INFO: SUCCESS!@#KODE 1!@#USER_ID 45!@#ACTIVITY_CODE 5
12/21/2022 02:30:46 PM script INFO: SUCCESS!@#KODE 1!@#USER_ID 45!@#ACTIVITY_CODE 3
12/21/2022 02:30:46 PM script INFO: SUCCESS!@#KODE 1!@#USER_ID 45!@#ACTIVITY_CODE 2
12/21/2022 02:30:47 PM script INFO: SUCCESS!@#KODE 1!@#USER_ID 45!@#ACTIVITY_CODE 3
12/21/2022 02:30:47 PM script INFO: SUCCESS!@#KODE 1!@#USER_ID 45!@#ACTIVITY_CODE 1
12/21/2022 02:30:47 PM script INFO: SUCCESS!@#KODE 1!@#USER_ID 45!@#ACTIVITY_CODE 2
12/21/2022 02:30:47 PM script INFO: SUCCESS!@#KODE 1!@#USER_ID 45!@#ACTIVITY_CODE 3
12/21/2022 02:30:47 PM script INFO: SUCCESS!@#KODE 1!@#USER_ID 45!@#ACTIVITY_CODE 2
12/21/2022 02:30:47 PM script INFO: SUCCESS!@#KODE 1!@#USER_ID 45!@#ACTIVITY_CODE 3
12/21/2022 02:30:47 PM script INFO: SUCCESS!@#KODE 1!@#USER_ID 45!@#ACTIVITY_CODE 5
12/21/2022 02:30:47 PM script INFO: SUCCESS!@#KODE 1!@#USER_ID 45!@#ACTIVITY_CODE 5
12/21/2022 02:30:50 PM script INFO: SUCCESS!@#KODE 1!@#USER_ID 45!@#ACTIVITY_CODE 3
12/21/2022 02:30:50 PM script INFO: SUCCESS!@#KODE 1!@#USER_ID 45!@#ACTIVITY_CODE 3
12/21/2022 02:30:50 PM script INFO: SUCCESS!@#KODE 1!@#USER_ID 45!@#ACTIVITY_CODE 1
12/21/2022 02:30:50 PM script INFO: SUCCESS!@#KODE 1!@#USER_ID 45!@#ACTIVITY_CODE 3
12/21/2022 02:30:50 PM script INFO: SUCCESS!@#KODE 1!@#USER_ID 45!@#ACTIVITY_CODE 1
12/21/2022 02:30:50 PM script INFO: SUCCESS!@#KODE 1!@#USER_ID 45!@#ACTIVITY_CODE 2
12/21/2022 02:30:50 PM script INFO: Duration: 20.662537097930908
12/21/2022 02:30:50 PM script INFO: mengakhiri-quiz
12/21/2022 02:30:51 PM script INFO: SUCCESS!@#KODE 1!@#USER_ID 45!@#ACTIVITY_CODE 5
12/21/2022 02:30:51 PM script INFO: berhasil-submit
