12/11/2022 03:11:15 PM script INFO: Prepared chrome options..
12/11/2022 03:11:16 PM script INFO: Initialized chrome browser..
12/11/2022 03:11:16 PM script INFO: mengakses-homepage
12/11/2022 03:11:38 PM script INFO: mengakses-login-page
12/11/2022 03:11:41 PM script INFO: mengakses-site-home
12/11/2022 03:11:42 PM script INFO: mengakses-site-course
12/11/2022 03:11:43 PM script INFO: mengakses-quiz
12/11/2022 03:11:44 PM script INFO: mengakses-start-quiz-page
12/11/2022 03:11:45 PM script INFO: memulai-quiz
12/11/2022 03:11:45 PM script INFO: SUCCESS!@#KODE 1!@#USER_ID 77!@#ACTIVITY_CODE 5
12/11/2022 03:11:56 PM script INFO: SUCCESS!@#KODE 1!@#USER_ID 77!@#ACTIVITY_CODE 3
12/11/2022 03:11:56 PM script INFO: SUCCESS!@#KODE 1!@#USER_ID 77!@#ACTIVITY_CODE 2
12/11/2022 03:11:56 PM script INFO: SUCCESS!@#KODE 1!@#USER_ID 77!@#ACTIVITY_CODE 5
12/11/2022 03:11:56 PM script INFO: SUCCESS!@#KODE 1!@#USER_ID 77!@#ACTIVITY_CODE 5
12/11/2022 03:11:59 PM script INFO: SUCCESS!@#KODE 1!@#USER_ID 77!@#ACTIVITY_CODE 2
12/11/2022 03:11:59 PM script INFO: SUCCESS!@#KODE 1!@#USER_ID 77!@#ACTIVITY_CODE 2
12/11/2022 03:11:59 PM script INFO: SUCCESS!@#KODE 1!@#USER_ID 77!@#ACTIVITY_CODE 2
12/11/2022 03:11:59 PM script INFO: SUCCESS!@#KODE 1!@#USER_ID 77!@#ACTIVITY_CODE 5
12/11/2022 03:11:59 PM script INFO: SUCCESS!@#KODE 1!@#USER_ID 77!@#ACTIVITY_CODE 5
12/11/2022 03:12:02 PM script INFO: SUCCESS!@#KODE 1!@#USER_ID 77!@#ACTIVITY_CODE 1
12/11/2022 03:12:02 PM script INFO: SUCCESS!@#KODE 1!@#USER_ID 77!@#ACTIVITY_CODE 3
12/11/2022 03:12:02 PM script INFO: SUCCESS!@#KODE 1!@#USER_ID 77!@#ACTIVITY_CODE 3
12/11/2022 03:12:02 PM script INFO: SUCCESS!@#KODE 1!@#USER_ID 77!@#ACTIVITY_CODE 1
12/11/2022 03:12:02 PM script INFO: SUCCESS!@#KODE 1!@#USER_ID 77!@#ACTIVITY_CODE 5
12/11/2022 03:12:02 PM script INFO: SUCCESS!@#KODE 1!@#USER_ID 77!@#ACTIVITY_CODE 5
12/11/2022 03:12:04 PM script INFO: SUCCESS!@#KODE 1!@#USER_ID 77!@#ACTIVITY_CODE 1
12/11/2022 03:12:04 PM script INFO: SUCCESS!@#KODE 1!@#USER_ID 77!@#ACTIVITY_CODE 5
12/11/2022 03:12:04 PM script INFO: SUCCESS!@#KODE 1!@#USER_ID 77!@#ACTIVITY_CODE 5
12/11/2022 03:12:07 PM script INFO: SUCCESS!@#KODE 1!@#USER_ID 77!@#ACTIVITY_CODE 5
12/11/2022 03:12:07 PM script INFO: SUCCESS!@#KODE 1!@#USER_ID 77!@#ACTIVITY_CODE 5
12/11/2022 03:12:09 PM script INFO: SUCCESS!@#KODE 1!@#USER_ID 77!@#ACTIVITY_CODE 3
12/11/2022 03:12:10 PM script INFO: SUCCESS!@#KODE 1!@#USER_ID 77!@#ACTIVITY_CODE 2
12/11/2022 03:12:10 PM script INFO: SUCCESS!@#KODE 1!@#USER_ID 77!@#ACTIVITY_CODE 1
12/11/2022 03:12:10 PM script INFO: SUCCESS!@#KODE 1!@#USER_ID 77!@#ACTIVITY_CODE 1
12/11/2022 03:12:10 PM script INFO: SUCCESS!@#KODE 1!@#USER_ID 77!@#ACTIVITY_CODE 5
12/11/2022 03:12:10 PM script INFO: SUCCESS!@#KODE 1!@#USER_ID 77!@#ACTIVITY_CODE 5
12/11/2022 03:12:12 PM script INFO: SUCCESS!@#KODE 1!@#USER_ID 77!@#ACTIVITY_CODE 4
12/11/2022 03:12:12 PM script INFO: SUCCESS!@#KODE 1!@#USER_ID 77!@#ACTIVITY_CODE 2
12/11/2022 03:12:12 PM script INFO: SUCCESS!@#KODE 1!@#USER_ID 77!@#ACTIVITY_CODE 5
12/11/2022 03:12:12 PM script INFO: SUCCESS!@#KODE 1!@#USER_ID 77!@#ACTIVITY_CODE 5
12/11/2022 03:12:15 PM script INFO: SUCCESS!@#KODE 1!@#USER_ID 77!@#ACTIVITY_CODE 3
12/11/2022 03:12:15 PM script INFO: SUCCESS!@#KODE 1!@#USER_ID 77!@#ACTIVITY_CODE 2
12/11/2022 03:12:15 PM script INFO: SUCCESS!@#KODE 1!@#USER_ID 77!@#ACTIVITY_CODE 2
12/11/2022 03:12:15 PM script INFO: SUCCESS!@#KODE 1!@#USER_ID 77!@#ACTIVITY_CODE 3
12/11/2022 03:12:15 PM script INFO: SUCCESS!@#KODE 1!@#USER_ID 77!@#ACTIVITY_CODE 5
12/11/2022 03:12:15 PM script INFO: SUCCESS!@#KODE 1!@#USER_ID 77!@#ACTIVITY_CODE 5
12/11/2022 03:12:18 PM script INFO: SUCCESS!@#KODE 1!@#USER_ID 77!@#ACTIVITY_CODE 1
12/11/2022 03:12:18 PM script INFO: SUCCESS!@#KODE 1!@#USER_ID 77!@#ACTIVITY_CODE 4
12/11/2022 03:12:18 PM script INFO: SUCCESS!@#KODE 1!@#USER_ID 77!@#ACTIVITY_CODE 5
12/11/2022 03:12:18 PM script INFO: SUCCESS!@#KODE 1!@#USER_ID 77!@#ACTIVITY_CODE 5
12/11/2022 03:12:21 PM script INFO: SUCCESS!@#KODE 1!@#USER_ID 77!@#ACTIVITY_CODE 2
12/11/2022 03:12:21 PM script INFO: SUCCESS!@#KODE 1!@#USER_ID 77!@#ACTIVITY_CODE 5
12/11/2022 03:12:21 PM script INFO: SUCCESS!@#KODE 1!@#USER_ID 77!@#ACTIVITY_CODE 5
12/11/2022 03:12:23 PM script INFO: SUCCESS!@#KODE 1!@#USER_ID 77!@#ACTIVITY_CODE 3
12/11/2022 03:12:23 PM script INFO: SUCCESS!@#KODE 1!@#USER_ID 77!@#ACTIVITY_CODE 1
12/11/2022 03:12:24 PM script INFO: SUCCESS!@#KODE 1!@#USER_ID 77!@#ACTIVITY_CODE 3
12/11/2022 03:12:24 PM script INFO: SUCCESS!@#KODE 1!@#USER_ID 77!@#ACTIVITY_CODE 4
12/11/2022 03:12:24 PM script INFO: SUCCESS!@#KODE 1!@#USER_ID 77!@#ACTIVITY_CODE 2
12/11/2022 03:12:24 PM script INFO: SUCCESS!@#KODE 1!@#USER_ID 77!@#ACTIVITY_CODE 5
12/11/2022 03:12:24 PM script INFO: SUCCESS!@#KODE 1!@#USER_ID 77!@#ACTIVITY_CODE 5
12/11/2022 03:12:26 PM script INFO: SUCCESS!@#KODE 1!@#USER_ID 77!@#ACTIVITY_CODE 3
12/11/2022 03:12:26 PM script INFO: SUCCESS!@#KODE 1!@#USER_ID 77!@#ACTIVITY_CODE 1
12/11/2022 03:12:27 PM script INFO: SUCCESS!@#KODE 1!@#USER_ID 77!@#ACTIVITY_CODE 1
12/11/2022 03:12:27 PM script INFO: SUCCESS!@#KODE 1!@#USER_ID 77!@#ACTIVITY_CODE 2
12/11/2022 03:12:27 PM script INFO: SUCCESS!@#KODE 1!@#USER_ID 77!@#ACTIVITY_CODE 2
12/11/2022 03:12:27 PM script INFO: SUCCESS!@#KODE 1!@#USER_ID 77!@#ACTIVITY_CODE 3
12/11/2022 03:12:27 PM script INFO: SUCCESS!@#KODE 1!@#USER_ID 77!@#ACTIVITY_CODE 1
12/11/2022 03:12:27 PM script INFO: SUCCESS!@#KODE 1!@#USER_ID 77!@#ACTIVITY_CODE 1
12/11/2022 03:12:27 PM script INFO: SUCCESS!@#KODE 1!@#USER_ID 77!@#ACTIVITY_CODE 2
12/11/2022 03:12:27 PM script INFO: SUCCESS!@#KODE 1!@#USER_ID 77!@#ACTIVITY_CODE 1
12/11/2022 03:12:27 PM script INFO: SUCCESS!@#KODE 1!@#USER_ID 77!@#ACTIVITY_CODE 2
12/11/2022 03:12:28 PM script INFO: SUCCESS!@#KODE 1!@#USER_ID 77!@#ACTIVITY_CODE 3
12/11/2022 03:12:28 PM script INFO: SUCCESS!@#KODE 1!@#USER_ID 77!@#ACTIVITY_CODE 2
12/11/2022 03:12:28 PM script INFO: SUCCESS!@#KODE 1!@#USER_ID 77!@#ACTIVITY_CODE 1
12/11/2022 03:12:28 PM script INFO: SUCCESS!@#KODE 1!@#USER_ID 77!@#ACTIVITY_CODE 1
12/11/2022 03:12:28 PM script INFO: SUCCESS!@#KODE 1!@#USER_ID 77!@#ACTIVITY_CODE 3
12/11/2022 03:12:28 PM script INFO: SUCCESS!@#KODE 1!@#USER_ID 77!@#ACTIVITY_CODE 2
12/11/2022 03:12:28 PM script INFO: SUCCESS!@#KODE 1!@#USER_ID 77!@#ACTIVITY_CODE 2
12/11/2022 03:12:28 PM script INFO: SUCCESS!@#KODE 1!@#USER_ID 77!@#ACTIVITY_CODE 3
12/11/2022 03:12:28 PM script INFO: SUCCESS!@#KODE 1!@#USER_ID 77!@#ACTIVITY_CODE 4
12/11/2022 03:12:29 PM script INFO: SUCCESS!@#KODE 1!@#USER_ID 77!@#ACTIVITY_CODE 2
12/11/2022 03:12:29 PM script INFO: SUCCESS!@#KODE 1!@#USER_ID 77!@#ACTIVITY_CODE 4
12/11/2022 03:12:29 PM script INFO: SUCCESS!@#KODE 1!@#USER_ID 77!@#ACTIVITY_CODE 3
12/11/2022 03:12:29 PM script INFO: SUCCESS!@#KODE 1!@#USER_ID 77!@#ACTIVITY_CODE 3
12/11/2022 03:12:29 PM script INFO: SUCCESS!@#KODE 1!@#USER_ID 77!@#ACTIVITY_CODE 2
12/11/2022 03:12:29 PM script INFO: SUCCESS!@#KODE 1!@#USER_ID 77!@#ACTIVITY_CODE 1
12/11/2022 03:12:29 PM script INFO: SUCCESS!@#KODE 1!@#USER_ID 77!@#ACTIVITY_CODE 3
12/11/2022 03:12:29 PM script INFO: SUCCESS!@#KODE 1!@#USER_ID 77!@#ACTIVITY_CODE 3
12/11/2022 03:12:29 PM script INFO: SUCCESS!@#KODE 1!@#USER_ID 77!@#ACTIVITY_CODE 2
12/11/2022 03:12:29 PM script INFO: SUCCESS!@#KODE 1!@#USER_ID 77!@#ACTIVITY_CODE 1
12/11/2022 03:12:30 PM script INFO: SUCCESS!@#KODE 1!@#USER_ID 77!@#ACTIVITY_CODE 3
12/11/2022 03:12:30 PM script INFO: SUCCESS!@#KODE 1!@#USER_ID 77!@#ACTIVITY_CODE 1
12/11/2022 03:12:30 PM script INFO: SUCCESS!@#KODE 1!@#USER_ID 77!@#ACTIVITY_CODE 3
12/11/2022 03:12:30 PM script INFO: SUCCESS!@#KODE 1!@#USER_ID 77!@#ACTIVITY_CODE 3
12/11/2022 03:12:30 PM script INFO: SUCCESS!@#KODE 1!@#USER_ID 77!@#ACTIVITY_CODE 4
12/11/2022 03:12:30 PM script INFO: SUCCESS!@#KODE 1!@#USER_ID 77!@#ACTIVITY_CODE 1
12/11/2022 03:12:30 PM script INFO: SUCCESS!@#KODE 1!@#USER_ID 77!@#ACTIVITY_CODE 4
12/11/2022 03:12:30 PM script INFO: SUCCESS!@#KODE 1!@#USER_ID 77!@#ACTIVITY_CODE 2
12/11/2022 03:12:30 PM script INFO: SUCCESS!@#KODE 1!@#USER_ID 77!@#ACTIVITY_CODE 1
12/11/2022 03:12:30 PM script INFO: SUCCESS!@#KODE 1!@#USER_ID 77!@#ACTIVITY_CODE 3
12/11/2022 03:12:30 PM script INFO: SUCCESS!@#KODE 1!@#USER_ID 77!@#ACTIVITY_CODE 3
12/11/2022 03:12:30 PM script INFO: SUCCESS!@#KODE 1!@#USER_ID 77!@#ACTIVITY_CODE 4
12/11/2022 03:12:31 PM script INFO: SUCCESS!@#KODE 1!@#USER_ID 77!@#ACTIVITY_CODE 3
12/11/2022 03:12:31 PM script INFO: SUCCESS!@#KODE 1!@#USER_ID 77!@#ACTIVITY_CODE 3
12/11/2022 03:12:31 PM script INFO: SUCCESS!@#KODE 1!@#USER_ID 77!@#ACTIVITY_CODE 3
12/11/2022 03:12:31 PM script INFO: SUCCESS!@#KODE 1!@#USER_ID 77!@#ACTIVITY_CODE 3
12/11/2022 03:12:31 PM script INFO: SUCCESS!@#KODE 1!@#USER_ID 77!@#ACTIVITY_CODE 1
12/11/2022 03:12:31 PM script INFO: SUCCESS!@#KODE 1!@#USER_ID 77!@#ACTIVITY_CODE 1
12/11/2022 03:12:31 PM script INFO: Duration: 35.1295964717865
12/11/2022 03:12:31 PM script INFO: mengakhiri-quiz
12/11/2022 03:12:42 PM script INFO: SUCCESS!@#KODE 1!@#USER_ID 77!@#ACTIVITY_CODE 5
12/11/2022 03:12:42 PM script INFO: berhasil-submit
