12/11/2022 03:11:15 PM script INFO: Prepared chrome options..
12/11/2022 03:11:16 PM script INFO: Initialized chrome browser..
12/11/2022 03:11:16 PM script INFO: mengakses-homepage
12/11/2022 03:11:49 PM script INFO: mengakses-login-page
12/11/2022 03:11:51 PM script INFO: mengakses-site-home
12/11/2022 03:11:51 PM script INFO: mengakses-site-course
12/11/2022 03:11:52 PM script INFO: mengakses-quiz
12/11/2022 03:11:53 PM script INFO: mengakses-start-quiz-page
12/11/2022 03:11:54 PM script INFO: memulai-quiz
12/11/2022 03:11:54 PM script INFO: SUCCESS!@#KODE 1!@#USER_ID 12!@#ACTIVITY_CODE 5
12/11/2022 03:12:05 PM script INFO: SUCCESS!@#KODE 1!@#USER_ID 12!@#ACTIVITY_CODE 3
12/11/2022 03:12:05 PM script INFO: SUCCESS!@#KODE 1!@#USER_ID 12!@#ACTIVITY_CODE 5
12/11/2022 03:12:05 PM script INFO: SUCCESS!@#KODE 1!@#USER_ID 12!@#ACTIVITY_CODE 5
12/11/2022 03:12:07 PM script INFO: SUCCESS!@#KODE 1!@#USER_ID 12!@#ACTIVITY_CODE 3
12/11/2022 03:12:07 PM script INFO: SUCCESS!@#KODE 1!@#USER_ID 12!@#ACTIVITY_CODE 5
12/11/2022 03:12:07 PM script INFO: SUCCESS!@#KODE 1!@#USER_ID 12!@#ACTIVITY_CODE 5
12/11/2022 03:12:10 PM script INFO: SUCCESS!@#KODE 1!@#USER_ID 12!@#ACTIVITY_CODE 3
12/11/2022 03:12:10 PM script INFO: SUCCESS!@#KODE 1!@#USER_ID 12!@#ACTIVITY_CODE 2
12/11/2022 03:12:10 PM script INFO: SUCCESS!@#KODE 1!@#USER_ID 12!@#ACTIVITY_CODE 2
12/11/2022 03:12:10 PM script INFO: SUCCESS!@#KODE 1!@#USER_ID 12!@#ACTIVITY_CODE 1
12/11/2022 03:12:10 PM script INFO: SUCCESS!@#KODE 1!@#USER_ID 12!@#ACTIVITY_CODE 3
12/11/2022 03:12:10 PM script INFO: SUCCESS!@#KODE 1!@#USER_ID 12!@#ACTIVITY_CODE 5
12/11/2022 03:12:10 PM script INFO: SUCCESS!@#KODE 1!@#USER_ID 12!@#ACTIVITY_CODE 5
12/11/2022 03:12:13 PM script INFO: SUCCESS!@#KODE 1!@#USER_ID 12!@#ACTIVITY_CODE 2
12/11/2022 03:12:13 PM script INFO: SUCCESS!@#KODE 1!@#USER_ID 12!@#ACTIVITY_CODE 1
12/11/2022 03:12:13 PM script INFO: SUCCESS!@#KODE 1!@#USER_ID 12!@#ACTIVITY_CODE 1
12/11/2022 03:12:13 PM script INFO: SUCCESS!@#KODE 1!@#USER_ID 12!@#ACTIVITY_CODE 2
12/11/2022 03:12:14 PM script INFO: SUCCESS!@#KODE 1!@#USER_ID 12!@#ACTIVITY_CODE 2
12/11/2022 03:12:14 PM script INFO: SUCCESS!@#KODE 1!@#USER_ID 12!@#ACTIVITY_CODE 2
12/11/2022 03:12:14 PM script INFO: SUCCESS!@#KODE 1!@#USER_ID 12!@#ACTIVITY_CODE 1
12/11/2022 03:12:14 PM script INFO: SUCCESS!@#KODE 1!@#USER_ID 12!@#ACTIVITY_CODE 3
12/11/2022 03:12:14 PM script INFO: SUCCESS!@#KODE 1!@#USER_ID 12!@#ACTIVITY_CODE 3
12/11/2022 03:12:14 PM script INFO: SUCCESS!@#KODE 1!@#USER_ID 12!@#ACTIVITY_CODE 3
12/11/2022 03:12:14 PM script INFO: SUCCESS!@#KODE 1!@#USER_ID 12!@#ACTIVITY_CODE 1
12/11/2022 03:12:14 PM script INFO: SUCCESS!@#KODE 1!@#USER_ID 12!@#ACTIVITY_CODE 3
12/11/2022 03:12:14 PM script INFO: SUCCESS!@#KODE 1!@#USER_ID 12!@#ACTIVITY_CODE 2
12/11/2022 03:12:14 PM script INFO: SUCCESS!@#KODE 1!@#USER_ID 12!@#ACTIVITY_CODE 3
12/11/2022 03:12:14 PM script INFO: SUCCESS!@#KODE 1!@#USER_ID 12!@#ACTIVITY_CODE 1
12/11/2022 03:12:14 PM script INFO: SUCCESS!@#KODE 1!@#USER_ID 12!@#ACTIVITY_CODE 2
12/11/2022 03:12:15 PM script INFO: SUCCESS!@#KODE 1!@#USER_ID 12!@#ACTIVITY_CODE 2
12/11/2022 03:12:15 PM script INFO: SUCCESS!@#KODE 1!@#USER_ID 12!@#ACTIVITY_CODE 4
12/11/2022 03:12:15 PM script INFO: SUCCESS!@#KODE 1!@#USER_ID 12!@#ACTIVITY_CODE 1
12/11/2022 03:12:15 PM script INFO: SUCCESS!@#KODE 1!@#USER_ID 12!@#ACTIVITY_CODE 3
12/11/2022 03:12:15 PM script INFO: SUCCESS!@#KODE 1!@#USER_ID 12!@#ACTIVITY_CODE 5
12/11/2022 03:12:15 PM script INFO: SUCCESS!@#KODE 1!@#USER_ID 12!@#ACTIVITY_CODE 5
12/11/2022 03:12:17 PM script INFO: SUCCESS!@#KODE 1!@#USER_ID 12!@#ACTIVITY_CODE 1
12/11/2022 03:12:17 PM script INFO: SUCCESS!@#KODE 1!@#USER_ID 12!@#ACTIVITY_CODE 5
12/11/2022 03:12:17 PM script INFO: SUCCESS!@#KODE 1!@#USER_ID 12!@#ACTIVITY_CODE 5
12/11/2022 03:12:20 PM script INFO: SUCCESS!@#KODE 1!@#USER_ID 12!@#ACTIVITY_CODE 2
12/11/2022 03:12:20 PM script INFO: SUCCESS!@#KODE 1!@#USER_ID 12!@#ACTIVITY_CODE 2
12/11/2022 03:12:20 PM script INFO: SUCCESS!@#KODE 1!@#USER_ID 12!@#ACTIVITY_CODE 1
12/11/2022 03:12:20 PM script INFO: SUCCESS!@#KODE 1!@#USER_ID 12!@#ACTIVITY_CODE 4
12/11/2022 03:12:20 PM script INFO: SUCCESS!@#KODE 1!@#USER_ID 12!@#ACTIVITY_CODE 3
12/11/2022 03:12:21 PM script INFO: SUCCESS!@#KODE 1!@#USER_ID 12!@#ACTIVITY_CODE 2
12/11/2022 03:12:21 PM script INFO: SUCCESS!@#KODE 1!@#USER_ID 12!@#ACTIVITY_CODE 1
12/11/2022 03:12:21 PM script INFO: SUCCESS!@#KODE 1!@#USER_ID 12!@#ACTIVITY_CODE 1
12/11/2022 03:12:21 PM script INFO: SUCCESS!@#KODE 1!@#USER_ID 12!@#ACTIVITY_CODE 2
12/11/2022 03:12:21 PM script INFO: SUCCESS!@#KODE 1!@#USER_ID 12!@#ACTIVITY_CODE 5
12/11/2022 03:12:21 PM script INFO: SUCCESS!@#KODE 1!@#USER_ID 12!@#ACTIVITY_CODE 5
12/11/2022 03:12:23 PM script INFO: SUCCESS!@#KODE 1!@#USER_ID 12!@#ACTIVITY_CODE 3
12/11/2022 03:12:23 PM script INFO: SUCCESS!@#KODE 1!@#USER_ID 12!@#ACTIVITY_CODE 5
12/11/2022 03:12:23 PM script INFO: SUCCESS!@#KODE 1!@#USER_ID 12!@#ACTIVITY_CODE 5
12/11/2022 03:12:26 PM script INFO: SUCCESS!@#KODE 1!@#USER_ID 12!@#ACTIVITY_CODE 2
12/11/2022 03:12:26 PM script INFO: SUCCESS!@#KODE 1!@#USER_ID 12!@#ACTIVITY_CODE 2
12/11/2022 03:12:26 PM script INFO: SUCCESS!@#KODE 1!@#USER_ID 12!@#ACTIVITY_CODE 4
12/11/2022 03:12:26 PM script INFO: SUCCESS!@#KODE 1!@#USER_ID 12!@#ACTIVITY_CODE 3
12/11/2022 03:12:27 PM script INFO: SUCCESS!@#KODE 1!@#USER_ID 12!@#ACTIVITY_CODE 1
12/11/2022 03:12:27 PM script INFO: SUCCESS!@#KODE 1!@#USER_ID 12!@#ACTIVITY_CODE 3
12/11/2022 03:12:27 PM script INFO: SUCCESS!@#KODE 1!@#USER_ID 12!@#ACTIVITY_CODE 4
12/11/2022 03:12:27 PM script INFO: SUCCESS!@#KODE 1!@#USER_ID 12!@#ACTIVITY_CODE 1
12/11/2022 03:12:27 PM script INFO: SUCCESS!@#KODE 1!@#USER_ID 12!@#ACTIVITY_CODE 4
12/11/2022 03:12:27 PM script INFO: SUCCESS!@#KODE 1!@#USER_ID 12!@#ACTIVITY_CODE 5
12/11/2022 03:12:27 PM script INFO: SUCCESS!@#KODE 1!@#USER_ID 12!@#ACTIVITY_CODE 5
12/11/2022 03:12:30 PM script INFO: SUCCESS!@#KODE 1!@#USER_ID 12!@#ACTIVITY_CODE 3
12/11/2022 03:12:30 PM script INFO: SUCCESS!@#KODE 1!@#USER_ID 12!@#ACTIVITY_CODE 1
12/11/2022 03:12:30 PM script INFO: SUCCESS!@#KODE 1!@#USER_ID 12!@#ACTIVITY_CODE 1
12/11/2022 03:12:30 PM script INFO: SUCCESS!@#KODE 1!@#USER_ID 12!@#ACTIVITY_CODE 3
12/11/2022 03:12:30 PM script INFO: SUCCESS!@#KODE 1!@#USER_ID 12!@#ACTIVITY_CODE 2
12/11/2022 03:12:30 PM script INFO: SUCCESS!@#KODE 1!@#USER_ID 12!@#ACTIVITY_CODE 2
12/11/2022 03:12:30 PM script INFO: SUCCESS!@#KODE 1!@#USER_ID 12!@#ACTIVITY_CODE 5
12/11/2022 03:12:30 PM script INFO: SUCCESS!@#KODE 1!@#USER_ID 12!@#ACTIVITY_CODE 5
12/11/2022 03:12:33 PM script INFO: SUCCESS!@#KODE 1!@#USER_ID 12!@#ACTIVITY_CODE 5
12/11/2022 03:12:33 PM script INFO: SUCCESS!@#KODE 1!@#USER_ID 12!@#ACTIVITY_CODE 5
12/11/2022 03:12:35 PM script INFO: SUCCESS!@#KODE 1!@#USER_ID 12!@#ACTIVITY_CODE 3
12/11/2022 03:12:35 PM script INFO: SUCCESS!@#KODE 1!@#USER_ID 12!@#ACTIVITY_CODE 5
12/11/2022 03:12:35 PM script INFO: SUCCESS!@#KODE 1!@#USER_ID 12!@#ACTIVITY_CODE 5
12/11/2022 03:12:38 PM script INFO: SUCCESS!@#KODE 1!@#USER_ID 12!@#ACTIVITY_CODE 1
12/11/2022 03:12:38 PM script INFO: SUCCESS!@#KODE 1!@#USER_ID 12!@#ACTIVITY_CODE 1
12/11/2022 03:12:38 PM script INFO: SUCCESS!@#KODE 1!@#USER_ID 12!@#ACTIVITY_CODE 4
12/11/2022 03:12:38 PM script INFO: SUCCESS!@#KODE 1!@#USER_ID 12!@#ACTIVITY_CODE 2
12/11/2022 03:12:38 PM script INFO: SUCCESS!@#KODE 1!@#USER_ID 12!@#ACTIVITY_CODE 4
12/11/2022 03:12:38 PM script INFO: SUCCESS!@#KODE 1!@#USER_ID 12!@#ACTIVITY_CODE 3
12/11/2022 03:12:38 PM script INFO: SUCCESS!@#KODE 1!@#USER_ID 12!@#ACTIVITY_CODE 1
12/11/2022 03:12:38 PM script INFO: SUCCESS!@#KODE 1!@#USER_ID 12!@#ACTIVITY_CODE 4
12/11/2022 03:12:38 PM script INFO: SUCCESS!@#KODE 1!@#USER_ID 12!@#ACTIVITY_CODE 1
12/11/2022 03:12:38 PM script INFO: SUCCESS!@#KODE 1!@#USER_ID 12!@#ACTIVITY_CODE 4
12/11/2022 03:12:38 PM script INFO: SUCCESS!@#KODE 1!@#USER_ID 12!@#ACTIVITY_CODE 3
12/11/2022 03:12:39 PM script INFO: SUCCESS!@#KODE 1!@#USER_ID 12!@#ACTIVITY_CODE 1
12/11/2022 03:12:39 PM script INFO: SUCCESS!@#KODE 1!@#USER_ID 12!@#ACTIVITY_CODE 4
12/11/2022 03:12:39 PM script INFO: SUCCESS!@#KODE 1!@#USER_ID 12!@#ACTIVITY_CODE 1
12/11/2022 03:12:39 PM script INFO: SUCCESS!@#KODE 1!@#USER_ID 12!@#ACTIVITY_CODE 3
12/11/2022 03:12:39 PM script INFO: SUCCESS!@#KODE 1!@#USER_ID 12!@#ACTIVITY_CODE 3
12/11/2022 03:12:39 PM script INFO: SUCCESS!@#KODE 1!@#USER_ID 12!@#ACTIVITY_CODE 3
12/11/2022 03:12:39 PM script INFO: SUCCESS!@#KODE 1!@#USER_ID 12!@#ACTIVITY_CODE 2
12/11/2022 03:12:39 PM script INFO: SUCCESS!@#KODE 1!@#USER_ID 12!@#ACTIVITY_CODE 1
12/11/2022 03:12:39 PM script INFO: SUCCESS!@#KODE 1!@#USER_ID 12!@#ACTIVITY_CODE 3
12/11/2022 03:12:39 PM script INFO: SUCCESS!@#KODE 1!@#USER_ID 12!@#ACTIVITY_CODE 2
12/11/2022 03:12:39 PM script INFO: SUCCESS!@#KODE 1!@#USER_ID 12!@#ACTIVITY_CODE 2
12/11/2022 03:12:39 PM script INFO: Duration: 34.760292530059814
12/11/2022 03:12:39 PM script INFO: mengakhiri-quiz
12/11/2022 03:12:40 PM script INFO: SUCCESS!@#KODE 1!@#USER_ID 12!@#ACTIVITY_CODE 5
12/11/2022 03:12:40 PM script INFO: berhasil-submit
12/11/2022 03:14:11 PM script ERROR: TIMEOUT EXCEPTION!@#KODE 0!@#LOCATION berhasil-submit
12/11/2022 03:14:11 PM main_worker ERROR: Message: None

