12/23/2022 07:04:05 AM script INFO: Prepared chrome options..
12/23/2022 07:04:07 AM script INFO: Initialized chrome browser..
12/23/2022 07:04:07 AM script INFO: mengakses-homepage
12/23/2022 07:04:12 AM script INFO: mengakses-login-page
12/23/2022 07:04:13 AM script INFO: mengakses-site-home
12/23/2022 07:04:14 AM script INFO: mengakses-site-course
12/23/2022 07:04:15 AM script INFO: mengakses-quiz
12/23/2022 07:04:15 AM script INFO: mengakses-start-quiz-page
12/23/2022 07:04:16 AM script INFO: memulai-quiz
12/23/2022 07:04:16 AM script INFO: SUCCESS!@#KODE 1!@#USER_ID 73!@#ACTIVITY_CODE 5
12/23/2022 07:04:27 AM script INFO: SUCCESS!@#KODE 1!@#USER_ID 73!@#ACTIVITY_CODE 2
12/23/2022 07:04:27 AM script INFO: SUCCESS!@#KODE 1!@#USER_ID 73!@#ACTIVITY_CODE 5
12/23/2022 07:04:27 AM script INFO: SUCCESS!@#KODE 1!@#USER_ID 73!@#ACTIVITY_CODE 5
12/23/2022 07:04:30 AM script INFO: SUCCESS!@#KODE 1!@#USER_ID 73!@#ACTIVITY_CODE 3
12/23/2022 07:04:30 AM script INFO: SUCCESS!@#KODE 1!@#USER_ID 73!@#ACTIVITY_CODE 2
12/23/2022 07:04:30 AM script INFO: SUCCESS!@#KODE 1!@#USER_ID 73!@#ACTIVITY_CODE 5
12/23/2022 07:04:30 AM script INFO: SUCCESS!@#KODE 1!@#USER_ID 73!@#ACTIVITY_CODE 5
12/23/2022 07:04:33 AM script INFO: SUCCESS!@#KODE 1!@#USER_ID 73!@#ACTIVITY_CODE 3
12/23/2022 07:04:33 AM script INFO: SUCCESS!@#KODE 1!@#USER_ID 73!@#ACTIVITY_CODE 3
12/23/2022 07:04:33 AM script INFO: SUCCESS!@#KODE 1!@#USER_ID 73!@#ACTIVITY_CODE 3
12/23/2022 07:04:33 AM script INFO: SUCCESS!@#KODE 1!@#USER_ID 73!@#ACTIVITY_CODE 1
12/23/2022 07:04:33 AM script INFO: SUCCESS!@#KODE 1!@#USER_ID 73!@#ACTIVITY_CODE 3
12/23/2022 07:04:33 AM script INFO: SUCCESS!@#KODE 1!@#USER_ID 73!@#ACTIVITY_CODE 3
12/23/2022 07:04:33 AM script INFO: SUCCESS!@#KODE 1!@#USER_ID 73!@#ACTIVITY_CODE 1
12/23/2022 07:04:33 AM script INFO: SUCCESS!@#KODE 1!@#USER_ID 73!@#ACTIVITY_CODE 4
12/23/2022 07:04:33 AM script INFO: SUCCESS!@#KODE 1!@#USER_ID 73!@#ACTIVITY_CODE 2
12/23/2022 07:04:33 AM script INFO: SUCCESS!@#KODE 1!@#USER_ID 73!@#ACTIVITY_CODE 1
12/23/2022 07:04:33 AM script INFO: SUCCESS!@#KODE 1!@#USER_ID 73!@#ACTIVITY_CODE 5
12/23/2022 07:04:33 AM script INFO: SUCCESS!@#KODE 1!@#USER_ID 73!@#ACTIVITY_CODE 5
12/23/2022 07:04:36 AM script INFO: SUCCESS!@#KODE 1!@#USER_ID 73!@#ACTIVITY_CODE 2
12/23/2022 07:04:36 AM script INFO: SUCCESS!@#KODE 1!@#USER_ID 73!@#ACTIVITY_CODE 2
12/23/2022 07:04:36 AM script INFO: SUCCESS!@#KODE 1!@#USER_ID 73!@#ACTIVITY_CODE 1
12/23/2022 07:04:36 AM script INFO: SUCCESS!@#KODE 1!@#USER_ID 73!@#ACTIVITY_CODE 5
12/23/2022 07:04:36 AM script INFO: SUCCESS!@#KODE 1!@#USER_ID 73!@#ACTIVITY_CODE 5
12/23/2022 07:04:39 AM script INFO: SUCCESS!@#KODE 1!@#USER_ID 73!@#ACTIVITY_CODE 5
12/23/2022 07:04:39 AM script INFO: SUCCESS!@#KODE 1!@#USER_ID 73!@#ACTIVITY_CODE 5
12/23/2022 07:04:41 AM script INFO: SUCCESS!@#KODE 1!@#USER_ID 73!@#ACTIVITY_CODE 1
12/23/2022 07:04:41 AM script INFO: SUCCESS!@#KODE 1!@#USER_ID 73!@#ACTIVITY_CODE 3
12/23/2022 07:04:41 AM script INFO: SUCCESS!@#KODE 1!@#USER_ID 73!@#ACTIVITY_CODE 2
12/23/2022 07:04:41 AM script INFO: SUCCESS!@#KODE 1!@#USER_ID 73!@#ACTIVITY_CODE 5
12/23/2022 07:04:41 AM script INFO: SUCCESS!@#KODE 1!@#USER_ID 73!@#ACTIVITY_CODE 5
12/23/2022 07:04:44 AM script INFO: SUCCESS!@#KODE 1!@#USER_ID 73!@#ACTIVITY_CODE 1
12/23/2022 07:04:44 AM script INFO: SUCCESS!@#KODE 1!@#USER_ID 73!@#ACTIVITY_CODE 2
12/23/2022 07:04:44 AM script INFO: SUCCESS!@#KODE 1!@#USER_ID 73!@#ACTIVITY_CODE 2
12/23/2022 07:04:44 AM script INFO: SUCCESS!@#KODE 1!@#USER_ID 73!@#ACTIVITY_CODE 1
12/23/2022 07:04:44 AM script INFO: SUCCESS!@#KODE 1!@#USER_ID 73!@#ACTIVITY_CODE 3
12/23/2022 07:04:45 AM script INFO: SUCCESS!@#KODE 1!@#USER_ID 73!@#ACTIVITY_CODE 3
12/23/2022 07:04:45 AM script INFO: SUCCESS!@#KODE 1!@#USER_ID 73!@#ACTIVITY_CODE 2
12/23/2022 07:04:45 AM script INFO: SUCCESS!@#KODE 1!@#USER_ID 73!@#ACTIVITY_CODE 2
12/23/2022 07:04:45 AM script INFO: SUCCESS!@#KODE 1!@#USER_ID 73!@#ACTIVITY_CODE 2
12/23/2022 07:04:45 AM script INFO: SUCCESS!@#KODE 1!@#USER_ID 73!@#ACTIVITY_CODE 3
12/23/2022 07:04:45 AM script INFO: SUCCESS!@#KODE 1!@#USER_ID 73!@#ACTIVITY_CODE 3
12/23/2022 07:04:45 AM script INFO: SUCCESS!@#KODE 1!@#USER_ID 73!@#ACTIVITY_CODE 1
12/23/2022 07:04:45 AM script INFO: SUCCESS!@#KODE 1!@#USER_ID 73!@#ACTIVITY_CODE 4
12/23/2022 07:04:45 AM script INFO: SUCCESS!@#KODE 1!@#USER_ID 73!@#ACTIVITY_CODE 2
12/23/2022 07:04:46 AM script INFO: SUCCESS!@#KODE 1!@#USER_ID 73!@#ACTIVITY_CODE 2
12/23/2022 07:04:46 AM script INFO: SUCCESS!@#KODE 1!@#USER_ID 73!@#ACTIVITY_CODE 1
12/23/2022 07:04:46 AM script INFO: SUCCESS!@#KODE 1!@#USER_ID 73!@#ACTIVITY_CODE 4
12/23/2022 07:04:46 AM script INFO: Duration: 18.561930179595947
12/23/2022 07:04:46 AM script INFO: mengakhiri-quiz
12/23/2022 07:04:47 AM script INFO: SUCCESS!@#KODE 1!@#USER_ID 73!@#ACTIVITY_CODE 5
12/23/2022 07:04:47 AM script INFO: berhasil-submit
