12/12/2022 01:09:55 AM script INFO: Prepared chrome options..
12/12/2022 01:09:56 AM script INFO: Initialized chrome browser..
12/12/2022 01:09:56 AM script INFO: mengakses-homepage
12/12/2022 01:10:04 AM script INFO: mengakses-login-page
12/12/2022 01:10:05 AM script INFO: mengakses-site-home
12/12/2022 01:10:05 AM script INFO: mengakses-site-course
12/12/2022 01:10:33 AM script INFO: mengakses-quiz
12/12/2022 01:10:42 AM script INFO: mengakses-start-quiz-page
12/12/2022 01:10:51 AM script INFO: memulai-quiz
12/12/2022 01:10:51 AM script INFO: SUCCESS!@#KODE 1!@#USER_ID 14!@#ACTIVITY_CODE 5
12/12/2022 01:11:02 AM script INFO: SUCCESS!@#KODE 1!@#USER_ID 14!@#ACTIVITY_CODE 2
12/12/2022 01:11:02 AM script INFO: SUCCESS!@#KODE 1!@#USER_ID 14!@#ACTIVITY_CODE 5
12/12/2022 01:11:02 AM script INFO: SUCCESS!@#KODE 1!@#USER_ID 14!@#ACTIVITY_CODE 5
12/12/2022 01:11:04 AM script INFO: SUCCESS!@#KODE 1!@#USER_ID 14!@#ACTIVITY_CODE 5
12/12/2022 01:11:04 AM script INFO: SUCCESS!@#KODE 1!@#USER_ID 14!@#ACTIVITY_CODE 5
12/12/2022 01:11:07 AM script INFO: SUCCESS!@#KODE 1!@#USER_ID 14!@#ACTIVITY_CODE 3
12/12/2022 01:11:07 AM script INFO: SUCCESS!@#KODE 1!@#USER_ID 14!@#ACTIVITY_CODE 3
12/12/2022 01:11:07 AM script INFO: SUCCESS!@#KODE 1!@#USER_ID 14!@#ACTIVITY_CODE 1
12/12/2022 01:11:07 AM script INFO: SUCCESS!@#KODE 1!@#USER_ID 14!@#ACTIVITY_CODE 4
12/12/2022 01:11:07 AM script INFO: SUCCESS!@#KODE 1!@#USER_ID 14!@#ACTIVITY_CODE 2
12/12/2022 01:11:07 AM script INFO: SUCCESS!@#KODE 1!@#USER_ID 14!@#ACTIVITY_CODE 3
12/12/2022 01:11:07 AM script INFO: SUCCESS!@#KODE 1!@#USER_ID 14!@#ACTIVITY_CODE 2
12/12/2022 01:11:07 AM script INFO: SUCCESS!@#KODE 1!@#USER_ID 14!@#ACTIVITY_CODE 5
12/12/2022 01:11:07 AM script INFO: SUCCESS!@#KODE 1!@#USER_ID 14!@#ACTIVITY_CODE 5
12/12/2022 01:11:10 AM script INFO: SUCCESS!@#KODE 1!@#USER_ID 14!@#ACTIVITY_CODE 1
12/12/2022 01:11:10 AM script INFO: SUCCESS!@#KODE 1!@#USER_ID 14!@#ACTIVITY_CODE 1
12/12/2022 01:11:10 AM script INFO: SUCCESS!@#KODE 1!@#USER_ID 14!@#ACTIVITY_CODE 5
12/12/2022 01:11:10 AM script INFO: SUCCESS!@#KODE 1!@#USER_ID 14!@#ACTIVITY_CODE 5
12/12/2022 01:11:13 AM script INFO: SUCCESS!@#KODE 1!@#USER_ID 14!@#ACTIVITY_CODE 4
12/12/2022 01:11:13 AM script INFO: SUCCESS!@#KODE 1!@#USER_ID 14!@#ACTIVITY_CODE 3
12/12/2022 01:11:13 AM script INFO: SUCCESS!@#KODE 1!@#USER_ID 14!@#ACTIVITY_CODE 3
12/12/2022 01:11:13 AM script INFO: SUCCESS!@#KODE 1!@#USER_ID 14!@#ACTIVITY_CODE 3
12/12/2022 01:11:13 AM script INFO: SUCCESS!@#KODE 1!@#USER_ID 14!@#ACTIVITY_CODE 1
12/12/2022 01:11:13 AM script INFO: SUCCESS!@#KODE 1!@#USER_ID 14!@#ACTIVITY_CODE 5
12/12/2022 01:11:13 AM script INFO: SUCCESS!@#KODE 1!@#USER_ID 14!@#ACTIVITY_CODE 5
12/12/2022 01:11:15 AM script INFO: SUCCESS!@#KODE 1!@#USER_ID 14!@#ACTIVITY_CODE 4
12/12/2022 01:11:15 AM script INFO: SUCCESS!@#KODE 1!@#USER_ID 14!@#ACTIVITY_CODE 1
12/12/2022 01:11:16 AM script INFO: SUCCESS!@#KODE 1!@#USER_ID 14!@#ACTIVITY_CODE 1
12/12/2022 01:11:16 AM script INFO: SUCCESS!@#KODE 1!@#USER_ID 14!@#ACTIVITY_CODE 4
12/12/2022 01:11:16 AM script INFO: SUCCESS!@#KODE 1!@#USER_ID 14!@#ACTIVITY_CODE 2
12/12/2022 01:11:16 AM script INFO: SUCCESS!@#KODE 1!@#USER_ID 14!@#ACTIVITY_CODE 2
12/12/2022 01:11:16 AM script INFO: SUCCESS!@#KODE 1!@#USER_ID 14!@#ACTIVITY_CODE 2
12/12/2022 01:11:16 AM script INFO: SUCCESS!@#KODE 1!@#USER_ID 14!@#ACTIVITY_CODE 1
12/12/2022 01:11:16 AM script INFO: SUCCESS!@#KODE 1!@#USER_ID 14!@#ACTIVITY_CODE 1
12/12/2022 01:11:16 AM script INFO: SUCCESS!@#KODE 1!@#USER_ID 14!@#ACTIVITY_CODE 4
12/12/2022 01:11:16 AM script INFO: SUCCESS!@#KODE 1!@#USER_ID 14!@#ACTIVITY_CODE 5
12/12/2022 01:11:16 AM script INFO: SUCCESS!@#KODE 1!@#USER_ID 14!@#ACTIVITY_CODE 5
12/12/2022 01:11:19 AM script INFO: SUCCESS!@#KODE 1!@#USER_ID 14!@#ACTIVITY_CODE 3
12/12/2022 01:11:19 AM script INFO: SUCCESS!@#KODE 1!@#USER_ID 14!@#ACTIVITY_CODE 3
12/12/2022 01:11:19 AM script INFO: SUCCESS!@#KODE 1!@#USER_ID 14!@#ACTIVITY_CODE 3
12/12/2022 01:11:19 AM script INFO: SUCCESS!@#KODE 1!@#USER_ID 14!@#ACTIVITY_CODE 1
12/12/2022 01:11:19 AM script INFO: SUCCESS!@#KODE 1!@#USER_ID 14!@#ACTIVITY_CODE 1
12/12/2022 01:11:19 AM script INFO: SUCCESS!@#KODE 1!@#USER_ID 14!@#ACTIVITY_CODE 4
12/12/2022 01:11:19 AM script INFO: SUCCESS!@#KODE 1!@#USER_ID 14!@#ACTIVITY_CODE 2
12/12/2022 01:11:19 AM script INFO: SUCCESS!@#KODE 1!@#USER_ID 14!@#ACTIVITY_CODE 3
12/12/2022 01:11:19 AM script INFO: SUCCESS!@#KODE 1!@#USER_ID 14!@#ACTIVITY_CODE 2
12/12/2022 01:11:19 AM script INFO: SUCCESS!@#KODE 1!@#USER_ID 14!@#ACTIVITY_CODE 3
12/12/2022 01:11:19 AM script INFO: SUCCESS!@#KODE 1!@#USER_ID 14!@#ACTIVITY_CODE 3
12/12/2022 01:11:19 AM script INFO: Duration: 17.63928747177124
12/12/2022 01:11:19 AM script INFO: mengakhiri-quiz
12/12/2022 01:11:20 AM script INFO: SUCCESS!@#KODE 1!@#USER_ID 14!@#ACTIVITY_CODE 5
12/12/2022 01:11:20 AM script INFO: berhasil-submit
