12/23/2022 01:06:08 AM script INFO: Prepared chrome options..
12/23/2022 01:06:09 AM script INFO: Initialized chrome browser..
12/23/2022 01:06:09 AM script INFO: mengakses-homepage
12/23/2022 01:07:10 AM script INFO: mengakses-login-page
12/23/2022 01:07:50 AM script INFO: mengakses-site-home
12/23/2022 01:08:00 AM script INFO: mengakses-site-course
12/23/2022 01:08:38 AM script INFO: mengakses-quiz
12/23/2022 01:08:55 AM script INFO: mengakses-start-quiz-page
12/23/2022 01:09:14 AM script INFO: memulai-quiz
12/23/2022 01:09:14 AM script INFO: SUCCESS!@#KODE 1!@#USER_ID 53!@#ACTIVITY_CODE 5
12/23/2022 01:09:24 AM script INFO: SUCCESS!@#KODE 1!@#USER_ID 53!@#ACTIVITY_CODE 2
12/23/2022 01:09:24 AM script INFO: SUCCESS!@#KODE 1!@#USER_ID 53!@#ACTIVITY_CODE 5
12/23/2022 01:09:24 AM script INFO: SUCCESS!@#KODE 1!@#USER_ID 53!@#ACTIVITY_CODE 5
12/23/2022 01:09:27 AM script INFO: SUCCESS!@#KODE 1!@#USER_ID 53!@#ACTIVITY_CODE 3
12/23/2022 01:09:27 AM script INFO: SUCCESS!@#KODE 1!@#USER_ID 53!@#ACTIVITY_CODE 3
12/23/2022 01:09:27 AM script INFO: SUCCESS!@#KODE 1!@#USER_ID 53!@#ACTIVITY_CODE 1
12/23/2022 01:09:27 AM script INFO: SUCCESS!@#KODE 1!@#USER_ID 53!@#ACTIVITY_CODE 5
12/23/2022 01:09:27 AM script INFO: SUCCESS!@#KODE 1!@#USER_ID 53!@#ACTIVITY_CODE 5
12/23/2022 01:09:30 AM script INFO: SUCCESS!@#KODE 1!@#USER_ID 53!@#ACTIVITY_CODE 4
12/23/2022 01:09:30 AM script INFO: SUCCESS!@#KODE 1!@#USER_ID 53!@#ACTIVITY_CODE 3
12/23/2022 01:09:30 AM script INFO: SUCCESS!@#KODE 1!@#USER_ID 53!@#ACTIVITY_CODE 5
12/23/2022 01:09:30 AM script INFO: SUCCESS!@#KODE 1!@#USER_ID 53!@#ACTIVITY_CODE 5
12/23/2022 01:09:32 AM script INFO: SUCCESS!@#KODE 1!@#USER_ID 53!@#ACTIVITY_CODE 5
12/23/2022 01:09:32 AM script INFO: SUCCESS!@#KODE 1!@#USER_ID 53!@#ACTIVITY_CODE 5
12/23/2022 01:09:35 AM script INFO: SUCCESS!@#KODE 1!@#USER_ID 53!@#ACTIVITY_CODE 1
12/23/2022 01:09:35 AM script INFO: SUCCESS!@#KODE 1!@#USER_ID 53!@#ACTIVITY_CODE 1
12/23/2022 01:09:35 AM script INFO: SUCCESS!@#KODE 1!@#USER_ID 53!@#ACTIVITY_CODE 2
12/23/2022 01:09:35 AM script INFO: SUCCESS!@#KODE 1!@#USER_ID 53!@#ACTIVITY_CODE 3
12/23/2022 01:09:35 AM script INFO: SUCCESS!@#KODE 1!@#USER_ID 53!@#ACTIVITY_CODE 3
12/23/2022 01:09:35 AM script INFO: SUCCESS!@#KODE 1!@#USER_ID 53!@#ACTIVITY_CODE 5
12/23/2022 01:09:35 AM script INFO: SUCCESS!@#KODE 1!@#USER_ID 53!@#ACTIVITY_CODE 5
12/23/2022 01:09:38 AM script INFO: SUCCESS!@#KODE 1!@#USER_ID 53!@#ACTIVITY_CODE 3
12/23/2022 01:09:38 AM script INFO: SUCCESS!@#KODE 1!@#USER_ID 53!@#ACTIVITY_CODE 3
12/23/2022 01:09:38 AM script INFO: SUCCESS!@#KODE 1!@#USER_ID 53!@#ACTIVITY_CODE 1
12/23/2022 01:09:38 AM script INFO: SUCCESS!@#KODE 1!@#USER_ID 53!@#ACTIVITY_CODE 5
12/23/2022 01:09:38 AM script INFO: SUCCESS!@#KODE 1!@#USER_ID 53!@#ACTIVITY_CODE 5
12/23/2022 01:09:40 AM script INFO: SUCCESS!@#KODE 1!@#USER_ID 53!@#ACTIVITY_CODE 1
12/23/2022 01:09:40 AM script INFO: SUCCESS!@#KODE 1!@#USER_ID 53!@#ACTIVITY_CODE 1
12/23/2022 01:09:40 AM script INFO: SUCCESS!@#KODE 1!@#USER_ID 53!@#ACTIVITY_CODE 3
12/23/2022 01:09:41 AM script INFO: SUCCESS!@#KODE 1!@#USER_ID 53!@#ACTIVITY_CODE 4
12/23/2022 01:09:41 AM script INFO: SUCCESS!@#KODE 1!@#USER_ID 53!@#ACTIVITY_CODE 2
12/23/2022 01:09:41 AM script INFO: SUCCESS!@#KODE 1!@#USER_ID 53!@#ACTIVITY_CODE 2
12/23/2022 01:09:41 AM script INFO: SUCCESS!@#KODE 1!@#USER_ID 53!@#ACTIVITY_CODE 1
12/23/2022 01:09:41 AM script INFO: SUCCESS!@#KODE 1!@#USER_ID 53!@#ACTIVITY_CODE 4
12/23/2022 01:09:41 AM script INFO: SUCCESS!@#KODE 1!@#USER_ID 53!@#ACTIVITY_CODE 2
12/23/2022 01:09:41 AM script INFO: SUCCESS!@#KODE 1!@#USER_ID 53!@#ACTIVITY_CODE 2
12/23/2022 01:09:41 AM script INFO: SUCCESS!@#KODE 1!@#USER_ID 53!@#ACTIVITY_CODE 2
12/23/2022 01:09:41 AM script INFO: SUCCESS!@#KODE 1!@#USER_ID 53!@#ACTIVITY_CODE 3
12/23/2022 01:09:41 AM script INFO: SUCCESS!@#KODE 1!@#USER_ID 53!@#ACTIVITY_CODE 1
12/23/2022 01:09:41 AM script INFO: SUCCESS!@#KODE 1!@#USER_ID 53!@#ACTIVITY_CODE 4
12/23/2022 01:09:41 AM script INFO: SUCCESS!@#KODE 1!@#USER_ID 53!@#ACTIVITY_CODE 1
12/23/2022 01:09:42 AM script INFO: SUCCESS!@#KODE 1!@#USER_ID 53!@#ACTIVITY_CODE 3
12/23/2022 01:09:42 AM script INFO: SUCCESS!@#KODE 1!@#USER_ID 53!@#ACTIVITY_CODE 4
12/23/2022 01:09:42 AM script INFO: SUCCESS!@#KODE 1!@#USER_ID 53!@#ACTIVITY_CODE 3
12/23/2022 01:09:42 AM script INFO: SUCCESS!@#KODE 1!@#USER_ID 53!@#ACTIVITY_CODE 1
12/23/2022 01:09:42 AM script INFO: SUCCESS!@#KODE 1!@#USER_ID 53!@#ACTIVITY_CODE 1
12/23/2022 01:09:42 AM script INFO: SUCCESS!@#KODE 1!@#USER_ID 53!@#ACTIVITY_CODE 2
12/23/2022 01:09:42 AM script INFO: SUCCESS!@#KODE 1!@#USER_ID 53!@#ACTIVITY_CODE 1
12/23/2022 01:09:42 AM script INFO: Duration: 17.76699447631836
12/23/2022 01:09:42 AM script INFO: mengakhiri-quiz
12/23/2022 01:09:55 AM script INFO: SUCCESS!@#KODE 1!@#USER_ID 53!@#ACTIVITY_CODE 5
12/23/2022 01:09:55 AM script INFO: berhasil-submit
12/23/2022 01:11:25 AM script ERROR: TIMEOUT EXCEPTION!@#KODE 0!@#LOCATION berhasil-submit
12/23/2022 01:11:25 AM main_worker ERROR: Message: None

