12/21/2022 02:35:01 PM script INFO: Prepared chrome options..
12/21/2022 02:35:02 PM script INFO: Initialized chrome browser..
12/21/2022 02:35:02 PM script INFO: mengakses-homepage
12/21/2022 02:35:16 PM script INFO: mengakses-login-page
12/21/2022 02:35:17 PM script INFO: mengakses-site-home
12/21/2022 02:35:18 PM script INFO: mengakses-site-course
12/21/2022 02:35:40 PM script INFO: mengakses-quiz
12/21/2022 02:35:53 PM script INFO: mengakses-start-quiz-page
12/21/2022 02:36:07 PM script INFO: memulai-quiz
12/21/2022 02:36:07 PM script INFO: SUCCESS!@#KODE 1!@#USER_ID 37!@#ACTIVITY_CODE 5
12/21/2022 02:36:18 PM script INFO: SUCCESS!@#KODE 1!@#USER_ID 37!@#ACTIVITY_CODE 1
12/21/2022 02:36:18 PM script INFO: SUCCESS!@#KODE 1!@#USER_ID 37!@#ACTIVITY_CODE 4
12/21/2022 02:36:18 PM script INFO: SUCCESS!@#KODE 1!@#USER_ID 37!@#ACTIVITY_CODE 3
12/21/2022 02:36:18 PM script INFO: SUCCESS!@#KODE 1!@#USER_ID 37!@#ACTIVITY_CODE 3
12/21/2022 02:36:18 PM script INFO: SUCCESS!@#KODE 1!@#USER_ID 37!@#ACTIVITY_CODE 5
12/21/2022 02:36:18 PM script INFO: SUCCESS!@#KODE 1!@#USER_ID 37!@#ACTIVITY_CODE 5
12/21/2022 02:36:21 PM script INFO: SUCCESS!@#KODE 1!@#USER_ID 37!@#ACTIVITY_CODE 3
12/21/2022 02:36:21 PM script INFO: SUCCESS!@#KODE 1!@#USER_ID 37!@#ACTIVITY_CODE 2
12/21/2022 02:36:21 PM script INFO: SUCCESS!@#KODE 1!@#USER_ID 37!@#ACTIVITY_CODE 1
12/21/2022 02:36:21 PM script INFO: SUCCESS!@#KODE 1!@#USER_ID 37!@#ACTIVITY_CODE 2
12/21/2022 02:36:21 PM script INFO: SUCCESS!@#KODE 1!@#USER_ID 37!@#ACTIVITY_CODE 5
12/21/2022 02:36:21 PM script INFO: SUCCESS!@#KODE 1!@#USER_ID 37!@#ACTIVITY_CODE 5
12/21/2022 02:36:24 PM script INFO: SUCCESS!@#KODE 1!@#USER_ID 37!@#ACTIVITY_CODE 1
12/21/2022 02:36:24 PM script INFO: SUCCESS!@#KODE 1!@#USER_ID 37!@#ACTIVITY_CODE 2
12/21/2022 02:36:24 PM script INFO: SUCCESS!@#KODE 1!@#USER_ID 37!@#ACTIVITY_CODE 3
12/21/2022 02:36:24 PM script INFO: SUCCESS!@#KODE 1!@#USER_ID 37!@#ACTIVITY_CODE 1
12/21/2022 02:36:24 PM script INFO: SUCCESS!@#KODE 1!@#USER_ID 37!@#ACTIVITY_CODE 5
12/21/2022 02:36:24 PM script INFO: SUCCESS!@#KODE 1!@#USER_ID 37!@#ACTIVITY_CODE 5
12/21/2022 02:36:26 PM script INFO: SUCCESS!@#KODE 1!@#USER_ID 37!@#ACTIVITY_CODE 2
12/21/2022 02:36:26 PM script INFO: SUCCESS!@#KODE 1!@#USER_ID 37!@#ACTIVITY_CODE 5
12/21/2022 02:36:26 PM script INFO: SUCCESS!@#KODE 1!@#USER_ID 37!@#ACTIVITY_CODE 5
12/21/2022 02:36:29 PM script INFO: SUCCESS!@#KODE 1!@#USER_ID 37!@#ACTIVITY_CODE 1
12/21/2022 02:36:29 PM script INFO: SUCCESS!@#KODE 1!@#USER_ID 37!@#ACTIVITY_CODE 2
12/21/2022 02:36:29 PM script INFO: SUCCESS!@#KODE 1!@#USER_ID 37!@#ACTIVITY_CODE 3
12/21/2022 02:36:29 PM script INFO: SUCCESS!@#KODE 1!@#USER_ID 37!@#ACTIVITY_CODE 2
12/21/2022 02:36:29 PM script INFO: SUCCESS!@#KODE 1!@#USER_ID 37!@#ACTIVITY_CODE 5
12/21/2022 02:36:29 PM script INFO: SUCCESS!@#KODE 1!@#USER_ID 37!@#ACTIVITY_CODE 5
12/21/2022 02:36:32 PM script INFO: SUCCESS!@#KODE 1!@#USER_ID 37!@#ACTIVITY_CODE 3
12/21/2022 02:36:32 PM script INFO: SUCCESS!@#KODE 1!@#USER_ID 37!@#ACTIVITY_CODE 5
12/21/2022 02:36:32 PM script INFO: SUCCESS!@#KODE 1!@#USER_ID 37!@#ACTIVITY_CODE 5
12/21/2022 02:36:34 PM script INFO: SUCCESS!@#KODE 1!@#USER_ID 37!@#ACTIVITY_CODE 1
12/21/2022 02:36:34 PM script INFO: SUCCESS!@#KODE 1!@#USER_ID 37!@#ACTIVITY_CODE 1
12/21/2022 02:36:34 PM script INFO: SUCCESS!@#KODE 1!@#USER_ID 37!@#ACTIVITY_CODE 4
12/21/2022 02:36:34 PM script INFO: SUCCESS!@#KODE 1!@#USER_ID 37!@#ACTIVITY_CODE 5
12/21/2022 02:36:34 PM script INFO: SUCCESS!@#KODE 1!@#USER_ID 37!@#ACTIVITY_CODE 5
12/21/2022 02:36:37 PM script INFO: SUCCESS!@#KODE 1!@#USER_ID 37!@#ACTIVITY_CODE 5
12/21/2022 02:36:37 PM script INFO: SUCCESS!@#KODE 1!@#USER_ID 37!@#ACTIVITY_CODE 5
12/21/2022 02:36:40 PM script INFO: SUCCESS!@#KODE 1!@#USER_ID 37!@#ACTIVITY_CODE 1
12/21/2022 02:36:40 PM script INFO: SUCCESS!@#KODE 1!@#USER_ID 37!@#ACTIVITY_CODE 2
12/21/2022 02:36:40 PM script INFO: SUCCESS!@#KODE 1!@#USER_ID 37!@#ACTIVITY_CODE 5
12/21/2022 02:36:40 PM script INFO: SUCCESS!@#KODE 1!@#USER_ID 37!@#ACTIVITY_CODE 5
12/21/2022 02:36:42 PM script INFO: SUCCESS!@#KODE 1!@#USER_ID 37!@#ACTIVITY_CODE 3
12/21/2022 02:36:42 PM script INFO: SUCCESS!@#KODE 1!@#USER_ID 37!@#ACTIVITY_CODE 2
12/21/2022 02:36:42 PM script INFO: SUCCESS!@#KODE 1!@#USER_ID 37!@#ACTIVITY_CODE 1
12/21/2022 02:36:42 PM script INFO: SUCCESS!@#KODE 1!@#USER_ID 37!@#ACTIVITY_CODE 5
12/21/2022 02:36:42 PM script INFO: SUCCESS!@#KODE 1!@#USER_ID 37!@#ACTIVITY_CODE 5
12/21/2022 02:36:45 PM script INFO: SUCCESS!@#KODE 1!@#USER_ID 37!@#ACTIVITY_CODE 4
12/21/2022 02:36:45 PM script INFO: SUCCESS!@#KODE 1!@#USER_ID 37!@#ACTIVITY_CODE 1
12/21/2022 02:36:45 PM script INFO: SUCCESS!@#KODE 1!@#USER_ID 37!@#ACTIVITY_CODE 2
12/21/2022 02:36:45 PM script INFO: SUCCESS!@#KODE 1!@#USER_ID 37!@#ACTIVITY_CODE 2
12/21/2022 02:36:45 PM script INFO: SUCCESS!@#KODE 1!@#USER_ID 37!@#ACTIVITY_CODE 4
12/21/2022 02:36:45 PM script INFO: SUCCESS!@#KODE 1!@#USER_ID 37!@#ACTIVITY_CODE 2
12/21/2022 02:36:45 PM script INFO: SUCCESS!@#KODE 1!@#USER_ID 37!@#ACTIVITY_CODE 1
12/21/2022 02:36:46 PM script INFO: SUCCESS!@#KODE 1!@#USER_ID 37!@#ACTIVITY_CODE 2
12/21/2022 02:36:46 PM script INFO: SUCCESS!@#KODE 1!@#USER_ID 37!@#ACTIVITY_CODE 3
12/21/2022 02:36:46 PM script INFO: SUCCESS!@#KODE 1!@#USER_ID 37!@#ACTIVITY_CODE 5
12/21/2022 02:36:46 PM script INFO: SUCCESS!@#KODE 1!@#USER_ID 37!@#ACTIVITY_CODE 5
12/21/2022 02:36:48 PM script INFO: SUCCESS!@#KODE 1!@#USER_ID 37!@#ACTIVITY_CODE 2
12/21/2022 02:36:48 PM script INFO: SUCCESS!@#KODE 1!@#USER_ID 37!@#ACTIVITY_CODE 4
12/21/2022 02:36:48 PM script INFO: SUCCESS!@#KODE 1!@#USER_ID 37!@#ACTIVITY_CODE 1
12/21/2022 02:36:49 PM script INFO: SUCCESS!@#KODE 1!@#USER_ID 37!@#ACTIVITY_CODE 2
12/21/2022 02:36:49 PM script INFO: SUCCESS!@#KODE 1!@#USER_ID 37!@#ACTIVITY_CODE 1
12/21/2022 02:36:49 PM script INFO: SUCCESS!@#KODE 1!@#USER_ID 37!@#ACTIVITY_CODE 3
12/21/2022 02:36:49 PM script INFO: SUCCESS!@#KODE 1!@#USER_ID 37!@#ACTIVITY_CODE 4
12/21/2022 02:36:49 PM script INFO: SUCCESS!@#KODE 1!@#USER_ID 37!@#ACTIVITY_CODE 3
12/21/2022 02:36:49 PM script INFO: SUCCESS!@#KODE 1!@#USER_ID 37!@#ACTIVITY_CODE 3
12/21/2022 02:36:49 PM script INFO: SUCCESS!@#KODE 1!@#USER_ID 37!@#ACTIVITY_CODE 1
12/21/2022 02:36:49 PM script INFO: SUCCESS!@#KODE 1!@#USER_ID 37!@#ACTIVITY_CODE 4
12/21/2022 02:36:49 PM script INFO: SUCCESS!@#KODE 1!@#USER_ID 37!@#ACTIVITY_CODE 2
12/21/2022 02:36:49 PM script INFO: SUCCESS!@#KODE 1!@#USER_ID 37!@#ACTIVITY_CODE 1
12/21/2022 02:36:49 PM script INFO: SUCCESS!@#KODE 1!@#USER_ID 37!@#ACTIVITY_CODE 2
12/21/2022 02:36:49 PM script INFO: SUCCESS!@#KODE 1!@#USER_ID 37!@#ACTIVITY_CODE 4
12/21/2022 02:36:49 PM script INFO: SUCCESS!@#KODE 1!@#USER_ID 37!@#ACTIVITY_CODE 1
12/21/2022 02:36:49 PM script INFO: SUCCESS!@#KODE 1!@#USER_ID 37!@#ACTIVITY_CODE 3
12/21/2022 02:36:49 PM script INFO: SUCCESS!@#KODE 1!@#USER_ID 37!@#ACTIVITY_CODE 1
12/21/2022 02:36:49 PM script INFO: SUCCESS!@#KODE 1!@#USER_ID 37!@#ACTIVITY_CODE 1
12/21/2022 02:36:49 PM script INFO: SUCCESS!@#KODE 1!@#USER_ID 37!@#ACTIVITY_CODE 1
12/21/2022 02:36:50 PM script INFO: SUCCESS!@#KODE 1!@#USER_ID 37!@#ACTIVITY_CODE 1
12/21/2022 02:36:50 PM script INFO: SUCCESS!@#KODE 1!@#USER_ID 37!@#ACTIVITY_CODE 3
12/21/2022 02:36:50 PM script INFO: SUCCESS!@#KODE 1!@#USER_ID 37!@#ACTIVITY_CODE 1
12/21/2022 02:36:50 PM script INFO: SUCCESS!@#KODE 1!@#USER_ID 37!@#ACTIVITY_CODE 1
12/21/2022 02:36:50 PM script INFO: SUCCESS!@#KODE 1!@#USER_ID 37!@#ACTIVITY_CODE 2
12/21/2022 02:36:50 PM script INFO: SUCCESS!@#KODE 1!@#USER_ID 37!@#ACTIVITY_CODE 3
12/21/2022 02:36:50 PM script INFO: SUCCESS!@#KODE 1!@#USER_ID 37!@#ACTIVITY_CODE 3
12/21/2022 02:36:50 PM script INFO: SUCCESS!@#KODE 1!@#USER_ID 37!@#ACTIVITY_CODE 3
12/21/2022 02:36:50 PM script INFO: SUCCESS!@#KODE 1!@#USER_ID 37!@#ACTIVITY_CODE 2
12/21/2022 02:36:50 PM script INFO: SUCCESS!@#KODE 1!@#USER_ID 37!@#ACTIVITY_CODE 1
12/21/2022 02:36:50 PM script INFO: SUCCESS!@#KODE 1!@#USER_ID 37!@#ACTIVITY_CODE 2
12/21/2022 02:36:50 PM script INFO: SUCCESS!@#KODE 1!@#USER_ID 37!@#ACTIVITY_CODE 3
12/21/2022 02:36:50 PM script INFO: SUCCESS!@#KODE 1!@#USER_ID 37!@#ACTIVITY_CODE 3
12/21/2022 02:36:50 PM script INFO: SUCCESS!@#KODE 1!@#USER_ID 37!@#ACTIVITY_CODE 3
12/21/2022 02:36:50 PM script INFO: SUCCESS!@#KODE 1!@#USER_ID 37!@#ACTIVITY_CODE 2
12/21/2022 02:36:51 PM script INFO: SUCCESS!@#KODE 1!@#USER_ID 37!@#ACTIVITY_CODE 2
12/21/2022 02:36:51 PM script INFO: SUCCESS!@#KODE 1!@#USER_ID 37!@#ACTIVITY_CODE 2
12/21/2022 02:36:51 PM script INFO: SUCCESS!@#KODE 1!@#USER_ID 37!@#ACTIVITY_CODE 4
12/21/2022 02:36:51 PM script INFO: SUCCESS!@#KODE 1!@#USER_ID 37!@#ACTIVITY_CODE 3
12/21/2022 02:36:51 PM script INFO: SUCCESS!@#KODE 1!@#USER_ID 37!@#ACTIVITY_CODE 1
12/21/2022 02:36:51 PM script INFO: SUCCESS!@#KODE 1!@#USER_ID 37!@#ACTIVITY_CODE 3
12/21/2022 02:36:51 PM script INFO: Duration: 33.06018877029419
12/21/2022 02:36:51 PM script INFO: mengakhiri-quiz
12/21/2022 02:36:54 PM script INFO: SUCCESS!@#KODE 1!@#USER_ID 37!@#ACTIVITY_CODE 5
12/21/2022 02:36:54 PM script INFO: berhasil-submit
