12/12/2022 01:44:27 AM script INFO: Prepared chrome options..
12/12/2022 01:44:28 AM script INFO: Initialized chrome browser..
12/12/2022 01:44:28 AM script INFO: mengakses-homepage
12/12/2022 01:44:42 AM script INFO: mengakses-login-page
12/12/2022 01:44:43 AM script INFO: mengakses-site-home
12/12/2022 01:44:43 AM script INFO: mengakses-site-course
12/12/2022 01:44:44 AM script INFO: mengakses-quiz
12/12/2022 01:44:44 AM script INFO: mengakses-start-quiz-page
12/12/2022 01:44:45 AM script INFO: memulai-quiz
12/12/2022 01:44:45 AM script INFO: SUCCESS!@#KODE 1!@#USER_ID 61!@#ACTIVITY_CODE 5
12/12/2022 01:44:56 AM script INFO: SUCCESS!@#KODE 1!@#USER_ID 61!@#ACTIVITY_CODE 3
12/12/2022 01:44:56 AM script INFO: SUCCESS!@#KODE 1!@#USER_ID 61!@#ACTIVITY_CODE 2
12/12/2022 01:44:56 AM script INFO: SUCCESS!@#KODE 1!@#USER_ID 61!@#ACTIVITY_CODE 3
12/12/2022 01:44:56 AM script INFO: SUCCESS!@#KODE 1!@#USER_ID 61!@#ACTIVITY_CODE 5
12/12/2022 01:44:56 AM script INFO: SUCCESS!@#KODE 1!@#USER_ID 61!@#ACTIVITY_CODE 5
12/12/2022 01:44:59 AM script INFO: SUCCESS!@#KODE 1!@#USER_ID 61!@#ACTIVITY_CODE 1
12/12/2022 01:44:59 AM script INFO: SUCCESS!@#KODE 1!@#USER_ID 61!@#ACTIVITY_CODE 3
12/12/2022 01:44:59 AM script INFO: SUCCESS!@#KODE 1!@#USER_ID 61!@#ACTIVITY_CODE 2
12/12/2022 01:44:59 AM script INFO: SUCCESS!@#KODE 1!@#USER_ID 61!@#ACTIVITY_CODE 2
12/12/2022 01:44:59 AM script INFO: SUCCESS!@#KODE 1!@#USER_ID 61!@#ACTIVITY_CODE 3
12/12/2022 01:45:00 AM script INFO: SUCCESS!@#KODE 1!@#USER_ID 61!@#ACTIVITY_CODE 2
12/12/2022 01:45:00 AM script INFO: SUCCESS!@#KODE 1!@#USER_ID 61!@#ACTIVITY_CODE 1
12/12/2022 01:45:00 AM script INFO: SUCCESS!@#KODE 1!@#USER_ID 61!@#ACTIVITY_CODE 3
12/12/2022 01:45:00 AM script INFO: SUCCESS!@#KODE 1!@#USER_ID 61!@#ACTIVITY_CODE 2
12/12/2022 01:45:00 AM script INFO: SUCCESS!@#KODE 1!@#USER_ID 61!@#ACTIVITY_CODE 2
12/12/2022 01:45:00 AM script INFO: SUCCESS!@#KODE 1!@#USER_ID 61!@#ACTIVITY_CODE 3
12/12/2022 01:45:00 AM script INFO: SUCCESS!@#KODE 1!@#USER_ID 61!@#ACTIVITY_CODE 3
12/12/2022 01:45:00 AM script INFO: SUCCESS!@#KODE 1!@#USER_ID 61!@#ACTIVITY_CODE 3
12/12/2022 01:45:00 AM script INFO: SUCCESS!@#KODE 1!@#USER_ID 61!@#ACTIVITY_CODE 3
12/12/2022 01:45:00 AM script INFO: SUCCESS!@#KODE 1!@#USER_ID 61!@#ACTIVITY_CODE 1
12/12/2022 01:45:00 AM script INFO: SUCCESS!@#KODE 1!@#USER_ID 61!@#ACTIVITY_CODE 2
12/12/2022 01:45:01 AM script INFO: SUCCESS!@#KODE 1!@#USER_ID 61!@#ACTIVITY_CODE 1
12/12/2022 01:45:01 AM script INFO: SUCCESS!@#KODE 1!@#USER_ID 61!@#ACTIVITY_CODE 4
12/12/2022 01:45:01 AM script INFO: SUCCESS!@#KODE 1!@#USER_ID 61!@#ACTIVITY_CODE 3
12/12/2022 01:45:01 AM script INFO: SUCCESS!@#KODE 1!@#USER_ID 61!@#ACTIVITY_CODE 2
12/12/2022 01:45:01 AM script INFO: SUCCESS!@#KODE 1!@#USER_ID 61!@#ACTIVITY_CODE 1
12/12/2022 01:45:01 AM script INFO: SUCCESS!@#KODE 1!@#USER_ID 61!@#ACTIVITY_CODE 1
12/12/2022 01:45:01 AM script INFO: SUCCESS!@#KODE 1!@#USER_ID 61!@#ACTIVITY_CODE 2
12/12/2022 01:45:01 AM script INFO: SUCCESS!@#KODE 1!@#USER_ID 61!@#ACTIVITY_CODE 1
12/12/2022 01:45:01 AM script INFO: SUCCESS!@#KODE 1!@#USER_ID 61!@#ACTIVITY_CODE 5
12/12/2022 01:45:01 AM script INFO: SUCCESS!@#KODE 1!@#USER_ID 61!@#ACTIVITY_CODE 5
12/12/2022 01:45:04 AM script INFO: SUCCESS!@#KODE 1!@#USER_ID 61!@#ACTIVITY_CODE 2
12/12/2022 01:45:04 AM script INFO: SUCCESS!@#KODE 1!@#USER_ID 61!@#ACTIVITY_CODE 2
12/12/2022 01:45:04 AM script INFO: SUCCESS!@#KODE 1!@#USER_ID 61!@#ACTIVITY_CODE 4
12/12/2022 01:45:04 AM script INFO: SUCCESS!@#KODE 1!@#USER_ID 61!@#ACTIVITY_CODE 2
12/12/2022 01:45:04 AM script INFO: SUCCESS!@#KODE 1!@#USER_ID 61!@#ACTIVITY_CODE 5
12/12/2022 01:45:04 AM script INFO: SUCCESS!@#KODE 1!@#USER_ID 61!@#ACTIVITY_CODE 5
12/12/2022 01:45:07 AM script INFO: SUCCESS!@#KODE 1!@#USER_ID 61!@#ACTIVITY_CODE 1
12/12/2022 01:45:07 AM script INFO: SUCCESS!@#KODE 1!@#USER_ID 61!@#ACTIVITY_CODE 4
12/12/2022 01:45:07 AM script INFO: SUCCESS!@#KODE 1!@#USER_ID 61!@#ACTIVITY_CODE 5
12/12/2022 01:45:07 AM script INFO: SUCCESS!@#KODE 1!@#USER_ID 61!@#ACTIVITY_CODE 5
12/12/2022 01:45:09 AM script INFO: SUCCESS!@#KODE 1!@#USER_ID 61!@#ACTIVITY_CODE 1
12/12/2022 01:45:10 AM script INFO: SUCCESS!@#KODE 1!@#USER_ID 61!@#ACTIVITY_CODE 1
12/12/2022 01:45:10 AM script INFO: SUCCESS!@#KODE 1!@#USER_ID 61!@#ACTIVITY_CODE 4
12/12/2022 01:45:10 AM script INFO: SUCCESS!@#KODE 1!@#USER_ID 61!@#ACTIVITY_CODE 5
12/12/2022 01:45:10 AM script INFO: SUCCESS!@#KODE 1!@#USER_ID 61!@#ACTIVITY_CODE 5
12/12/2022 01:45:12 AM script INFO: SUCCESS!@#KODE 1!@#USER_ID 61!@#ACTIVITY_CODE 1
12/12/2022 01:45:12 AM script INFO: SUCCESS!@#KODE 1!@#USER_ID 61!@#ACTIVITY_CODE 4
12/12/2022 01:45:12 AM script INFO: SUCCESS!@#KODE 1!@#USER_ID 61!@#ACTIVITY_CODE 3
12/12/2022 01:45:12 AM script INFO: SUCCESS!@#KODE 1!@#USER_ID 61!@#ACTIVITY_CODE 5
12/12/2022 01:45:12 AM script INFO: SUCCESS!@#KODE 1!@#USER_ID 61!@#ACTIVITY_CODE 5
12/12/2022 01:45:15 AM script INFO: SUCCESS!@#KODE 1!@#USER_ID 61!@#ACTIVITY_CODE 1
12/12/2022 01:45:15 AM script INFO: SUCCESS!@#KODE 1!@#USER_ID 61!@#ACTIVITY_CODE 4
12/12/2022 01:45:15 AM script INFO: SUCCESS!@#KODE 1!@#USER_ID 61!@#ACTIVITY_CODE 3
12/12/2022 01:45:15 AM script INFO: SUCCESS!@#KODE 1!@#USER_ID 61!@#ACTIVITY_CODE 1
12/12/2022 01:45:15 AM script INFO: SUCCESS!@#KODE 1!@#USER_ID 61!@#ACTIVITY_CODE 5
12/12/2022 01:45:15 AM script INFO: SUCCESS!@#KODE 1!@#USER_ID 61!@#ACTIVITY_CODE 5
12/12/2022 01:45:18 AM script INFO: SUCCESS!@#KODE 1!@#USER_ID 61!@#ACTIVITY_CODE 1
12/12/2022 01:45:18 AM script INFO: SUCCESS!@#KODE 1!@#USER_ID 61!@#ACTIVITY_CODE 3
12/12/2022 01:45:18 AM script INFO: SUCCESS!@#KODE 1!@#USER_ID 61!@#ACTIVITY_CODE 1
12/12/2022 01:45:18 AM script INFO: SUCCESS!@#KODE 1!@#USER_ID 61!@#ACTIVITY_CODE 5
12/12/2022 01:45:18 AM script INFO: SUCCESS!@#KODE 1!@#USER_ID 61!@#ACTIVITY_CODE 5
12/12/2022 01:45:20 AM script INFO: SUCCESS!@#KODE 1!@#USER_ID 61!@#ACTIVITY_CODE 1
12/12/2022 01:45:20 AM script INFO: SUCCESS!@#KODE 1!@#USER_ID 61!@#ACTIVITY_CODE 5
12/12/2022 01:45:20 AM script INFO: SUCCESS!@#KODE 1!@#USER_ID 61!@#ACTIVITY_CODE 5
12/12/2022 01:45:23 AM script INFO: SUCCESS!@#KODE 1!@#USER_ID 61!@#ACTIVITY_CODE 5
12/12/2022 01:45:23 AM script INFO: SUCCESS!@#KODE 1!@#USER_ID 61!@#ACTIVITY_CODE 5
12/12/2022 01:45:26 AM script INFO: SUCCESS!@#KODE 1!@#USER_ID 61!@#ACTIVITY_CODE 1
12/12/2022 01:45:26 AM script INFO: SUCCESS!@#KODE 1!@#USER_ID 61!@#ACTIVITY_CODE 3
12/12/2022 01:45:26 AM script INFO: SUCCESS!@#KODE 1!@#USER_ID 61!@#ACTIVITY_CODE 5
12/12/2022 01:45:26 AM script INFO: SUCCESS!@#KODE 1!@#USER_ID 61!@#ACTIVITY_CODE 5
12/12/2022 01:45:28 AM script INFO: SUCCESS!@#KODE 1!@#USER_ID 61!@#ACTIVITY_CODE 1
12/12/2022 01:45:28 AM script INFO: SUCCESS!@#KODE 1!@#USER_ID 61!@#ACTIVITY_CODE 1
12/12/2022 01:45:28 AM script INFO: SUCCESS!@#KODE 1!@#USER_ID 61!@#ACTIVITY_CODE 4
12/12/2022 01:45:28 AM script INFO: SUCCESS!@#KODE 1!@#USER_ID 61!@#ACTIVITY_CODE 1
12/12/2022 01:45:28 AM script INFO: SUCCESS!@#KODE 1!@#USER_ID 61!@#ACTIVITY_CODE 1
12/12/2022 01:45:28 AM script INFO: SUCCESS!@#KODE 1!@#USER_ID 61!@#ACTIVITY_CODE 3
12/12/2022 01:45:29 AM script INFO: SUCCESS!@#KODE 1!@#USER_ID 61!@#ACTIVITY_CODE 4
12/12/2022 01:45:29 AM script INFO: SUCCESS!@#KODE 1!@#USER_ID 61!@#ACTIVITY_CODE 1
12/12/2022 01:45:29 AM script INFO: SUCCESS!@#KODE 1!@#USER_ID 61!@#ACTIVITY_CODE 2
12/12/2022 01:45:29 AM script INFO: SUCCESS!@#KODE 1!@#USER_ID 61!@#ACTIVITY_CODE 1
12/12/2022 01:45:29 AM script INFO: SUCCESS!@#KODE 1!@#USER_ID 61!@#ACTIVITY_CODE 2
12/12/2022 01:45:29 AM script INFO: SUCCESS!@#KODE 1!@#USER_ID 61!@#ACTIVITY_CODE 1
12/12/2022 01:45:29 AM script INFO: SUCCESS!@#KODE 1!@#USER_ID 61!@#ACTIVITY_CODE 1
12/12/2022 01:45:29 AM script INFO: SUCCESS!@#KODE 1!@#USER_ID 61!@#ACTIVITY_CODE 1
12/12/2022 01:45:29 AM script INFO: SUCCESS!@#KODE 1!@#USER_ID 61!@#ACTIVITY_CODE 2
12/12/2022 01:45:29 AM script INFO: SUCCESS!@#KODE 1!@#USER_ID 61!@#ACTIVITY_CODE 3
12/12/2022 01:45:29 AM script INFO: SUCCESS!@#KODE 1!@#USER_ID 61!@#ACTIVITY_CODE 3
12/12/2022 01:45:30 AM script INFO: SUCCESS!@#KODE 1!@#USER_ID 61!@#ACTIVITY_CODE 1
12/12/2022 01:45:30 AM script INFO: SUCCESS!@#KODE 1!@#USER_ID 61!@#ACTIVITY_CODE 1
12/12/2022 01:45:30 AM script INFO: SUCCESS!@#KODE 1!@#USER_ID 61!@#ACTIVITY_CODE 2
12/12/2022 01:45:30 AM script INFO: SUCCESS!@#KODE 1!@#USER_ID 61!@#ACTIVITY_CODE 4
12/12/2022 01:45:30 AM script INFO: SUCCESS!@#KODE 1!@#USER_ID 61!@#ACTIVITY_CODE 3
12/12/2022 01:45:30 AM script INFO: SUCCESS!@#KODE 1!@#USER_ID 61!@#ACTIVITY_CODE 2
12/12/2022 01:45:30 AM script INFO: SUCCESS!@#KODE 1!@#USER_ID 61!@#ACTIVITY_CODE 3
12/12/2022 01:45:30 AM script INFO: SUCCESS!@#KODE 1!@#USER_ID 61!@#ACTIVITY_CODE 2
12/12/2022 01:45:30 AM script INFO: SUCCESS!@#KODE 1!@#USER_ID 61!@#ACTIVITY_CODE 3
12/12/2022 01:45:31 AM script INFO: SUCCESS!@#KODE 1!@#USER_ID 61!@#ACTIVITY_CODE 2
12/12/2022 01:45:31 AM script INFO: Duration: 34.75141477584839
12/12/2022 01:45:31 AM script INFO: mengakhiri-quiz
12/12/2022 01:45:44 AM script INFO: SUCCESS!@#KODE 1!@#USER_ID 61!@#ACTIVITY_CODE 5
12/12/2022 01:45:44 AM script INFO: berhasil-submit
