12/21/2022 01:36:43 PM script INFO: Prepared chrome options..
12/21/2022 01:36:44 PM script INFO: Initialized chrome browser..
12/21/2022 01:36:44 PM script INFO: mengakses-homepage
12/21/2022 01:37:23 PM script INFO: mengakses-login-page
12/21/2022 01:37:28 PM script INFO: mengakses-site-home
12/21/2022 01:37:31 PM script INFO: mengakses-site-course
12/21/2022 01:37:47 PM script INFO: mengakses-quiz
12/21/2022 01:37:51 PM script INFO: mengakses-start-quiz-page
12/21/2022 01:38:16 PM script INFO: memulai-quiz
12/21/2022 01:38:16 PM script INFO: SUCCESS!@#KODE 1!@#USER_ID 13!@#ACTIVITY_CODE 5
12/21/2022 01:38:26 PM script INFO: SUCCESS!@#KODE 1!@#USER_ID 13!@#ACTIVITY_CODE 1
12/21/2022 01:38:26 PM script INFO: SUCCESS!@#KODE 1!@#USER_ID 13!@#ACTIVITY_CODE 3
12/21/2022 01:38:27 PM script INFO: SUCCESS!@#KODE 1!@#USER_ID 13!@#ACTIVITY_CODE 4
12/21/2022 01:38:27 PM script INFO: SUCCESS!@#KODE 1!@#USER_ID 13!@#ACTIVITY_CODE 5
12/21/2022 01:38:27 PM script INFO: SUCCESS!@#KODE 1!@#USER_ID 13!@#ACTIVITY_CODE 5
12/21/2022 01:38:29 PM script INFO: SUCCESS!@#KODE 1!@#USER_ID 13!@#ACTIVITY_CODE 1
12/21/2022 01:38:29 PM script INFO: SUCCESS!@#KODE 1!@#USER_ID 13!@#ACTIVITY_CODE 2
12/21/2022 01:38:29 PM script INFO: SUCCESS!@#KODE 1!@#USER_ID 13!@#ACTIVITY_CODE 1
12/21/2022 01:38:29 PM script INFO: SUCCESS!@#KODE 1!@#USER_ID 13!@#ACTIVITY_CODE 5
12/21/2022 01:38:29 PM script INFO: SUCCESS!@#KODE 1!@#USER_ID 13!@#ACTIVITY_CODE 5
12/21/2022 01:38:32 PM script INFO: SUCCESS!@#KODE 1!@#USER_ID 13!@#ACTIVITY_CODE 3
12/21/2022 01:38:32 PM script INFO: SUCCESS!@#KODE 1!@#USER_ID 13!@#ACTIVITY_CODE 2
12/21/2022 01:38:32 PM script INFO: SUCCESS!@#KODE 1!@#USER_ID 13!@#ACTIVITY_CODE 1
12/21/2022 01:38:32 PM script INFO: SUCCESS!@#KODE 1!@#USER_ID 13!@#ACTIVITY_CODE 2
12/21/2022 01:38:32 PM script INFO: SUCCESS!@#KODE 1!@#USER_ID 13!@#ACTIVITY_CODE 1
12/21/2022 01:38:32 PM script INFO: SUCCESS!@#KODE 1!@#USER_ID 13!@#ACTIVITY_CODE 2
12/21/2022 01:38:32 PM script INFO: SUCCESS!@#KODE 1!@#USER_ID 13!@#ACTIVITY_CODE 1
12/21/2022 01:38:33 PM script INFO: SUCCESS!@#KODE 1!@#USER_ID 13!@#ACTIVITY_CODE 1
12/21/2022 01:38:33 PM script INFO: SUCCESS!@#KODE 1!@#USER_ID 13!@#ACTIVITY_CODE 2
12/21/2022 01:38:33 PM script INFO: SUCCESS!@#KODE 1!@#USER_ID 13!@#ACTIVITY_CODE 4
12/21/2022 01:38:33 PM script INFO: SUCCESS!@#KODE 1!@#USER_ID 13!@#ACTIVITY_CODE 3
12/21/2022 01:38:33 PM script INFO: SUCCESS!@#KODE 1!@#USER_ID 13!@#ACTIVITY_CODE 5
12/21/2022 01:38:33 PM script INFO: SUCCESS!@#KODE 1!@#USER_ID 13!@#ACTIVITY_CODE 5
12/21/2022 01:38:35 PM script INFO: SUCCESS!@#KODE 1!@#USER_ID 13!@#ACTIVITY_CODE 2
12/21/2022 01:38:36 PM script INFO: SUCCESS!@#KODE 1!@#USER_ID 13!@#ACTIVITY_CODE 2
12/21/2022 01:38:36 PM script INFO: SUCCESS!@#KODE 1!@#USER_ID 13!@#ACTIVITY_CODE 2
12/21/2022 01:38:36 PM script INFO: SUCCESS!@#KODE 1!@#USER_ID 13!@#ACTIVITY_CODE 5
12/21/2022 01:38:36 PM script INFO: SUCCESS!@#KODE 1!@#USER_ID 13!@#ACTIVITY_CODE 5
12/21/2022 01:38:38 PM script INFO: SUCCESS!@#KODE 1!@#USER_ID 13!@#ACTIVITY_CODE 2
12/21/2022 01:38:39 PM script INFO: SUCCESS!@#KODE 1!@#USER_ID 13!@#ACTIVITY_CODE 2
12/21/2022 01:38:39 PM script INFO: SUCCESS!@#KODE 1!@#USER_ID 13!@#ACTIVITY_CODE 5
12/21/2022 01:38:39 PM script INFO: SUCCESS!@#KODE 1!@#USER_ID 13!@#ACTIVITY_CODE 5
12/21/2022 01:38:41 PM script INFO: SUCCESS!@#KODE 1!@#USER_ID 13!@#ACTIVITY_CODE 2
12/21/2022 01:38:41 PM script INFO: SUCCESS!@#KODE 1!@#USER_ID 13!@#ACTIVITY_CODE 1
12/21/2022 01:38:41 PM script INFO: SUCCESS!@#KODE 1!@#USER_ID 13!@#ACTIVITY_CODE 5
12/21/2022 01:38:41 PM script INFO: SUCCESS!@#KODE 1!@#USER_ID 13!@#ACTIVITY_CODE 5
12/21/2022 01:38:44 PM script INFO: SUCCESS!@#KODE 1!@#USER_ID 13!@#ACTIVITY_CODE 5
12/21/2022 01:38:44 PM script INFO: SUCCESS!@#KODE 1!@#USER_ID 13!@#ACTIVITY_CODE 5
12/21/2022 01:38:46 PM script INFO: SUCCESS!@#KODE 1!@#USER_ID 13!@#ACTIVITY_CODE 2
12/21/2022 01:38:46 PM script INFO: SUCCESS!@#KODE 1!@#USER_ID 13!@#ACTIVITY_CODE 5
12/21/2022 01:38:46 PM script INFO: SUCCESS!@#KODE 1!@#USER_ID 13!@#ACTIVITY_CODE 5
12/21/2022 01:38:49 PM script INFO: SUCCESS!@#KODE 1!@#USER_ID 13!@#ACTIVITY_CODE 1
12/21/2022 01:38:49 PM script INFO: SUCCESS!@#KODE 1!@#USER_ID 13!@#ACTIVITY_CODE 5
12/21/2022 01:38:49 PM script INFO: SUCCESS!@#KODE 1!@#USER_ID 13!@#ACTIVITY_CODE 5
12/21/2022 01:38:51 PM script INFO: SUCCESS!@#KODE 1!@#USER_ID 13!@#ACTIVITY_CODE 5
12/21/2022 01:38:51 PM script INFO: SUCCESS!@#KODE 1!@#USER_ID 13!@#ACTIVITY_CODE 5
12/21/2022 01:38:54 PM script INFO: SUCCESS!@#KODE 1!@#USER_ID 13!@#ACTIVITY_CODE 2
12/21/2022 01:38:54 PM script INFO: SUCCESS!@#KODE 1!@#USER_ID 13!@#ACTIVITY_CODE 2
12/21/2022 01:38:54 PM script INFO: SUCCESS!@#KODE 1!@#USER_ID 13!@#ACTIVITY_CODE 1
12/21/2022 01:38:54 PM script INFO: SUCCESS!@#KODE 1!@#USER_ID 13!@#ACTIVITY_CODE 2
12/21/2022 01:38:55 PM script INFO: SUCCESS!@#KODE 1!@#USER_ID 13!@#ACTIVITY_CODE 3
12/21/2022 01:38:55 PM script INFO: SUCCESS!@#KODE 1!@#USER_ID 13!@#ACTIVITY_CODE 4
12/21/2022 01:38:55 PM script INFO: SUCCESS!@#KODE 1!@#USER_ID 13!@#ACTIVITY_CODE 5
12/21/2022 01:38:55 PM script INFO: SUCCESS!@#KODE 1!@#USER_ID 13!@#ACTIVITY_CODE 5
12/21/2022 01:38:57 PM script INFO: SUCCESS!@#KODE 1!@#USER_ID 13!@#ACTIVITY_CODE 1
12/21/2022 01:38:57 PM script INFO: SUCCESS!@#KODE 1!@#USER_ID 13!@#ACTIVITY_CODE 1
12/21/2022 01:38:57 PM script INFO: SUCCESS!@#KODE 1!@#USER_ID 13!@#ACTIVITY_CODE 3
12/21/2022 01:38:57 PM script INFO: SUCCESS!@#KODE 1!@#USER_ID 13!@#ACTIVITY_CODE 3
12/21/2022 01:38:58 PM script INFO: SUCCESS!@#KODE 1!@#USER_ID 13!@#ACTIVITY_CODE 3
12/21/2022 01:38:58 PM script INFO: SUCCESS!@#KODE 1!@#USER_ID 13!@#ACTIVITY_CODE 2
12/21/2022 01:38:58 PM script INFO: SUCCESS!@#KODE 1!@#USER_ID 13!@#ACTIVITY_CODE 2
12/21/2022 01:38:58 PM script INFO: SUCCESS!@#KODE 1!@#USER_ID 13!@#ACTIVITY_CODE 3
12/21/2022 01:38:58 PM script INFO: SUCCESS!@#KODE 1!@#USER_ID 13!@#ACTIVITY_CODE 3
12/21/2022 01:38:58 PM script INFO: SUCCESS!@#KODE 1!@#USER_ID 13!@#ACTIVITY_CODE 2
12/21/2022 01:38:58 PM script INFO: SUCCESS!@#KODE 1!@#USER_ID 13!@#ACTIVITY_CODE 3
12/21/2022 01:38:58 PM script INFO: SUCCESS!@#KODE 1!@#USER_ID 13!@#ACTIVITY_CODE 4
12/21/2022 01:38:58 PM script INFO: SUCCESS!@#KODE 1!@#USER_ID 13!@#ACTIVITY_CODE 3
12/21/2022 01:38:59 PM script INFO: SUCCESS!@#KODE 1!@#USER_ID 13!@#ACTIVITY_CODE 2
12/21/2022 01:38:59 PM script INFO: SUCCESS!@#KODE 1!@#USER_ID 13!@#ACTIVITY_CODE 4
12/21/2022 01:38:59 PM script INFO: SUCCESS!@#KODE 1!@#USER_ID 13!@#ACTIVITY_CODE 2
12/21/2022 01:38:59 PM script INFO: SUCCESS!@#KODE 1!@#USER_ID 13!@#ACTIVITY_CODE 3
12/21/2022 01:38:59 PM script INFO: SUCCESS!@#KODE 1!@#USER_ID 13!@#ACTIVITY_CODE 1
12/21/2022 01:38:59 PM script INFO: SUCCESS!@#KODE 1!@#USER_ID 13!@#ACTIVITY_CODE 1
12/21/2022 01:38:59 PM script INFO: SUCCESS!@#KODE 1!@#USER_ID 13!@#ACTIVITY_CODE 1
12/21/2022 01:38:59 PM script INFO: SUCCESS!@#KODE 1!@#USER_ID 13!@#ACTIVITY_CODE 2
12/21/2022 01:38:59 PM script INFO: SUCCESS!@#KODE 1!@#USER_ID 13!@#ACTIVITY_CODE 2
12/21/2022 01:39:00 PM script INFO: SUCCESS!@#KODE 1!@#USER_ID 13!@#ACTIVITY_CODE 2
12/21/2022 01:39:00 PM script INFO: SUCCESS!@#KODE 1!@#USER_ID 13!@#ACTIVITY_CODE 4
12/21/2022 01:39:00 PM script INFO: SUCCESS!@#KODE 1!@#USER_ID 13!@#ACTIVITY_CODE 3
12/21/2022 01:39:00 PM script INFO: SUCCESS!@#KODE 1!@#USER_ID 13!@#ACTIVITY_CODE 3
12/21/2022 01:39:00 PM script INFO: SUCCESS!@#KODE 1!@#USER_ID 13!@#ACTIVITY_CODE 3
12/21/2022 01:39:00 PM script INFO: SUCCESS!@#KODE 1!@#USER_ID 13!@#ACTIVITY_CODE 2
12/21/2022 01:39:00 PM script INFO: SUCCESS!@#KODE 1!@#USER_ID 13!@#ACTIVITY_CODE 2
12/21/2022 01:39:00 PM script INFO: SUCCESS!@#KODE 1!@#USER_ID 13!@#ACTIVITY_CODE 2
12/21/2022 01:39:00 PM script INFO: SUCCESS!@#KODE 1!@#USER_ID 13!@#ACTIVITY_CODE 3
12/21/2022 01:39:01 PM script INFO: SUCCESS!@#KODE 1!@#USER_ID 13!@#ACTIVITY_CODE 2
12/21/2022 01:39:01 PM script INFO: SUCCESS!@#KODE 1!@#USER_ID 13!@#ACTIVITY_CODE 1
12/21/2022 01:39:01 PM script INFO: SUCCESS!@#KODE 1!@#USER_ID 13!@#ACTIVITY_CODE 2
12/21/2022 01:39:01 PM script INFO: SUCCESS!@#KODE 1!@#USER_ID 13!@#ACTIVITY_CODE 3
12/21/2022 01:39:01 PM script INFO: SUCCESS!@#KODE 1!@#USER_ID 13!@#ACTIVITY_CODE 1
12/21/2022 01:39:01 PM script INFO: SUCCESS!@#KODE 1!@#USER_ID 13!@#ACTIVITY_CODE 1
12/21/2022 01:39:01 PM script INFO: SUCCESS!@#KODE 1!@#USER_ID 13!@#ACTIVITY_CODE 4
12/21/2022 01:39:01 PM script INFO: SUCCESS!@#KODE 1!@#USER_ID 13!@#ACTIVITY_CODE 1
12/21/2022 01:39:01 PM script INFO: SUCCESS!@#KODE 1!@#USER_ID 13!@#ACTIVITY_CODE 2
12/21/2022 01:39:01 PM script INFO: SUCCESS!@#KODE 1!@#USER_ID 13!@#ACTIVITY_CODE 3
12/21/2022 01:39:01 PM script INFO: SUCCESS!@#KODE 1!@#USER_ID 13!@#ACTIVITY_CODE 1
12/21/2022 01:39:02 PM script INFO: SUCCESS!@#KODE 1!@#USER_ID 13!@#ACTIVITY_CODE 3
12/21/2022 01:39:02 PM script INFO: SUCCESS!@#KODE 1!@#USER_ID 13!@#ACTIVITY_CODE 1
12/21/2022 01:39:02 PM script INFO: Duration: 35.32854604721069
12/21/2022 01:39:02 PM script INFO: mengakhiri-quiz
12/21/2022 01:39:08 PM script INFO: SUCCESS!@#KODE 1!@#USER_ID 13!@#ACTIVITY_CODE 5
12/21/2022 01:39:08 PM script INFO: berhasil-submit
