12/23/2022 03:21:10 AM script INFO: Prepared chrome options..
12/23/2022 03:21:11 AM script INFO: Initialized chrome browser..
12/23/2022 03:21:11 AM script INFO: mengakses-homepage
12/23/2022 03:21:50 AM script INFO: mengakses-login-page
12/23/2022 03:22:06 AM script INFO: mengakses-site-home
12/23/2022 03:22:07 AM script INFO: mengakses-site-course
12/23/2022 03:22:21 AM script INFO: mengakses-quiz
12/23/2022 03:22:22 AM script INFO: mengakses-start-quiz-page
12/23/2022 03:22:23 AM script INFO: memulai-quiz
12/23/2022 03:22:23 AM script INFO: SUCCESS!@#KODE 1!@#USER_ID 21!@#ACTIVITY_CODE 5
12/23/2022 03:22:34 AM script INFO: SUCCESS!@#KODE 1!@#USER_ID 21!@#ACTIVITY_CODE 3
12/23/2022 03:22:34 AM script INFO: SUCCESS!@#KODE 1!@#USER_ID 21!@#ACTIVITY_CODE 5
12/23/2022 03:22:34 AM script INFO: SUCCESS!@#KODE 1!@#USER_ID 21!@#ACTIVITY_CODE 5
12/23/2022 03:22:37 AM script INFO: SUCCESS!@#KODE 1!@#USER_ID 21!@#ACTIVITY_CODE 2
12/23/2022 03:22:37 AM script INFO: SUCCESS!@#KODE 1!@#USER_ID 21!@#ACTIVITY_CODE 5
12/23/2022 03:22:37 AM script INFO: SUCCESS!@#KODE 1!@#USER_ID 21!@#ACTIVITY_CODE 5
12/23/2022 03:22:39 AM script INFO: SUCCESS!@#KODE 1!@#USER_ID 21!@#ACTIVITY_CODE 3
12/23/2022 03:22:40 AM script INFO: SUCCESS!@#KODE 1!@#USER_ID 21!@#ACTIVITY_CODE 2
12/23/2022 03:22:40 AM script INFO: SUCCESS!@#KODE 1!@#USER_ID 21!@#ACTIVITY_CODE 5
12/23/2022 03:22:40 AM script INFO: SUCCESS!@#KODE 1!@#USER_ID 21!@#ACTIVITY_CODE 5
12/23/2022 03:22:42 AM script INFO: SUCCESS!@#KODE 1!@#USER_ID 21!@#ACTIVITY_CODE 1
12/23/2022 03:22:42 AM script INFO: SUCCESS!@#KODE 1!@#USER_ID 21!@#ACTIVITY_CODE 4
12/23/2022 03:22:42 AM script INFO: SUCCESS!@#KODE 1!@#USER_ID 21!@#ACTIVITY_CODE 2
12/23/2022 03:22:42 AM script INFO: SUCCESS!@#KODE 1!@#USER_ID 21!@#ACTIVITY_CODE 1
12/23/2022 03:22:42 AM script INFO: SUCCESS!@#KODE 1!@#USER_ID 21!@#ACTIVITY_CODE 3
12/23/2022 03:22:42 AM script INFO: SUCCESS!@#KODE 1!@#USER_ID 21!@#ACTIVITY_CODE 3
12/23/2022 03:22:43 AM script INFO: SUCCESS!@#KODE 1!@#USER_ID 21!@#ACTIVITY_CODE 1
12/23/2022 03:22:43 AM script INFO: SUCCESS!@#KODE 1!@#USER_ID 21!@#ACTIVITY_CODE 4
12/23/2022 03:22:43 AM script INFO: SUCCESS!@#KODE 1!@#USER_ID 21!@#ACTIVITY_CODE 5
12/23/2022 03:22:43 AM script INFO: SUCCESS!@#KODE 1!@#USER_ID 21!@#ACTIVITY_CODE 5
12/23/2022 03:22:45 AM script INFO: SUCCESS!@#KODE 1!@#USER_ID 21!@#ACTIVITY_CODE 1
12/23/2022 03:22:45 AM script INFO: SUCCESS!@#KODE 1!@#USER_ID 21!@#ACTIVITY_CODE 3
12/23/2022 03:22:45 AM script INFO: SUCCESS!@#KODE 1!@#USER_ID 21!@#ACTIVITY_CODE 1
12/23/2022 03:22:45 AM script INFO: SUCCESS!@#KODE 1!@#USER_ID 21!@#ACTIVITY_CODE 3
12/23/2022 03:22:45 AM script INFO: SUCCESS!@#KODE 1!@#USER_ID 21!@#ACTIVITY_CODE 1
12/23/2022 03:22:45 AM script INFO: SUCCESS!@#KODE 1!@#USER_ID 21!@#ACTIVITY_CODE 5
12/23/2022 03:22:45 AM script INFO: SUCCESS!@#KODE 1!@#USER_ID 21!@#ACTIVITY_CODE 5
12/23/2022 03:22:48 AM script INFO: SUCCESS!@#KODE 1!@#USER_ID 21!@#ACTIVITY_CODE 4
12/23/2022 03:22:48 AM script INFO: SUCCESS!@#KODE 1!@#USER_ID 21!@#ACTIVITY_CODE 5
12/23/2022 03:22:48 AM script INFO: SUCCESS!@#KODE 1!@#USER_ID 21!@#ACTIVITY_CODE 5
12/23/2022 03:22:50 AM script INFO: SUCCESS!@#KODE 1!@#USER_ID 21!@#ACTIVITY_CODE 3
12/23/2022 03:22:51 AM script INFO: SUCCESS!@#KODE 1!@#USER_ID 21!@#ACTIVITY_CODE 2
12/23/2022 03:22:51 AM script INFO: SUCCESS!@#KODE 1!@#USER_ID 21!@#ACTIVITY_CODE 5
12/23/2022 03:22:51 AM script INFO: SUCCESS!@#KODE 1!@#USER_ID 21!@#ACTIVITY_CODE 5
12/23/2022 03:22:53 AM script INFO: SUCCESS!@#KODE 1!@#USER_ID 21!@#ACTIVITY_CODE 3
12/23/2022 03:22:53 AM script INFO: SUCCESS!@#KODE 1!@#USER_ID 21!@#ACTIVITY_CODE 2
12/23/2022 03:22:53 AM script INFO: SUCCESS!@#KODE 1!@#USER_ID 21!@#ACTIVITY_CODE 1
12/23/2022 03:22:53 AM script INFO: SUCCESS!@#KODE 1!@#USER_ID 21!@#ACTIVITY_CODE 2
12/23/2022 03:22:54 AM script INFO: SUCCESS!@#KODE 1!@#USER_ID 21!@#ACTIVITY_CODE 2
12/23/2022 03:22:54 AM script INFO: SUCCESS!@#KODE 1!@#USER_ID 21!@#ACTIVITY_CODE 2
12/23/2022 03:22:54 AM script INFO: SUCCESS!@#KODE 1!@#USER_ID 21!@#ACTIVITY_CODE 3
12/23/2022 03:22:54 AM script INFO: SUCCESS!@#KODE 1!@#USER_ID 21!@#ACTIVITY_CODE 5
12/23/2022 03:22:54 AM script INFO: SUCCESS!@#KODE 1!@#USER_ID 21!@#ACTIVITY_CODE 5
12/23/2022 03:22:56 AM script INFO: SUCCESS!@#KODE 1!@#USER_ID 21!@#ACTIVITY_CODE 2
12/23/2022 03:22:56 AM script INFO: SUCCESS!@#KODE 1!@#USER_ID 21!@#ACTIVITY_CODE 5
12/23/2022 03:22:56 AM script INFO: SUCCESS!@#KODE 1!@#USER_ID 21!@#ACTIVITY_CODE 5
12/23/2022 03:22:59 AM script INFO: SUCCESS!@#KODE 1!@#USER_ID 21!@#ACTIVITY_CODE 3
12/23/2022 03:22:59 AM script INFO: SUCCESS!@#KODE 1!@#USER_ID 21!@#ACTIVITY_CODE 2
12/23/2022 03:22:59 AM script INFO: SUCCESS!@#KODE 1!@#USER_ID 21!@#ACTIVITY_CODE 5
12/23/2022 03:22:59 AM script INFO: SUCCESS!@#KODE 1!@#USER_ID 21!@#ACTIVITY_CODE 5
12/23/2022 03:23:02 AM script INFO: SUCCESS!@#KODE 1!@#USER_ID 21!@#ACTIVITY_CODE 5
12/23/2022 03:23:02 AM script INFO: SUCCESS!@#KODE 1!@#USER_ID 21!@#ACTIVITY_CODE 5
12/23/2022 03:23:04 AM script INFO: SUCCESS!@#KODE 1!@#USER_ID 21!@#ACTIVITY_CODE 2
12/23/2022 03:23:04 AM script INFO: SUCCESS!@#KODE 1!@#USER_ID 21!@#ACTIVITY_CODE 2
12/23/2022 03:23:04 AM script INFO: SUCCESS!@#KODE 1!@#USER_ID 21!@#ACTIVITY_CODE 2
12/23/2022 03:23:05 AM script INFO: SUCCESS!@#KODE 1!@#USER_ID 21!@#ACTIVITY_CODE 2
12/23/2022 03:23:05 AM script INFO: SUCCESS!@#KODE 1!@#USER_ID 21!@#ACTIVITY_CODE 3
12/23/2022 03:23:05 AM script INFO: SUCCESS!@#KODE 1!@#USER_ID 21!@#ACTIVITY_CODE 2
12/23/2022 03:23:05 AM script INFO: SUCCESS!@#KODE 1!@#USER_ID 21!@#ACTIVITY_CODE 1
12/23/2022 03:23:05 AM script INFO: SUCCESS!@#KODE 1!@#USER_ID 21!@#ACTIVITY_CODE 4
12/23/2022 03:23:05 AM script INFO: SUCCESS!@#KODE 1!@#USER_ID 21!@#ACTIVITY_CODE 3
12/23/2022 03:23:05 AM script INFO: SUCCESS!@#KODE 1!@#USER_ID 21!@#ACTIVITY_CODE 1
12/23/2022 03:23:05 AM script INFO: SUCCESS!@#KODE 1!@#USER_ID 21!@#ACTIVITY_CODE 1
12/23/2022 03:23:05 AM script INFO: SUCCESS!@#KODE 1!@#USER_ID 21!@#ACTIVITY_CODE 1
12/23/2022 03:23:05 AM script INFO: SUCCESS!@#KODE 1!@#USER_ID 21!@#ACTIVITY_CODE 2
12/23/2022 03:23:05 AM script INFO: SUCCESS!@#KODE 1!@#USER_ID 21!@#ACTIVITY_CODE 2
12/23/2022 03:23:05 AM script INFO: SUCCESS!@#KODE 1!@#USER_ID 21!@#ACTIVITY_CODE 3
12/23/2022 03:23:05 AM script INFO: SUCCESS!@#KODE 1!@#USER_ID 21!@#ACTIVITY_CODE 1
12/23/2022 03:23:06 AM script INFO: SUCCESS!@#KODE 1!@#USER_ID 21!@#ACTIVITY_CODE 2
12/23/2022 03:23:06 AM script INFO: SUCCESS!@#KODE 1!@#USER_ID 21!@#ACTIVITY_CODE 2
12/23/2022 03:23:06 AM script INFO: SUCCESS!@#KODE 1!@#USER_ID 21!@#ACTIVITY_CODE 3
12/23/2022 03:23:06 AM script INFO: SUCCESS!@#KODE 1!@#USER_ID 21!@#ACTIVITY_CODE 1
12/23/2022 03:23:06 AM script INFO: SUCCESS!@#KODE 1!@#USER_ID 21!@#ACTIVITY_CODE 2
12/23/2022 03:23:06 AM script INFO: SUCCESS!@#KODE 1!@#USER_ID 21!@#ACTIVITY_CODE 3
12/23/2022 03:23:06 AM script INFO: SUCCESS!@#KODE 1!@#USER_ID 21!@#ACTIVITY_CODE 2
12/23/2022 03:23:06 AM script INFO: SUCCESS!@#KODE 1!@#USER_ID 21!@#ACTIVITY_CODE 2
12/23/2022 03:23:06 AM script INFO: SUCCESS!@#KODE 1!@#USER_ID 21!@#ACTIVITY_CODE 1
12/23/2022 03:23:06 AM script INFO: SUCCESS!@#KODE 1!@#USER_ID 21!@#ACTIVITY_CODE 3
12/23/2022 03:23:07 AM script INFO: SUCCESS!@#KODE 1!@#USER_ID 21!@#ACTIVITY_CODE 2
12/23/2022 03:23:07 AM script INFO: SUCCESS!@#KODE 1!@#USER_ID 21!@#ACTIVITY_CODE 4
12/23/2022 03:23:07 AM script INFO: SUCCESS!@#KODE 1!@#USER_ID 21!@#ACTIVITY_CODE 3
12/23/2022 03:23:07 AM script INFO: SUCCESS!@#KODE 1!@#USER_ID 21!@#ACTIVITY_CODE 3
12/23/2022 03:23:07 AM script INFO: SUCCESS!@#KODE 1!@#USER_ID 21!@#ACTIVITY_CODE 3
12/23/2022 03:23:07 AM script INFO: SUCCESS!@#KODE 1!@#USER_ID 21!@#ACTIVITY_CODE 2
12/23/2022 03:23:07 AM script INFO: SUCCESS!@#KODE 1!@#USER_ID 21!@#ACTIVITY_CODE 1
12/23/2022 03:23:07 AM script INFO: SUCCESS!@#KODE 1!@#USER_ID 21!@#ACTIVITY_CODE 2
12/23/2022 03:23:07 AM script INFO: SUCCESS!@#KODE 1!@#USER_ID 21!@#ACTIVITY_CODE 1
12/23/2022 03:23:07 AM script INFO: SUCCESS!@#KODE 1!@#USER_ID 21!@#ACTIVITY_CODE 3
12/23/2022 03:23:07 AM script INFO: SUCCESS!@#KODE 1!@#USER_ID 21!@#ACTIVITY_CODE 3
12/23/2022 03:23:07 AM script INFO: SUCCESS!@#KODE 1!@#USER_ID 21!@#ACTIVITY_CODE 4
12/23/2022 03:23:07 AM script INFO: SUCCESS!@#KODE 1!@#USER_ID 21!@#ACTIVITY_CODE 1
12/23/2022 03:23:07 AM script INFO: SUCCESS!@#KODE 1!@#USER_ID 21!@#ACTIVITY_CODE 3
12/23/2022 03:23:07 AM script INFO: SUCCESS!@#KODE 1!@#USER_ID 21!@#ACTIVITY_CODE 2
12/23/2022 03:23:08 AM script INFO: SUCCESS!@#KODE 1!@#USER_ID 21!@#ACTIVITY_CODE 2
12/23/2022 03:23:08 AM script INFO: SUCCESS!@#KODE 1!@#USER_ID 21!@#ACTIVITY_CODE 3
12/23/2022 03:23:08 AM script INFO: SUCCESS!@#KODE 1!@#USER_ID 21!@#ACTIVITY_CODE 1
12/23/2022 03:23:08 AM script INFO: SUCCESS!@#KODE 1!@#USER_ID 21!@#ACTIVITY_CODE 2
12/23/2022 03:23:08 AM script INFO: SUCCESS!@#KODE 1!@#USER_ID 21!@#ACTIVITY_CODE 3
12/23/2022 03:23:08 AM script INFO: Duration: 33.776487588882446
12/23/2022 03:23:08 AM script INFO: mengakhiri-quiz
12/23/2022 03:23:09 AM script INFO: SUCCESS!@#KODE 1!@#USER_ID 21!@#ACTIVITY_CODE 5
12/23/2022 03:23:09 AM script INFO: berhasil-submit
