12/21/2022 01:36:43 PM script INFO: Prepared chrome options..
12/21/2022 01:36:44 PM script INFO: Initialized chrome browser..
12/21/2022 01:36:44 PM script INFO: mengakses-homepage
12/21/2022 01:37:21 PM script INFO: mengakses-login-page
12/21/2022 01:37:26 PM script INFO: mengakses-site-home
12/21/2022 01:37:45 PM script INFO: mengakses-site-course
12/21/2022 01:38:11 PM script INFO: mengakses-quiz
12/21/2022 01:38:12 PM script INFO: mengakses-start-quiz-page
12/21/2022 01:38:13 PM script INFO: memulai-quiz
12/21/2022 01:38:13 PM script INFO: SUCCESS!@#KODE 1!@#USER_ID 98!@#ACTIVITY_CODE 5
12/21/2022 01:38:24 PM script INFO: SUCCESS!@#KODE 1!@#USER_ID 98!@#ACTIVITY_CODE 1
12/21/2022 01:38:24 PM script INFO: SUCCESS!@#KODE 1!@#USER_ID 98!@#ACTIVITY_CODE 1
12/21/2022 01:38:24 PM script INFO: SUCCESS!@#KODE 1!@#USER_ID 98!@#ACTIVITY_CODE 3
12/21/2022 01:38:24 PM script INFO: SUCCESS!@#KODE 1!@#USER_ID 98!@#ACTIVITY_CODE 2
12/21/2022 01:38:24 PM script INFO: SUCCESS!@#KODE 1!@#USER_ID 98!@#ACTIVITY_CODE 2
12/21/2022 01:38:24 PM script INFO: SUCCESS!@#KODE 1!@#USER_ID 98!@#ACTIVITY_CODE 1
12/21/2022 01:38:24 PM script INFO: SUCCESS!@#KODE 1!@#USER_ID 98!@#ACTIVITY_CODE 4
12/21/2022 01:38:24 PM script INFO: SUCCESS!@#KODE 1!@#USER_ID 98!@#ACTIVITY_CODE 1
12/21/2022 01:38:24 PM script INFO: SUCCESS!@#KODE 1!@#USER_ID 98!@#ACTIVITY_CODE 2
12/21/2022 01:38:24 PM script INFO: SUCCESS!@#KODE 1!@#USER_ID 98!@#ACTIVITY_CODE 3
12/21/2022 01:38:24 PM script INFO: SUCCESS!@#KODE 1!@#USER_ID 98!@#ACTIVITY_CODE 5
12/21/2022 01:38:24 PM script INFO: SUCCESS!@#KODE 1!@#USER_ID 98!@#ACTIVITY_CODE 5
12/21/2022 01:38:27 PM script INFO: SUCCESS!@#KODE 1!@#USER_ID 98!@#ACTIVITY_CODE 5
12/21/2022 01:38:27 PM script INFO: SUCCESS!@#KODE 1!@#USER_ID 98!@#ACTIVITY_CODE 5
12/21/2022 01:38:29 PM script INFO: SUCCESS!@#KODE 1!@#USER_ID 98!@#ACTIVITY_CODE 5
12/21/2022 01:38:29 PM script INFO: SUCCESS!@#KODE 1!@#USER_ID 98!@#ACTIVITY_CODE 5
12/21/2022 01:38:32 PM script INFO: SUCCESS!@#KODE 1!@#USER_ID 98!@#ACTIVITY_CODE 3
12/21/2022 01:38:32 PM script INFO: SUCCESS!@#KODE 1!@#USER_ID 98!@#ACTIVITY_CODE 2
12/21/2022 01:38:32 PM script INFO: SUCCESS!@#KODE 1!@#USER_ID 98!@#ACTIVITY_CODE 2
12/21/2022 01:38:32 PM script INFO: SUCCESS!@#KODE 1!@#USER_ID 98!@#ACTIVITY_CODE 2
12/21/2022 01:38:33 PM script INFO: SUCCESS!@#KODE 1!@#USER_ID 98!@#ACTIVITY_CODE 1
12/21/2022 01:38:33 PM script INFO: SUCCESS!@#KODE 1!@#USER_ID 98!@#ACTIVITY_CODE 3
12/21/2022 01:38:33 PM script INFO: SUCCESS!@#KODE 1!@#USER_ID 98!@#ACTIVITY_CODE 5
12/21/2022 01:38:33 PM script INFO: SUCCESS!@#KODE 1!@#USER_ID 98!@#ACTIVITY_CODE 5
12/21/2022 01:38:35 PM script INFO: SUCCESS!@#KODE 1!@#USER_ID 98!@#ACTIVITY_CODE 1
12/21/2022 01:38:35 PM script INFO: SUCCESS!@#KODE 1!@#USER_ID 98!@#ACTIVITY_CODE 3
12/21/2022 01:38:35 PM script INFO: SUCCESS!@#KODE 1!@#USER_ID 98!@#ACTIVITY_CODE 1
12/21/2022 01:38:35 PM script INFO: SUCCESS!@#KODE 1!@#USER_ID 98!@#ACTIVITY_CODE 3
12/21/2022 01:38:35 PM script INFO: SUCCESS!@#KODE 1!@#USER_ID 98!@#ACTIVITY_CODE 3
12/21/2022 01:38:35 PM script INFO: SUCCESS!@#KODE 1!@#USER_ID 98!@#ACTIVITY_CODE 2
12/21/2022 01:38:36 PM script INFO: SUCCESS!@#KODE 1!@#USER_ID 98!@#ACTIVITY_CODE 3
12/21/2022 01:38:36 PM script INFO: SUCCESS!@#KODE 1!@#USER_ID 98!@#ACTIVITY_CODE 5
12/21/2022 01:38:36 PM script INFO: SUCCESS!@#KODE 1!@#USER_ID 98!@#ACTIVITY_CODE 5
12/21/2022 01:38:38 PM script INFO: SUCCESS!@#KODE 1!@#USER_ID 98!@#ACTIVITY_CODE 5
12/21/2022 01:38:38 PM script INFO: SUCCESS!@#KODE 1!@#USER_ID 98!@#ACTIVITY_CODE 5
12/21/2022 01:38:41 PM script INFO: SUCCESS!@#KODE 1!@#USER_ID 98!@#ACTIVITY_CODE 2
12/21/2022 01:38:41 PM script INFO: SUCCESS!@#KODE 1!@#USER_ID 98!@#ACTIVITY_CODE 1
12/21/2022 01:38:41 PM script INFO: SUCCESS!@#KODE 1!@#USER_ID 98!@#ACTIVITY_CODE 5
12/21/2022 01:38:41 PM script INFO: SUCCESS!@#KODE 1!@#USER_ID 98!@#ACTIVITY_CODE 5
12/21/2022 01:38:43 PM script INFO: SUCCESS!@#KODE 1!@#USER_ID 98!@#ACTIVITY_CODE 2
12/21/2022 01:38:43 PM script INFO: SUCCESS!@#KODE 1!@#USER_ID 98!@#ACTIVITY_CODE 3
12/21/2022 01:38:44 PM script INFO: SUCCESS!@#KODE 1!@#USER_ID 98!@#ACTIVITY_CODE 3
12/21/2022 01:38:44 PM script INFO: SUCCESS!@#KODE 1!@#USER_ID 98!@#ACTIVITY_CODE 5
12/21/2022 01:38:44 PM script INFO: SUCCESS!@#KODE 1!@#USER_ID 98!@#ACTIVITY_CODE 5
12/21/2022 01:38:46 PM script INFO: SUCCESS!@#KODE 1!@#USER_ID 98!@#ACTIVITY_CODE 2
12/21/2022 01:38:46 PM script INFO: SUCCESS!@#KODE 1!@#USER_ID 98!@#ACTIVITY_CODE 2
12/21/2022 01:38:46 PM script INFO: SUCCESS!@#KODE 1!@#USER_ID 98!@#ACTIVITY_CODE 1
12/21/2022 01:38:46 PM script INFO: SUCCESS!@#KODE 1!@#USER_ID 98!@#ACTIVITY_CODE 5
12/21/2022 01:38:46 PM script INFO: SUCCESS!@#KODE 1!@#USER_ID 98!@#ACTIVITY_CODE 5
12/21/2022 01:38:49 PM script INFO: SUCCESS!@#KODE 1!@#USER_ID 98!@#ACTIVITY_CODE 2
12/21/2022 01:38:49 PM script INFO: SUCCESS!@#KODE 1!@#USER_ID 98!@#ACTIVITY_CODE 1
12/21/2022 01:38:49 PM script INFO: SUCCESS!@#KODE 1!@#USER_ID 98!@#ACTIVITY_CODE 3
12/21/2022 01:38:49 PM script INFO: SUCCESS!@#KODE 1!@#USER_ID 98!@#ACTIVITY_CODE 3
12/21/2022 01:38:49 PM script INFO: SUCCESS!@#KODE 1!@#USER_ID 98!@#ACTIVITY_CODE 5
12/21/2022 01:38:49 PM script INFO: SUCCESS!@#KODE 1!@#USER_ID 98!@#ACTIVITY_CODE 5
12/21/2022 01:38:52 PM script INFO: SUCCESS!@#KODE 1!@#USER_ID 98!@#ACTIVITY_CODE 1
12/21/2022 01:38:52 PM script INFO: SUCCESS!@#KODE 1!@#USER_ID 98!@#ACTIVITY_CODE 2
12/21/2022 01:38:52 PM script INFO: SUCCESS!@#KODE 1!@#USER_ID 98!@#ACTIVITY_CODE 2
12/21/2022 01:38:52 PM script INFO: SUCCESS!@#KODE 1!@#USER_ID 98!@#ACTIVITY_CODE 5
12/21/2022 01:38:52 PM script INFO: SUCCESS!@#KODE 1!@#USER_ID 98!@#ACTIVITY_CODE 5
12/21/2022 01:38:55 PM script INFO: SUCCESS!@#KODE 1!@#USER_ID 98!@#ACTIVITY_CODE 1
12/21/2022 01:38:55 PM script INFO: SUCCESS!@#KODE 1!@#USER_ID 98!@#ACTIVITY_CODE 2
12/21/2022 01:38:55 PM script INFO: SUCCESS!@#KODE 1!@#USER_ID 98!@#ACTIVITY_CODE 3
12/21/2022 01:38:55 PM script INFO: SUCCESS!@#KODE 1!@#USER_ID 98!@#ACTIVITY_CODE 3
12/21/2022 01:38:55 PM script INFO: SUCCESS!@#KODE 1!@#USER_ID 98!@#ACTIVITY_CODE 1
12/21/2022 01:38:55 PM script INFO: SUCCESS!@#KODE 1!@#USER_ID 98!@#ACTIVITY_CODE 3
12/21/2022 01:38:55 PM script INFO: SUCCESS!@#KODE 1!@#USER_ID 98!@#ACTIVITY_CODE 2
12/21/2022 01:38:55 PM script INFO: SUCCESS!@#KODE 1!@#USER_ID 98!@#ACTIVITY_CODE 4
12/21/2022 01:38:56 PM script INFO: SUCCESS!@#KODE 1!@#USER_ID 98!@#ACTIVITY_CODE 2
12/21/2022 01:38:56 PM script INFO: SUCCESS!@#KODE 1!@#USER_ID 98!@#ACTIVITY_CODE 1
12/21/2022 01:38:56 PM script INFO: SUCCESS!@#KODE 1!@#USER_ID 98!@#ACTIVITY_CODE 2
12/21/2022 01:38:56 PM script INFO: SUCCESS!@#KODE 1!@#USER_ID 98!@#ACTIVITY_CODE 3
12/21/2022 01:38:56 PM script INFO: SUCCESS!@#KODE 1!@#USER_ID 98!@#ACTIVITY_CODE 1
12/21/2022 01:38:56 PM script INFO: SUCCESS!@#KODE 1!@#USER_ID 98!@#ACTIVITY_CODE 4
12/21/2022 01:38:56 PM script INFO: SUCCESS!@#KODE 1!@#USER_ID 98!@#ACTIVITY_CODE 3
12/21/2022 01:38:56 PM script INFO: SUCCESS!@#KODE 1!@#USER_ID 98!@#ACTIVITY_CODE 2
12/21/2022 01:38:56 PM script INFO: SUCCESS!@#KODE 1!@#USER_ID 98!@#ACTIVITY_CODE 3
12/21/2022 01:38:56 PM script INFO: SUCCESS!@#KODE 1!@#USER_ID 98!@#ACTIVITY_CODE 2
12/21/2022 01:38:57 PM script INFO: SUCCESS!@#KODE 1!@#USER_ID 98!@#ACTIVITY_CODE 4
12/21/2022 01:38:57 PM script INFO: SUCCESS!@#KODE 1!@#USER_ID 98!@#ACTIVITY_CODE 1
12/21/2022 01:38:57 PM script INFO: SUCCESS!@#KODE 1!@#USER_ID 98!@#ACTIVITY_CODE 2
12/21/2022 01:38:57 PM script INFO: SUCCESS!@#KODE 1!@#USER_ID 98!@#ACTIVITY_CODE 1
12/21/2022 01:38:57 PM script INFO: SUCCESS!@#KODE 1!@#USER_ID 98!@#ACTIVITY_CODE 3
12/21/2022 01:38:57 PM script INFO: SUCCESS!@#KODE 1!@#USER_ID 98!@#ACTIVITY_CODE 1
12/21/2022 01:38:57 PM script INFO: SUCCESS!@#KODE 1!@#USER_ID 98!@#ACTIVITY_CODE 1
12/21/2022 01:38:57 PM script INFO: SUCCESS!@#KODE 1!@#USER_ID 98!@#ACTIVITY_CODE 3
12/21/2022 01:38:57 PM script INFO: SUCCESS!@#KODE 1!@#USER_ID 98!@#ACTIVITY_CODE 1
12/21/2022 01:38:57 PM script INFO: SUCCESS!@#KODE 1!@#USER_ID 98!@#ACTIVITY_CODE 2
12/21/2022 01:38:57 PM script INFO: SUCCESS!@#KODE 1!@#USER_ID 98!@#ACTIVITY_CODE 4
12/21/2022 01:38:57 PM script INFO: SUCCESS!@#KODE 1!@#USER_ID 98!@#ACTIVITY_CODE 3
12/21/2022 01:38:58 PM script INFO: SUCCESS!@#KODE 1!@#USER_ID 98!@#ACTIVITY_CODE 2
12/21/2022 01:38:58 PM script INFO: SUCCESS!@#KODE 1!@#USER_ID 98!@#ACTIVITY_CODE 1
12/21/2022 01:38:58 PM script INFO: SUCCESS!@#KODE 1!@#USER_ID 98!@#ACTIVITY_CODE 3
12/21/2022 01:38:58 PM script INFO: SUCCESS!@#KODE 1!@#USER_ID 98!@#ACTIVITY_CODE 2
12/21/2022 01:38:58 PM script INFO: SUCCESS!@#KODE 1!@#USER_ID 98!@#ACTIVITY_CODE 1
12/21/2022 01:38:58 PM script INFO: SUCCESS!@#KODE 1!@#USER_ID 98!@#ACTIVITY_CODE 3
12/21/2022 01:38:58 PM script INFO: SUCCESS!@#KODE 1!@#USER_ID 98!@#ACTIVITY_CODE 1
12/21/2022 01:38:58 PM script INFO: SUCCESS!@#KODE 1!@#USER_ID 98!@#ACTIVITY_CODE 2
12/21/2022 01:38:58 PM script INFO: Duration: 34.82085943222046
12/21/2022 01:38:58 PM script INFO: mengakhiri-quiz
12/21/2022 01:38:59 PM script INFO: SUCCESS!@#KODE 1!@#USER_ID 98!@#ACTIVITY_CODE 5
12/21/2022 01:38:59 PM script INFO: berhasil-submit
12/21/2022 01:40:29 PM script ERROR: TIMEOUT EXCEPTION!@#KODE 0!@#LOCATION berhasil-submit
12/21/2022 01:40:29 PM main_worker ERROR: Message: None

