12/23/2022 07:11:46 AM script INFO: Prepared chrome options..
12/23/2022 07:11:48 AM script INFO: Initialized chrome browser..
12/23/2022 07:11:48 AM script INFO: mengakses-homepage
12/23/2022 07:12:34 AM script INFO: mengakses-login-page
12/23/2022 07:12:35 AM script INFO: mengakses-site-home
12/23/2022 07:12:52 AM script INFO: mengakses-site-course
12/23/2022 07:13:02 AM script INFO: mengakses-quiz
12/23/2022 07:13:06 AM script INFO: mengakses-start-quiz-page
12/23/2022 07:13:07 AM script INFO: memulai-quiz
12/23/2022 07:13:07 AM script INFO: SUCCESS!@#KODE 1!@#USER_ID 37!@#ACTIVITY_CODE 5
12/23/2022 07:13:17 AM script INFO: SUCCESS!@#KODE 1!@#USER_ID 37!@#ACTIVITY_CODE 3
12/23/2022 07:13:18 AM script INFO: SUCCESS!@#KODE 1!@#USER_ID 37!@#ACTIVITY_CODE 3
12/23/2022 07:13:18 AM script INFO: SUCCESS!@#KODE 1!@#USER_ID 37!@#ACTIVITY_CODE 3
12/23/2022 07:13:18 AM script INFO: SUCCESS!@#KODE 1!@#USER_ID 37!@#ACTIVITY_CODE 3
12/23/2022 07:13:18 AM script INFO: SUCCESS!@#KODE 1!@#USER_ID 37!@#ACTIVITY_CODE 1
12/23/2022 07:13:18 AM script INFO: SUCCESS!@#KODE 1!@#USER_ID 37!@#ACTIVITY_CODE 4
12/23/2022 07:13:18 AM script INFO: SUCCESS!@#KODE 1!@#USER_ID 37!@#ACTIVITY_CODE 3
12/23/2022 07:13:18 AM script INFO: SUCCESS!@#KODE 1!@#USER_ID 37!@#ACTIVITY_CODE 5
12/23/2022 07:13:18 AM script INFO: SUCCESS!@#KODE 1!@#USER_ID 37!@#ACTIVITY_CODE 5
12/23/2022 07:13:20 AM script INFO: SUCCESS!@#KODE 1!@#USER_ID 37!@#ACTIVITY_CODE 2
12/23/2022 07:13:21 AM script INFO: SUCCESS!@#KODE 1!@#USER_ID 37!@#ACTIVITY_CODE 2
12/23/2022 07:13:21 AM script INFO: SUCCESS!@#KODE 1!@#USER_ID 37!@#ACTIVITY_CODE 2
12/23/2022 07:13:21 AM script INFO: SUCCESS!@#KODE 1!@#USER_ID 37!@#ACTIVITY_CODE 1
12/23/2022 07:13:21 AM script INFO: SUCCESS!@#KODE 1!@#USER_ID 37!@#ACTIVITY_CODE 3
12/23/2022 07:13:21 AM script INFO: SUCCESS!@#KODE 1!@#USER_ID 37!@#ACTIVITY_CODE 2
12/23/2022 07:13:21 AM script INFO: SUCCESS!@#KODE 1!@#USER_ID 37!@#ACTIVITY_CODE 2
12/23/2022 07:13:21 AM script INFO: SUCCESS!@#KODE 1!@#USER_ID 37!@#ACTIVITY_CODE 3
12/23/2022 07:13:21 AM script INFO: SUCCESS!@#KODE 1!@#USER_ID 37!@#ACTIVITY_CODE 2
12/23/2022 07:13:21 AM script INFO: SUCCESS!@#KODE 1!@#USER_ID 37!@#ACTIVITY_CODE 1
12/23/2022 07:13:21 AM script INFO: SUCCESS!@#KODE 1!@#USER_ID 37!@#ACTIVITY_CODE 1
12/23/2022 07:13:21 AM script INFO: SUCCESS!@#KODE 1!@#USER_ID 37!@#ACTIVITY_CODE 1
12/23/2022 07:13:21 AM script INFO: SUCCESS!@#KODE 1!@#USER_ID 37!@#ACTIVITY_CODE 4
12/23/2022 07:13:22 AM script INFO: SUCCESS!@#KODE 1!@#USER_ID 37!@#ACTIVITY_CODE 2
12/23/2022 07:13:22 AM script INFO: SUCCESS!@#KODE 1!@#USER_ID 37!@#ACTIVITY_CODE 3
12/23/2022 07:13:22 AM script INFO: SUCCESS!@#KODE 1!@#USER_ID 37!@#ACTIVITY_CODE 1
12/23/2022 07:13:22 AM script INFO: SUCCESS!@#KODE 1!@#USER_ID 37!@#ACTIVITY_CODE 2
12/23/2022 07:13:22 AM script INFO: SUCCESS!@#KODE 1!@#USER_ID 37!@#ACTIVITY_CODE 2
12/23/2022 07:13:22 AM script INFO: SUCCESS!@#KODE 1!@#USER_ID 37!@#ACTIVITY_CODE 1
12/23/2022 07:13:22 AM script INFO: SUCCESS!@#KODE 1!@#USER_ID 37!@#ACTIVITY_CODE 1
12/23/2022 07:13:22 AM script INFO: SUCCESS!@#KODE 1!@#USER_ID 37!@#ACTIVITY_CODE 4
12/23/2022 07:13:22 AM script INFO: SUCCESS!@#KODE 1!@#USER_ID 37!@#ACTIVITY_CODE 5
12/23/2022 07:13:22 AM script INFO: SUCCESS!@#KODE 1!@#USER_ID 37!@#ACTIVITY_CODE 5
12/23/2022 07:13:25 AM script INFO: SUCCESS!@#KODE 1!@#USER_ID 37!@#ACTIVITY_CODE 2
12/23/2022 07:13:25 AM script INFO: SUCCESS!@#KODE 1!@#USER_ID 37!@#ACTIVITY_CODE 1
12/23/2022 07:13:25 AM script INFO: SUCCESS!@#KODE 1!@#USER_ID 37!@#ACTIVITY_CODE 4
12/23/2022 07:13:25 AM script INFO: SUCCESS!@#KODE 1!@#USER_ID 37!@#ACTIVITY_CODE 3
12/23/2022 07:13:25 AM script INFO: SUCCESS!@#KODE 1!@#USER_ID 37!@#ACTIVITY_CODE 3
12/23/2022 07:13:25 AM script INFO: SUCCESS!@#KODE 1!@#USER_ID 37!@#ACTIVITY_CODE 2
12/23/2022 07:13:25 AM script INFO: SUCCESS!@#KODE 1!@#USER_ID 37!@#ACTIVITY_CODE 2
12/23/2022 07:13:25 AM script INFO: SUCCESS!@#KODE 1!@#USER_ID 37!@#ACTIVITY_CODE 5
12/23/2022 07:13:25 AM script INFO: SUCCESS!@#KODE 1!@#USER_ID 37!@#ACTIVITY_CODE 5
12/23/2022 07:13:28 AM script INFO: SUCCESS!@#KODE 1!@#USER_ID 37!@#ACTIVITY_CODE 3
12/23/2022 07:13:28 AM script INFO: SUCCESS!@#KODE 1!@#USER_ID 37!@#ACTIVITY_CODE 5
12/23/2022 07:13:28 AM script INFO: SUCCESS!@#KODE 1!@#USER_ID 37!@#ACTIVITY_CODE 5
12/23/2022 07:13:30 AM script INFO: SUCCESS!@#KODE 1!@#USER_ID 37!@#ACTIVITY_CODE 5
12/23/2022 07:13:30 AM script INFO: SUCCESS!@#KODE 1!@#USER_ID 37!@#ACTIVITY_CODE 5
12/23/2022 07:13:33 AM script INFO: SUCCESS!@#KODE 1!@#USER_ID 37!@#ACTIVITY_CODE 2
12/23/2022 07:13:33 AM script INFO: SUCCESS!@#KODE 1!@#USER_ID 37!@#ACTIVITY_CODE 5
12/23/2022 07:13:33 AM script INFO: SUCCESS!@#KODE 1!@#USER_ID 37!@#ACTIVITY_CODE 5
12/23/2022 07:13:35 AM script INFO: SUCCESS!@#KODE 1!@#USER_ID 37!@#ACTIVITY_CODE 2
12/23/2022 07:13:35 AM script INFO: SUCCESS!@#KODE 1!@#USER_ID 37!@#ACTIVITY_CODE 3
12/23/2022 07:13:36 AM script INFO: SUCCESS!@#KODE 1!@#USER_ID 37!@#ACTIVITY_CODE 2
12/23/2022 07:13:36 AM script INFO: SUCCESS!@#KODE 1!@#USER_ID 37!@#ACTIVITY_CODE 3
12/23/2022 07:13:36 AM script INFO: SUCCESS!@#KODE 1!@#USER_ID 37!@#ACTIVITY_CODE 1
12/23/2022 07:13:36 AM script INFO: SUCCESS!@#KODE 1!@#USER_ID 37!@#ACTIVITY_CODE 5
12/23/2022 07:13:36 AM script INFO: SUCCESS!@#KODE 1!@#USER_ID 37!@#ACTIVITY_CODE 5
12/23/2022 07:13:38 AM script INFO: SUCCESS!@#KODE 1!@#USER_ID 37!@#ACTIVITY_CODE 5
12/23/2022 07:13:38 AM script INFO: SUCCESS!@#KODE 1!@#USER_ID 37!@#ACTIVITY_CODE 5
12/23/2022 07:13:41 AM script INFO: SUCCESS!@#KODE 1!@#USER_ID 37!@#ACTIVITY_CODE 1
12/23/2022 07:13:41 AM script INFO: SUCCESS!@#KODE 1!@#USER_ID 37!@#ACTIVITY_CODE 4
12/23/2022 07:13:41 AM script INFO: SUCCESS!@#KODE 1!@#USER_ID 37!@#ACTIVITY_CODE 5
12/23/2022 07:13:41 AM script INFO: SUCCESS!@#KODE 1!@#USER_ID 37!@#ACTIVITY_CODE 5
12/23/2022 07:13:43 AM script INFO: SUCCESS!@#KODE 1!@#USER_ID 37!@#ACTIVITY_CODE 5
12/23/2022 07:13:43 AM script INFO: SUCCESS!@#KODE 1!@#USER_ID 37!@#ACTIVITY_CODE 5
12/23/2022 07:13:46 AM script INFO: SUCCESS!@#KODE 1!@#USER_ID 37!@#ACTIVITY_CODE 1
12/23/2022 07:13:46 AM script INFO: SUCCESS!@#KODE 1!@#USER_ID 37!@#ACTIVITY_CODE 3
12/23/2022 07:13:46 AM script INFO: SUCCESS!@#KODE 1!@#USER_ID 37!@#ACTIVITY_CODE 5
12/23/2022 07:13:46 AM script INFO: SUCCESS!@#KODE 1!@#USER_ID 37!@#ACTIVITY_CODE 5
12/23/2022 07:13:49 AM script INFO: SUCCESS!@#KODE 1!@#USER_ID 37!@#ACTIVITY_CODE 2
12/23/2022 07:13:49 AM script INFO: SUCCESS!@#KODE 1!@#USER_ID 37!@#ACTIVITY_CODE 2
12/23/2022 07:13:49 AM script INFO: SUCCESS!@#KODE 1!@#USER_ID 37!@#ACTIVITY_CODE 4
12/23/2022 07:13:49 AM script INFO: SUCCESS!@#KODE 1!@#USER_ID 37!@#ACTIVITY_CODE 2
12/23/2022 07:13:49 AM script INFO: SUCCESS!@#KODE 1!@#USER_ID 37!@#ACTIVITY_CODE 1
12/23/2022 07:13:49 AM script INFO: SUCCESS!@#KODE 1!@#USER_ID 37!@#ACTIVITY_CODE 3
12/23/2022 07:13:49 AM script INFO: SUCCESS!@#KODE 1!@#USER_ID 37!@#ACTIVITY_CODE 3
12/23/2022 07:13:49 AM script INFO: SUCCESS!@#KODE 1!@#USER_ID 37!@#ACTIVITY_CODE 3
12/23/2022 07:13:49 AM script INFO: SUCCESS!@#KODE 1!@#USER_ID 37!@#ACTIVITY_CODE 3
12/23/2022 07:13:49 AM script INFO: SUCCESS!@#KODE 1!@#USER_ID 37!@#ACTIVITY_CODE 3
12/23/2022 07:13:49 AM script INFO: SUCCESS!@#KODE 1!@#USER_ID 37!@#ACTIVITY_CODE 1
12/23/2022 07:13:49 AM script INFO: SUCCESS!@#KODE 1!@#USER_ID 37!@#ACTIVITY_CODE 1
12/23/2022 07:13:49 AM script INFO: SUCCESS!@#KODE 1!@#USER_ID 37!@#ACTIVITY_CODE 1
12/23/2022 07:13:49 AM script INFO: SUCCESS!@#KODE 1!@#USER_ID 37!@#ACTIVITY_CODE 4
12/23/2022 07:13:49 AM script INFO: SUCCESS!@#KODE 1!@#USER_ID 37!@#ACTIVITY_CODE 1
12/23/2022 07:13:49 AM script INFO: SUCCESS!@#KODE 1!@#USER_ID 37!@#ACTIVITY_CODE 3
12/23/2022 07:13:49 AM script INFO: SUCCESS!@#KODE 1!@#USER_ID 37!@#ACTIVITY_CODE 4
12/23/2022 07:13:50 AM script INFO: SUCCESS!@#KODE 1!@#USER_ID 37!@#ACTIVITY_CODE 3
12/23/2022 07:13:50 AM script INFO: SUCCESS!@#KODE 1!@#USER_ID 37!@#ACTIVITY_CODE 2
12/23/2022 07:13:50 AM script INFO: SUCCESS!@#KODE 1!@#USER_ID 37!@#ACTIVITY_CODE 2
12/23/2022 07:13:50 AM script INFO: SUCCESS!@#KODE 1!@#USER_ID 37!@#ACTIVITY_CODE 1
12/23/2022 07:13:50 AM script INFO: SUCCESS!@#KODE 1!@#USER_ID 37!@#ACTIVITY_CODE 4
12/23/2022 07:13:50 AM script INFO: SUCCESS!@#KODE 1!@#USER_ID 37!@#ACTIVITY_CODE 1
12/23/2022 07:13:50 AM script INFO: SUCCESS!@#KODE 1!@#USER_ID 37!@#ACTIVITY_CODE 1
12/23/2022 07:13:50 AM script INFO: SUCCESS!@#KODE 1!@#USER_ID 37!@#ACTIVITY_CODE 1
12/23/2022 07:13:50 AM script INFO: SUCCESS!@#KODE 1!@#USER_ID 37!@#ACTIVITY_CODE 2
12/23/2022 07:13:50 AM script INFO: SUCCESS!@#KODE 1!@#USER_ID 37!@#ACTIVITY_CODE 2
12/23/2022 07:13:50 AM script INFO: SUCCESS!@#KODE 1!@#USER_ID 37!@#ACTIVITY_CODE 1
12/23/2022 07:13:50 AM script INFO: SUCCESS!@#KODE 1!@#USER_ID 37!@#ACTIVITY_CODE 1
12/23/2022 07:13:50 AM script INFO: SUCCESS!@#KODE 1!@#USER_ID 37!@#ACTIVITY_CODE 2
12/23/2022 07:13:50 AM script INFO: Duration: 32.96824383735657
12/23/2022 07:13:50 AM script INFO: mengakhiri-quiz
12/23/2022 07:13:51 AM script INFO: SUCCESS!@#KODE 1!@#USER_ID 37!@#ACTIVITY_CODE 5
12/23/2022 07:13:51 AM script INFO: berhasil-submit
