12/12/2022 01:32:05 AM script INFO: Prepared chrome options..
12/12/2022 01:32:07 AM script INFO: Initialized chrome browser..
12/12/2022 01:32:07 AM script INFO: mengakses-homepage
12/12/2022 01:32:58 AM script INFO: mengakses-login-page
12/12/2022 01:32:59 AM script INFO: mengakses-site-home
12/12/2022 01:33:15 AM script INFO: mengakses-site-course
12/12/2022 01:33:16 AM script INFO: mengakses-quiz
12/12/2022 01:33:17 AM script INFO: mengakses-start-quiz-page
12/12/2022 01:33:18 AM script INFO: memulai-quiz
12/12/2022 01:33:18 AM script INFO: SUCCESS!@#KODE 1!@#USER_ID 61!@#ACTIVITY_CODE 5
12/12/2022 01:33:29 AM script INFO: SUCCESS!@#KODE 1!@#USER_ID 61!@#ACTIVITY_CODE 2
12/12/2022 01:33:29 AM script INFO: SUCCESS!@#KODE 1!@#USER_ID 61!@#ACTIVITY_CODE 5
12/12/2022 01:33:29 AM script INFO: SUCCESS!@#KODE 1!@#USER_ID 61!@#ACTIVITY_CODE 5
12/12/2022 01:33:31 AM script INFO: SUCCESS!@#KODE 1!@#USER_ID 61!@#ACTIVITY_CODE 1
12/12/2022 01:33:32 AM script INFO: SUCCESS!@#KODE 1!@#USER_ID 61!@#ACTIVITY_CODE 3
12/12/2022 01:33:32 AM script INFO: SUCCESS!@#KODE 1!@#USER_ID 61!@#ACTIVITY_CODE 4
12/12/2022 01:33:32 AM script INFO: SUCCESS!@#KODE 1!@#USER_ID 61!@#ACTIVITY_CODE 2
12/12/2022 01:33:32 AM script INFO: SUCCESS!@#KODE 1!@#USER_ID 61!@#ACTIVITY_CODE 1
12/12/2022 01:33:32 AM script INFO: SUCCESS!@#KODE 1!@#USER_ID 61!@#ACTIVITY_CODE 1
12/12/2022 01:33:32 AM script INFO: SUCCESS!@#KODE 1!@#USER_ID 61!@#ACTIVITY_CODE 4
12/12/2022 01:33:32 AM script INFO: SUCCESS!@#KODE 1!@#USER_ID 61!@#ACTIVITY_CODE 3
12/12/2022 01:33:32 AM script INFO: SUCCESS!@#KODE 1!@#USER_ID 61!@#ACTIVITY_CODE 2
12/12/2022 01:33:32 AM script INFO: SUCCESS!@#KODE 1!@#USER_ID 61!@#ACTIVITY_CODE 3
12/12/2022 01:33:33 AM script INFO: SUCCESS!@#KODE 1!@#USER_ID 61!@#ACTIVITY_CODE 2
12/12/2022 01:33:33 AM script INFO: SUCCESS!@#KODE 1!@#USER_ID 61!@#ACTIVITY_CODE 5
12/12/2022 01:33:33 AM script INFO: SUCCESS!@#KODE 1!@#USER_ID 61!@#ACTIVITY_CODE 5
12/12/2022 01:33:35 AM script INFO: SUCCESS!@#KODE 1!@#USER_ID 61!@#ACTIVITY_CODE 3
12/12/2022 01:33:35 AM script INFO: SUCCESS!@#KODE 1!@#USER_ID 61!@#ACTIVITY_CODE 3
12/12/2022 01:33:35 AM script INFO: SUCCESS!@#KODE 1!@#USER_ID 61!@#ACTIVITY_CODE 5
12/12/2022 01:33:35 AM script INFO: SUCCESS!@#KODE 1!@#USER_ID 61!@#ACTIVITY_CODE 5
12/12/2022 01:33:38 AM script INFO: SUCCESS!@#KODE 1!@#USER_ID 61!@#ACTIVITY_CODE 5
12/12/2022 01:33:38 AM script INFO: SUCCESS!@#KODE 1!@#USER_ID 61!@#ACTIVITY_CODE 5
12/12/2022 01:33:40 AM script INFO: SUCCESS!@#KODE 1!@#USER_ID 61!@#ACTIVITY_CODE 5
12/12/2022 01:33:40 AM script INFO: SUCCESS!@#KODE 1!@#USER_ID 61!@#ACTIVITY_CODE 5
12/12/2022 01:33:43 AM script INFO: SUCCESS!@#KODE 1!@#USER_ID 61!@#ACTIVITY_CODE 3
12/12/2022 01:33:43 AM script INFO: SUCCESS!@#KODE 1!@#USER_ID 61!@#ACTIVITY_CODE 2
12/12/2022 01:33:44 AM script INFO: SUCCESS!@#KODE 1!@#USER_ID 61!@#ACTIVITY_CODE 1
12/12/2022 01:33:44 AM script INFO: SUCCESS!@#KODE 1!@#USER_ID 61!@#ACTIVITY_CODE 3
12/12/2022 01:33:44 AM script INFO: SUCCESS!@#KODE 1!@#USER_ID 61!@#ACTIVITY_CODE 5
12/12/2022 01:33:44 AM script INFO: SUCCESS!@#KODE 1!@#USER_ID 61!@#ACTIVITY_CODE 5
12/12/2022 01:33:46 AM script INFO: SUCCESS!@#KODE 1!@#USER_ID 61!@#ACTIVITY_CODE 5
12/12/2022 01:33:46 AM script INFO: SUCCESS!@#KODE 1!@#USER_ID 61!@#ACTIVITY_CODE 5
12/12/2022 01:33:49 AM script INFO: SUCCESS!@#KODE 1!@#USER_ID 61!@#ACTIVITY_CODE 3
12/12/2022 01:33:49 AM script INFO: SUCCESS!@#KODE 1!@#USER_ID 61!@#ACTIVITY_CODE 5
12/12/2022 01:33:49 AM script INFO: SUCCESS!@#KODE 1!@#USER_ID 61!@#ACTIVITY_CODE 5
12/12/2022 01:33:51 AM script INFO: SUCCESS!@#KODE 1!@#USER_ID 61!@#ACTIVITY_CODE 1
12/12/2022 01:33:51 AM script INFO: SUCCESS!@#KODE 1!@#USER_ID 61!@#ACTIVITY_CODE 5
12/12/2022 01:33:51 AM script INFO: SUCCESS!@#KODE 1!@#USER_ID 61!@#ACTIVITY_CODE 5
12/12/2022 01:33:54 AM script INFO: SUCCESS!@#KODE 1!@#USER_ID 61!@#ACTIVITY_CODE 5
12/12/2022 01:33:54 AM script INFO: SUCCESS!@#KODE 1!@#USER_ID 61!@#ACTIVITY_CODE 5
12/12/2022 01:33:57 AM script INFO: SUCCESS!@#KODE 1!@#USER_ID 61!@#ACTIVITY_CODE 2
12/12/2022 01:33:57 AM script INFO: SUCCESS!@#KODE 1!@#USER_ID 61!@#ACTIVITY_CODE 2
12/12/2022 01:33:57 AM script INFO: SUCCESS!@#KODE 1!@#USER_ID 61!@#ACTIVITY_CODE 1
12/12/2022 01:33:57 AM script INFO: SUCCESS!@#KODE 1!@#USER_ID 61!@#ACTIVITY_CODE 3
12/12/2022 01:33:58 AM script INFO: SUCCESS!@#KODE 1!@#USER_ID 61!@#ACTIVITY_CODE 2
12/12/2022 01:33:58 AM script INFO: SUCCESS!@#KODE 1!@#USER_ID 61!@#ACTIVITY_CODE 5
12/12/2022 01:33:58 AM script INFO: SUCCESS!@#KODE 1!@#USER_ID 61!@#ACTIVITY_CODE 5
12/12/2022 01:34:00 AM script INFO: SUCCESS!@#KODE 1!@#USER_ID 61!@#ACTIVITY_CODE 3
12/12/2022 01:34:00 AM script INFO: SUCCESS!@#KODE 1!@#USER_ID 61!@#ACTIVITY_CODE 5
12/12/2022 01:34:00 AM script INFO: SUCCESS!@#KODE 1!@#USER_ID 61!@#ACTIVITY_CODE 5
12/12/2022 01:34:03 AM script INFO: SUCCESS!@#KODE 1!@#USER_ID 61!@#ACTIVITY_CODE 1
12/12/2022 01:34:03 AM script INFO: SUCCESS!@#KODE 1!@#USER_ID 61!@#ACTIVITY_CODE 5
12/12/2022 01:34:03 AM script INFO: SUCCESS!@#KODE 1!@#USER_ID 61!@#ACTIVITY_CODE 5
12/12/2022 01:34:05 AM script INFO: SUCCESS!@#KODE 1!@#USER_ID 61!@#ACTIVITY_CODE 5
12/12/2022 01:34:05 AM script INFO: SUCCESS!@#KODE 1!@#USER_ID 61!@#ACTIVITY_CODE 5
12/12/2022 01:34:08 AM script INFO: SUCCESS!@#KODE 1!@#USER_ID 61!@#ACTIVITY_CODE 2
12/12/2022 01:34:08 AM script INFO: SUCCESS!@#KODE 1!@#USER_ID 61!@#ACTIVITY_CODE 1
12/12/2022 01:34:08 AM script INFO: SUCCESS!@#KODE 1!@#USER_ID 61!@#ACTIVITY_CODE 5
12/12/2022 01:34:08 AM script INFO: SUCCESS!@#KODE 1!@#USER_ID 61!@#ACTIVITY_CODE 5
12/12/2022 01:34:11 AM script INFO: SUCCESS!@#KODE 1!@#USER_ID 61!@#ACTIVITY_CODE 4
12/12/2022 01:34:11 AM script INFO: SUCCESS!@#KODE 1!@#USER_ID 61!@#ACTIVITY_CODE 1
12/12/2022 01:34:11 AM script INFO: SUCCESS!@#KODE 1!@#USER_ID 61!@#ACTIVITY_CODE 1
12/12/2022 01:34:11 AM script INFO: SUCCESS!@#KODE 1!@#USER_ID 61!@#ACTIVITY_CODE 5
12/12/2022 01:34:11 AM script INFO: SUCCESS!@#KODE 1!@#USER_ID 61!@#ACTIVITY_CODE 5
12/12/2022 01:34:13 AM script INFO: SUCCESS!@#KODE 1!@#USER_ID 61!@#ACTIVITY_CODE 3
12/12/2022 01:34:14 AM script INFO: SUCCESS!@#KODE 1!@#USER_ID 61!@#ACTIVITY_CODE 2
12/12/2022 01:34:14 AM script INFO: SUCCESS!@#KODE 1!@#USER_ID 61!@#ACTIVITY_CODE 2
12/12/2022 01:34:14 AM script INFO: SUCCESS!@#KODE 1!@#USER_ID 61!@#ACTIVITY_CODE 4
12/12/2022 01:34:14 AM script INFO: SUCCESS!@#KODE 1!@#USER_ID 61!@#ACTIVITY_CODE 2
12/12/2022 01:34:14 AM script INFO: SUCCESS!@#KODE 1!@#USER_ID 61!@#ACTIVITY_CODE 3
12/12/2022 01:34:14 AM script INFO: SUCCESS!@#KODE 1!@#USER_ID 61!@#ACTIVITY_CODE 1
12/12/2022 01:34:14 AM script INFO: SUCCESS!@#KODE 1!@#USER_ID 61!@#ACTIVITY_CODE 1
12/12/2022 01:34:14 AM script INFO: SUCCESS!@#KODE 1!@#USER_ID 61!@#ACTIVITY_CODE 1
12/12/2022 01:34:14 AM script INFO: SUCCESS!@#KODE 1!@#USER_ID 61!@#ACTIVITY_CODE 3
12/12/2022 01:34:14 AM script INFO: SUCCESS!@#KODE 1!@#USER_ID 61!@#ACTIVITY_CODE 3
12/12/2022 01:34:14 AM script INFO: SUCCESS!@#KODE 1!@#USER_ID 61!@#ACTIVITY_CODE 1
12/12/2022 01:34:14 AM script INFO: SUCCESS!@#KODE 1!@#USER_ID 61!@#ACTIVITY_CODE 2
12/12/2022 01:34:14 AM script INFO: SUCCESS!@#KODE 1!@#USER_ID 61!@#ACTIVITY_CODE 4
12/12/2022 01:34:14 AM script INFO: SUCCESS!@#KODE 1!@#USER_ID 61!@#ACTIVITY_CODE 1
12/12/2022 01:34:14 AM script INFO: SUCCESS!@#KODE 1!@#USER_ID 61!@#ACTIVITY_CODE 1
12/12/2022 01:34:14 AM script INFO: SUCCESS!@#KODE 1!@#USER_ID 61!@#ACTIVITY_CODE 1
12/12/2022 01:34:15 AM script INFO: SUCCESS!@#KODE 1!@#USER_ID 61!@#ACTIVITY_CODE 4
12/12/2022 01:34:15 AM script INFO: SUCCESS!@#KODE 1!@#USER_ID 61!@#ACTIVITY_CODE 2
12/12/2022 01:34:15 AM script INFO: SUCCESS!@#KODE 1!@#USER_ID 61!@#ACTIVITY_CODE 2
12/12/2022 01:34:15 AM script INFO: SUCCESS!@#KODE 1!@#USER_ID 61!@#ACTIVITY_CODE 2
12/12/2022 01:34:15 AM script INFO: SUCCESS!@#KODE 1!@#USER_ID 61!@#ACTIVITY_CODE 1
12/12/2022 01:34:15 AM script INFO: SUCCESS!@#KODE 1!@#USER_ID 61!@#ACTIVITY_CODE 1
12/12/2022 01:34:15 AM script INFO: SUCCESS!@#KODE 1!@#USER_ID 61!@#ACTIVITY_CODE 1
12/12/2022 01:34:15 AM script INFO: SUCCESS!@#KODE 1!@#USER_ID 61!@#ACTIVITY_CODE 1
12/12/2022 01:34:15 AM script INFO: SUCCESS!@#KODE 1!@#USER_ID 61!@#ACTIVITY_CODE 1
12/12/2022 01:34:15 AM script INFO: SUCCESS!@#KODE 1!@#USER_ID 61!@#ACTIVITY_CODE 1
12/12/2022 01:34:15 AM script INFO: SUCCESS!@#KODE 1!@#USER_ID 61!@#ACTIVITY_CODE 3
12/12/2022 01:34:15 AM script INFO: SUCCESS!@#KODE 1!@#USER_ID 61!@#ACTIVITY_CODE 3
12/12/2022 01:34:15 AM script INFO: SUCCESS!@#KODE 1!@#USER_ID 61!@#ACTIVITY_CODE 2
12/12/2022 01:34:15 AM script INFO: SUCCESS!@#KODE 1!@#USER_ID 61!@#ACTIVITY_CODE 2
12/12/2022 01:34:16 AM script INFO: SUCCESS!@#KODE 1!@#USER_ID 61!@#ACTIVITY_CODE 2
12/12/2022 01:34:16 AM script INFO: SUCCESS!@#KODE 1!@#USER_ID 61!@#ACTIVITY_CODE 2
12/12/2022 01:34:16 AM script INFO: SUCCESS!@#KODE 1!@#USER_ID 61!@#ACTIVITY_CODE 3
12/12/2022 01:34:16 AM script INFO: SUCCESS!@#KODE 1!@#USER_ID 61!@#ACTIVITY_CODE 2
12/12/2022 01:34:16 AM script INFO: SUCCESS!@#KODE 1!@#USER_ID 61!@#ACTIVITY_CODE 3
12/12/2022 01:34:16 AM script INFO: SUCCESS!@#KODE 1!@#USER_ID 61!@#ACTIVITY_CODE 1
12/12/2022 01:34:16 AM script INFO: SUCCESS!@#KODE 1!@#USER_ID 61!@#ACTIVITY_CODE 1
12/12/2022 01:34:16 AM script INFO: SUCCESS!@#KODE 1!@#USER_ID 61!@#ACTIVITY_CODE 2
12/12/2022 01:34:16 AM script INFO: SUCCESS!@#KODE 1!@#USER_ID 61!@#ACTIVITY_CODE 3
12/12/2022 01:34:16 AM script INFO: SUCCESS!@#KODE 1!@#USER_ID 61!@#ACTIVITY_CODE 4
12/12/2022 01:34:16 AM script INFO: SUCCESS!@#KODE 1!@#USER_ID 61!@#ACTIVITY_CODE 2
12/12/2022 01:34:16 AM script INFO: SUCCESS!@#KODE 1!@#USER_ID 61!@#ACTIVITY_CODE 3
12/12/2022 01:34:16 AM script INFO: SUCCESS!@#KODE 1!@#USER_ID 61!@#ACTIVITY_CODE 3
12/12/2022 01:34:17 AM script INFO: SUCCESS!@#KODE 1!@#USER_ID 61!@#ACTIVITY_CODE 3
12/12/2022 01:34:17 AM script INFO: SUCCESS!@#KODE 1!@#USER_ID 61!@#ACTIVITY_CODE 2
12/12/2022 01:34:17 AM script INFO: SUCCESS!@#KODE 1!@#USER_ID 61!@#ACTIVITY_CODE 3
12/12/2022 01:34:17 AM script INFO: SUCCESS!@#KODE 1!@#USER_ID 61!@#ACTIVITY_CODE 1
12/12/2022 01:34:17 AM script INFO: SUCCESS!@#KODE 1!@#USER_ID 61!@#ACTIVITY_CODE 2
12/12/2022 01:34:17 AM script INFO: SUCCESS!@#KODE 1!@#USER_ID 61!@#ACTIVITY_CODE 1
12/12/2022 01:34:17 AM script INFO: SUCCESS!@#KODE 1!@#USER_ID 61!@#ACTIVITY_CODE 3
12/12/2022 01:34:17 AM script INFO: SUCCESS!@#KODE 1!@#USER_ID 61!@#ACTIVITY_CODE 1
12/12/2022 01:34:17 AM script INFO: SUCCESS!@#KODE 1!@#USER_ID 61!@#ACTIVITY_CODE 2
12/12/2022 01:34:17 AM script INFO: SUCCESS!@#KODE 1!@#USER_ID 61!@#ACTIVITY_CODE 4
12/12/2022 01:34:17 AM script INFO: SUCCESS!@#KODE 1!@#USER_ID 61!@#ACTIVITY_CODE 3
12/12/2022 01:34:17 AM script INFO: SUCCESS!@#KODE 1!@#USER_ID 61!@#ACTIVITY_CODE 3
12/12/2022 01:34:17 AM script INFO: SUCCESS!@#KODE 1!@#USER_ID 61!@#ACTIVITY_CODE 2
12/12/2022 01:34:18 AM script INFO: SUCCESS!@#KODE 1!@#USER_ID 61!@#ACTIVITY_CODE 3
12/12/2022 01:34:18 AM script INFO: SUCCESS!@#KODE 1!@#USER_ID 61!@#ACTIVITY_CODE 2
12/12/2022 01:34:18 AM script INFO: SUCCESS!@#KODE 1!@#USER_ID 61!@#ACTIVITY_CODE 1
12/12/2022 01:34:18 AM script INFO: SUCCESS!@#KODE 1!@#USER_ID 61!@#ACTIVITY_CODE 2
12/12/2022 01:34:18 AM script INFO: SUCCESS!@#KODE 1!@#USER_ID 61!@#ACTIVITY_CODE 4
12/12/2022 01:34:18 AM script INFO: SUCCESS!@#KODE 1!@#USER_ID 61!@#ACTIVITY_CODE 2
12/12/2022 01:34:18 AM script INFO: SUCCESS!@#KODE 1!@#USER_ID 61!@#ACTIVITY_CODE 4
12/12/2022 01:34:18 AM script INFO: SUCCESS!@#KODE 1!@#USER_ID 61!@#ACTIVITY_CODE 3
12/12/2022 01:34:18 AM script INFO: SUCCESS!@#KODE 1!@#USER_ID 61!@#ACTIVITY_CODE 3
12/12/2022 01:34:18 AM script INFO: SUCCESS!@#KODE 1!@#USER_ID 61!@#ACTIVITY_CODE 1
12/12/2022 01:34:18 AM script INFO: SUCCESS!@#KODE 1!@#USER_ID 61!@#ACTIVITY_CODE 1
12/12/2022 01:34:18 AM script INFO: SUCCESS!@#KODE 1!@#USER_ID 61!@#ACTIVITY_CODE 3
12/12/2022 01:34:18 AM script INFO: SUCCESS!@#KODE 1!@#USER_ID 61!@#ACTIVITY_CODE 1
12/12/2022 01:34:18 AM script INFO: SUCCESS!@#KODE 1!@#USER_ID 61!@#ACTIVITY_CODE 2
12/12/2022 01:34:18 AM script INFO: SUCCESS!@#KODE 1!@#USER_ID 61!@#ACTIVITY_CODE 1
12/12/2022 01:34:19 AM script INFO: SUCCESS!@#KODE 1!@#USER_ID 61!@#ACTIVITY_CODE 2
12/12/2022 01:34:19 AM script INFO: SUCCESS!@#KODE 1!@#USER_ID 61!@#ACTIVITY_CODE 3
12/12/2022 01:34:19 AM script INFO: SUCCESS!@#KODE 1!@#USER_ID 61!@#ACTIVITY_CODE 2
12/12/2022 01:34:19 AM script INFO: SUCCESS!@#KODE 1!@#USER_ID 61!@#ACTIVITY_CODE 3
12/12/2022 01:34:19 AM script INFO: SUCCESS!@#KODE 1!@#USER_ID 61!@#ACTIVITY_CODE 1
12/12/2022 01:34:19 AM script INFO: SUCCESS!@#KODE 1!@#USER_ID 61!@#ACTIVITY_CODE 2
12/12/2022 01:34:19 AM script INFO: SUCCESS!@#KODE 1!@#USER_ID 61!@#ACTIVITY_CODE 3
12/12/2022 01:34:19 AM script INFO: SUCCESS!@#KODE 1!@#USER_ID 61!@#ACTIVITY_CODE 2
12/12/2022 01:34:19 AM script INFO: SUCCESS!@#KODE 1!@#USER_ID 61!@#ACTIVITY_CODE 1
12/12/2022 01:34:19 AM script INFO: SUCCESS!@#KODE 1!@#USER_ID 61!@#ACTIVITY_CODE 2
12/12/2022 01:34:19 AM script INFO: SUCCESS!@#KODE 1!@#USER_ID 61!@#ACTIVITY_CODE 2
12/12/2022 01:34:19 AM script INFO: SUCCESS!@#KODE 1!@#USER_ID 61!@#ACTIVITY_CODE 1
12/12/2022 01:34:20 AM script INFO: SUCCESS!@#KODE 1!@#USER_ID 61!@#ACTIVITY_CODE 2
12/12/2022 01:34:20 AM script INFO: SUCCESS!@#KODE 1!@#USER_ID 61!@#ACTIVITY_CODE 2
12/12/2022 01:34:20 AM script INFO: SUCCESS!@#KODE 1!@#USER_ID 61!@#ACTIVITY_CODE 1
12/12/2022 01:34:20 AM script INFO: SUCCESS!@#KODE 1!@#USER_ID 61!@#ACTIVITY_CODE 2
12/12/2022 01:34:20 AM script INFO: SUCCESS!@#KODE 1!@#USER_ID 61!@#ACTIVITY_CODE 4
12/12/2022 01:34:20 AM script INFO: SUCCESS!@#KODE 1!@#USER_ID 61!@#ACTIVITY_CODE 2
12/12/2022 01:34:20 AM script INFO: SUCCESS!@#KODE 1!@#USER_ID 61!@#ACTIVITY_CODE 1
12/12/2022 01:34:20 AM script INFO: SUCCESS!@#KODE 1!@#USER_ID 61!@#ACTIVITY_CODE 3
12/12/2022 01:34:20 AM script INFO: SUCCESS!@#KODE 1!@#USER_ID 61!@#ACTIVITY_CODE 4
12/12/2022 01:34:20 AM script INFO: SUCCESS!@#KODE 1!@#USER_ID 61!@#ACTIVITY_CODE 3
12/12/2022 01:34:20 AM script INFO: SUCCESS!@#KODE 1!@#USER_ID 61!@#ACTIVITY_CODE 2
12/12/2022 01:34:21 AM script INFO: SUCCESS!@#KODE 1!@#USER_ID 61!@#ACTIVITY_CODE 2
12/12/2022 01:34:21 AM script INFO: SUCCESS!@#KODE 1!@#USER_ID 61!@#ACTIVITY_CODE 1
12/12/2022 01:34:21 AM script INFO: SUCCESS!@#KODE 1!@#USER_ID 61!@#ACTIVITY_CODE 2
12/12/2022 01:34:21 AM script INFO: SUCCESS!@#KODE 1!@#USER_ID 61!@#ACTIVITY_CODE 1
12/12/2022 01:34:21 AM script INFO: SUCCESS!@#KODE 1!@#USER_ID 61!@#ACTIVITY_CODE 2
12/12/2022 01:34:21 AM script INFO: SUCCESS!@#KODE 1!@#USER_ID 61!@#ACTIVITY_CODE 2
12/12/2022 01:34:21 AM script INFO: SUCCESS!@#KODE 1!@#USER_ID 61!@#ACTIVITY_CODE 2
12/12/2022 01:34:21 AM script INFO: SUCCESS!@#KODE 1!@#USER_ID 61!@#ACTIVITY_CODE 1
12/12/2022 01:34:21 AM script INFO: SUCCESS!@#KODE 1!@#USER_ID 61!@#ACTIVITY_CODE 1
12/12/2022 01:34:21 AM script INFO: SUCCESS!@#KODE 1!@#USER_ID 61!@#ACTIVITY_CODE 2
12/12/2022 01:34:21 AM script INFO: SUCCESS!@#KODE 1!@#USER_ID 61!@#ACTIVITY_CODE 2
12/12/2022 01:34:21 AM script INFO: SUCCESS!@#KODE 1!@#USER_ID 61!@#ACTIVITY_CODE 3
12/12/2022 01:34:21 AM script INFO: SUCCESS!@#KODE 1!@#USER_ID 61!@#ACTIVITY_CODE 3
12/12/2022 01:34:22 AM script INFO: SUCCESS!@#KODE 1!@#USER_ID 61!@#ACTIVITY_CODE 4
12/12/2022 01:34:22 AM script INFO: SUCCESS!@#KODE 1!@#USER_ID 61!@#ACTIVITY_CODE 3
12/12/2022 01:34:22 AM script INFO: SUCCESS!@#KODE 1!@#USER_ID 61!@#ACTIVITY_CODE 2
12/12/2022 01:34:22 AM script INFO: SUCCESS!@#KODE 1!@#USER_ID 61!@#ACTIVITY_CODE 2
12/12/2022 01:34:22 AM script INFO: SUCCESS!@#KODE 1!@#USER_ID 61!@#ACTIVITY_CODE 3
12/12/2022 01:34:22 AM script INFO: SUCCESS!@#KODE 1!@#USER_ID 61!@#ACTIVITY_CODE 3
12/12/2022 01:34:22 AM script INFO: SUCCESS!@#KODE 1!@#USER_ID 61!@#ACTIVITY_CODE 1
12/12/2022 01:34:22 AM script INFO: SUCCESS!@#KODE 1!@#USER_ID 61!@#ACTIVITY_CODE 2
12/12/2022 01:34:22 AM script INFO: SUCCESS!@#KODE 1!@#USER_ID 61!@#ACTIVITY_CODE 3
12/12/2022 01:34:22 AM script INFO: SUCCESS!@#KODE 1!@#USER_ID 61!@#ACTIVITY_CODE 1
12/12/2022 01:34:22 AM script INFO: SUCCESS!@#KODE 1!@#USER_ID 61!@#ACTIVITY_CODE 1
12/12/2022 01:34:22 AM script INFO: SUCCESS!@#KODE 1!@#USER_ID 61!@#ACTIVITY_CODE 2
12/12/2022 01:34:22 AM script INFO: SUCCESS!@#KODE 1!@#USER_ID 61!@#ACTIVITY_CODE 4
12/12/2022 01:34:23 AM script INFO: SUCCESS!@#KODE 1!@#USER_ID 61!@#ACTIVITY_CODE 3
12/12/2022 01:34:23 AM script INFO: SUCCESS!@#KODE 1!@#USER_ID 61!@#ACTIVITY_CODE 1
12/12/2022 01:34:23 AM script INFO: SUCCESS!@#KODE 1!@#USER_ID 61!@#ACTIVITY_CODE 1
12/12/2022 01:34:23 AM script INFO: SUCCESS!@#KODE 1!@#USER_ID 61!@#ACTIVITY_CODE 4
12/12/2022 01:34:23 AM script INFO: SUCCESS!@#KODE 1!@#USER_ID 61!@#ACTIVITY_CODE 1
12/12/2022 01:34:23 AM script INFO: SUCCESS!@#KODE 1!@#USER_ID 61!@#ACTIVITY_CODE 4
12/12/2022 01:34:23 AM script INFO: SUCCESS!@#KODE 1!@#USER_ID 61!@#ACTIVITY_CODE 1
12/12/2022 01:34:23 AM script INFO: SUCCESS!@#KODE 1!@#USER_ID 61!@#ACTIVITY_CODE 3
12/12/2022 01:34:23 AM script INFO: SUCCESS!@#KODE 1!@#USER_ID 61!@#ACTIVITY_CODE 1
12/12/2022 01:34:23 AM script INFO: SUCCESS!@#KODE 1!@#USER_ID 61!@#ACTIVITY_CODE 4
12/12/2022 01:34:23 AM script INFO: SUCCESS!@#KODE 1!@#USER_ID 61!@#ACTIVITY_CODE 1
12/12/2022 01:34:23 AM script INFO: SUCCESS!@#KODE 1!@#USER_ID 61!@#ACTIVITY_CODE 3
12/12/2022 01:34:23 AM script INFO: SUCCESS!@#KODE 1!@#USER_ID 61!@#ACTIVITY_CODE 1
12/12/2022 01:34:23 AM script INFO: SUCCESS!@#KODE 1!@#USER_ID 61!@#ACTIVITY_CODE 2
12/12/2022 01:34:23 AM script INFO: SUCCESS!@#KODE 1!@#USER_ID 61!@#ACTIVITY_CODE 2
12/12/2022 01:34:23 AM script INFO: SUCCESS!@#KODE 1!@#USER_ID 61!@#ACTIVITY_CODE 1
12/12/2022 01:34:24 AM script INFO: SUCCESS!@#KODE 1!@#USER_ID 61!@#ACTIVITY_CODE 2
12/12/2022 01:34:24 AM script INFO: SUCCESS!@#KODE 1!@#USER_ID 61!@#ACTIVITY_CODE 3
12/12/2022 01:34:24 AM script INFO: SUCCESS!@#KODE 1!@#USER_ID 61!@#ACTIVITY_CODE 4
12/12/2022 01:34:24 AM script INFO: SUCCESS!@#KODE 1!@#USER_ID 61!@#ACTIVITY_CODE 1
12/12/2022 01:34:24 AM script INFO: SUCCESS!@#KODE 1!@#USER_ID 61!@#ACTIVITY_CODE 3
12/12/2022 01:34:24 AM script INFO: SUCCESS!@#KODE 1!@#USER_ID 61!@#ACTIVITY_CODE 4
12/12/2022 01:34:24 AM script INFO: SUCCESS!@#KODE 1!@#USER_ID 61!@#ACTIVITY_CODE 2
12/12/2022 01:34:24 AM script INFO: SUCCESS!@#KODE 1!@#USER_ID 61!@#ACTIVITY_CODE 1
12/12/2022 01:34:24 AM script INFO: SUCCESS!@#KODE 1!@#USER_ID 61!@#ACTIVITY_CODE 3
12/12/2022 01:34:24 AM script INFO: SUCCESS!@#KODE 1!@#USER_ID 61!@#ACTIVITY_CODE 3
12/12/2022 01:34:24 AM script INFO: SUCCESS!@#KODE 1!@#USER_ID 61!@#ACTIVITY_CODE 4
12/12/2022 01:34:24 AM script INFO: SUCCESS!@#KODE 1!@#USER_ID 61!@#ACTIVITY_CODE 3
12/12/2022 01:34:24 AM script INFO: SUCCESS!@#KODE 1!@#USER_ID 61!@#ACTIVITY_CODE 2
12/12/2022 01:34:24 AM script INFO: SUCCESS!@#KODE 1!@#USER_ID 61!@#ACTIVITY_CODE 2
12/12/2022 01:34:25 AM script INFO: SUCCESS!@#KODE 1!@#USER_ID 61!@#ACTIVITY_CODE 4
12/12/2022 01:34:25 AM script INFO: SUCCESS!@#KODE 1!@#USER_ID 61!@#ACTIVITY_CODE 3
12/12/2022 01:34:25 AM script INFO: SUCCESS!@#KODE 1!@#USER_ID 61!@#ACTIVITY_CODE 3
12/12/2022 01:34:25 AM script INFO: SUCCESS!@#KODE 1!@#USER_ID 61!@#ACTIVITY_CODE 1
12/12/2022 01:34:25 AM script INFO: SUCCESS!@#KODE 1!@#USER_ID 61!@#ACTIVITY_CODE 3
12/12/2022 01:34:25 AM script INFO: SUCCESS!@#KODE 1!@#USER_ID 61!@#ACTIVITY_CODE 1
12/12/2022 01:34:25 AM script INFO: SUCCESS!@#KODE 1!@#USER_ID 61!@#ACTIVITY_CODE 2
12/12/2022 01:34:25 AM script INFO: SUCCESS!@#KODE 1!@#USER_ID 61!@#ACTIVITY_CODE 3
12/12/2022 01:34:25 AM script INFO: SUCCESS!@#KODE 1!@#USER_ID 61!@#ACTIVITY_CODE 3
12/12/2022 01:34:25 AM script INFO: SUCCESS!@#KODE 1!@#USER_ID 61!@#ACTIVITY_CODE 3
12/12/2022 01:34:25 AM script INFO: SUCCESS!@#KODE 1!@#USER_ID 61!@#ACTIVITY_CODE 1
12/12/2022 01:34:25 AM script INFO: SUCCESS!@#KODE 1!@#USER_ID 61!@#ACTIVITY_CODE 2
12/12/2022 01:34:25 AM script INFO: SUCCESS!@#KODE 1!@#USER_ID 61!@#ACTIVITY_CODE 1
12/12/2022 01:34:25 AM script INFO: SUCCESS!@#KODE 1!@#USER_ID 61!@#ACTIVITY_CODE 4
12/12/2022 01:34:25 AM script INFO: SUCCESS!@#KODE 1!@#USER_ID 61!@#ACTIVITY_CODE 1
12/12/2022 01:34:25 AM script INFO: SUCCESS!@#KODE 1!@#USER_ID 61!@#ACTIVITY_CODE 2
12/12/2022 01:34:26 AM script INFO: SUCCESS!@#KODE 1!@#USER_ID 61!@#ACTIVITY_CODE 2
12/12/2022 01:34:26 AM script INFO: SUCCESS!@#KODE 1!@#USER_ID 61!@#ACTIVITY_CODE 3
12/12/2022 01:34:26 AM script INFO: SUCCESS!@#KODE 1!@#USER_ID 61!@#ACTIVITY_CODE 4
12/12/2022 01:34:26 AM script INFO: SUCCESS!@#KODE 1!@#USER_ID 61!@#ACTIVITY_CODE 3
12/12/2022 01:34:26 AM script INFO: SUCCESS!@#KODE 1!@#USER_ID 61!@#ACTIVITY_CODE 2
12/12/2022 01:34:26 AM script INFO: SUCCESS!@#KODE 1!@#USER_ID 61!@#ACTIVITY_CODE 1
12/12/2022 01:34:26 AM script INFO: SUCCESS!@#KODE 1!@#USER_ID 61!@#ACTIVITY_CODE 2
12/12/2022 01:34:26 AM script INFO: SUCCESS!@#KODE 1!@#USER_ID 61!@#ACTIVITY_CODE 2
12/12/2022 01:34:26 AM script INFO: SUCCESS!@#KODE 1!@#USER_ID 61!@#ACTIVITY_CODE 3
12/12/2022 01:34:26 AM script INFO: SUCCESS!@#KODE 1!@#USER_ID 61!@#ACTIVITY_CODE 2
12/12/2022 01:34:26 AM script INFO: SUCCESS!@#KODE 1!@#USER_ID 61!@#ACTIVITY_CODE 3
12/12/2022 01:34:26 AM script INFO: SUCCESS!@#KODE 1!@#USER_ID 61!@#ACTIVITY_CODE 1
12/12/2022 01:34:26 AM script INFO: SUCCESS!@#KODE 1!@#USER_ID 61!@#ACTIVITY_CODE 4
12/12/2022 01:34:27 AM script INFO: SUCCESS!@#KODE 1!@#USER_ID 61!@#ACTIVITY_CODE 3
12/12/2022 01:34:27 AM script INFO: SUCCESS!@#KODE 1!@#USER_ID 61!@#ACTIVITY_CODE 2
12/12/2022 01:34:27 AM script INFO: SUCCESS!@#KODE 1!@#USER_ID 61!@#ACTIVITY_CODE 3
12/12/2022 01:34:27 AM script INFO: SUCCESS!@#KODE 1!@#USER_ID 61!@#ACTIVITY_CODE 1
12/12/2022 01:34:27 AM script INFO: Duration: 58.057127475738525
12/12/2022 01:34:27 AM script INFO: mengakhiri-quiz
12/12/2022 01:34:28 AM script INFO: SUCCESS!@#KODE 1!@#USER_ID 61!@#ACTIVITY_CODE 5
12/12/2022 01:34:28 AM script INFO: berhasil-submit
