12/21/2022 01:59:03 PM script INFO: Prepared chrome options..
12/21/2022 01:59:04 PM script INFO: Initialized chrome browser..
12/21/2022 01:59:04 PM script INFO: mengakses-homepage
12/21/2022 01:59:25 PM script INFO: mengakses-login-page
12/21/2022 01:59:30 PM script INFO: mengakses-site-home
12/21/2022 01:59:33 PM script INFO: mengakses-site-course
12/21/2022 01:59:54 PM script INFO: mengakses-quiz
12/21/2022 02:00:11 PM script INFO: mengakses-start-quiz-page
12/21/2022 02:00:36 PM script INFO: memulai-quiz
12/21/2022 02:00:36 PM script INFO: SUCCESS!@#KODE 1!@#USER_ID 48!@#ACTIVITY_CODE 5
12/21/2022 02:00:47 PM script INFO: SUCCESS!@#KODE 1!@#USER_ID 48!@#ACTIVITY_CODE 5
12/21/2022 02:00:47 PM script INFO: SUCCESS!@#KODE 1!@#USER_ID 48!@#ACTIVITY_CODE 5
12/21/2022 02:00:49 PM script INFO: SUCCESS!@#KODE 1!@#USER_ID 48!@#ACTIVITY_CODE 3
12/21/2022 02:00:50 PM script INFO: SUCCESS!@#KODE 1!@#USER_ID 48!@#ACTIVITY_CODE 1
12/21/2022 02:00:50 PM script INFO: SUCCESS!@#KODE 1!@#USER_ID 48!@#ACTIVITY_CODE 5
12/21/2022 02:00:50 PM script INFO: SUCCESS!@#KODE 1!@#USER_ID 48!@#ACTIVITY_CODE 5
12/21/2022 02:00:52 PM script INFO: SUCCESS!@#KODE 1!@#USER_ID 48!@#ACTIVITY_CODE 3
12/21/2022 02:00:52 PM script INFO: SUCCESS!@#KODE 1!@#USER_ID 48!@#ACTIVITY_CODE 3
12/21/2022 02:00:52 PM script INFO: SUCCESS!@#KODE 1!@#USER_ID 48!@#ACTIVITY_CODE 1
12/21/2022 02:00:52 PM script INFO: SUCCESS!@#KODE 1!@#USER_ID 48!@#ACTIVITY_CODE 1
12/21/2022 02:00:52 PM script INFO: SUCCESS!@#KODE 1!@#USER_ID 48!@#ACTIVITY_CODE 1
12/21/2022 02:00:52 PM script INFO: SUCCESS!@#KODE 1!@#USER_ID 48!@#ACTIVITY_CODE 3
12/21/2022 02:00:52 PM script INFO: SUCCESS!@#KODE 1!@#USER_ID 48!@#ACTIVITY_CODE 1
12/21/2022 02:00:53 PM script INFO: SUCCESS!@#KODE 1!@#USER_ID 48!@#ACTIVITY_CODE 3
12/21/2022 02:00:53 PM script INFO: SUCCESS!@#KODE 1!@#USER_ID 48!@#ACTIVITY_CODE 4
12/21/2022 02:00:53 PM script INFO: SUCCESS!@#KODE 1!@#USER_ID 48!@#ACTIVITY_CODE 5
12/21/2022 02:00:53 PM script INFO: SUCCESS!@#KODE 1!@#USER_ID 48!@#ACTIVITY_CODE 5
12/21/2022 02:00:55 PM script INFO: SUCCESS!@#KODE 1!@#USER_ID 48!@#ACTIVITY_CODE 5
12/21/2022 02:00:55 PM script INFO: SUCCESS!@#KODE 1!@#USER_ID 48!@#ACTIVITY_CODE 5
12/21/2022 02:00:58 PM script INFO: SUCCESS!@#KODE 1!@#USER_ID 48!@#ACTIVITY_CODE 3
12/21/2022 02:00:58 PM script INFO: SUCCESS!@#KODE 1!@#USER_ID 48!@#ACTIVITY_CODE 2
12/21/2022 02:00:58 PM script INFO: SUCCESS!@#KODE 1!@#USER_ID 48!@#ACTIVITY_CODE 5
12/21/2022 02:00:58 PM script INFO: SUCCESS!@#KODE 1!@#USER_ID 48!@#ACTIVITY_CODE 5
12/21/2022 02:01:00 PM script INFO: SUCCESS!@#KODE 1!@#USER_ID 48!@#ACTIVITY_CODE 1
12/21/2022 02:01:01 PM script INFO: SUCCESS!@#KODE 1!@#USER_ID 48!@#ACTIVITY_CODE 2
12/21/2022 02:01:01 PM script INFO: SUCCESS!@#KODE 1!@#USER_ID 48!@#ACTIVITY_CODE 5
12/21/2022 02:01:01 PM script INFO: SUCCESS!@#KODE 1!@#USER_ID 48!@#ACTIVITY_CODE 5
12/21/2022 02:01:03 PM script INFO: SUCCESS!@#KODE 1!@#USER_ID 48!@#ACTIVITY_CODE 1
12/21/2022 02:01:03 PM script INFO: SUCCESS!@#KODE 1!@#USER_ID 48!@#ACTIVITY_CODE 3
12/21/2022 02:01:03 PM script INFO: SUCCESS!@#KODE 1!@#USER_ID 48!@#ACTIVITY_CODE 3
12/21/2022 02:01:03 PM script INFO: SUCCESS!@#KODE 1!@#USER_ID 48!@#ACTIVITY_CODE 4
12/21/2022 02:01:04 PM script INFO: SUCCESS!@#KODE 1!@#USER_ID 48!@#ACTIVITY_CODE 2
12/21/2022 02:01:04 PM script INFO: SUCCESS!@#KODE 1!@#USER_ID 48!@#ACTIVITY_CODE 5
12/21/2022 02:01:04 PM script INFO: SUCCESS!@#KODE 1!@#USER_ID 48!@#ACTIVITY_CODE 5
12/21/2022 02:01:06 PM script INFO: SUCCESS!@#KODE 1!@#USER_ID 48!@#ACTIVITY_CODE 1
12/21/2022 02:01:06 PM script INFO: SUCCESS!@#KODE 1!@#USER_ID 48!@#ACTIVITY_CODE 1
12/21/2022 02:01:06 PM script INFO: SUCCESS!@#KODE 1!@#USER_ID 48!@#ACTIVITY_CODE 4
12/21/2022 02:01:06 PM script INFO: SUCCESS!@#KODE 1!@#USER_ID 48!@#ACTIVITY_CODE 1
12/21/2022 02:01:07 PM script INFO: SUCCESS!@#KODE 1!@#USER_ID 48!@#ACTIVITY_CODE 2
12/21/2022 02:01:07 PM script INFO: SUCCESS!@#KODE 1!@#USER_ID 48!@#ACTIVITY_CODE 1
12/21/2022 02:01:07 PM script INFO: SUCCESS!@#KODE 1!@#USER_ID 48!@#ACTIVITY_CODE 4
12/21/2022 02:01:07 PM script INFO: SUCCESS!@#KODE 1!@#USER_ID 48!@#ACTIVITY_CODE 2
12/21/2022 02:01:07 PM script INFO: SUCCESS!@#KODE 1!@#USER_ID 48!@#ACTIVITY_CODE 1
12/21/2022 02:01:07 PM script INFO: SUCCESS!@#KODE 1!@#USER_ID 48!@#ACTIVITY_CODE 2
12/21/2022 02:01:07 PM script INFO: SUCCESS!@#KODE 1!@#USER_ID 48!@#ACTIVITY_CODE 3
12/21/2022 02:01:07 PM script INFO: SUCCESS!@#KODE 1!@#USER_ID 48!@#ACTIVITY_CODE 2
12/21/2022 02:01:07 PM script INFO: SUCCESS!@#KODE 1!@#USER_ID 48!@#ACTIVITY_CODE 1
12/21/2022 02:01:07 PM script INFO: SUCCESS!@#KODE 1!@#USER_ID 48!@#ACTIVITY_CODE 2
12/21/2022 02:01:07 PM script INFO: SUCCESS!@#KODE 1!@#USER_ID 48!@#ACTIVITY_CODE 3
12/21/2022 02:01:08 PM script INFO: SUCCESS!@#KODE 1!@#USER_ID 48!@#ACTIVITY_CODE 2
12/21/2022 02:01:08 PM script INFO: SUCCESS!@#KODE 1!@#USER_ID 48!@#ACTIVITY_CODE 1
12/21/2022 02:01:08 PM script INFO: SUCCESS!@#KODE 1!@#USER_ID 48!@#ACTIVITY_CODE 2
12/21/2022 02:01:08 PM script INFO: SUCCESS!@#KODE 1!@#USER_ID 48!@#ACTIVITY_CODE 5
12/21/2022 02:01:08 PM script INFO: SUCCESS!@#KODE 1!@#USER_ID 48!@#ACTIVITY_CODE 5
12/21/2022 02:01:10 PM script INFO: SUCCESS!@#KODE 1!@#USER_ID 48!@#ACTIVITY_CODE 5
12/21/2022 02:01:10 PM script INFO: SUCCESS!@#KODE 1!@#USER_ID 48!@#ACTIVITY_CODE 5
12/21/2022 02:01:13 PM script INFO: SUCCESS!@#KODE 1!@#USER_ID 48!@#ACTIVITY_CODE 3
12/21/2022 02:01:13 PM script INFO: SUCCESS!@#KODE 1!@#USER_ID 48!@#ACTIVITY_CODE 3
12/21/2022 02:01:13 PM script INFO: SUCCESS!@#KODE 1!@#USER_ID 48!@#ACTIVITY_CODE 5
12/21/2022 02:01:13 PM script INFO: SUCCESS!@#KODE 1!@#USER_ID 48!@#ACTIVITY_CODE 5
12/21/2022 02:01:16 PM script INFO: SUCCESS!@#KODE 1!@#USER_ID 48!@#ACTIVITY_CODE 5
12/21/2022 02:01:16 PM script INFO: SUCCESS!@#KODE 1!@#USER_ID 48!@#ACTIVITY_CODE 5
12/21/2022 02:01:18 PM script INFO: SUCCESS!@#KODE 1!@#USER_ID 48!@#ACTIVITY_CODE 2
12/21/2022 02:01:18 PM script INFO: SUCCESS!@#KODE 1!@#USER_ID 48!@#ACTIVITY_CODE 3
12/21/2022 02:01:18 PM script INFO: SUCCESS!@#KODE 1!@#USER_ID 48!@#ACTIVITY_CODE 3
12/21/2022 02:01:19 PM script INFO: SUCCESS!@#KODE 1!@#USER_ID 48!@#ACTIVITY_CODE 2
12/21/2022 02:01:19 PM script INFO: SUCCESS!@#KODE 1!@#USER_ID 48!@#ACTIVITY_CODE 5
12/21/2022 02:01:19 PM script INFO: SUCCESS!@#KODE 1!@#USER_ID 48!@#ACTIVITY_CODE 5
12/21/2022 02:01:21 PM script INFO: SUCCESS!@#KODE 1!@#USER_ID 48!@#ACTIVITY_CODE 1
12/21/2022 02:01:21 PM script INFO: SUCCESS!@#KODE 1!@#USER_ID 48!@#ACTIVITY_CODE 1
12/21/2022 02:01:21 PM script INFO: SUCCESS!@#KODE 1!@#USER_ID 48!@#ACTIVITY_CODE 3
12/21/2022 02:01:21 PM script INFO: SUCCESS!@#KODE 1!@#USER_ID 48!@#ACTIVITY_CODE 3
12/21/2022 02:01:21 PM script INFO: SUCCESS!@#KODE 1!@#USER_ID 48!@#ACTIVITY_CODE 5
12/21/2022 02:01:21 PM script INFO: SUCCESS!@#KODE 1!@#USER_ID 48!@#ACTIVITY_CODE 5
12/21/2022 02:01:24 PM script INFO: SUCCESS!@#KODE 1!@#USER_ID 48!@#ACTIVITY_CODE 1
12/21/2022 02:01:24 PM script INFO: SUCCESS!@#KODE 1!@#USER_ID 48!@#ACTIVITY_CODE 3
12/21/2022 02:01:24 PM script INFO: SUCCESS!@#KODE 1!@#USER_ID 48!@#ACTIVITY_CODE 3
12/21/2022 02:01:24 PM script INFO: SUCCESS!@#KODE 1!@#USER_ID 48!@#ACTIVITY_CODE 5
12/21/2022 02:01:24 PM script INFO: SUCCESS!@#KODE 1!@#USER_ID 48!@#ACTIVITY_CODE 5
12/21/2022 02:01:27 PM script INFO: SUCCESS!@#KODE 1!@#USER_ID 48!@#ACTIVITY_CODE 3
12/21/2022 02:01:27 PM script INFO: SUCCESS!@#KODE 1!@#USER_ID 48!@#ACTIVITY_CODE 1
12/21/2022 02:01:27 PM script INFO: SUCCESS!@#KODE 1!@#USER_ID 48!@#ACTIVITY_CODE 1
12/21/2022 02:01:27 PM script INFO: SUCCESS!@#KODE 1!@#USER_ID 48!@#ACTIVITY_CODE 3
12/21/2022 02:01:27 PM script INFO: SUCCESS!@#KODE 1!@#USER_ID 48!@#ACTIVITY_CODE 5
12/21/2022 02:01:27 PM script INFO: SUCCESS!@#KODE 1!@#USER_ID 48!@#ACTIVITY_CODE 5
12/21/2022 02:01:29 PM script INFO: SUCCESS!@#KODE 1!@#USER_ID 48!@#ACTIVITY_CODE 2
12/21/2022 02:01:29 PM script INFO: SUCCESS!@#KODE 1!@#USER_ID 48!@#ACTIVITY_CODE 1
12/21/2022 02:01:30 PM script INFO: SUCCESS!@#KODE 1!@#USER_ID 48!@#ACTIVITY_CODE 4
12/21/2022 02:01:30 PM script INFO: SUCCESS!@#KODE 1!@#USER_ID 48!@#ACTIVITY_CODE 1
12/21/2022 02:01:30 PM script INFO: SUCCESS!@#KODE 1!@#USER_ID 48!@#ACTIVITY_CODE 1
12/21/2022 02:01:30 PM script INFO: SUCCESS!@#KODE 1!@#USER_ID 48!@#ACTIVITY_CODE 2
12/21/2022 02:01:30 PM script INFO: SUCCESS!@#KODE 1!@#USER_ID 48!@#ACTIVITY_CODE 5
12/21/2022 02:01:30 PM script INFO: SUCCESS!@#KODE 1!@#USER_ID 48!@#ACTIVITY_CODE 5
12/21/2022 02:01:32 PM script INFO: SUCCESS!@#KODE 1!@#USER_ID 48!@#ACTIVITY_CODE 1
12/21/2022 02:01:33 PM script INFO: SUCCESS!@#KODE 1!@#USER_ID 48!@#ACTIVITY_CODE 2
12/21/2022 02:01:33 PM script INFO: SUCCESS!@#KODE 1!@#USER_ID 48!@#ACTIVITY_CODE 5
12/21/2022 02:01:33 PM script INFO: SUCCESS!@#KODE 1!@#USER_ID 48!@#ACTIVITY_CODE 5
12/21/2022 02:01:35 PM script INFO: SUCCESS!@#KODE 1!@#USER_ID 48!@#ACTIVITY_CODE 5
12/21/2022 02:01:35 PM script INFO: SUCCESS!@#KODE 1!@#USER_ID 48!@#ACTIVITY_CODE 5
12/21/2022 02:01:38 PM script INFO: SUCCESS!@#KODE 1!@#USER_ID 48!@#ACTIVITY_CODE 1
12/21/2022 02:01:38 PM script INFO: SUCCESS!@#KODE 1!@#USER_ID 48!@#ACTIVITY_CODE 5
12/21/2022 02:01:38 PM script INFO: SUCCESS!@#KODE 1!@#USER_ID 48!@#ACTIVITY_CODE 5
12/21/2022 02:01:40 PM script INFO: SUCCESS!@#KODE 1!@#USER_ID 48!@#ACTIVITY_CODE 2
12/21/2022 02:01:40 PM script INFO: SUCCESS!@#KODE 1!@#USER_ID 48!@#ACTIVITY_CODE 5
12/21/2022 02:01:40 PM script INFO: SUCCESS!@#KODE 1!@#USER_ID 48!@#ACTIVITY_CODE 5
12/21/2022 02:01:43 PM script INFO: SUCCESS!@#KODE 1!@#USER_ID 48!@#ACTIVITY_CODE 3
12/21/2022 02:01:43 PM script INFO: SUCCESS!@#KODE 1!@#USER_ID 48!@#ACTIVITY_CODE 3
12/21/2022 02:01:43 PM script INFO: SUCCESS!@#KODE 1!@#USER_ID 48!@#ACTIVITY_CODE 1
12/21/2022 02:01:43 PM script INFO: SUCCESS!@#KODE 1!@#USER_ID 48!@#ACTIVITY_CODE 5
12/21/2022 02:01:43 PM script INFO: SUCCESS!@#KODE 1!@#USER_ID 48!@#ACTIVITY_CODE 5
12/21/2022 02:01:46 PM script INFO: SUCCESS!@#KODE 1!@#USER_ID 48!@#ACTIVITY_CODE 4
12/21/2022 02:01:46 PM script INFO: SUCCESS!@#KODE 1!@#USER_ID 48!@#ACTIVITY_CODE 1
12/21/2022 02:01:46 PM script INFO: SUCCESS!@#KODE 1!@#USER_ID 48!@#ACTIVITY_CODE 1
12/21/2022 02:01:46 PM script INFO: SUCCESS!@#KODE 1!@#USER_ID 48!@#ACTIVITY_CODE 1
12/21/2022 02:01:46 PM script INFO: SUCCESS!@#KODE 1!@#USER_ID 48!@#ACTIVITY_CODE 1
12/21/2022 02:01:46 PM script INFO: SUCCESS!@#KODE 1!@#USER_ID 48!@#ACTIVITY_CODE 4
12/21/2022 02:01:47 PM script INFO: SUCCESS!@#KODE 1!@#USER_ID 48!@#ACTIVITY_CODE 1
12/21/2022 02:01:47 PM script INFO: SUCCESS!@#KODE 1!@#USER_ID 48!@#ACTIVITY_CODE 4
12/21/2022 02:01:47 PM script INFO: SUCCESS!@#KODE 1!@#USER_ID 48!@#ACTIVITY_CODE 3
12/21/2022 02:01:47 PM script INFO: SUCCESS!@#KODE 1!@#USER_ID 48!@#ACTIVITY_CODE 3
12/21/2022 02:01:47 PM script INFO: SUCCESS!@#KODE 1!@#USER_ID 48!@#ACTIVITY_CODE 1
12/21/2022 02:01:47 PM script INFO: SUCCESS!@#KODE 1!@#USER_ID 48!@#ACTIVITY_CODE 2
12/21/2022 02:01:48 PM script INFO: SUCCESS!@#KODE 1!@#USER_ID 48!@#ACTIVITY_CODE 2
12/21/2022 02:01:48 PM script INFO: SUCCESS!@#KODE 1!@#USER_ID 48!@#ACTIVITY_CODE 3
12/21/2022 02:01:48 PM script INFO: SUCCESS!@#KODE 1!@#USER_ID 48!@#ACTIVITY_CODE 3
12/21/2022 02:01:48 PM script INFO: SUCCESS!@#KODE 1!@#USER_ID 48!@#ACTIVITY_CODE 2
12/21/2022 02:01:48 PM script INFO: SUCCESS!@#KODE 1!@#USER_ID 48!@#ACTIVITY_CODE 3
12/21/2022 02:01:48 PM script INFO: SUCCESS!@#KODE 1!@#USER_ID 48!@#ACTIVITY_CODE 4
12/21/2022 02:01:49 PM script INFO: SUCCESS!@#KODE 1!@#USER_ID 48!@#ACTIVITY_CODE 2
12/21/2022 02:01:49 PM script INFO: SUCCESS!@#KODE 1!@#USER_ID 48!@#ACTIVITY_CODE 4
12/21/2022 02:01:49 PM script INFO: SUCCESS!@#KODE 1!@#USER_ID 48!@#ACTIVITY_CODE 2
12/21/2022 02:01:49 PM script INFO: SUCCESS!@#KODE 1!@#USER_ID 48!@#ACTIVITY_CODE 3
12/21/2022 02:01:50 PM script INFO: SUCCESS!@#KODE 1!@#USER_ID 48!@#ACTIVITY_CODE 2
12/21/2022 02:01:50 PM script INFO: SUCCESS!@#KODE 1!@#USER_ID 48!@#ACTIVITY_CODE 4
12/21/2022 02:01:50 PM script INFO: SUCCESS!@#KODE 1!@#USER_ID 48!@#ACTIVITY_CODE 3
12/21/2022 02:01:50 PM script INFO: SUCCESS!@#KODE 1!@#USER_ID 48!@#ACTIVITY_CODE 1
12/21/2022 02:01:50 PM script INFO: SUCCESS!@#KODE 1!@#USER_ID 48!@#ACTIVITY_CODE 3
12/21/2022 02:01:50 PM script INFO: SUCCESS!@#KODE 1!@#USER_ID 48!@#ACTIVITY_CODE 2
12/21/2022 02:01:51 PM script INFO: SUCCESS!@#KODE 1!@#USER_ID 48!@#ACTIVITY_CODE 2
12/21/2022 02:01:51 PM script INFO: SUCCESS!@#KODE 1!@#USER_ID 48!@#ACTIVITY_CODE 3
12/21/2022 02:01:51 PM script INFO: SUCCESS!@#KODE 1!@#USER_ID 48!@#ACTIVITY_CODE 1
12/21/2022 02:01:51 PM script INFO: SUCCESS!@#KODE 1!@#USER_ID 48!@#ACTIVITY_CODE 3
12/21/2022 02:01:51 PM script INFO: SUCCESS!@#KODE 1!@#USER_ID 48!@#ACTIVITY_CODE 1
12/21/2022 02:01:51 PM script INFO: SUCCESS!@#KODE 1!@#USER_ID 48!@#ACTIVITY_CODE 2
12/21/2022 02:01:51 PM script INFO: SUCCESS!@#KODE 1!@#USER_ID 48!@#ACTIVITY_CODE 3
12/21/2022 02:01:52 PM script INFO: SUCCESS!@#KODE 1!@#USER_ID 48!@#ACTIVITY_CODE 2
12/21/2022 02:01:52 PM script INFO: SUCCESS!@#KODE 1!@#USER_ID 48!@#ACTIVITY_CODE 1
12/21/2022 02:01:52 PM script INFO: SUCCESS!@#KODE 1!@#USER_ID 48!@#ACTIVITY_CODE 3
12/21/2022 02:01:52 PM script INFO: SUCCESS!@#KODE 1!@#USER_ID 48!@#ACTIVITY_CODE 1
12/21/2022 02:01:52 PM script INFO: SUCCESS!@#KODE 1!@#USER_ID 48!@#ACTIVITY_CODE 2
12/21/2022 02:01:53 PM script INFO: SUCCESS!@#KODE 1!@#USER_ID 48!@#ACTIVITY_CODE 2
12/21/2022 02:01:53 PM script INFO: SUCCESS!@#KODE 1!@#USER_ID 48!@#ACTIVITY_CODE 2
12/21/2022 02:01:53 PM script INFO: SUCCESS!@#KODE 1!@#USER_ID 48!@#ACTIVITY_CODE 1
12/21/2022 02:01:53 PM script INFO: SUCCESS!@#KODE 1!@#USER_ID 48!@#ACTIVITY_CODE 1
12/21/2022 02:01:53 PM script INFO: SUCCESS!@#KODE 1!@#USER_ID 48!@#ACTIVITY_CODE 3
12/21/2022 02:01:53 PM script INFO: SUCCESS!@#KODE 1!@#USER_ID 48!@#ACTIVITY_CODE 3
12/21/2022 02:01:54 PM script INFO: SUCCESS!@#KODE 1!@#USER_ID 48!@#ACTIVITY_CODE 2
12/21/2022 02:01:54 PM script INFO: SUCCESS!@#KODE 1!@#USER_ID 48!@#ACTIVITY_CODE 1
12/21/2022 02:01:54 PM script INFO: SUCCESS!@#KODE 1!@#USER_ID 48!@#ACTIVITY_CODE 1
12/21/2022 02:01:54 PM script INFO: SUCCESS!@#KODE 1!@#USER_ID 48!@#ACTIVITY_CODE 2
12/21/2022 02:01:55 PM script INFO: SUCCESS!@#KODE 1!@#USER_ID 48!@#ACTIVITY_CODE 2
12/21/2022 02:01:55 PM script INFO: SUCCESS!@#KODE 1!@#USER_ID 48!@#ACTIVITY_CODE 1
12/21/2022 02:01:55 PM script INFO: SUCCESS!@#KODE 1!@#USER_ID 48!@#ACTIVITY_CODE 2
12/21/2022 02:01:55 PM script INFO: SUCCESS!@#KODE 1!@#USER_ID 48!@#ACTIVITY_CODE 2
12/21/2022 02:01:55 PM script INFO: SUCCESS!@#KODE 1!@#USER_ID 48!@#ACTIVITY_CODE 3
12/21/2022 02:01:55 PM script INFO: SUCCESS!@#KODE 1!@#USER_ID 48!@#ACTIVITY_CODE 3
12/21/2022 02:01:56 PM script INFO: SUCCESS!@#KODE 1!@#USER_ID 48!@#ACTIVITY_CODE 4
12/21/2022 02:01:56 PM script INFO: SUCCESS!@#KODE 1!@#USER_ID 48!@#ACTIVITY_CODE 2
12/21/2022 02:01:56 PM script INFO: SUCCESS!@#KODE 1!@#USER_ID 48!@#ACTIVITY_CODE 1
12/21/2022 02:01:56 PM script INFO: SUCCESS!@#KODE 1!@#USER_ID 48!@#ACTIVITY_CODE 2
12/21/2022 02:01:56 PM script INFO: SUCCESS!@#KODE 1!@#USER_ID 48!@#ACTIVITY_CODE 4
12/21/2022 02:01:57 PM script INFO: SUCCESS!@#KODE 1!@#USER_ID 48!@#ACTIVITY_CODE 2
12/21/2022 02:01:57 PM script INFO: SUCCESS!@#KODE 1!@#USER_ID 48!@#ACTIVITY_CODE 4
12/21/2022 02:01:57 PM script INFO: SUCCESS!@#KODE 1!@#USER_ID 48!@#ACTIVITY_CODE 2
12/21/2022 02:01:58 PM script INFO: SUCCESS!@#KODE 1!@#USER_ID 48!@#ACTIVITY_CODE 1
12/21/2022 02:01:58 PM script INFO: SUCCESS!@#KODE 1!@#USER_ID 48!@#ACTIVITY_CODE 2
12/21/2022 02:01:58 PM script INFO: SUCCESS!@#KODE 1!@#USER_ID 48!@#ACTIVITY_CODE 1
12/21/2022 02:01:58 PM script INFO: SUCCESS!@#KODE 1!@#USER_ID 48!@#ACTIVITY_CODE 1
12/21/2022 02:01:58 PM script INFO: SUCCESS!@#KODE 1!@#USER_ID 48!@#ACTIVITY_CODE 3
12/21/2022 02:01:58 PM script INFO: SUCCESS!@#KODE 1!@#USER_ID 48!@#ACTIVITY_CODE 1
12/21/2022 02:01:59 PM script INFO: SUCCESS!@#KODE 1!@#USER_ID 48!@#ACTIVITY_CODE 2
12/21/2022 02:01:59 PM script INFO: SUCCESS!@#KODE 1!@#USER_ID 48!@#ACTIVITY_CODE 3
12/21/2022 02:01:59 PM script INFO: SUCCESS!@#KODE 1!@#USER_ID 48!@#ACTIVITY_CODE 1
12/21/2022 02:01:59 PM script INFO: SUCCESS!@#KODE 1!@#USER_ID 48!@#ACTIVITY_CODE 4
12/21/2022 02:01:59 PM script INFO: SUCCESS!@#KODE 1!@#USER_ID 48!@#ACTIVITY_CODE 1
12/21/2022 02:01:59 PM script INFO: SUCCESS!@#KODE 1!@#USER_ID 48!@#ACTIVITY_CODE 3
12/21/2022 02:01:59 PM script INFO: SUCCESS!@#KODE 1!@#USER_ID 48!@#ACTIVITY_CODE 4
12/21/2022 02:01:59 PM script INFO: SUCCESS!@#KODE 1!@#USER_ID 48!@#ACTIVITY_CODE 1
12/21/2022 02:02:00 PM script INFO: SUCCESS!@#KODE 1!@#USER_ID 48!@#ACTIVITY_CODE 4
12/21/2022 02:02:00 PM script INFO: SUCCESS!@#KODE 1!@#USER_ID 48!@#ACTIVITY_CODE 1
12/21/2022 02:02:00 PM script INFO: SUCCESS!@#KODE 1!@#USER_ID 48!@#ACTIVITY_CODE 2
12/21/2022 02:02:00 PM script INFO: SUCCESS!@#KODE 1!@#USER_ID 48!@#ACTIVITY_CODE 3
12/21/2022 02:02:00 PM script INFO: SUCCESS!@#KODE 1!@#USER_ID 48!@#ACTIVITY_CODE 2
12/21/2022 02:02:01 PM script INFO: SUCCESS!@#KODE 1!@#USER_ID 48!@#ACTIVITY_CODE 1
12/21/2022 02:02:01 PM script INFO: SUCCESS!@#KODE 1!@#USER_ID 48!@#ACTIVITY_CODE 3
12/21/2022 02:02:01 PM script INFO: SUCCESS!@#KODE 1!@#USER_ID 48!@#ACTIVITY_CODE 4
12/21/2022 02:02:01 PM script INFO: SUCCESS!@#KODE 1!@#USER_ID 48!@#ACTIVITY_CODE 1
12/21/2022 02:02:01 PM script INFO: SUCCESS!@#KODE 1!@#USER_ID 48!@#ACTIVITY_CODE 3
12/21/2022 02:02:01 PM script INFO: SUCCESS!@#KODE 1!@#USER_ID 48!@#ACTIVITY_CODE 3
12/21/2022 02:02:02 PM script INFO: SUCCESS!@#KODE 1!@#USER_ID 48!@#ACTIVITY_CODE 3
12/21/2022 02:02:02 PM script INFO: SUCCESS!@#KODE 1!@#USER_ID 48!@#ACTIVITY_CODE 3
12/21/2022 02:02:02 PM script INFO: SUCCESS!@#KODE 1!@#USER_ID 48!@#ACTIVITY_CODE 3
12/21/2022 02:02:02 PM script INFO: SUCCESS!@#KODE 1!@#USER_ID 48!@#ACTIVITY_CODE 3
12/21/2022 02:02:02 PM script INFO: SUCCESS!@#KODE 1!@#USER_ID 48!@#ACTIVITY_CODE 2
12/21/2022 02:02:02 PM script INFO: SUCCESS!@#KODE 1!@#USER_ID 48!@#ACTIVITY_CODE 1
12/21/2022 02:02:02 PM script INFO: SUCCESS!@#KODE 1!@#USER_ID 48!@#ACTIVITY_CODE 1
12/21/2022 02:02:03 PM script INFO: SUCCESS!@#KODE 1!@#USER_ID 48!@#ACTIVITY_CODE 2
12/21/2022 02:02:03 PM script INFO: SUCCESS!@#KODE 1!@#USER_ID 48!@#ACTIVITY_CODE 2
12/21/2022 02:02:03 PM script INFO: SUCCESS!@#KODE 1!@#USER_ID 48!@#ACTIVITY_CODE 3
12/21/2022 02:02:03 PM script INFO: SUCCESS!@#KODE 1!@#USER_ID 48!@#ACTIVITY_CODE 3
12/21/2022 02:02:04 PM script INFO: SUCCESS!@#KODE 1!@#USER_ID 48!@#ACTIVITY_CODE 2
12/21/2022 02:02:04 PM script INFO: SUCCESS!@#KODE 1!@#USER_ID 48!@#ACTIVITY_CODE 1
12/21/2022 02:02:04 PM script INFO: SUCCESS!@#KODE 1!@#USER_ID 48!@#ACTIVITY_CODE 2
12/21/2022 02:02:04 PM script INFO: SUCCESS!@#KODE 1!@#USER_ID 48!@#ACTIVITY_CODE 1
12/21/2022 02:02:04 PM script INFO: SUCCESS!@#KODE 1!@#USER_ID 48!@#ACTIVITY_CODE 2
12/21/2022 02:02:05 PM script INFO: SUCCESS!@#KODE 1!@#USER_ID 48!@#ACTIVITY_CODE 3
12/21/2022 02:02:05 PM script INFO: SUCCESS!@#KODE 1!@#USER_ID 48!@#ACTIVITY_CODE 3
12/21/2022 02:02:05 PM script INFO: SUCCESS!@#KODE 1!@#USER_ID 48!@#ACTIVITY_CODE 1
12/21/2022 02:02:05 PM script INFO: SUCCESS!@#KODE 1!@#USER_ID 48!@#ACTIVITY_CODE 4
12/21/2022 02:02:05 PM script INFO: SUCCESS!@#KODE 1!@#USER_ID 48!@#ACTIVITY_CODE 2
12/21/2022 02:02:05 PM script INFO: SUCCESS!@#KODE 1!@#USER_ID 48!@#ACTIVITY_CODE 3
12/21/2022 02:02:05 PM script INFO: SUCCESS!@#KODE 1!@#USER_ID 48!@#ACTIVITY_CODE 1
12/21/2022 02:02:06 PM script INFO: SUCCESS!@#KODE 1!@#USER_ID 48!@#ACTIVITY_CODE 1
12/21/2022 02:02:06 PM script INFO: SUCCESS!@#KODE 1!@#USER_ID 48!@#ACTIVITY_CODE 2
12/21/2022 02:02:06 PM script INFO: SUCCESS!@#KODE 1!@#USER_ID 48!@#ACTIVITY_CODE 1
12/21/2022 02:02:06 PM script INFO: SUCCESS!@#KODE 1!@#USER_ID 48!@#ACTIVITY_CODE 2
12/21/2022 02:02:07 PM script INFO: SUCCESS!@#KODE 1!@#USER_ID 48!@#ACTIVITY_CODE 2
12/21/2022 02:02:07 PM script INFO: SUCCESS!@#KODE 1!@#USER_ID 48!@#ACTIVITY_CODE 3
12/21/2022 02:02:07 PM script INFO: SUCCESS!@#KODE 1!@#USER_ID 48!@#ACTIVITY_CODE 3
12/21/2022 02:02:07 PM script INFO: SUCCESS!@#KODE 1!@#USER_ID 48!@#ACTIVITY_CODE 1
12/21/2022 02:02:07 PM script INFO: SUCCESS!@#KODE 1!@#USER_ID 48!@#ACTIVITY_CODE 2
12/21/2022 02:02:07 PM script INFO: SUCCESS!@#KODE 1!@#USER_ID 48!@#ACTIVITY_CODE 1
12/21/2022 02:02:07 PM script INFO: SUCCESS!@#KODE 1!@#USER_ID 48!@#ACTIVITY_CODE 1
12/21/2022 02:02:08 PM script INFO: SUCCESS!@#KODE 1!@#USER_ID 48!@#ACTIVITY_CODE 3
12/21/2022 02:02:08 PM script INFO: SUCCESS!@#KODE 1!@#USER_ID 48!@#ACTIVITY_CODE 1
12/21/2022 02:02:08 PM script INFO: SUCCESS!@#KODE 1!@#USER_ID 48!@#ACTIVITY_CODE 1
12/21/2022 02:02:08 PM script INFO: SUCCESS!@#KODE 1!@#USER_ID 48!@#ACTIVITY_CODE 1
12/21/2022 02:02:08 PM script INFO: SUCCESS!@#KODE 1!@#USER_ID 48!@#ACTIVITY_CODE 3
12/21/2022 02:02:08 PM script INFO: SUCCESS!@#KODE 1!@#USER_ID 48!@#ACTIVITY_CODE 3
12/21/2022 02:02:09 PM script INFO: SUCCESS!@#KODE 1!@#USER_ID 48!@#ACTIVITY_CODE 2
12/21/2022 02:02:09 PM script INFO: SUCCESS!@#KODE 1!@#USER_ID 48!@#ACTIVITY_CODE 1
12/21/2022 02:02:09 PM script INFO: SUCCESS!@#KODE 1!@#USER_ID 48!@#ACTIVITY_CODE 4
12/21/2022 02:02:09 PM script INFO: SUCCESS!@#KODE 1!@#USER_ID 48!@#ACTIVITY_CODE 2
12/21/2022 02:02:10 PM script INFO: SUCCESS!@#KODE 1!@#USER_ID 48!@#ACTIVITY_CODE 4
12/21/2022 02:02:10 PM script INFO: SUCCESS!@#KODE 1!@#USER_ID 48!@#ACTIVITY_CODE 1
12/21/2022 02:02:10 PM script INFO: SUCCESS!@#KODE 1!@#USER_ID 48!@#ACTIVITY_CODE 2
12/21/2022 02:02:10 PM script INFO: SUCCESS!@#KODE 1!@#USER_ID 48!@#ACTIVITY_CODE 2
12/21/2022 02:02:10 PM script INFO: SUCCESS!@#KODE 1!@#USER_ID 48!@#ACTIVITY_CODE 1
12/21/2022 02:02:11 PM script INFO: SUCCESS!@#KODE 1!@#USER_ID 48!@#ACTIVITY_CODE 3
12/21/2022 02:02:11 PM script INFO: SUCCESS!@#KODE 1!@#USER_ID 48!@#ACTIVITY_CODE 1
12/21/2022 02:02:11 PM script INFO: SUCCESS!@#KODE 1!@#USER_ID 48!@#ACTIVITY_CODE 1
12/21/2022 02:02:11 PM script INFO: SUCCESS!@#KODE 1!@#USER_ID 48!@#ACTIVITY_CODE 1
12/21/2022 02:02:11 PM script INFO: SUCCESS!@#KODE 1!@#USER_ID 48!@#ACTIVITY_CODE 1
12/21/2022 02:02:11 PM script INFO: SUCCESS!@#KODE 1!@#USER_ID 48!@#ACTIVITY_CODE 3
12/21/2022 02:02:11 PM script INFO: SUCCESS!@#KODE 1!@#USER_ID 48!@#ACTIVITY_CODE 1
12/21/2022 02:02:11 PM script INFO: SUCCESS!@#KODE 1!@#USER_ID 48!@#ACTIVITY_CODE 3
12/21/2022 02:02:12 PM script INFO: SUCCESS!@#KODE 1!@#USER_ID 48!@#ACTIVITY_CODE 3
12/21/2022 02:02:12 PM script INFO: SUCCESS!@#KODE 1!@#USER_ID 48!@#ACTIVITY_CODE 3
12/21/2022 02:02:12 PM script INFO: SUCCESS!@#KODE 1!@#USER_ID 48!@#ACTIVITY_CODE 3
12/21/2022 02:02:12 PM script INFO: SUCCESS!@#KODE 1!@#USER_ID 48!@#ACTIVITY_CODE 3
12/21/2022 02:02:12 PM script INFO: SUCCESS!@#KODE 1!@#USER_ID 48!@#ACTIVITY_CODE 3
12/21/2022 02:02:13 PM script INFO: SUCCESS!@#KODE 1!@#USER_ID 48!@#ACTIVITY_CODE 2
12/21/2022 02:02:13 PM script INFO: SUCCESS!@#KODE 1!@#USER_ID 48!@#ACTIVITY_CODE 4
12/21/2022 02:02:13 PM script INFO: SUCCESS!@#KODE 1!@#USER_ID 48!@#ACTIVITY_CODE 2
12/21/2022 02:02:13 PM script INFO: SUCCESS!@#KODE 1!@#USER_ID 48!@#ACTIVITY_CODE 1
12/21/2022 02:02:13 PM script INFO: SUCCESS!@#KODE 1!@#USER_ID 48!@#ACTIVITY_CODE 3
12/21/2022 02:02:13 PM script INFO: SUCCESS!@#KODE 1!@#USER_ID 48!@#ACTIVITY_CODE 3
12/21/2022 02:02:14 PM script INFO: SUCCESS!@#KODE 1!@#USER_ID 48!@#ACTIVITY_CODE 1
12/21/2022 02:02:14 PM script INFO: SUCCESS!@#KODE 1!@#USER_ID 48!@#ACTIVITY_CODE 2
12/21/2022 02:02:14 PM script INFO: SUCCESS!@#KODE 1!@#USER_ID 48!@#ACTIVITY_CODE 2
12/21/2022 02:02:14 PM script INFO: SUCCESS!@#KODE 1!@#USER_ID 48!@#ACTIVITY_CODE 1
12/21/2022 02:02:14 PM script INFO: SUCCESS!@#KODE 1!@#USER_ID 48!@#ACTIVITY_CODE 3
12/21/2022 02:02:15 PM script INFO: SUCCESS!@#KODE 1!@#USER_ID 48!@#ACTIVITY_CODE 3
12/21/2022 02:02:15 PM script INFO: SUCCESS!@#KODE 1!@#USER_ID 48!@#ACTIVITY_CODE 1
12/21/2022 02:02:15 PM script INFO: SUCCESS!@#KODE 1!@#USER_ID 48!@#ACTIVITY_CODE 2
12/21/2022 02:02:15 PM script INFO: SUCCESS!@#KODE 1!@#USER_ID 48!@#ACTIVITY_CODE 3
12/21/2022 02:02:15 PM script INFO: SUCCESS!@#KODE 1!@#USER_ID 48!@#ACTIVITY_CODE 4
12/21/2022 02:02:15 PM script INFO: SUCCESS!@#KODE 1!@#USER_ID 48!@#ACTIVITY_CODE 3
12/21/2022 02:02:16 PM script INFO: SUCCESS!@#KODE 1!@#USER_ID 48!@#ACTIVITY_CODE 3
12/21/2022 02:02:16 PM script INFO: SUCCESS!@#KODE 1!@#USER_ID 48!@#ACTIVITY_CODE 2
12/21/2022 02:02:16 PM script INFO: SUCCESS!@#KODE 1!@#USER_ID 48!@#ACTIVITY_CODE 1
12/21/2022 02:02:16 PM script INFO: SUCCESS!@#KODE 1!@#USER_ID 48!@#ACTIVITY_CODE 3
12/21/2022 02:02:16 PM script INFO: SUCCESS!@#KODE 1!@#USER_ID 48!@#ACTIVITY_CODE 2
12/21/2022 02:02:16 PM script INFO: SUCCESS!@#KODE 1!@#USER_ID 48!@#ACTIVITY_CODE 3
12/21/2022 02:02:17 PM script INFO: SUCCESS!@#KODE 1!@#USER_ID 48!@#ACTIVITY_CODE 1
12/21/2022 02:02:17 PM script INFO: SUCCESS!@#KODE 1!@#USER_ID 48!@#ACTIVITY_CODE 4
12/21/2022 02:02:17 PM script INFO: SUCCESS!@#KODE 1!@#USER_ID 48!@#ACTIVITY_CODE 2
12/21/2022 02:02:17 PM script INFO: SUCCESS!@#KODE 1!@#USER_ID 48!@#ACTIVITY_CODE 3
12/21/2022 02:02:17 PM script INFO: SUCCESS!@#KODE 1!@#USER_ID 48!@#ACTIVITY_CODE 2
12/21/2022 02:02:18 PM script INFO: SUCCESS!@#KODE 1!@#USER_ID 48!@#ACTIVITY_CODE 3
12/21/2022 02:02:18 PM script INFO: SUCCESS!@#KODE 1!@#USER_ID 48!@#ACTIVITY_CODE 1
12/21/2022 02:02:18 PM script INFO: SUCCESS!@#KODE 1!@#USER_ID 48!@#ACTIVITY_CODE 3
12/21/2022 02:02:18 PM script INFO: SUCCESS!@#KODE 1!@#USER_ID 48!@#ACTIVITY_CODE 4
12/21/2022 02:02:18 PM script INFO: SUCCESS!@#KODE 1!@#USER_ID 48!@#ACTIVITY_CODE 3
12/21/2022 02:02:18 PM script INFO: SUCCESS!@#KODE 1!@#USER_ID 48!@#ACTIVITY_CODE 2
12/21/2022 02:02:19 PM script INFO: SUCCESS!@#KODE 1!@#USER_ID 48!@#ACTIVITY_CODE 2
12/21/2022 02:02:19 PM script INFO: SUCCESS!@#KODE 1!@#USER_ID 48!@#ACTIVITY_CODE 1
12/21/2022 02:02:19 PM script INFO: SUCCESS!@#KODE 1!@#USER_ID 48!@#ACTIVITY_CODE 1
12/21/2022 02:02:19 PM script INFO: SUCCESS!@#KODE 1!@#USER_ID 48!@#ACTIVITY_CODE 2
12/21/2022 02:02:19 PM script INFO: SUCCESS!@#KODE 1!@#USER_ID 48!@#ACTIVITY_CODE 3
12/21/2022 02:02:19 PM script INFO: SUCCESS!@#KODE 1!@#USER_ID 48!@#ACTIVITY_CODE 3
12/21/2022 02:02:20 PM script INFO: SUCCESS!@#KODE 1!@#USER_ID 48!@#ACTIVITY_CODE 3
12/21/2022 02:02:20 PM script INFO: SUCCESS!@#KODE 1!@#USER_ID 48!@#ACTIVITY_CODE 2
12/21/2022 02:02:20 PM script INFO: SUCCESS!@#KODE 1!@#USER_ID 48!@#ACTIVITY_CODE 3
12/21/2022 02:02:21 PM script INFO: SUCCESS!@#KODE 1!@#USER_ID 48!@#ACTIVITY_CODE 2
12/21/2022 02:02:21 PM script INFO: SUCCESS!@#KODE 1!@#USER_ID 48!@#ACTIVITY_CODE 1
12/21/2022 02:02:21 PM script INFO: SUCCESS!@#KODE 1!@#USER_ID 48!@#ACTIVITY_CODE 4
12/21/2022 02:02:21 PM script INFO: SUCCESS!@#KODE 1!@#USER_ID 48!@#ACTIVITY_CODE 3
12/21/2022 02:02:21 PM script INFO: SUCCESS!@#KODE 1!@#USER_ID 48!@#ACTIVITY_CODE 3
12/21/2022 02:02:22 PM script INFO: SUCCESS!@#KODE 1!@#USER_ID 48!@#ACTIVITY_CODE 1
12/21/2022 02:02:22 PM script INFO: SUCCESS!@#KODE 1!@#USER_ID 48!@#ACTIVITY_CODE 3
12/21/2022 02:02:22 PM script INFO: SUCCESS!@#KODE 1!@#USER_ID 48!@#ACTIVITY_CODE 4
12/21/2022 02:02:22 PM script INFO: SUCCESS!@#KODE 1!@#USER_ID 48!@#ACTIVITY_CODE 1
12/21/2022 02:02:22 PM script INFO: SUCCESS!@#KODE 1!@#USER_ID 48!@#ACTIVITY_CODE 1
12/21/2022 02:02:22 PM script INFO: SUCCESS!@#KODE 1!@#USER_ID 48!@#ACTIVITY_CODE 3
12/21/2022 02:02:22 PM script INFO: SUCCESS!@#KODE 1!@#USER_ID 48!@#ACTIVITY_CODE 4
12/21/2022 02:02:23 PM script INFO: SUCCESS!@#KODE 1!@#USER_ID 48!@#ACTIVITY_CODE 3
12/21/2022 02:02:23 PM script INFO: SUCCESS!@#KODE 1!@#USER_ID 48!@#ACTIVITY_CODE 3
12/21/2022 02:02:23 PM script INFO: SUCCESS!@#KODE 1!@#USER_ID 48!@#ACTIVITY_CODE 1
12/21/2022 02:02:23 PM script INFO: SUCCESS!@#KODE 1!@#USER_ID 48!@#ACTIVITY_CODE 1
12/21/2022 02:02:23 PM script INFO: SUCCESS!@#KODE 1!@#USER_ID 48!@#ACTIVITY_CODE 3
12/21/2022 02:02:23 PM script INFO: SUCCESS!@#KODE 1!@#USER_ID 48!@#ACTIVITY_CODE 1
12/21/2022 02:02:23 PM script INFO: SUCCESS!@#KODE 1!@#USER_ID 48!@#ACTIVITY_CODE 1
12/21/2022 02:02:23 PM script INFO: SUCCESS!@#KODE 1!@#USER_ID 48!@#ACTIVITY_CODE 3
12/21/2022 02:02:24 PM script INFO: SUCCESS!@#KODE 1!@#USER_ID 48!@#ACTIVITY_CODE 2
12/21/2022 02:02:24 PM script INFO: SUCCESS!@#KODE 1!@#USER_ID 48!@#ACTIVITY_CODE 3
12/21/2022 02:02:24 PM script INFO: SUCCESS!@#KODE 1!@#USER_ID 48!@#ACTIVITY_CODE 3
12/21/2022 02:02:24 PM script INFO: SUCCESS!@#KODE 1!@#USER_ID 48!@#ACTIVITY_CODE 3
12/21/2022 02:02:24 PM script INFO: SUCCESS!@#KODE 1!@#USER_ID 48!@#ACTIVITY_CODE 1
12/21/2022 02:02:24 PM script INFO: SUCCESS!@#KODE 1!@#USER_ID 48!@#ACTIVITY_CODE 2
12/21/2022 02:02:24 PM script INFO: SUCCESS!@#KODE 1!@#USER_ID 48!@#ACTIVITY_CODE 1
12/21/2022 02:02:25 PM script INFO: SUCCESS!@#KODE 1!@#USER_ID 48!@#ACTIVITY_CODE 4
12/21/2022 02:02:25 PM script INFO: SUCCESS!@#KODE 1!@#USER_ID 48!@#ACTIVITY_CODE 1
12/21/2022 02:02:25 PM script INFO: SUCCESS!@#KODE 1!@#USER_ID 48!@#ACTIVITY_CODE 2
12/21/2022 02:02:25 PM script INFO: SUCCESS!@#KODE 1!@#USER_ID 48!@#ACTIVITY_CODE 2
12/21/2022 02:02:25 PM script INFO: SUCCESS!@#KODE 1!@#USER_ID 48!@#ACTIVITY_CODE 3
12/21/2022 02:02:26 PM script INFO: SUCCESS!@#KODE 1!@#USER_ID 48!@#ACTIVITY_CODE 1
12/21/2022 02:02:26 PM script INFO: SUCCESS!@#KODE 1!@#USER_ID 48!@#ACTIVITY_CODE 2
12/21/2022 02:02:26 PM script INFO: SUCCESS!@#KODE 1!@#USER_ID 48!@#ACTIVITY_CODE 2
12/21/2022 02:02:26 PM script INFO: SUCCESS!@#KODE 1!@#USER_ID 48!@#ACTIVITY_CODE 2
12/21/2022 02:02:27 PM script INFO: SUCCESS!@#KODE 1!@#USER_ID 48!@#ACTIVITY_CODE 3
12/21/2022 02:02:27 PM script INFO: SUCCESS!@#KODE 1!@#USER_ID 48!@#ACTIVITY_CODE 1
12/21/2022 02:02:27 PM script INFO: SUCCESS!@#KODE 1!@#USER_ID 48!@#ACTIVITY_CODE 3
12/21/2022 02:02:27 PM script INFO: SUCCESS!@#KODE 1!@#USER_ID 48!@#ACTIVITY_CODE 1
12/21/2022 02:02:27 PM script INFO: SUCCESS!@#KODE 1!@#USER_ID 48!@#ACTIVITY_CODE 3
12/21/2022 02:02:27 PM script INFO: SUCCESS!@#KODE 1!@#USER_ID 48!@#ACTIVITY_CODE 3
12/21/2022 02:02:27 PM script INFO: SUCCESS!@#KODE 1!@#USER_ID 48!@#ACTIVITY_CODE 1
12/21/2022 02:02:28 PM script INFO: SUCCESS!@#KODE 1!@#USER_ID 48!@#ACTIVITY_CODE 3
12/21/2022 02:02:28 PM script INFO: SUCCESS!@#KODE 1!@#USER_ID 48!@#ACTIVITY_CODE 1
12/21/2022 02:02:28 PM script INFO: SUCCESS!@#KODE 1!@#USER_ID 48!@#ACTIVITY_CODE 2
12/21/2022 02:02:28 PM script INFO: SUCCESS!@#KODE 1!@#USER_ID 48!@#ACTIVITY_CODE 1
12/21/2022 02:02:28 PM script INFO: SUCCESS!@#KODE 1!@#USER_ID 48!@#ACTIVITY_CODE 4
12/21/2022 02:02:29 PM script INFO: SUCCESS!@#KODE 1!@#USER_ID 48!@#ACTIVITY_CODE 2
12/21/2022 02:02:29 PM script INFO: SUCCESS!@#KODE 1!@#USER_ID 48!@#ACTIVITY_CODE 2
12/21/2022 02:02:29 PM script INFO: SUCCESS!@#KODE 1!@#USER_ID 48!@#ACTIVITY_CODE 2
12/21/2022 02:02:29 PM script INFO: SUCCESS!@#KODE 1!@#USER_ID 48!@#ACTIVITY_CODE 1
12/21/2022 02:02:29 PM script INFO: SUCCESS!@#KODE 1!@#USER_ID 48!@#ACTIVITY_CODE 3
12/21/2022 02:02:30 PM script INFO: SUCCESS!@#KODE 1!@#USER_ID 48!@#ACTIVITY_CODE 2
12/21/2022 02:02:30 PM script INFO: SUCCESS!@#KODE 1!@#USER_ID 48!@#ACTIVITY_CODE 4
12/21/2022 02:02:30 PM script INFO: SUCCESS!@#KODE 1!@#USER_ID 48!@#ACTIVITY_CODE 2
12/21/2022 02:02:31 PM script INFO: SUCCESS!@#KODE 1!@#USER_ID 48!@#ACTIVITY_CODE 2
12/21/2022 02:02:31 PM script INFO: SUCCESS!@#KODE 1!@#USER_ID 48!@#ACTIVITY_CODE 2
12/21/2022 02:02:31 PM script INFO: SUCCESS!@#KODE 1!@#USER_ID 48!@#ACTIVITY_CODE 4
12/21/2022 02:02:31 PM script INFO: SUCCESS!@#KODE 1!@#USER_ID 48!@#ACTIVITY_CODE 3
12/21/2022 02:02:31 PM script INFO: SUCCESS!@#KODE 1!@#USER_ID 48!@#ACTIVITY_CODE 2
12/21/2022 02:02:32 PM script INFO: SUCCESS!@#KODE 1!@#USER_ID 48!@#ACTIVITY_CODE 1
12/21/2022 02:02:32 PM script INFO: SUCCESS!@#KODE 1!@#USER_ID 48!@#ACTIVITY_CODE 4
12/21/2022 02:02:32 PM script INFO: SUCCESS!@#KODE 1!@#USER_ID 48!@#ACTIVITY_CODE 1
12/21/2022 02:02:32 PM script INFO: SUCCESS!@#KODE 1!@#USER_ID 48!@#ACTIVITY_CODE 3
12/21/2022 02:02:32 PM script INFO: SUCCESS!@#KODE 1!@#USER_ID 48!@#ACTIVITY_CODE 4
12/21/2022 02:02:32 PM script INFO: SUCCESS!@#KODE 1!@#USER_ID 48!@#ACTIVITY_CODE 3
12/21/2022 02:02:32 PM script INFO: SUCCESS!@#KODE 1!@#USER_ID 48!@#ACTIVITY_CODE 3
12/21/2022 02:02:33 PM script INFO: SUCCESS!@#KODE 1!@#USER_ID 48!@#ACTIVITY_CODE 2
12/21/2022 02:02:33 PM script INFO: SUCCESS!@#KODE 1!@#USER_ID 48!@#ACTIVITY_CODE 1
12/21/2022 02:02:33 PM script INFO: SUCCESS!@#KODE 1!@#USER_ID 48!@#ACTIVITY_CODE 4
12/21/2022 02:02:33 PM script INFO: SUCCESS!@#KODE 1!@#USER_ID 48!@#ACTIVITY_CODE 1
12/21/2022 02:02:33 PM script INFO: SUCCESS!@#KODE 1!@#USER_ID 48!@#ACTIVITY_CODE 2
12/21/2022 02:02:33 PM script INFO: SUCCESS!@#KODE 1!@#USER_ID 48!@#ACTIVITY_CODE 1
12/21/2022 02:02:34 PM script INFO: SUCCESS!@#KODE 1!@#USER_ID 48!@#ACTIVITY_CODE 4
12/21/2022 02:02:34 PM script INFO: SUCCESS!@#KODE 1!@#USER_ID 48!@#ACTIVITY_CODE 1
12/21/2022 02:02:34 PM script INFO: SUCCESS!@#KODE 1!@#USER_ID 48!@#ACTIVITY_CODE 3
12/21/2022 02:02:34 PM script INFO: SUCCESS!@#KODE 1!@#USER_ID 48!@#ACTIVITY_CODE 4
12/21/2022 02:02:34 PM script INFO: SUCCESS!@#KODE 1!@#USER_ID 48!@#ACTIVITY_CODE 3
12/21/2022 02:02:34 PM script INFO: SUCCESS!@#KODE 1!@#USER_ID 48!@#ACTIVITY_CODE 1
12/21/2022 02:02:34 PM script INFO: SUCCESS!@#KODE 1!@#USER_ID 48!@#ACTIVITY_CODE 3
12/21/2022 02:02:34 PM script INFO: SUCCESS!@#KODE 1!@#USER_ID 48!@#ACTIVITY_CODE 1
12/21/2022 02:02:35 PM script INFO: SUCCESS!@#KODE 1!@#USER_ID 48!@#ACTIVITY_CODE 3
12/21/2022 02:02:35 PM script INFO: SUCCESS!@#KODE 1!@#USER_ID 48!@#ACTIVITY_CODE 4
12/21/2022 02:02:35 PM script INFO: SUCCESS!@#KODE 1!@#USER_ID 48!@#ACTIVITY_CODE 3
12/21/2022 02:02:35 PM script INFO: SUCCESS!@#KODE 1!@#USER_ID 48!@#ACTIVITY_CODE 2
12/21/2022 02:02:35 PM script INFO: SUCCESS!@#KODE 1!@#USER_ID 48!@#ACTIVITY_CODE 1
12/21/2022 02:02:35 PM script INFO: SUCCESS!@#KODE 1!@#USER_ID 48!@#ACTIVITY_CODE 4
12/21/2022 02:02:36 PM script INFO: SUCCESS!@#KODE 1!@#USER_ID 48!@#ACTIVITY_CODE 2
12/21/2022 02:02:36 PM script INFO: SUCCESS!@#KODE 1!@#USER_ID 48!@#ACTIVITY_CODE 3
12/21/2022 02:02:36 PM script INFO: SUCCESS!@#KODE 1!@#USER_ID 48!@#ACTIVITY_CODE 3
12/21/2022 02:02:36 PM script INFO: SUCCESS!@#KODE 1!@#USER_ID 48!@#ACTIVITY_CODE 3
12/21/2022 02:02:36 PM script INFO: SUCCESS!@#KODE 1!@#USER_ID 48!@#ACTIVITY_CODE 1
12/21/2022 02:02:36 PM script INFO: SUCCESS!@#KODE 1!@#USER_ID 48!@#ACTIVITY_CODE 3
12/21/2022 02:02:37 PM script INFO: SUCCESS!@#KODE 1!@#USER_ID 48!@#ACTIVITY_CODE 4
12/21/2022 02:02:37 PM script INFO: SUCCESS!@#KODE 1!@#USER_ID 48!@#ACTIVITY_CODE 3
12/21/2022 02:02:37 PM script INFO: SUCCESS!@#KODE 1!@#USER_ID 48!@#ACTIVITY_CODE 3
12/21/2022 02:02:37 PM script INFO: SUCCESS!@#KODE 1!@#USER_ID 48!@#ACTIVITY_CODE 3
12/21/2022 02:02:37 PM script INFO: SUCCESS!@#KODE 1!@#USER_ID 48!@#ACTIVITY_CODE 1
12/21/2022 02:02:37 PM script INFO: SUCCESS!@#KODE 1!@#USER_ID 48!@#ACTIVITY_CODE 3
12/21/2022 02:02:37 PM script INFO: SUCCESS!@#KODE 1!@#USER_ID 48!@#ACTIVITY_CODE 4
12/21/2022 02:02:37 PM script INFO: SUCCESS!@#KODE 1!@#USER_ID 48!@#ACTIVITY_CODE 2
12/21/2022 02:02:38 PM script INFO: SUCCESS!@#KODE 1!@#USER_ID 48!@#ACTIVITY_CODE 3
12/21/2022 02:02:38 PM script INFO: SUCCESS!@#KODE 1!@#USER_ID 48!@#ACTIVITY_CODE 3
12/21/2022 02:02:38 PM script INFO: SUCCESS!@#KODE 1!@#USER_ID 48!@#ACTIVITY_CODE 1
12/21/2022 02:02:38 PM script INFO: SUCCESS!@#KODE 1!@#USER_ID 48!@#ACTIVITY_CODE 4
12/21/2022 02:02:38 PM script INFO: SUCCESS!@#KODE 1!@#USER_ID 48!@#ACTIVITY_CODE 3
12/21/2022 02:02:38 PM script INFO: SUCCESS!@#KODE 1!@#USER_ID 48!@#ACTIVITY_CODE 3
12/21/2022 02:02:38 PM script INFO: SUCCESS!@#KODE 1!@#USER_ID 48!@#ACTIVITY_CODE 1
12/21/2022 02:02:38 PM script INFO: SUCCESS!@#KODE 1!@#USER_ID 48!@#ACTIVITY_CODE 4
12/21/2022 02:02:38 PM script INFO: SUCCESS!@#KODE 1!@#USER_ID 48!@#ACTIVITY_CODE 3
12/21/2022 02:02:39 PM script INFO: SUCCESS!@#KODE 1!@#USER_ID 48!@#ACTIVITY_CODE 2
12/21/2022 02:02:39 PM script INFO: SUCCESS!@#KODE 1!@#USER_ID 48!@#ACTIVITY_CODE 2
12/21/2022 02:02:39 PM script INFO: SUCCESS!@#KODE 1!@#USER_ID 48!@#ACTIVITY_CODE 3
12/21/2022 02:02:39 PM script INFO: SUCCESS!@#KODE 1!@#USER_ID 48!@#ACTIVITY_CODE 1
12/21/2022 02:02:39 PM script INFO: SUCCESS!@#KODE 1!@#USER_ID 48!@#ACTIVITY_CODE 3
12/21/2022 02:02:39 PM script INFO: SUCCESS!@#KODE 1!@#USER_ID 48!@#ACTIVITY_CODE 1
12/21/2022 02:02:39 PM script INFO: SUCCESS!@#KODE 1!@#USER_ID 48!@#ACTIVITY_CODE 2
12/21/2022 02:02:39 PM script INFO: SUCCESS!@#KODE 1!@#USER_ID 48!@#ACTIVITY_CODE 1
12/21/2022 02:02:39 PM script INFO: SUCCESS!@#KODE 1!@#USER_ID 48!@#ACTIVITY_CODE 1
12/21/2022 02:02:39 PM script INFO: SUCCESS!@#KODE 1!@#USER_ID 48!@#ACTIVITY_CODE 3
12/21/2022 02:02:40 PM script INFO: SUCCESS!@#KODE 1!@#USER_ID 48!@#ACTIVITY_CODE 1
12/21/2022 02:02:40 PM script INFO: SUCCESS!@#KODE 1!@#USER_ID 48!@#ACTIVITY_CODE 2
12/21/2022 02:02:40 PM script INFO: SUCCESS!@#KODE 1!@#USER_ID 48!@#ACTIVITY_CODE 1
12/21/2022 02:02:40 PM script INFO: SUCCESS!@#KODE 1!@#USER_ID 48!@#ACTIVITY_CODE 3
12/21/2022 02:02:40 PM script INFO: SUCCESS!@#KODE 1!@#USER_ID 48!@#ACTIVITY_CODE 2
12/21/2022 02:02:40 PM script INFO: SUCCESS!@#KODE 1!@#USER_ID 48!@#ACTIVITY_CODE 2
12/21/2022 02:02:40 PM script INFO: SUCCESS!@#KODE 1!@#USER_ID 48!@#ACTIVITY_CODE 2
12/21/2022 02:02:41 PM script INFO: SUCCESS!@#KODE 1!@#USER_ID 48!@#ACTIVITY_CODE 3
12/21/2022 02:02:41 PM script INFO: SUCCESS!@#KODE 1!@#USER_ID 48!@#ACTIVITY_CODE 1
12/21/2022 02:02:41 PM script INFO: SUCCESS!@#KODE 1!@#USER_ID 48!@#ACTIVITY_CODE 3
12/21/2022 02:02:41 PM script INFO: SUCCESS!@#KODE 1!@#USER_ID 48!@#ACTIVITY_CODE 1
12/21/2022 02:02:41 PM script INFO: SUCCESS!@#KODE 1!@#USER_ID 48!@#ACTIVITY_CODE 2
12/21/2022 02:02:41 PM script INFO: SUCCESS!@#KODE 1!@#USER_ID 48!@#ACTIVITY_CODE 1
12/21/2022 02:02:41 PM script INFO: SUCCESS!@#KODE 1!@#USER_ID 48!@#ACTIVITY_CODE 4
12/21/2022 02:02:41 PM script INFO: SUCCESS!@#KODE 1!@#USER_ID 48!@#ACTIVITY_CODE 1
12/21/2022 02:02:41 PM script INFO: SUCCESS!@#KODE 1!@#USER_ID 48!@#ACTIVITY_CODE 4
12/21/2022 02:02:41 PM script INFO: SUCCESS!@#KODE 1!@#USER_ID 48!@#ACTIVITY_CODE 1
12/21/2022 02:02:41 PM script INFO: SUCCESS!@#KODE 1!@#USER_ID 48!@#ACTIVITY_CODE 3
12/21/2022 02:02:42 PM script INFO: SUCCESS!@#KODE 1!@#USER_ID 48!@#ACTIVITY_CODE 3
12/21/2022 02:02:42 PM script INFO: SUCCESS!@#KODE 1!@#USER_ID 48!@#ACTIVITY_CODE 3
12/21/2022 02:02:42 PM script INFO: SUCCESS!@#KODE 1!@#USER_ID 48!@#ACTIVITY_CODE 2
12/21/2022 02:02:42 PM script INFO: SUCCESS!@#KODE 1!@#USER_ID 48!@#ACTIVITY_CODE 2
12/21/2022 02:02:42 PM script INFO: SUCCESS!@#KODE 1!@#USER_ID 48!@#ACTIVITY_CODE 2
12/21/2022 02:02:42 PM script INFO: SUCCESS!@#KODE 1!@#USER_ID 48!@#ACTIVITY_CODE 1
12/21/2022 02:02:42 PM script INFO: SUCCESS!@#KODE 1!@#USER_ID 48!@#ACTIVITY_CODE 2
12/21/2022 02:02:43 PM script INFO: SUCCESS!@#KODE 1!@#USER_ID 48!@#ACTIVITY_CODE 1
12/21/2022 02:02:43 PM script INFO: SUCCESS!@#KODE 1!@#USER_ID 48!@#ACTIVITY_CODE 4
12/21/2022 02:02:43 PM script INFO: SUCCESS!@#KODE 1!@#USER_ID 48!@#ACTIVITY_CODE 1
12/21/2022 02:02:43 PM script INFO: SUCCESS!@#KODE 1!@#USER_ID 48!@#ACTIVITY_CODE 3
12/21/2022 02:02:43 PM script INFO: SUCCESS!@#KODE 1!@#USER_ID 48!@#ACTIVITY_CODE 3
12/21/2022 02:02:43 PM script INFO: SUCCESS!@#KODE 1!@#USER_ID 48!@#ACTIVITY_CODE 1
12/21/2022 02:02:43 PM script INFO: SUCCESS!@#KODE 1!@#USER_ID 48!@#ACTIVITY_CODE 3
12/21/2022 02:02:43 PM script INFO: SUCCESS!@#KODE 1!@#USER_ID 48!@#ACTIVITY_CODE 1
12/21/2022 02:02:43 PM script INFO: SUCCESS!@#KODE 1!@#USER_ID 48!@#ACTIVITY_CODE 1
12/21/2022 02:02:43 PM script INFO: SUCCESS!@#KODE 1!@#USER_ID 48!@#ACTIVITY_CODE 4
12/21/2022 02:02:43 PM script INFO: SUCCESS!@#KODE 1!@#USER_ID 48!@#ACTIVITY_CODE 3
12/21/2022 02:02:43 PM script INFO: SUCCESS!@#KODE 1!@#USER_ID 48!@#ACTIVITY_CODE 1
12/21/2022 02:02:43 PM script INFO: SUCCESS!@#KODE 1!@#USER_ID 48!@#ACTIVITY_CODE 4
12/21/2022 02:02:44 PM script INFO: SUCCESS!@#KODE 1!@#USER_ID 48!@#ACTIVITY_CODE 2
12/21/2022 02:02:44 PM script INFO: SUCCESS!@#KODE 1!@#USER_ID 48!@#ACTIVITY_CODE 3
12/21/2022 02:02:44 PM script INFO: SUCCESS!@#KODE 1!@#USER_ID 48!@#ACTIVITY_CODE 2
12/21/2022 02:02:44 PM script INFO: SUCCESS!@#KODE 1!@#USER_ID 48!@#ACTIVITY_CODE 3
12/21/2022 02:02:44 PM script INFO: SUCCESS!@#KODE 1!@#USER_ID 48!@#ACTIVITY_CODE 1
12/21/2022 02:02:44 PM script INFO: SUCCESS!@#KODE 1!@#USER_ID 48!@#ACTIVITY_CODE 1
12/21/2022 02:02:44 PM script INFO: SUCCESS!@#KODE 1!@#USER_ID 48!@#ACTIVITY_CODE 3
12/21/2022 02:02:44 PM script INFO: SUCCESS!@#KODE 1!@#USER_ID 48!@#ACTIVITY_CODE 3
12/21/2022 02:02:44 PM script INFO: SUCCESS!@#KODE 1!@#USER_ID 48!@#ACTIVITY_CODE 1
12/21/2022 02:02:44 PM script INFO: SUCCESS!@#KODE 1!@#USER_ID 48!@#ACTIVITY_CODE 3
12/21/2022 02:02:45 PM script INFO: SUCCESS!@#KODE 1!@#USER_ID 48!@#ACTIVITY_CODE 3
12/21/2022 02:02:45 PM script INFO: SUCCESS!@#KODE 1!@#USER_ID 48!@#ACTIVITY_CODE 4
12/21/2022 02:02:45 PM script INFO: SUCCESS!@#KODE 1!@#USER_ID 48!@#ACTIVITY_CODE 3
12/21/2022 02:02:45 PM script INFO: SUCCESS!@#KODE 1!@#USER_ID 48!@#ACTIVITY_CODE 3
12/21/2022 02:02:45 PM script INFO: SUCCESS!@#KODE 1!@#USER_ID 48!@#ACTIVITY_CODE 2
12/21/2022 02:02:45 PM script INFO: SUCCESS!@#KODE 1!@#USER_ID 48!@#ACTIVITY_CODE 3
12/21/2022 02:02:45 PM script INFO: SUCCESS!@#KODE 1!@#USER_ID 48!@#ACTIVITY_CODE 3
12/21/2022 02:02:45 PM script INFO: SUCCESS!@#KODE 1!@#USER_ID 48!@#ACTIVITY_CODE 2
12/21/2022 02:02:45 PM script INFO: SUCCESS!@#KODE 1!@#USER_ID 48!@#ACTIVITY_CODE 1
12/21/2022 02:02:45 PM script INFO: SUCCESS!@#KODE 1!@#USER_ID 48!@#ACTIVITY_CODE 2
12/21/2022 02:02:46 PM script INFO: SUCCESS!@#KODE 1!@#USER_ID 48!@#ACTIVITY_CODE 3
12/21/2022 02:02:46 PM script INFO: SUCCESS!@#KODE 1!@#USER_ID 48!@#ACTIVITY_CODE 3
12/21/2022 02:02:46 PM script INFO: SUCCESS!@#KODE 1!@#USER_ID 48!@#ACTIVITY_CODE 1
12/21/2022 02:02:46 PM script INFO: SUCCESS!@#KODE 1!@#USER_ID 48!@#ACTIVITY_CODE 2
12/21/2022 02:02:46 PM script INFO: SUCCESS!@#KODE 1!@#USER_ID 48!@#ACTIVITY_CODE 1
12/21/2022 02:02:46 PM script INFO: SUCCESS!@#KODE 1!@#USER_ID 48!@#ACTIVITY_CODE 3
12/21/2022 02:02:46 PM script INFO: SUCCESS!@#KODE 1!@#USER_ID 48!@#ACTIVITY_CODE 4
12/21/2022 02:02:46 PM script INFO: SUCCESS!@#KODE 1!@#USER_ID 48!@#ACTIVITY_CODE 2
12/21/2022 02:02:46 PM script INFO: SUCCESS!@#KODE 1!@#USER_ID 48!@#ACTIVITY_CODE 3
12/21/2022 02:02:46 PM script INFO: SUCCESS!@#KODE 1!@#USER_ID 48!@#ACTIVITY_CODE 4
12/21/2022 02:02:46 PM script INFO: SUCCESS!@#KODE 1!@#USER_ID 48!@#ACTIVITY_CODE 1
12/21/2022 02:02:47 PM script INFO: SUCCESS!@#KODE 1!@#USER_ID 48!@#ACTIVITY_CODE 4
12/21/2022 02:02:47 PM script INFO: SUCCESS!@#KODE 1!@#USER_ID 48!@#ACTIVITY_CODE 1
12/21/2022 02:02:47 PM script INFO: SUCCESS!@#KODE 1!@#USER_ID 48!@#ACTIVITY_CODE 2
12/21/2022 02:02:47 PM script INFO: SUCCESS!@#KODE 1!@#USER_ID 48!@#ACTIVITY_CODE 1
12/21/2022 02:02:47 PM script INFO: Duration: 120.0081856250763
12/21/2022 02:02:47 PM script INFO: mengakhiri-quiz
12/21/2022 02:02:55 PM script INFO: SUCCESS!@#KODE 1!@#USER_ID 48!@#ACTIVITY_CODE 5
12/21/2022 02:02:55 PM script INFO: berhasil-submit
12/21/2022 02:04:25 PM script ERROR: TIMEOUT EXCEPTION!@#KODE 0!@#LOCATION berhasil-submit
12/21/2022 02:04:25 PM main_worker ERROR: Message: None

