12/23/2022 04:26:04 AM script INFO: Prepared chrome options..
12/23/2022 04:26:06 AM script INFO: Initialized chrome browser..
12/23/2022 04:26:06 AM script INFO: mengakses-homepage
12/23/2022 04:26:48 AM script INFO: mengakses-login-page
12/23/2022 04:27:19 AM script INFO: mengakses-site-home
12/23/2022 04:27:51 AM script INFO: mengakses-site-course
12/23/2022 04:28:23 AM script INFO: mengakses-quiz
12/23/2022 04:28:33 AM script INFO: mengakses-start-quiz-page
12/23/2022 04:29:30 AM script INFO: memulai-quiz
12/23/2022 04:29:30 AM script INFO: SUCCESS!@#KODE 1!@#USER_ID 54!@#ACTIVITY_CODE 5
12/23/2022 04:29:41 AM script INFO: SUCCESS!@#KODE 1!@#USER_ID 54!@#ACTIVITY_CODE 2
12/23/2022 04:29:41 AM script INFO: SUCCESS!@#KODE 1!@#USER_ID 54!@#ACTIVITY_CODE 1
12/23/2022 04:29:41 AM script INFO: SUCCESS!@#KODE 1!@#USER_ID 54!@#ACTIVITY_CODE 5
12/23/2022 04:29:41 AM script INFO: SUCCESS!@#KODE 1!@#USER_ID 54!@#ACTIVITY_CODE 5
12/23/2022 04:29:43 AM script INFO: SUCCESS!@#KODE 1!@#USER_ID 54!@#ACTIVITY_CODE 3
12/23/2022 04:29:43 AM script INFO: SUCCESS!@#KODE 1!@#USER_ID 54!@#ACTIVITY_CODE 5
12/23/2022 04:29:43 AM script INFO: SUCCESS!@#KODE 1!@#USER_ID 54!@#ACTIVITY_CODE 5
12/23/2022 04:29:46 AM script INFO: SUCCESS!@#KODE 1!@#USER_ID 54!@#ACTIVITY_CODE 1
12/23/2022 04:29:46 AM script INFO: SUCCESS!@#KODE 1!@#USER_ID 54!@#ACTIVITY_CODE 1
12/23/2022 04:29:46 AM script INFO: SUCCESS!@#KODE 1!@#USER_ID 54!@#ACTIVITY_CODE 1
12/23/2022 04:29:46 AM script INFO: SUCCESS!@#KODE 1!@#USER_ID 54!@#ACTIVITY_CODE 2
12/23/2022 04:29:46 AM script INFO: SUCCESS!@#KODE 1!@#USER_ID 54!@#ACTIVITY_CODE 5
12/23/2022 04:29:46 AM script INFO: SUCCESS!@#KODE 1!@#USER_ID 54!@#ACTIVITY_CODE 5
12/23/2022 04:29:49 AM script INFO: SUCCESS!@#KODE 1!@#USER_ID 54!@#ACTIVITY_CODE 2
12/23/2022 04:29:49 AM script INFO: SUCCESS!@#KODE 1!@#USER_ID 54!@#ACTIVITY_CODE 3
12/23/2022 04:29:49 AM script INFO: SUCCESS!@#KODE 1!@#USER_ID 54!@#ACTIVITY_CODE 5
12/23/2022 04:29:49 AM script INFO: SUCCESS!@#KODE 1!@#USER_ID 54!@#ACTIVITY_CODE 5
12/23/2022 04:29:51 AM script INFO: SUCCESS!@#KODE 1!@#USER_ID 54!@#ACTIVITY_CODE 5
12/23/2022 04:29:51 AM script INFO: SUCCESS!@#KODE 1!@#USER_ID 54!@#ACTIVITY_CODE 5
12/23/2022 04:29:54 AM script INFO: SUCCESS!@#KODE 1!@#USER_ID 54!@#ACTIVITY_CODE 1
12/23/2022 04:29:54 AM script INFO: SUCCESS!@#KODE 1!@#USER_ID 54!@#ACTIVITY_CODE 3
12/23/2022 04:29:54 AM script INFO: SUCCESS!@#KODE 1!@#USER_ID 54!@#ACTIVITY_CODE 4
12/23/2022 04:29:54 AM script INFO: SUCCESS!@#KODE 1!@#USER_ID 54!@#ACTIVITY_CODE 2
12/23/2022 04:29:54 AM script INFO: SUCCESS!@#KODE 1!@#USER_ID 54!@#ACTIVITY_CODE 1
12/23/2022 04:29:54 AM script INFO: SUCCESS!@#KODE 1!@#USER_ID 54!@#ACTIVITY_CODE 1
12/23/2022 04:29:54 AM script INFO: SUCCESS!@#KODE 1!@#USER_ID 54!@#ACTIVITY_CODE 3
12/23/2022 04:29:54 AM script INFO: SUCCESS!@#KODE 1!@#USER_ID 54!@#ACTIVITY_CODE 1
12/23/2022 04:29:54 AM script INFO: SUCCESS!@#KODE 1!@#USER_ID 54!@#ACTIVITY_CODE 2
12/23/2022 04:29:55 AM script INFO: SUCCESS!@#KODE 1!@#USER_ID 54!@#ACTIVITY_CODE 1
12/23/2022 04:29:55 AM script INFO: SUCCESS!@#KODE 1!@#USER_ID 54!@#ACTIVITY_CODE 1
12/23/2022 04:29:55 AM script INFO: SUCCESS!@#KODE 1!@#USER_ID 54!@#ACTIVITY_CODE 5
12/23/2022 04:29:55 AM script INFO: SUCCESS!@#KODE 1!@#USER_ID 54!@#ACTIVITY_CODE 5
12/23/2022 04:29:57 AM script INFO: SUCCESS!@#KODE 1!@#USER_ID 54!@#ACTIVITY_CODE 4
12/23/2022 04:29:57 AM script INFO: SUCCESS!@#KODE 1!@#USER_ID 54!@#ACTIVITY_CODE 3
12/23/2022 04:29:57 AM script INFO: SUCCESS!@#KODE 1!@#USER_ID 54!@#ACTIVITY_CODE 2
12/23/2022 04:29:57 AM script INFO: SUCCESS!@#KODE 1!@#USER_ID 54!@#ACTIVITY_CODE 1
12/23/2022 04:29:57 AM script INFO: SUCCESS!@#KODE 1!@#USER_ID 54!@#ACTIVITY_CODE 3
12/23/2022 04:29:57 AM script INFO: SUCCESS!@#KODE 1!@#USER_ID 54!@#ACTIVITY_CODE 3
12/23/2022 04:29:58 AM script INFO: SUCCESS!@#KODE 1!@#USER_ID 54!@#ACTIVITY_CODE 1
12/23/2022 04:29:58 AM script INFO: SUCCESS!@#KODE 1!@#USER_ID 54!@#ACTIVITY_CODE 5
12/23/2022 04:29:58 AM script INFO: SUCCESS!@#KODE 1!@#USER_ID 54!@#ACTIVITY_CODE 5
12/23/2022 04:30:00 AM script INFO: SUCCESS!@#KODE 1!@#USER_ID 54!@#ACTIVITY_CODE 1
12/23/2022 04:30:00 AM script INFO: SUCCESS!@#KODE 1!@#USER_ID 54!@#ACTIVITY_CODE 1
12/23/2022 04:30:00 AM script INFO: SUCCESS!@#KODE 1!@#USER_ID 54!@#ACTIVITY_CODE 1
12/23/2022 04:30:00 AM script INFO: SUCCESS!@#KODE 1!@#USER_ID 54!@#ACTIVITY_CODE 2
12/23/2022 04:30:00 AM script INFO: SUCCESS!@#KODE 1!@#USER_ID 54!@#ACTIVITY_CODE 4
12/23/2022 04:30:00 AM script INFO: SUCCESS!@#KODE 1!@#USER_ID 54!@#ACTIVITY_CODE 1
12/23/2022 04:30:00 AM script INFO: SUCCESS!@#KODE 1!@#USER_ID 54!@#ACTIVITY_CODE 5
12/23/2022 04:30:00 AM script INFO: SUCCESS!@#KODE 1!@#USER_ID 54!@#ACTIVITY_CODE 5
12/23/2022 04:30:03 AM script INFO: SUCCESS!@#KODE 1!@#USER_ID 54!@#ACTIVITY_CODE 4
12/23/2022 04:30:03 AM script INFO: SUCCESS!@#KODE 1!@#USER_ID 54!@#ACTIVITY_CODE 3
12/23/2022 04:30:03 AM script INFO: SUCCESS!@#KODE 1!@#USER_ID 54!@#ACTIVITY_CODE 3
12/23/2022 04:30:03 AM script INFO: SUCCESS!@#KODE 1!@#USER_ID 54!@#ACTIVITY_CODE 5
12/23/2022 04:30:03 AM script INFO: SUCCESS!@#KODE 1!@#USER_ID 54!@#ACTIVITY_CODE 5
12/23/2022 04:30:06 AM script INFO: SUCCESS!@#KODE 1!@#USER_ID 54!@#ACTIVITY_CODE 5
12/23/2022 04:30:06 AM script INFO: SUCCESS!@#KODE 1!@#USER_ID 54!@#ACTIVITY_CODE 5
12/23/2022 04:30:08 AM script INFO: SUCCESS!@#KODE 1!@#USER_ID 54!@#ACTIVITY_CODE 3
12/23/2022 04:30:08 AM script INFO: SUCCESS!@#KODE 1!@#USER_ID 54!@#ACTIVITY_CODE 2
12/23/2022 04:30:08 AM script INFO: SUCCESS!@#KODE 1!@#USER_ID 54!@#ACTIVITY_CODE 5
12/23/2022 04:30:08 AM script INFO: SUCCESS!@#KODE 1!@#USER_ID 54!@#ACTIVITY_CODE 5
12/23/2022 04:30:11 AM script INFO: SUCCESS!@#KODE 1!@#USER_ID 54!@#ACTIVITY_CODE 3
12/23/2022 04:30:11 AM script INFO: SUCCESS!@#KODE 1!@#USER_ID 54!@#ACTIVITY_CODE 1
12/23/2022 04:30:11 AM script INFO: SUCCESS!@#KODE 1!@#USER_ID 54!@#ACTIVITY_CODE 2
12/23/2022 04:30:11 AM script INFO: SUCCESS!@#KODE 1!@#USER_ID 54!@#ACTIVITY_CODE 2
12/23/2022 04:30:11 AM script INFO: SUCCESS!@#KODE 1!@#USER_ID 54!@#ACTIVITY_CODE 3
12/23/2022 04:30:11 AM script INFO: SUCCESS!@#KODE 1!@#USER_ID 54!@#ACTIVITY_CODE 2
12/23/2022 04:30:11 AM script INFO: SUCCESS!@#KODE 1!@#USER_ID 54!@#ACTIVITY_CODE 1
12/23/2022 04:30:11 AM script INFO: SUCCESS!@#KODE 1!@#USER_ID 54!@#ACTIVITY_CODE 2
12/23/2022 04:30:11 AM script INFO: SUCCESS!@#KODE 1!@#USER_ID 54!@#ACTIVITY_CODE 1
12/23/2022 04:30:12 AM script INFO: SUCCESS!@#KODE 1!@#USER_ID 54!@#ACTIVITY_CODE 2
12/23/2022 04:30:12 AM script INFO: SUCCESS!@#KODE 1!@#USER_ID 54!@#ACTIVITY_CODE 1
12/23/2022 04:30:12 AM script INFO: SUCCESS!@#KODE 1!@#USER_ID 54!@#ACTIVITY_CODE 4
12/23/2022 04:30:12 AM script INFO: SUCCESS!@#KODE 1!@#USER_ID 54!@#ACTIVITY_CODE 3
12/23/2022 04:30:12 AM script INFO: SUCCESS!@#KODE 1!@#USER_ID 54!@#ACTIVITY_CODE 2
12/23/2022 04:30:12 AM script INFO: SUCCESS!@#KODE 1!@#USER_ID 54!@#ACTIVITY_CODE 2
12/23/2022 04:30:12 AM script INFO: SUCCESS!@#KODE 1!@#USER_ID 54!@#ACTIVITY_CODE 3
12/23/2022 04:30:12 AM script INFO: SUCCESS!@#KODE 1!@#USER_ID 54!@#ACTIVITY_CODE 1
12/23/2022 04:30:12 AM script INFO: SUCCESS!@#KODE 1!@#USER_ID 54!@#ACTIVITY_CODE 1
12/23/2022 04:30:12 AM script INFO: SUCCESS!@#KODE 1!@#USER_ID 54!@#ACTIVITY_CODE 1
12/23/2022 04:30:12 AM script INFO: SUCCESS!@#KODE 1!@#USER_ID 54!@#ACTIVITY_CODE 3
12/23/2022 04:30:12 AM script INFO: SUCCESS!@#KODE 1!@#USER_ID 54!@#ACTIVITY_CODE 3
12/23/2022 04:30:12 AM script INFO: SUCCESS!@#KODE 1!@#USER_ID 54!@#ACTIVITY_CODE 3
12/23/2022 04:30:12 AM script INFO: SUCCESS!@#KODE 1!@#USER_ID 54!@#ACTIVITY_CODE 2
12/23/2022 04:30:12 AM script INFO: SUCCESS!@#KODE 1!@#USER_ID 54!@#ACTIVITY_CODE 2
12/23/2022 04:30:13 AM script INFO: SUCCESS!@#KODE 1!@#USER_ID 54!@#ACTIVITY_CODE 2
12/23/2022 04:30:13 AM script INFO: SUCCESS!@#KODE 1!@#USER_ID 54!@#ACTIVITY_CODE 2
12/23/2022 04:30:13 AM script INFO: SUCCESS!@#KODE 1!@#USER_ID 54!@#ACTIVITY_CODE 2
12/23/2022 04:30:13 AM script INFO: SUCCESS!@#KODE 1!@#USER_ID 54!@#ACTIVITY_CODE 1
12/23/2022 04:30:13 AM script INFO: SUCCESS!@#KODE 1!@#USER_ID 54!@#ACTIVITY_CODE 2
12/23/2022 04:30:13 AM script INFO: SUCCESS!@#KODE 1!@#USER_ID 54!@#ACTIVITY_CODE 4
12/23/2022 04:30:13 AM script INFO: SUCCESS!@#KODE 1!@#USER_ID 54!@#ACTIVITY_CODE 1
12/23/2022 04:30:13 AM script INFO: SUCCESS!@#KODE 1!@#USER_ID 54!@#ACTIVITY_CODE 3
12/23/2022 04:30:13 AM script INFO: SUCCESS!@#KODE 1!@#USER_ID 54!@#ACTIVITY_CODE 3
12/23/2022 04:30:13 AM script INFO: SUCCESS!@#KODE 1!@#USER_ID 54!@#ACTIVITY_CODE 3
12/23/2022 04:30:13 AM script INFO: SUCCESS!@#KODE 1!@#USER_ID 54!@#ACTIVITY_CODE 4
12/23/2022 04:30:13 AM script INFO: SUCCESS!@#KODE 1!@#USER_ID 54!@#ACTIVITY_CODE 2
12/23/2022 04:30:13 AM script INFO: SUCCESS!@#KODE 1!@#USER_ID 54!@#ACTIVITY_CODE 2
12/23/2022 04:30:14 AM script INFO: SUCCESS!@#KODE 1!@#USER_ID 54!@#ACTIVITY_CODE 2
12/23/2022 04:30:14 AM script INFO: Duration: 32.98615884780884
12/23/2022 04:30:14 AM script INFO: mengakhiri-quiz
12/23/2022 04:30:17 AM script INFO: SUCCESS!@#KODE 1!@#USER_ID 54!@#ACTIVITY_CODE 5
12/23/2022 04:30:17 AM script INFO: berhasil-submit
