12/11/2022 03:05:19 PM script INFO: Prepared chrome options..
12/11/2022 03:05:21 PM script INFO: Initialized chrome browser..
12/11/2022 03:05:21 PM script INFO: mengakses-homepage
12/11/2022 03:05:54 PM script INFO: mengakses-login-page
12/11/2022 03:05:55 PM script INFO: mengakses-site-home
12/11/2022 03:05:56 PM script INFO: mengakses-site-course
12/11/2022 03:06:10 PM script INFO: mengakses-quiz
12/11/2022 03:06:24 PM script INFO: mengakses-start-quiz-page
12/11/2022 03:06:32 PM script INFO: memulai-quiz
12/11/2022 03:06:32 PM script INFO: SUCCESS!@#KODE 1!@#USER_ID 86!@#ACTIVITY_CODE 5
12/11/2022 03:06:43 PM script INFO: SUCCESS!@#KODE 1!@#USER_ID 86!@#ACTIVITY_CODE 1
12/11/2022 03:06:43 PM script INFO: SUCCESS!@#KODE 1!@#USER_ID 86!@#ACTIVITY_CODE 2
12/11/2022 03:06:43 PM script INFO: SUCCESS!@#KODE 1!@#USER_ID 86!@#ACTIVITY_CODE 5
12/11/2022 03:06:43 PM script INFO: SUCCESS!@#KODE 1!@#USER_ID 86!@#ACTIVITY_CODE 5
12/11/2022 03:06:46 PM script INFO: SUCCESS!@#KODE 1!@#USER_ID 86!@#ACTIVITY_CODE 3
12/11/2022 03:06:46 PM script INFO: SUCCESS!@#KODE 1!@#USER_ID 86!@#ACTIVITY_CODE 5
12/11/2022 03:06:46 PM script INFO: SUCCESS!@#KODE 1!@#USER_ID 86!@#ACTIVITY_CODE 5
12/11/2022 03:06:48 PM script INFO: SUCCESS!@#KODE 1!@#USER_ID 86!@#ACTIVITY_CODE 1
12/11/2022 03:06:48 PM script INFO: SUCCESS!@#KODE 1!@#USER_ID 86!@#ACTIVITY_CODE 3
12/11/2022 03:06:48 PM script INFO: SUCCESS!@#KODE 1!@#USER_ID 86!@#ACTIVITY_CODE 5
12/11/2022 03:06:48 PM script INFO: SUCCESS!@#KODE 1!@#USER_ID 86!@#ACTIVITY_CODE 5
12/11/2022 03:06:51 PM script INFO: SUCCESS!@#KODE 1!@#USER_ID 86!@#ACTIVITY_CODE 3
12/11/2022 03:06:51 PM script INFO: SUCCESS!@#KODE 1!@#USER_ID 86!@#ACTIVITY_CODE 1
12/11/2022 03:06:51 PM script INFO: SUCCESS!@#KODE 1!@#USER_ID 86!@#ACTIVITY_CODE 2
12/11/2022 03:06:51 PM script INFO: SUCCESS!@#KODE 1!@#USER_ID 86!@#ACTIVITY_CODE 2
12/11/2022 03:06:51 PM script INFO: SUCCESS!@#KODE 1!@#USER_ID 86!@#ACTIVITY_CODE 1
12/11/2022 03:06:51 PM script INFO: SUCCESS!@#KODE 1!@#USER_ID 86!@#ACTIVITY_CODE 4
12/11/2022 03:06:51 PM script INFO: SUCCESS!@#KODE 1!@#USER_ID 86!@#ACTIVITY_CODE 1
12/11/2022 03:06:51 PM script INFO: SUCCESS!@#KODE 1!@#USER_ID 86!@#ACTIVITY_CODE 5
12/11/2022 03:06:51 PM script INFO: SUCCESS!@#KODE 1!@#USER_ID 86!@#ACTIVITY_CODE 5
12/11/2022 03:06:54 PM script INFO: SUCCESS!@#KODE 1!@#USER_ID 86!@#ACTIVITY_CODE 4
12/11/2022 03:06:54 PM script INFO: SUCCESS!@#KODE 1!@#USER_ID 86!@#ACTIVITY_CODE 2
12/11/2022 03:06:54 PM script INFO: SUCCESS!@#KODE 1!@#USER_ID 86!@#ACTIVITY_CODE 3
12/11/2022 03:06:54 PM script INFO: SUCCESS!@#KODE 1!@#USER_ID 86!@#ACTIVITY_CODE 1
12/11/2022 03:06:54 PM script INFO: SUCCESS!@#KODE 1!@#USER_ID 86!@#ACTIVITY_CODE 2
12/11/2022 03:06:54 PM script INFO: SUCCESS!@#KODE 1!@#USER_ID 86!@#ACTIVITY_CODE 5
12/11/2022 03:06:54 PM script INFO: SUCCESS!@#KODE 1!@#USER_ID 86!@#ACTIVITY_CODE 5
12/11/2022 03:06:57 PM script INFO: SUCCESS!@#KODE 1!@#USER_ID 86!@#ACTIVITY_CODE 2
12/11/2022 03:06:57 PM script INFO: SUCCESS!@#KODE 1!@#USER_ID 86!@#ACTIVITY_CODE 1
12/11/2022 03:06:57 PM script INFO: SUCCESS!@#KODE 1!@#USER_ID 86!@#ACTIVITY_CODE 3
12/11/2022 03:06:57 PM script INFO: SUCCESS!@#KODE 1!@#USER_ID 86!@#ACTIVITY_CODE 3
12/11/2022 03:06:57 PM script INFO: SUCCESS!@#KODE 1!@#USER_ID 86!@#ACTIVITY_CODE 1
12/11/2022 03:06:57 PM script INFO: SUCCESS!@#KODE 1!@#USER_ID 86!@#ACTIVITY_CODE 4
12/11/2022 03:06:57 PM script INFO: SUCCESS!@#KODE 1!@#USER_ID 86!@#ACTIVITY_CODE 5
12/11/2022 03:06:57 PM script INFO: SUCCESS!@#KODE 1!@#USER_ID 86!@#ACTIVITY_CODE 5
12/11/2022 03:07:00 PM script INFO: SUCCESS!@#KODE 1!@#USER_ID 86!@#ACTIVITY_CODE 3
12/11/2022 03:07:00 PM script INFO: SUCCESS!@#KODE 1!@#USER_ID 86!@#ACTIVITY_CODE 3
12/11/2022 03:07:00 PM script INFO: SUCCESS!@#KODE 1!@#USER_ID 86!@#ACTIVITY_CODE 2
12/11/2022 03:07:00 PM script INFO: SUCCESS!@#KODE 1!@#USER_ID 86!@#ACTIVITY_CODE 4
12/11/2022 03:07:00 PM script INFO: SUCCESS!@#KODE 1!@#USER_ID 86!@#ACTIVITY_CODE 3
12/11/2022 03:07:00 PM script INFO: SUCCESS!@#KODE 1!@#USER_ID 86!@#ACTIVITY_CODE 1
12/11/2022 03:07:01 PM script INFO: SUCCESS!@#KODE 1!@#USER_ID 86!@#ACTIVITY_CODE 2
12/11/2022 03:07:01 PM script INFO: SUCCESS!@#KODE 1!@#USER_ID 86!@#ACTIVITY_CODE 1
12/11/2022 03:07:01 PM script INFO: SUCCESS!@#KODE 1!@#USER_ID 86!@#ACTIVITY_CODE 2
12/11/2022 03:07:01 PM script INFO: SUCCESS!@#KODE 1!@#USER_ID 86!@#ACTIVITY_CODE 2
12/11/2022 03:07:01 PM script INFO: SUCCESS!@#KODE 1!@#USER_ID 86!@#ACTIVITY_CODE 3
12/11/2022 03:07:01 PM script INFO: SUCCESS!@#KODE 1!@#USER_ID 86!@#ACTIVITY_CODE 3
12/11/2022 03:07:01 PM script INFO: SUCCESS!@#KODE 1!@#USER_ID 86!@#ACTIVITY_CODE 1
12/11/2022 03:07:01 PM script INFO: Duration: 18.135718822479248
12/11/2022 03:07:01 PM script INFO: mengakhiri-quiz
12/11/2022 03:07:02 PM script INFO: SUCCESS!@#KODE 1!@#USER_ID 86!@#ACTIVITY_CODE 5
12/11/2022 03:07:02 PM script INFO: berhasil-submit
