12/23/2022 07:04:05 AM script INFO: Prepared chrome options..
12/23/2022 07:04:07 AM script INFO: Initialized chrome browser..
12/23/2022 07:04:07 AM script INFO: mengakses-homepage
12/23/2022 07:04:46 AM script INFO: mengakses-login-page
12/23/2022 07:04:57 AM script INFO: mengakses-site-home
12/23/2022 07:04:57 AM script INFO: mengakses-site-course
12/23/2022 07:05:06 AM script INFO: mengakses-quiz
12/23/2022 07:05:07 AM script INFO: mengakses-start-quiz-page
12/23/2022 07:05:08 AM script INFO: memulai-quiz
12/23/2022 07:05:08 AM script INFO: SUCCESS!@#KODE 1!@#USER_ID 100!@#ACTIVITY_CODE 5
12/23/2022 07:05:18 AM script INFO: SUCCESS!@#KODE 1!@#USER_ID 100!@#ACTIVITY_CODE 5
12/23/2022 07:05:18 AM script INFO: SUCCESS!@#KODE 1!@#USER_ID 100!@#ACTIVITY_CODE 5
12/23/2022 07:05:21 AM script INFO: SUCCESS!@#KODE 1!@#USER_ID 100!@#ACTIVITY_CODE 2
12/23/2022 07:05:21 AM script INFO: SUCCESS!@#KODE 1!@#USER_ID 100!@#ACTIVITY_CODE 1
12/23/2022 07:05:21 AM script INFO: SUCCESS!@#KODE 1!@#USER_ID 100!@#ACTIVITY_CODE 2
12/23/2022 07:05:21 AM script INFO: SUCCESS!@#KODE 1!@#USER_ID 100!@#ACTIVITY_CODE 5
12/23/2022 07:05:21 AM script INFO: SUCCESS!@#KODE 1!@#USER_ID 100!@#ACTIVITY_CODE 5
12/23/2022 07:05:24 AM script INFO: SUCCESS!@#KODE 1!@#USER_ID 100!@#ACTIVITY_CODE 2
12/23/2022 07:05:24 AM script INFO: SUCCESS!@#KODE 1!@#USER_ID 100!@#ACTIVITY_CODE 1
12/23/2022 07:05:24 AM script INFO: SUCCESS!@#KODE 1!@#USER_ID 100!@#ACTIVITY_CODE 1
12/23/2022 07:05:24 AM script INFO: SUCCESS!@#KODE 1!@#USER_ID 100!@#ACTIVITY_CODE 4
12/23/2022 07:05:24 AM script INFO: SUCCESS!@#KODE 1!@#USER_ID 100!@#ACTIVITY_CODE 2
12/23/2022 07:05:24 AM script INFO: SUCCESS!@#KODE 1!@#USER_ID 100!@#ACTIVITY_CODE 1
12/23/2022 07:05:24 AM script INFO: SUCCESS!@#KODE 1!@#USER_ID 100!@#ACTIVITY_CODE 2
12/23/2022 07:05:24 AM script INFO: SUCCESS!@#KODE 1!@#USER_ID 100!@#ACTIVITY_CODE 1
12/23/2022 07:05:24 AM script INFO: SUCCESS!@#KODE 1!@#USER_ID 100!@#ACTIVITY_CODE 1
12/23/2022 07:05:24 AM script INFO: SUCCESS!@#KODE 1!@#USER_ID 100!@#ACTIVITY_CODE 4
12/23/2022 07:05:24 AM script INFO: SUCCESS!@#KODE 1!@#USER_ID 100!@#ACTIVITY_CODE 5
12/23/2022 07:05:24 AM script INFO: SUCCESS!@#KODE 1!@#USER_ID 100!@#ACTIVITY_CODE 5
12/23/2022 07:05:27 AM script INFO: SUCCESS!@#KODE 1!@#USER_ID 100!@#ACTIVITY_CODE 2
12/23/2022 07:05:27 AM script INFO: SUCCESS!@#KODE 1!@#USER_ID 100!@#ACTIVITY_CODE 3
12/23/2022 07:05:27 AM script INFO: SUCCESS!@#KODE 1!@#USER_ID 100!@#ACTIVITY_CODE 3
12/23/2022 07:05:27 AM script INFO: SUCCESS!@#KODE 1!@#USER_ID 100!@#ACTIVITY_CODE 2
12/23/2022 07:05:27 AM script INFO: SUCCESS!@#KODE 1!@#USER_ID 100!@#ACTIVITY_CODE 1
12/23/2022 07:05:27 AM script INFO: SUCCESS!@#KODE 1!@#USER_ID 100!@#ACTIVITY_CODE 2
12/23/2022 07:05:27 AM script INFO: SUCCESS!@#KODE 1!@#USER_ID 100!@#ACTIVITY_CODE 3
12/23/2022 07:05:27 AM script INFO: SUCCESS!@#KODE 1!@#USER_ID 100!@#ACTIVITY_CODE 5
12/23/2022 07:05:27 AM script INFO: SUCCESS!@#KODE 1!@#USER_ID 100!@#ACTIVITY_CODE 5
12/23/2022 07:05:30 AM script INFO: SUCCESS!@#KODE 1!@#USER_ID 100!@#ACTIVITY_CODE 5
12/23/2022 07:05:30 AM script INFO: SUCCESS!@#KODE 1!@#USER_ID 100!@#ACTIVITY_CODE 5
12/23/2022 07:05:33 AM script INFO: SUCCESS!@#KODE 1!@#USER_ID 100!@#ACTIVITY_CODE 3
12/23/2022 07:05:33 AM script INFO: SUCCESS!@#KODE 1!@#USER_ID 100!@#ACTIVITY_CODE 3
12/23/2022 07:05:33 AM script INFO: SUCCESS!@#KODE 1!@#USER_ID 100!@#ACTIVITY_CODE 1
12/23/2022 07:05:33 AM script INFO: SUCCESS!@#KODE 1!@#USER_ID 100!@#ACTIVITY_CODE 4
12/23/2022 07:05:33 AM script INFO: SUCCESS!@#KODE 1!@#USER_ID 100!@#ACTIVITY_CODE 3
12/23/2022 07:05:33 AM script INFO: SUCCESS!@#KODE 1!@#USER_ID 100!@#ACTIVITY_CODE 2
12/23/2022 07:05:33 AM script INFO: SUCCESS!@#KODE 1!@#USER_ID 100!@#ACTIVITY_CODE 5
12/23/2022 07:05:33 AM script INFO: SUCCESS!@#KODE 1!@#USER_ID 100!@#ACTIVITY_CODE 5
12/23/2022 07:05:36 AM script INFO: SUCCESS!@#KODE 1!@#USER_ID 100!@#ACTIVITY_CODE 1
12/23/2022 07:05:36 AM script INFO: SUCCESS!@#KODE 1!@#USER_ID 100!@#ACTIVITY_CODE 3
12/23/2022 07:05:36 AM script INFO: SUCCESS!@#KODE 1!@#USER_ID 100!@#ACTIVITY_CODE 3
12/23/2022 07:05:36 AM script INFO: SUCCESS!@#KODE 1!@#USER_ID 100!@#ACTIVITY_CODE 2
12/23/2022 07:05:36 AM script INFO: SUCCESS!@#KODE 1!@#USER_ID 100!@#ACTIVITY_CODE 4
12/23/2022 07:05:36 AM script INFO: SUCCESS!@#KODE 1!@#USER_ID 100!@#ACTIVITY_CODE 3
12/23/2022 07:05:36 AM script INFO: SUCCESS!@#KODE 1!@#USER_ID 100!@#ACTIVITY_CODE 2
12/23/2022 07:05:36 AM script INFO: SUCCESS!@#KODE 1!@#USER_ID 100!@#ACTIVITY_CODE 1
12/23/2022 07:05:36 AM script INFO: SUCCESS!@#KODE 1!@#USER_ID 100!@#ACTIVITY_CODE 4
12/23/2022 07:05:36 AM script INFO: SUCCESS!@#KODE 1!@#USER_ID 100!@#ACTIVITY_CODE 2
12/23/2022 07:05:36 AM script INFO: Duration: 18.005895853042603
12/23/2022 07:05:36 AM script INFO: mengakhiri-quiz
12/23/2022 07:05:37 AM script INFO: SUCCESS!@#KODE 1!@#USER_ID 100!@#ACTIVITY_CODE 5
12/23/2022 07:05:37 AM script INFO: berhasil-submit
