12/23/2022 01:06:08 AM script INFO: Prepared chrome options..
12/23/2022 01:06:10 AM script INFO: Initialized chrome browser..
12/23/2022 01:06:10 AM script INFO: mengakses-homepage
12/23/2022 01:07:42 AM script INFO: mengakses-login-page
12/23/2022 01:09:12 AM script ERROR: TIMEOUT EXCEPTION!@#KODE 0!@#LOCATION mengakses-login-page
12/23/2022 01:09:12 AM main_worker ERROR: Message: None

