12/12/2022 01:53:33 AM script INFO: Prepared chrome options..
12/12/2022 01:53:34 AM script INFO: Initialized chrome browser..
12/12/2022 01:53:34 AM script INFO: mengakses-homepage
12/12/2022 01:53:37 AM script INFO: mengakses-login-page
12/12/2022 01:53:38 AM script INFO: mengakses-site-home
12/12/2022 01:53:38 AM script INFO: mengakses-site-course
12/12/2022 01:53:39 AM script INFO: mengakses-quiz
12/12/2022 01:53:39 AM script INFO: mengakses-start-quiz-page
12/12/2022 01:53:41 AM script INFO: memulai-quiz
12/12/2022 01:53:41 AM script INFO: SUCCESS!@#KODE 1!@#USER_ID 9!@#ACTIVITY_CODE 5
12/12/2022 01:53:51 AM script INFO: SUCCESS!@#KODE 1!@#USER_ID 9!@#ACTIVITY_CODE 3
12/12/2022 01:53:51 AM script INFO: SUCCESS!@#KODE 1!@#USER_ID 9!@#ACTIVITY_CODE 1
12/12/2022 01:53:51 AM script INFO: SUCCESS!@#KODE 1!@#USER_ID 9!@#ACTIVITY_CODE 5
12/12/2022 01:53:51 AM script INFO: SUCCESS!@#KODE 1!@#USER_ID 9!@#ACTIVITY_CODE 5
12/12/2022 01:53:54 AM script INFO: SUCCESS!@#KODE 1!@#USER_ID 9!@#ACTIVITY_CODE 5
12/12/2022 01:53:54 AM script INFO: SUCCESS!@#KODE 1!@#USER_ID 9!@#ACTIVITY_CODE 5
12/12/2022 01:53:57 AM script INFO: SUCCESS!@#KODE 1!@#USER_ID 9!@#ACTIVITY_CODE 2
12/12/2022 01:53:57 AM script INFO: SUCCESS!@#KODE 1!@#USER_ID 9!@#ACTIVITY_CODE 5
12/12/2022 01:53:57 AM script INFO: SUCCESS!@#KODE 1!@#USER_ID 9!@#ACTIVITY_CODE 5
12/12/2022 01:53:59 AM script INFO: SUCCESS!@#KODE 1!@#USER_ID 9!@#ACTIVITY_CODE 3
12/12/2022 01:53:59 AM script INFO: SUCCESS!@#KODE 1!@#USER_ID 9!@#ACTIVITY_CODE 1
12/12/2022 01:53:59 AM script INFO: SUCCESS!@#KODE 1!@#USER_ID 9!@#ACTIVITY_CODE 1
12/12/2022 01:53:59 AM script INFO: SUCCESS!@#KODE 1!@#USER_ID 9!@#ACTIVITY_CODE 4
12/12/2022 01:53:59 AM script INFO: SUCCESS!@#KODE 1!@#USER_ID 9!@#ACTIVITY_CODE 5
12/12/2022 01:53:59 AM script INFO: SUCCESS!@#KODE 1!@#USER_ID 9!@#ACTIVITY_CODE 5
12/12/2022 01:54:02 AM script INFO: SUCCESS!@#KODE 1!@#USER_ID 9!@#ACTIVITY_CODE 5
12/12/2022 01:54:02 AM script INFO: SUCCESS!@#KODE 1!@#USER_ID 9!@#ACTIVITY_CODE 5
12/12/2022 01:54:04 AM script INFO: SUCCESS!@#KODE 1!@#USER_ID 9!@#ACTIVITY_CODE 3
12/12/2022 01:54:05 AM script INFO: SUCCESS!@#KODE 1!@#USER_ID 9!@#ACTIVITY_CODE 2
12/12/2022 01:54:05 AM script INFO: SUCCESS!@#KODE 1!@#USER_ID 9!@#ACTIVITY_CODE 3
12/12/2022 01:54:05 AM script INFO: SUCCESS!@#KODE 1!@#USER_ID 9!@#ACTIVITY_CODE 5
12/12/2022 01:54:05 AM script INFO: SUCCESS!@#KODE 1!@#USER_ID 9!@#ACTIVITY_CODE 5
12/12/2022 01:54:07 AM script INFO: SUCCESS!@#KODE 1!@#USER_ID 9!@#ACTIVITY_CODE 5
12/12/2022 01:54:07 AM script INFO: SUCCESS!@#KODE 1!@#USER_ID 9!@#ACTIVITY_CODE 5
12/12/2022 01:54:10 AM script INFO: SUCCESS!@#KODE 1!@#USER_ID 9!@#ACTIVITY_CODE 1
12/12/2022 01:54:10 AM script INFO: SUCCESS!@#KODE 1!@#USER_ID 9!@#ACTIVITY_CODE 1
12/12/2022 01:54:10 AM script INFO: SUCCESS!@#KODE 1!@#USER_ID 9!@#ACTIVITY_CODE 2
12/12/2022 01:54:10 AM script INFO: SUCCESS!@#KODE 1!@#USER_ID 9!@#ACTIVITY_CODE 1
12/12/2022 01:54:10 AM script INFO: SUCCESS!@#KODE 1!@#USER_ID 9!@#ACTIVITY_CODE 1
12/12/2022 01:54:10 AM script INFO: SUCCESS!@#KODE 1!@#USER_ID 9!@#ACTIVITY_CODE 5
12/12/2022 01:54:10 AM script INFO: SUCCESS!@#KODE 1!@#USER_ID 9!@#ACTIVITY_CODE 5
12/12/2022 01:54:13 AM script INFO: SUCCESS!@#KODE 1!@#USER_ID 9!@#ACTIVITY_CODE 4
12/12/2022 01:54:13 AM script INFO: SUCCESS!@#KODE 1!@#USER_ID 9!@#ACTIVITY_CODE 5
12/12/2022 01:54:13 AM script INFO: SUCCESS!@#KODE 1!@#USER_ID 9!@#ACTIVITY_CODE 5
12/12/2022 01:54:15 AM script INFO: SUCCESS!@#KODE 1!@#USER_ID 9!@#ACTIVITY_CODE 2
12/12/2022 01:54:15 AM script INFO: SUCCESS!@#KODE 1!@#USER_ID 9!@#ACTIVITY_CODE 3
12/12/2022 01:54:15 AM script INFO: SUCCESS!@#KODE 1!@#USER_ID 9!@#ACTIVITY_CODE 3
12/12/2022 01:54:16 AM script INFO: SUCCESS!@#KODE 1!@#USER_ID 9!@#ACTIVITY_CODE 2
12/12/2022 01:54:16 AM script INFO: SUCCESS!@#KODE 1!@#USER_ID 9!@#ACTIVITY_CODE 2
12/12/2022 01:54:16 AM script INFO: SUCCESS!@#KODE 1!@#USER_ID 9!@#ACTIVITY_CODE 5
12/12/2022 01:54:16 AM script INFO: SUCCESS!@#KODE 1!@#USER_ID 9!@#ACTIVITY_CODE 5
12/12/2022 01:54:18 AM script INFO: SUCCESS!@#KODE 1!@#USER_ID 9!@#ACTIVITY_CODE 5
12/12/2022 01:54:18 AM script INFO: SUCCESS!@#KODE 1!@#USER_ID 9!@#ACTIVITY_CODE 5
12/12/2022 01:54:21 AM script INFO: SUCCESS!@#KODE 1!@#USER_ID 9!@#ACTIVITY_CODE 1
12/12/2022 01:54:21 AM script INFO: SUCCESS!@#KODE 1!@#USER_ID 9!@#ACTIVITY_CODE 5
12/12/2022 01:54:21 AM script INFO: SUCCESS!@#KODE 1!@#USER_ID 9!@#ACTIVITY_CODE 5
12/12/2022 01:54:23 AM script INFO: SUCCESS!@#KODE 1!@#USER_ID 9!@#ACTIVITY_CODE 4
12/12/2022 01:54:24 AM script INFO: SUCCESS!@#KODE 1!@#USER_ID 9!@#ACTIVITY_CODE 3
12/12/2022 01:54:24 AM script INFO: SUCCESS!@#KODE 1!@#USER_ID 9!@#ACTIVITY_CODE 1
12/12/2022 01:54:24 AM script INFO: SUCCESS!@#KODE 1!@#USER_ID 9!@#ACTIVITY_CODE 5
12/12/2022 01:54:24 AM script INFO: SUCCESS!@#KODE 1!@#USER_ID 9!@#ACTIVITY_CODE 5
12/12/2022 01:54:26 AM script INFO: SUCCESS!@#KODE 1!@#USER_ID 9!@#ACTIVITY_CODE 3
12/12/2022 01:54:26 AM script INFO: SUCCESS!@#KODE 1!@#USER_ID 9!@#ACTIVITY_CODE 1
12/12/2022 01:54:26 AM script INFO: SUCCESS!@#KODE 1!@#USER_ID 9!@#ACTIVITY_CODE 3
12/12/2022 01:54:26 AM script INFO: SUCCESS!@#KODE 1!@#USER_ID 9!@#ACTIVITY_CODE 4
12/12/2022 01:54:26 AM script INFO: SUCCESS!@#KODE 1!@#USER_ID 9!@#ACTIVITY_CODE 5
12/12/2022 01:54:26 AM script INFO: SUCCESS!@#KODE 1!@#USER_ID 9!@#ACTIVITY_CODE 5
12/12/2022 01:54:29 AM script INFO: SUCCESS!@#KODE 1!@#USER_ID 9!@#ACTIVITY_CODE 5
12/12/2022 01:54:29 AM script INFO: SUCCESS!@#KODE 1!@#USER_ID 9!@#ACTIVITY_CODE 5
12/12/2022 01:54:32 AM script INFO: SUCCESS!@#KODE 1!@#USER_ID 9!@#ACTIVITY_CODE 2
12/12/2022 01:54:32 AM script INFO: SUCCESS!@#KODE 1!@#USER_ID 9!@#ACTIVITY_CODE 3
12/12/2022 01:54:32 AM script INFO: SUCCESS!@#KODE 1!@#USER_ID 9!@#ACTIVITY_CODE 4
12/12/2022 01:54:32 AM script INFO: SUCCESS!@#KODE 1!@#USER_ID 9!@#ACTIVITY_CODE 3
12/12/2022 01:54:32 AM script INFO: SUCCESS!@#KODE 1!@#USER_ID 9!@#ACTIVITY_CODE 1
12/12/2022 01:54:32 AM script INFO: SUCCESS!@#KODE 1!@#USER_ID 9!@#ACTIVITY_CODE 4
12/12/2022 01:54:32 AM script INFO: SUCCESS!@#KODE 1!@#USER_ID 9!@#ACTIVITY_CODE 3
12/12/2022 01:54:32 AM script INFO: SUCCESS!@#KODE 1!@#USER_ID 9!@#ACTIVITY_CODE 1
12/12/2022 01:54:32 AM script INFO: SUCCESS!@#KODE 1!@#USER_ID 9!@#ACTIVITY_CODE 5
12/12/2022 01:54:32 AM script INFO: SUCCESS!@#KODE 1!@#USER_ID 9!@#ACTIVITY_CODE 5
12/12/2022 01:54:35 AM script INFO: SUCCESS!@#KODE 1!@#USER_ID 9!@#ACTIVITY_CODE 1
12/12/2022 01:54:35 AM script INFO: SUCCESS!@#KODE 1!@#USER_ID 9!@#ACTIVITY_CODE 4
12/12/2022 01:54:35 AM script INFO: SUCCESS!@#KODE 1!@#USER_ID 9!@#ACTIVITY_CODE 1
12/12/2022 01:54:35 AM script INFO: SUCCESS!@#KODE 1!@#USER_ID 9!@#ACTIVITY_CODE 3
12/12/2022 01:54:35 AM script INFO: SUCCESS!@#KODE 1!@#USER_ID 9!@#ACTIVITY_CODE 3
12/12/2022 01:54:35 AM script INFO: SUCCESS!@#KODE 1!@#USER_ID 9!@#ACTIVITY_CODE 2
12/12/2022 01:54:35 AM script INFO: SUCCESS!@#KODE 1!@#USER_ID 9!@#ACTIVITY_CODE 1
12/12/2022 01:54:35 AM script INFO: SUCCESS!@#KODE 1!@#USER_ID 9!@#ACTIVITY_CODE 3
12/12/2022 01:54:35 AM script INFO: SUCCESS!@#KODE 1!@#USER_ID 9!@#ACTIVITY_CODE 1
12/12/2022 01:54:35 AM script INFO: SUCCESS!@#KODE 1!@#USER_ID 9!@#ACTIVITY_CODE 2
12/12/2022 01:54:35 AM script INFO: SUCCESS!@#KODE 1!@#USER_ID 9!@#ACTIVITY_CODE 5
12/12/2022 01:54:35 AM script INFO: SUCCESS!@#KODE 1!@#USER_ID 9!@#ACTIVITY_CODE 5
12/12/2022 01:54:38 AM script INFO: SUCCESS!@#KODE 1!@#USER_ID 9!@#ACTIVITY_CODE 4
12/12/2022 01:54:38 AM script INFO: SUCCESS!@#KODE 1!@#USER_ID 9!@#ACTIVITY_CODE 5
12/12/2022 01:54:38 AM script INFO: SUCCESS!@#KODE 1!@#USER_ID 9!@#ACTIVITY_CODE 5
12/12/2022 01:54:40 AM script INFO: SUCCESS!@#KODE 1!@#USER_ID 9!@#ACTIVITY_CODE 1
12/12/2022 01:54:40 AM script INFO: SUCCESS!@#KODE 1!@#USER_ID 9!@#ACTIVITY_CODE 3
12/12/2022 01:54:40 AM script INFO: SUCCESS!@#KODE 1!@#USER_ID 9!@#ACTIVITY_CODE 5
12/12/2022 01:54:40 AM script INFO: SUCCESS!@#KODE 1!@#USER_ID 9!@#ACTIVITY_CODE 5
12/12/2022 01:54:43 AM script INFO: SUCCESS!@#KODE 1!@#USER_ID 9!@#ACTIVITY_CODE 4
12/12/2022 01:54:43 AM script INFO: SUCCESS!@#KODE 1!@#USER_ID 9!@#ACTIVITY_CODE 3
12/12/2022 01:54:43 AM script INFO: SUCCESS!@#KODE 1!@#USER_ID 9!@#ACTIVITY_CODE 3
12/12/2022 01:54:43 AM script INFO: SUCCESS!@#KODE 1!@#USER_ID 9!@#ACTIVITY_CODE 1
12/12/2022 01:54:43 AM script INFO: SUCCESS!@#KODE 1!@#USER_ID 9!@#ACTIVITY_CODE 2
12/12/2022 01:54:43 AM script INFO: SUCCESS!@#KODE 1!@#USER_ID 9!@#ACTIVITY_CODE 1
12/12/2022 01:54:43 AM script INFO: SUCCESS!@#KODE 1!@#USER_ID 9!@#ACTIVITY_CODE 4
12/12/2022 01:54:43 AM script INFO: SUCCESS!@#KODE 1!@#USER_ID 9!@#ACTIVITY_CODE 3
12/12/2022 01:54:44 AM script INFO: SUCCESS!@#KODE 1!@#USER_ID 9!@#ACTIVITY_CODE 2
12/12/2022 01:54:44 AM script INFO: SUCCESS!@#KODE 1!@#USER_ID 9!@#ACTIVITY_CODE 5
12/12/2022 01:54:44 AM script INFO: SUCCESS!@#KODE 1!@#USER_ID 9!@#ACTIVITY_CODE 5
12/12/2022 01:54:46 AM script INFO: SUCCESS!@#KODE 1!@#USER_ID 9!@#ACTIVITY_CODE 1
12/12/2022 01:54:46 AM script INFO: SUCCESS!@#KODE 1!@#USER_ID 9!@#ACTIVITY_CODE 4
12/12/2022 01:54:46 AM script INFO: SUCCESS!@#KODE 1!@#USER_ID 9!@#ACTIVITY_CODE 5
12/12/2022 01:54:46 AM script INFO: SUCCESS!@#KODE 1!@#USER_ID 9!@#ACTIVITY_CODE 5
12/12/2022 01:54:49 AM script INFO: SUCCESS!@#KODE 1!@#USER_ID 9!@#ACTIVITY_CODE 3
12/12/2022 01:54:49 AM script INFO: SUCCESS!@#KODE 1!@#USER_ID 9!@#ACTIVITY_CODE 1
12/12/2022 01:54:49 AM script INFO: SUCCESS!@#KODE 1!@#USER_ID 9!@#ACTIVITY_CODE 2
12/12/2022 01:54:49 AM script INFO: SUCCESS!@#KODE 1!@#USER_ID 9!@#ACTIVITY_CODE 3
12/12/2022 01:54:49 AM script INFO: SUCCESS!@#KODE 1!@#USER_ID 9!@#ACTIVITY_CODE 3
12/12/2022 01:54:49 AM script INFO: SUCCESS!@#KODE 1!@#USER_ID 9!@#ACTIVITY_CODE 3
12/12/2022 01:54:49 AM script INFO: SUCCESS!@#KODE 1!@#USER_ID 9!@#ACTIVITY_CODE 2
12/12/2022 01:54:49 AM script INFO: SUCCESS!@#KODE 1!@#USER_ID 9!@#ACTIVITY_CODE 3
12/12/2022 01:54:50 AM script INFO: SUCCESS!@#KODE 1!@#USER_ID 9!@#ACTIVITY_CODE 2
12/12/2022 01:54:50 AM script INFO: SUCCESS!@#KODE 1!@#USER_ID 9!@#ACTIVITY_CODE 1
12/12/2022 01:54:50 AM script INFO: SUCCESS!@#KODE 1!@#USER_ID 9!@#ACTIVITY_CODE 3
12/12/2022 01:54:50 AM script INFO: SUCCESS!@#KODE 1!@#USER_ID 9!@#ACTIVITY_CODE 1
12/12/2022 01:54:50 AM script INFO: SUCCESS!@#KODE 1!@#USER_ID 9!@#ACTIVITY_CODE 2
12/12/2022 01:54:50 AM script INFO: SUCCESS!@#KODE 1!@#USER_ID 9!@#ACTIVITY_CODE 2
12/12/2022 01:54:50 AM script INFO: SUCCESS!@#KODE 1!@#USER_ID 9!@#ACTIVITY_CODE 1
12/12/2022 01:54:50 AM script INFO: SUCCESS!@#KODE 1!@#USER_ID 9!@#ACTIVITY_CODE 3
12/12/2022 01:54:50 AM script INFO: SUCCESS!@#KODE 1!@#USER_ID 9!@#ACTIVITY_CODE 2
12/12/2022 01:54:50 AM script INFO: SUCCESS!@#KODE 1!@#USER_ID 9!@#ACTIVITY_CODE 1
12/12/2022 01:54:50 AM script INFO: SUCCESS!@#KODE 1!@#USER_ID 9!@#ACTIVITY_CODE 3
12/12/2022 01:54:51 AM script INFO: SUCCESS!@#KODE 1!@#USER_ID 9!@#ACTIVITY_CODE 4
12/12/2022 01:54:51 AM script INFO: SUCCESS!@#KODE 1!@#USER_ID 9!@#ACTIVITY_CODE 1
12/12/2022 01:54:51 AM script INFO: SUCCESS!@#KODE 1!@#USER_ID 9!@#ACTIVITY_CODE 2
12/12/2022 01:54:51 AM script INFO: SUCCESS!@#KODE 1!@#USER_ID 9!@#ACTIVITY_CODE 3
12/12/2022 01:54:51 AM script INFO: SUCCESS!@#KODE 1!@#USER_ID 9!@#ACTIVITY_CODE 3
12/12/2022 01:54:51 AM script INFO: SUCCESS!@#KODE 1!@#USER_ID 9!@#ACTIVITY_CODE 1
12/12/2022 01:54:51 AM script INFO: SUCCESS!@#KODE 1!@#USER_ID 9!@#ACTIVITY_CODE 3
12/12/2022 01:54:51 AM script INFO: SUCCESS!@#KODE 1!@#USER_ID 9!@#ACTIVITY_CODE 4
12/12/2022 01:54:51 AM script INFO: SUCCESS!@#KODE 1!@#USER_ID 9!@#ACTIVITY_CODE 1
12/12/2022 01:54:51 AM script INFO: SUCCESS!@#KODE 1!@#USER_ID 9!@#ACTIVITY_CODE 4
12/12/2022 01:54:51 AM script INFO: SUCCESS!@#KODE 1!@#USER_ID 9!@#ACTIVITY_CODE 2
12/12/2022 01:54:51 AM script INFO: SUCCESS!@#KODE 1!@#USER_ID 9!@#ACTIVITY_CODE 1
12/12/2022 01:54:52 AM script INFO: SUCCESS!@#KODE 1!@#USER_ID 9!@#ACTIVITY_CODE 2
12/12/2022 01:54:52 AM script INFO: SUCCESS!@#KODE 1!@#USER_ID 9!@#ACTIVITY_CODE 2
12/12/2022 01:54:52 AM script INFO: SUCCESS!@#KODE 1!@#USER_ID 9!@#ACTIVITY_CODE 4
12/12/2022 01:54:52 AM script INFO: SUCCESS!@#KODE 1!@#USER_ID 9!@#ACTIVITY_CODE 1
12/12/2022 01:54:52 AM script INFO: SUCCESS!@#KODE 1!@#USER_ID 9!@#ACTIVITY_CODE 1
12/12/2022 01:54:52 AM script INFO: SUCCESS!@#KODE 1!@#USER_ID 9!@#ACTIVITY_CODE 1
12/12/2022 01:54:52 AM script INFO: SUCCESS!@#KODE 1!@#USER_ID 9!@#ACTIVITY_CODE 3
12/12/2022 01:54:52 AM script INFO: SUCCESS!@#KODE 1!@#USER_ID 9!@#ACTIVITY_CODE 3
12/12/2022 01:54:52 AM script INFO: SUCCESS!@#KODE 1!@#USER_ID 9!@#ACTIVITY_CODE 1
12/12/2022 01:54:52 AM script INFO: SUCCESS!@#KODE 1!@#USER_ID 9!@#ACTIVITY_CODE 3
12/12/2022 01:54:52 AM script INFO: SUCCESS!@#KODE 1!@#USER_ID 9!@#ACTIVITY_CODE 3
12/12/2022 01:54:52 AM script INFO: SUCCESS!@#KODE 1!@#USER_ID 9!@#ACTIVITY_CODE 2
12/12/2022 01:54:52 AM script INFO: SUCCESS!@#KODE 1!@#USER_ID 9!@#ACTIVITY_CODE 3
12/12/2022 01:54:53 AM script INFO: SUCCESS!@#KODE 1!@#USER_ID 9!@#ACTIVITY_CODE 1
12/12/2022 01:54:53 AM script INFO: SUCCESS!@#KODE 1!@#USER_ID 9!@#ACTIVITY_CODE 4
12/12/2022 01:54:53 AM script INFO: SUCCESS!@#KODE 1!@#USER_ID 9!@#ACTIVITY_CODE 2
12/12/2022 01:54:53 AM script INFO: SUCCESS!@#KODE 1!@#USER_ID 9!@#ACTIVITY_CODE 3
12/12/2022 01:54:53 AM script INFO: SUCCESS!@#KODE 1!@#USER_ID 9!@#ACTIVITY_CODE 1
12/12/2022 01:54:53 AM script INFO: SUCCESS!@#KODE 1!@#USER_ID 9!@#ACTIVITY_CODE 2
12/12/2022 01:54:53 AM script INFO: SUCCESS!@#KODE 1!@#USER_ID 9!@#ACTIVITY_CODE 4
12/12/2022 01:54:53 AM script INFO: SUCCESS!@#KODE 1!@#USER_ID 9!@#ACTIVITY_CODE 3
12/12/2022 01:54:53 AM script INFO: SUCCESS!@#KODE 1!@#USER_ID 9!@#ACTIVITY_CODE 3
12/12/2022 01:54:53 AM script INFO: SUCCESS!@#KODE 1!@#USER_ID 9!@#ACTIVITY_CODE 1
12/12/2022 01:54:53 AM script INFO: SUCCESS!@#KODE 1!@#USER_ID 9!@#ACTIVITY_CODE 3
12/12/2022 01:54:53 AM script INFO: SUCCESS!@#KODE 1!@#USER_ID 9!@#ACTIVITY_CODE 3
12/12/2022 01:54:54 AM script INFO: SUCCESS!@#KODE 1!@#USER_ID 9!@#ACTIVITY_CODE 4
12/12/2022 01:54:54 AM script INFO: SUCCESS!@#KODE 1!@#USER_ID 9!@#ACTIVITY_CODE 3
12/12/2022 01:54:54 AM script INFO: SUCCESS!@#KODE 1!@#USER_ID 9!@#ACTIVITY_CODE 1
12/12/2022 01:54:54 AM script INFO: SUCCESS!@#KODE 1!@#USER_ID 9!@#ACTIVITY_CODE 4
12/12/2022 01:54:54 AM script INFO: SUCCESS!@#KODE 1!@#USER_ID 9!@#ACTIVITY_CODE 3
12/12/2022 01:54:54 AM script INFO: SUCCESS!@#KODE 1!@#USER_ID 9!@#ACTIVITY_CODE 1
12/12/2022 01:54:54 AM script INFO: SUCCESS!@#KODE 1!@#USER_ID 9!@#ACTIVITY_CODE 3
12/12/2022 01:54:54 AM script INFO: SUCCESS!@#KODE 1!@#USER_ID 9!@#ACTIVITY_CODE 3
12/12/2022 01:54:54 AM script INFO: SUCCESS!@#KODE 1!@#USER_ID 9!@#ACTIVITY_CODE 1
12/12/2022 01:54:54 AM script INFO: SUCCESS!@#KODE 1!@#USER_ID 9!@#ACTIVITY_CODE 3
12/12/2022 01:54:54 AM script INFO: SUCCESS!@#KODE 1!@#USER_ID 9!@#ACTIVITY_CODE 3
12/12/2022 01:54:54 AM script INFO: SUCCESS!@#KODE 1!@#USER_ID 9!@#ACTIVITY_CODE 1
12/12/2022 01:54:54 AM script INFO: SUCCESS!@#KODE 1!@#USER_ID 9!@#ACTIVITY_CODE 3
12/12/2022 01:54:54 AM script INFO: SUCCESS!@#KODE 1!@#USER_ID 9!@#ACTIVITY_CODE 3
12/12/2022 01:54:54 AM script INFO: SUCCESS!@#KODE 1!@#USER_ID 9!@#ACTIVITY_CODE 3
12/12/2022 01:54:54 AM script INFO: SUCCESS!@#KODE 1!@#USER_ID 9!@#ACTIVITY_CODE 3
12/12/2022 01:54:54 AM script INFO: SUCCESS!@#KODE 1!@#USER_ID 9!@#ACTIVITY_CODE 3
12/12/2022 01:54:55 AM script INFO: SUCCESS!@#KODE 1!@#USER_ID 9!@#ACTIVITY_CODE 2
12/12/2022 01:54:55 AM script INFO: SUCCESS!@#KODE 1!@#USER_ID 9!@#ACTIVITY_CODE 3
12/12/2022 01:54:55 AM script INFO: SUCCESS!@#KODE 1!@#USER_ID 9!@#ACTIVITY_CODE 3
12/12/2022 01:54:55 AM script INFO: SUCCESS!@#KODE 1!@#USER_ID 9!@#ACTIVITY_CODE 2
12/12/2022 01:54:55 AM script INFO: SUCCESS!@#KODE 1!@#USER_ID 9!@#ACTIVITY_CODE 4
12/12/2022 01:54:55 AM script INFO: SUCCESS!@#KODE 1!@#USER_ID 9!@#ACTIVITY_CODE 2
12/12/2022 01:54:55 AM script INFO: SUCCESS!@#KODE 1!@#USER_ID 9!@#ACTIVITY_CODE 2
12/12/2022 01:54:55 AM script INFO: SUCCESS!@#KODE 1!@#USER_ID 9!@#ACTIVITY_CODE 1
12/12/2022 01:54:56 AM script INFO: SUCCESS!@#KODE 1!@#USER_ID 9!@#ACTIVITY_CODE 2
12/12/2022 01:54:56 AM script INFO: SUCCESS!@#KODE 1!@#USER_ID 9!@#ACTIVITY_CODE 2
12/12/2022 01:54:56 AM script INFO: SUCCESS!@#KODE 1!@#USER_ID 9!@#ACTIVITY_CODE 1
12/12/2022 01:54:56 AM script INFO: SUCCESS!@#KODE 1!@#USER_ID 9!@#ACTIVITY_CODE 4
12/12/2022 01:54:56 AM script INFO: SUCCESS!@#KODE 1!@#USER_ID 9!@#ACTIVITY_CODE 3
12/12/2022 01:54:56 AM script INFO: SUCCESS!@#KODE 1!@#USER_ID 9!@#ACTIVITY_CODE 1
12/12/2022 01:54:56 AM script INFO: SUCCESS!@#KODE 1!@#USER_ID 9!@#ACTIVITY_CODE 1
12/12/2022 01:54:56 AM script INFO: SUCCESS!@#KODE 1!@#USER_ID 9!@#ACTIVITY_CODE 3
12/12/2022 01:54:56 AM script INFO: SUCCESS!@#KODE 1!@#USER_ID 9!@#ACTIVITY_CODE 3
12/12/2022 01:54:56 AM script INFO: SUCCESS!@#KODE 1!@#USER_ID 9!@#ACTIVITY_CODE 3
12/12/2022 01:54:57 AM script INFO: SUCCESS!@#KODE 1!@#USER_ID 9!@#ACTIVITY_CODE 4
12/12/2022 01:54:57 AM script INFO: SUCCESS!@#KODE 1!@#USER_ID 9!@#ACTIVITY_CODE 1
12/12/2022 01:54:57 AM script INFO: SUCCESS!@#KODE 1!@#USER_ID 9!@#ACTIVITY_CODE 2
12/12/2022 01:54:57 AM script INFO: SUCCESS!@#KODE 1!@#USER_ID 9!@#ACTIVITY_CODE 1
12/12/2022 01:54:57 AM script INFO: SUCCESS!@#KODE 1!@#USER_ID 9!@#ACTIVITY_CODE 2
12/12/2022 01:54:57 AM script INFO: SUCCESS!@#KODE 1!@#USER_ID 9!@#ACTIVITY_CODE 2
12/12/2022 01:54:57 AM script INFO: SUCCESS!@#KODE 1!@#USER_ID 9!@#ACTIVITY_CODE 3
12/12/2022 01:54:58 AM script INFO: SUCCESS!@#KODE 1!@#USER_ID 9!@#ACTIVITY_CODE 2
12/12/2022 01:54:58 AM script INFO: SUCCESS!@#KODE 1!@#USER_ID 9!@#ACTIVITY_CODE 2
12/12/2022 01:54:58 AM script INFO: SUCCESS!@#KODE 1!@#USER_ID 9!@#ACTIVITY_CODE 4
12/12/2022 01:54:58 AM script INFO: SUCCESS!@#KODE 1!@#USER_ID 9!@#ACTIVITY_CODE 2
12/12/2022 01:54:58 AM script INFO: SUCCESS!@#KODE 1!@#USER_ID 9!@#ACTIVITY_CODE 3
12/12/2022 01:54:58 AM script INFO: SUCCESS!@#KODE 1!@#USER_ID 9!@#ACTIVITY_CODE 2
12/12/2022 01:54:58 AM script INFO: SUCCESS!@#KODE 1!@#USER_ID 9!@#ACTIVITY_CODE 4
12/12/2022 01:54:58 AM script INFO: SUCCESS!@#KODE 1!@#USER_ID 9!@#ACTIVITY_CODE 3
12/12/2022 01:54:59 AM script INFO: SUCCESS!@#KODE 1!@#USER_ID 9!@#ACTIVITY_CODE 1
12/12/2022 01:54:59 AM script INFO: SUCCESS!@#KODE 1!@#USER_ID 9!@#ACTIVITY_CODE 2
12/12/2022 01:54:59 AM script INFO: SUCCESS!@#KODE 1!@#USER_ID 9!@#ACTIVITY_CODE 1
12/12/2022 01:54:59 AM script INFO: SUCCESS!@#KODE 1!@#USER_ID 9!@#ACTIVITY_CODE 3
12/12/2022 01:54:59 AM script INFO: SUCCESS!@#KODE 1!@#USER_ID 9!@#ACTIVITY_CODE 2
12/12/2022 01:54:59 AM script INFO: SUCCESS!@#KODE 1!@#USER_ID 9!@#ACTIVITY_CODE 1
12/12/2022 01:54:59 AM script INFO: SUCCESS!@#KODE 1!@#USER_ID 9!@#ACTIVITY_CODE 1
12/12/2022 01:54:59 AM script INFO: SUCCESS!@#KODE 1!@#USER_ID 9!@#ACTIVITY_CODE 3
12/12/2022 01:54:59 AM script INFO: SUCCESS!@#KODE 1!@#USER_ID 9!@#ACTIVITY_CODE 4
12/12/2022 01:55:00 AM script INFO: SUCCESS!@#KODE 1!@#USER_ID 9!@#ACTIVITY_CODE 3
12/12/2022 01:55:00 AM script INFO: SUCCESS!@#KODE 1!@#USER_ID 9!@#ACTIVITY_CODE 2
12/12/2022 01:55:00 AM script INFO: SUCCESS!@#KODE 1!@#USER_ID 9!@#ACTIVITY_CODE 2
12/12/2022 01:55:00 AM script INFO: SUCCESS!@#KODE 1!@#USER_ID 9!@#ACTIVITY_CODE 2
12/12/2022 01:55:00 AM script INFO: SUCCESS!@#KODE 1!@#USER_ID 9!@#ACTIVITY_CODE 2
12/12/2022 01:55:00 AM script INFO: SUCCESS!@#KODE 1!@#USER_ID 9!@#ACTIVITY_CODE 1
12/12/2022 01:55:00 AM script INFO: SUCCESS!@#KODE 1!@#USER_ID 9!@#ACTIVITY_CODE 3
12/12/2022 01:55:01 AM script INFO: SUCCESS!@#KODE 1!@#USER_ID 9!@#ACTIVITY_CODE 3
12/12/2022 01:55:01 AM script INFO: SUCCESS!@#KODE 1!@#USER_ID 9!@#ACTIVITY_CODE 4
12/12/2022 01:55:01 AM script INFO: SUCCESS!@#KODE 1!@#USER_ID 9!@#ACTIVITY_CODE 2
12/12/2022 01:55:01 AM script INFO: SUCCESS!@#KODE 1!@#USER_ID 9!@#ACTIVITY_CODE 4
12/12/2022 01:55:01 AM script INFO: SUCCESS!@#KODE 1!@#USER_ID 9!@#ACTIVITY_CODE 1
12/12/2022 01:55:01 AM script INFO: SUCCESS!@#KODE 1!@#USER_ID 9!@#ACTIVITY_CODE 1
12/12/2022 01:55:01 AM script INFO: SUCCESS!@#KODE 1!@#USER_ID 9!@#ACTIVITY_CODE 2
12/12/2022 01:55:01 AM script INFO: SUCCESS!@#KODE 1!@#USER_ID 9!@#ACTIVITY_CODE 2
12/12/2022 01:55:02 AM script INFO: SUCCESS!@#KODE 1!@#USER_ID 9!@#ACTIVITY_CODE 2
12/12/2022 01:55:02 AM script INFO: SUCCESS!@#KODE 1!@#USER_ID 9!@#ACTIVITY_CODE 2
12/12/2022 01:55:02 AM script INFO: SUCCESS!@#KODE 1!@#USER_ID 9!@#ACTIVITY_CODE 3
12/12/2022 01:55:02 AM script INFO: SUCCESS!@#KODE 1!@#USER_ID 9!@#ACTIVITY_CODE 3
12/12/2022 01:55:02 AM script INFO: SUCCESS!@#KODE 1!@#USER_ID 9!@#ACTIVITY_CODE 1
12/12/2022 01:55:02 AM script INFO: SUCCESS!@#KODE 1!@#USER_ID 9!@#ACTIVITY_CODE 1
12/12/2022 01:55:02 AM script INFO: SUCCESS!@#KODE 1!@#USER_ID 9!@#ACTIVITY_CODE 1
12/12/2022 01:55:02 AM script INFO: SUCCESS!@#KODE 1!@#USER_ID 9!@#ACTIVITY_CODE 1
12/12/2022 01:55:02 AM script INFO: SUCCESS!@#KODE 1!@#USER_ID 9!@#ACTIVITY_CODE 1
12/12/2022 01:55:03 AM script INFO: SUCCESS!@#KODE 1!@#USER_ID 9!@#ACTIVITY_CODE 3
12/12/2022 01:55:03 AM script INFO: SUCCESS!@#KODE 1!@#USER_ID 9!@#ACTIVITY_CODE 3
12/12/2022 01:55:03 AM script INFO: SUCCESS!@#KODE 1!@#USER_ID 9!@#ACTIVITY_CODE 2
12/12/2022 01:55:03 AM script INFO: SUCCESS!@#KODE 1!@#USER_ID 9!@#ACTIVITY_CODE 1
12/12/2022 01:55:03 AM script INFO: SUCCESS!@#KODE 1!@#USER_ID 9!@#ACTIVITY_CODE 2
12/12/2022 01:55:03 AM script INFO: SUCCESS!@#KODE 1!@#USER_ID 9!@#ACTIVITY_CODE 2
12/12/2022 01:55:04 AM script INFO: SUCCESS!@#KODE 1!@#USER_ID 9!@#ACTIVITY_CODE 2
12/12/2022 01:55:04 AM script INFO: SUCCESS!@#KODE 1!@#USER_ID 9!@#ACTIVITY_CODE 3
12/12/2022 01:55:04 AM script INFO: SUCCESS!@#KODE 1!@#USER_ID 9!@#ACTIVITY_CODE 3
12/12/2022 01:55:04 AM script INFO: SUCCESS!@#KODE 1!@#USER_ID 9!@#ACTIVITY_CODE 2
12/12/2022 01:55:04 AM script INFO: SUCCESS!@#KODE 1!@#USER_ID 9!@#ACTIVITY_CODE 3
12/12/2022 01:55:05 AM script INFO: SUCCESS!@#KODE 1!@#USER_ID 9!@#ACTIVITY_CODE 2
12/12/2022 01:55:05 AM script INFO: SUCCESS!@#KODE 1!@#USER_ID 9!@#ACTIVITY_CODE 2
12/12/2022 01:55:05 AM script INFO: SUCCESS!@#KODE 1!@#USER_ID 9!@#ACTIVITY_CODE 1
12/12/2022 01:55:05 AM script INFO: SUCCESS!@#KODE 1!@#USER_ID 9!@#ACTIVITY_CODE 3
12/12/2022 01:55:05 AM script INFO: SUCCESS!@#KODE 1!@#USER_ID 9!@#ACTIVITY_CODE 3
12/12/2022 01:55:05 AM script INFO: SUCCESS!@#KODE 1!@#USER_ID 9!@#ACTIVITY_CODE 1
12/12/2022 01:55:05 AM script INFO: SUCCESS!@#KODE 1!@#USER_ID 9!@#ACTIVITY_CODE 1
12/12/2022 01:55:06 AM script INFO: SUCCESS!@#KODE 1!@#USER_ID 9!@#ACTIVITY_CODE 1
12/12/2022 01:55:06 AM script INFO: SUCCESS!@#KODE 1!@#USER_ID 9!@#ACTIVITY_CODE 1
12/12/2022 01:55:06 AM script INFO: SUCCESS!@#KODE 1!@#USER_ID 9!@#ACTIVITY_CODE 2
12/12/2022 01:55:06 AM script INFO: SUCCESS!@#KODE 1!@#USER_ID 9!@#ACTIVITY_CODE 2
12/12/2022 01:55:06 AM script INFO: SUCCESS!@#KODE 1!@#USER_ID 9!@#ACTIVITY_CODE 2
12/12/2022 01:55:07 AM script INFO: SUCCESS!@#KODE 1!@#USER_ID 9!@#ACTIVITY_CODE 2
12/12/2022 01:55:07 AM script INFO: SUCCESS!@#KODE 1!@#USER_ID 9!@#ACTIVITY_CODE 2
12/12/2022 01:55:07 AM script INFO: SUCCESS!@#KODE 1!@#USER_ID 9!@#ACTIVITY_CODE 1
12/12/2022 01:55:07 AM script INFO: SUCCESS!@#KODE 1!@#USER_ID 9!@#ACTIVITY_CODE 1
12/12/2022 01:55:07 AM script INFO: SUCCESS!@#KODE 1!@#USER_ID 9!@#ACTIVITY_CODE 1
12/12/2022 01:55:08 AM script INFO: SUCCESS!@#KODE 1!@#USER_ID 9!@#ACTIVITY_CODE 2
12/12/2022 01:55:08 AM script INFO: SUCCESS!@#KODE 1!@#USER_ID 9!@#ACTIVITY_CODE 4
12/12/2022 01:55:08 AM script INFO: SUCCESS!@#KODE 1!@#USER_ID 9!@#ACTIVITY_CODE 3
12/12/2022 01:55:08 AM script INFO: SUCCESS!@#KODE 1!@#USER_ID 9!@#ACTIVITY_CODE 3
12/12/2022 01:55:08 AM script INFO: SUCCESS!@#KODE 1!@#USER_ID 9!@#ACTIVITY_CODE 2
12/12/2022 01:55:08 AM script INFO: SUCCESS!@#KODE 1!@#USER_ID 9!@#ACTIVITY_CODE 3
12/12/2022 01:55:09 AM script INFO: SUCCESS!@#KODE 1!@#USER_ID 9!@#ACTIVITY_CODE 2
12/12/2022 01:55:09 AM script INFO: SUCCESS!@#KODE 1!@#USER_ID 9!@#ACTIVITY_CODE 1
12/12/2022 01:55:09 AM script INFO: SUCCESS!@#KODE 1!@#USER_ID 9!@#ACTIVITY_CODE 2
12/12/2022 01:55:09 AM script INFO: SUCCESS!@#KODE 1!@#USER_ID 9!@#ACTIVITY_CODE 3
12/12/2022 01:55:10 AM script INFO: SUCCESS!@#KODE 1!@#USER_ID 9!@#ACTIVITY_CODE 2
12/12/2022 01:55:10 AM script INFO: SUCCESS!@#KODE 1!@#USER_ID 9!@#ACTIVITY_CODE 1
12/12/2022 01:55:10 AM script INFO: SUCCESS!@#KODE 1!@#USER_ID 9!@#ACTIVITY_CODE 4
12/12/2022 01:55:10 AM script INFO: SUCCESS!@#KODE 1!@#USER_ID 9!@#ACTIVITY_CODE 1
12/12/2022 01:55:10 AM script INFO: SUCCESS!@#KODE 1!@#USER_ID 9!@#ACTIVITY_CODE 2
12/12/2022 01:55:10 AM script INFO: SUCCESS!@#KODE 1!@#USER_ID 9!@#ACTIVITY_CODE 3
12/12/2022 01:55:11 AM script INFO: SUCCESS!@#KODE 1!@#USER_ID 9!@#ACTIVITY_CODE 1
12/12/2022 01:55:11 AM script INFO: SUCCESS!@#KODE 1!@#USER_ID 9!@#ACTIVITY_CODE 1
12/12/2022 01:55:11 AM script INFO: SUCCESS!@#KODE 1!@#USER_ID 9!@#ACTIVITY_CODE 1
12/12/2022 01:55:11 AM script INFO: SUCCESS!@#KODE 1!@#USER_ID 9!@#ACTIVITY_CODE 2
12/12/2022 01:55:11 AM script INFO: SUCCESS!@#KODE 1!@#USER_ID 9!@#ACTIVITY_CODE 1
12/12/2022 01:55:11 AM script INFO: SUCCESS!@#KODE 1!@#USER_ID 9!@#ACTIVITY_CODE 1
12/12/2022 01:55:11 AM script INFO: SUCCESS!@#KODE 1!@#USER_ID 9!@#ACTIVITY_CODE 3
12/12/2022 01:55:11 AM script INFO: SUCCESS!@#KODE 1!@#USER_ID 9!@#ACTIVITY_CODE 1
12/12/2022 01:55:12 AM script INFO: SUCCESS!@#KODE 1!@#USER_ID 9!@#ACTIVITY_CODE 2
12/12/2022 01:55:12 AM script INFO: SUCCESS!@#KODE 1!@#USER_ID 9!@#ACTIVITY_CODE 1
12/12/2022 01:55:12 AM script INFO: SUCCESS!@#KODE 1!@#USER_ID 9!@#ACTIVITY_CODE 4
12/12/2022 01:55:12 AM script INFO: SUCCESS!@#KODE 1!@#USER_ID 9!@#ACTIVITY_CODE 2
12/12/2022 01:55:12 AM script INFO: SUCCESS!@#KODE 1!@#USER_ID 9!@#ACTIVITY_CODE 1
12/12/2022 01:55:13 AM script INFO: SUCCESS!@#KODE 1!@#USER_ID 9!@#ACTIVITY_CODE 1
12/12/2022 01:55:13 AM script INFO: SUCCESS!@#KODE 1!@#USER_ID 9!@#ACTIVITY_CODE 2
12/12/2022 01:55:13 AM script INFO: SUCCESS!@#KODE 1!@#USER_ID 9!@#ACTIVITY_CODE 1
12/12/2022 01:55:13 AM script INFO: SUCCESS!@#KODE 1!@#USER_ID 9!@#ACTIVITY_CODE 2
12/12/2022 01:55:13 AM script INFO: SUCCESS!@#KODE 1!@#USER_ID 9!@#ACTIVITY_CODE 3
12/12/2022 01:55:13 AM script INFO: SUCCESS!@#KODE 1!@#USER_ID 9!@#ACTIVITY_CODE 3
12/12/2022 01:55:14 AM script INFO: SUCCESS!@#KODE 1!@#USER_ID 9!@#ACTIVITY_CODE 2
12/12/2022 01:55:14 AM script INFO: SUCCESS!@#KODE 1!@#USER_ID 9!@#ACTIVITY_CODE 2
12/12/2022 01:55:14 AM script INFO: SUCCESS!@#KODE 1!@#USER_ID 9!@#ACTIVITY_CODE 1
12/12/2022 01:55:14 AM script INFO: SUCCESS!@#KODE 1!@#USER_ID 9!@#ACTIVITY_CODE 1
12/12/2022 01:55:14 AM script INFO: SUCCESS!@#KODE 1!@#USER_ID 9!@#ACTIVITY_CODE 3
12/12/2022 01:55:15 AM script INFO: SUCCESS!@#KODE 1!@#USER_ID 9!@#ACTIVITY_CODE 2
12/12/2022 01:55:15 AM script INFO: SUCCESS!@#KODE 1!@#USER_ID 9!@#ACTIVITY_CODE 4
12/12/2022 01:55:15 AM script INFO: SUCCESS!@#KODE 1!@#USER_ID 9!@#ACTIVITY_CODE 2
12/12/2022 01:55:15 AM script INFO: SUCCESS!@#KODE 1!@#USER_ID 9!@#ACTIVITY_CODE 3
12/12/2022 01:55:16 AM script INFO: SUCCESS!@#KODE 1!@#USER_ID 9!@#ACTIVITY_CODE 4
12/12/2022 01:55:16 AM script INFO: SUCCESS!@#KODE 1!@#USER_ID 9!@#ACTIVITY_CODE 3
12/12/2022 01:55:16 AM script INFO: SUCCESS!@#KODE 1!@#USER_ID 9!@#ACTIVITY_CODE 2
12/12/2022 01:55:16 AM script INFO: SUCCESS!@#KODE 1!@#USER_ID 9!@#ACTIVITY_CODE 1
12/12/2022 01:55:17 AM script INFO: SUCCESS!@#KODE 1!@#USER_ID 9!@#ACTIVITY_CODE 2
12/12/2022 01:55:17 AM script INFO: SUCCESS!@#KODE 1!@#USER_ID 9!@#ACTIVITY_CODE 1
12/12/2022 01:55:17 AM script INFO: SUCCESS!@#KODE 1!@#USER_ID 9!@#ACTIVITY_CODE 3
12/12/2022 01:55:17 AM script INFO: SUCCESS!@#KODE 1!@#USER_ID 9!@#ACTIVITY_CODE 2
12/12/2022 01:55:17 AM script INFO: SUCCESS!@#KODE 1!@#USER_ID 9!@#ACTIVITY_CODE 2
12/12/2022 01:55:18 AM script INFO: SUCCESS!@#KODE 1!@#USER_ID 9!@#ACTIVITY_CODE 3
12/12/2022 01:55:18 AM script INFO: SUCCESS!@#KODE 1!@#USER_ID 9!@#ACTIVITY_CODE 1
12/12/2022 01:55:18 AM script INFO: SUCCESS!@#KODE 1!@#USER_ID 9!@#ACTIVITY_CODE 3
12/12/2022 01:55:18 AM script INFO: SUCCESS!@#KODE 1!@#USER_ID 9!@#ACTIVITY_CODE 3
12/12/2022 01:55:18 AM script INFO: SUCCESS!@#KODE 1!@#USER_ID 9!@#ACTIVITY_CODE 1
12/12/2022 01:55:18 AM script INFO: SUCCESS!@#KODE 1!@#USER_ID 9!@#ACTIVITY_CODE 1
12/12/2022 01:55:18 AM script INFO: SUCCESS!@#KODE 1!@#USER_ID 9!@#ACTIVITY_CODE 4
12/12/2022 01:55:18 AM script INFO: SUCCESS!@#KODE 1!@#USER_ID 9!@#ACTIVITY_CODE 3
12/12/2022 01:55:18 AM script INFO: SUCCESS!@#KODE 1!@#USER_ID 9!@#ACTIVITY_CODE 3
12/12/2022 01:55:19 AM script INFO: SUCCESS!@#KODE 1!@#USER_ID 9!@#ACTIVITY_CODE 2
12/12/2022 01:55:19 AM script INFO: SUCCESS!@#KODE 1!@#USER_ID 9!@#ACTIVITY_CODE 1
12/12/2022 01:55:19 AM script INFO: SUCCESS!@#KODE 1!@#USER_ID 9!@#ACTIVITY_CODE 3
12/12/2022 01:55:19 AM script INFO: SUCCESS!@#KODE 1!@#USER_ID 9!@#ACTIVITY_CODE 4
12/12/2022 01:55:19 AM script INFO: SUCCESS!@#KODE 1!@#USER_ID 9!@#ACTIVITY_CODE 2
12/12/2022 01:55:20 AM script INFO: SUCCESS!@#KODE 1!@#USER_ID 9!@#ACTIVITY_CODE 2
12/12/2022 01:55:20 AM script INFO: SUCCESS!@#KODE 1!@#USER_ID 9!@#ACTIVITY_CODE 4
12/12/2022 01:55:20 AM script INFO: SUCCESS!@#KODE 1!@#USER_ID 9!@#ACTIVITY_CODE 2
12/12/2022 01:55:20 AM script INFO: SUCCESS!@#KODE 1!@#USER_ID 9!@#ACTIVITY_CODE 1
12/12/2022 01:55:20 AM script INFO: SUCCESS!@#KODE 1!@#USER_ID 9!@#ACTIVITY_CODE 1
12/12/2022 01:55:21 AM script INFO: SUCCESS!@#KODE 1!@#USER_ID 9!@#ACTIVITY_CODE 4
12/12/2022 01:55:21 AM script INFO: SUCCESS!@#KODE 1!@#USER_ID 9!@#ACTIVITY_CODE 3
12/12/2022 01:55:21 AM script INFO: SUCCESS!@#KODE 1!@#USER_ID 9!@#ACTIVITY_CODE 1
12/12/2022 01:55:21 AM script INFO: SUCCESS!@#KODE 1!@#USER_ID 9!@#ACTIVITY_CODE 4
12/12/2022 01:55:21 AM script INFO: SUCCESS!@#KODE 1!@#USER_ID 9!@#ACTIVITY_CODE 1
12/12/2022 01:55:21 AM script INFO: SUCCESS!@#KODE 1!@#USER_ID 9!@#ACTIVITY_CODE 4
12/12/2022 01:55:22 AM script INFO: SUCCESS!@#KODE 1!@#USER_ID 9!@#ACTIVITY_CODE 2
12/12/2022 01:55:22 AM script INFO: SUCCESS!@#KODE 1!@#USER_ID 9!@#ACTIVITY_CODE 1
12/12/2022 01:55:22 AM script INFO: SUCCESS!@#KODE 1!@#USER_ID 9!@#ACTIVITY_CODE 2
12/12/2022 01:55:22 AM script INFO: SUCCESS!@#KODE 1!@#USER_ID 9!@#ACTIVITY_CODE 3
12/12/2022 01:55:22 AM script INFO: SUCCESS!@#KODE 1!@#USER_ID 9!@#ACTIVITY_CODE 1
12/12/2022 01:55:23 AM script INFO: SUCCESS!@#KODE 1!@#USER_ID 9!@#ACTIVITY_CODE 2
12/12/2022 01:55:23 AM script INFO: SUCCESS!@#KODE 1!@#USER_ID 9!@#ACTIVITY_CODE 1
12/12/2022 01:55:23 AM script INFO: SUCCESS!@#KODE 1!@#USER_ID 9!@#ACTIVITY_CODE 1
12/12/2022 01:55:23 AM script INFO: SUCCESS!@#KODE 1!@#USER_ID 9!@#ACTIVITY_CODE 3
12/12/2022 01:55:23 AM script INFO: SUCCESS!@#KODE 1!@#USER_ID 9!@#ACTIVITY_CODE 2
12/12/2022 01:55:23 AM script INFO: SUCCESS!@#KODE 1!@#USER_ID 9!@#ACTIVITY_CODE 3
12/12/2022 01:55:24 AM script INFO: SUCCESS!@#KODE 1!@#USER_ID 9!@#ACTIVITY_CODE 3
12/12/2022 01:55:24 AM script INFO: SUCCESS!@#KODE 1!@#USER_ID 9!@#ACTIVITY_CODE 2
12/12/2022 01:55:24 AM script INFO: SUCCESS!@#KODE 1!@#USER_ID 9!@#ACTIVITY_CODE 3
12/12/2022 01:55:24 AM script INFO: SUCCESS!@#KODE 1!@#USER_ID 9!@#ACTIVITY_CODE 2
12/12/2022 01:55:24 AM script INFO: SUCCESS!@#KODE 1!@#USER_ID 9!@#ACTIVITY_CODE 3
12/12/2022 01:55:25 AM script INFO: SUCCESS!@#KODE 1!@#USER_ID 9!@#ACTIVITY_CODE 3
12/12/2022 01:55:25 AM script INFO: SUCCESS!@#KODE 1!@#USER_ID 9!@#ACTIVITY_CODE 2
12/12/2022 01:55:25 AM script INFO: SUCCESS!@#KODE 1!@#USER_ID 9!@#ACTIVITY_CODE 1
12/12/2022 01:55:25 AM script INFO: SUCCESS!@#KODE 1!@#USER_ID 9!@#ACTIVITY_CODE 3
12/12/2022 01:55:25 AM script INFO: SUCCESS!@#KODE 1!@#USER_ID 9!@#ACTIVITY_CODE 3
12/12/2022 01:55:25 AM script INFO: SUCCESS!@#KODE 1!@#USER_ID 9!@#ACTIVITY_CODE 1
12/12/2022 01:55:25 AM script INFO: SUCCESS!@#KODE 1!@#USER_ID 9!@#ACTIVITY_CODE 3
12/12/2022 01:55:25 AM script INFO: SUCCESS!@#KODE 1!@#USER_ID 9!@#ACTIVITY_CODE 3
12/12/2022 01:55:26 AM script INFO: SUCCESS!@#KODE 1!@#USER_ID 9!@#ACTIVITY_CODE 2
12/12/2022 01:55:26 AM script INFO: SUCCESS!@#KODE 1!@#USER_ID 9!@#ACTIVITY_CODE 3
12/12/2022 01:55:26 AM script INFO: SUCCESS!@#KODE 1!@#USER_ID 9!@#ACTIVITY_CODE 2
12/12/2022 01:55:26 AM script INFO: SUCCESS!@#KODE 1!@#USER_ID 9!@#ACTIVITY_CODE 3
12/12/2022 01:55:27 AM script INFO: SUCCESS!@#KODE 1!@#USER_ID 9!@#ACTIVITY_CODE 2
12/12/2022 01:55:27 AM script INFO: SUCCESS!@#KODE 1!@#USER_ID 9!@#ACTIVITY_CODE 4
12/12/2022 01:55:27 AM script INFO: SUCCESS!@#KODE 1!@#USER_ID 9!@#ACTIVITY_CODE 2
12/12/2022 01:55:27 AM script INFO: SUCCESS!@#KODE 1!@#USER_ID 9!@#ACTIVITY_CODE 1
12/12/2022 01:55:27 AM script INFO: SUCCESS!@#KODE 1!@#USER_ID 9!@#ACTIVITY_CODE 3
12/12/2022 01:55:28 AM script INFO: SUCCESS!@#KODE 1!@#USER_ID 9!@#ACTIVITY_CODE 1
12/12/2022 01:55:28 AM script INFO: SUCCESS!@#KODE 1!@#USER_ID 9!@#ACTIVITY_CODE 2
12/12/2022 01:55:28 AM script INFO: SUCCESS!@#KODE 1!@#USER_ID 9!@#ACTIVITY_CODE 1
12/12/2022 01:55:28 AM script INFO: SUCCESS!@#KODE 1!@#USER_ID 9!@#ACTIVITY_CODE 1
12/12/2022 01:55:28 AM script INFO: SUCCESS!@#KODE 1!@#USER_ID 9!@#ACTIVITY_CODE 3
12/12/2022 01:55:28 AM script INFO: SUCCESS!@#KODE 1!@#USER_ID 9!@#ACTIVITY_CODE 4
12/12/2022 01:55:29 AM script INFO: SUCCESS!@#KODE 1!@#USER_ID 9!@#ACTIVITY_CODE 2
12/12/2022 01:55:29 AM script INFO: SUCCESS!@#KODE 1!@#USER_ID 9!@#ACTIVITY_CODE 2
12/12/2022 01:55:29 AM script INFO: SUCCESS!@#KODE 1!@#USER_ID 9!@#ACTIVITY_CODE 2
12/12/2022 01:55:30 AM script INFO: SUCCESS!@#KODE 1!@#USER_ID 9!@#ACTIVITY_CODE 2
12/12/2022 01:55:30 AM script INFO: SUCCESS!@#KODE 1!@#USER_ID 9!@#ACTIVITY_CODE 3
12/12/2022 01:55:30 AM script INFO: SUCCESS!@#KODE 1!@#USER_ID 9!@#ACTIVITY_CODE 3
12/12/2022 01:55:30 AM script INFO: SUCCESS!@#KODE 1!@#USER_ID 9!@#ACTIVITY_CODE 1
12/12/2022 01:55:30 AM script INFO: SUCCESS!@#KODE 1!@#USER_ID 9!@#ACTIVITY_CODE 3
12/12/2022 01:55:30 AM script INFO: SUCCESS!@#KODE 1!@#USER_ID 9!@#ACTIVITY_CODE 2
12/12/2022 01:55:31 AM script INFO: SUCCESS!@#KODE 1!@#USER_ID 9!@#ACTIVITY_CODE 1
12/12/2022 01:55:31 AM script INFO: SUCCESS!@#KODE 1!@#USER_ID 9!@#ACTIVITY_CODE 1
12/12/2022 01:55:31 AM script INFO: SUCCESS!@#KODE 1!@#USER_ID 9!@#ACTIVITY_CODE 1
12/12/2022 01:55:31 AM script INFO: SUCCESS!@#KODE 1!@#USER_ID 9!@#ACTIVITY_CODE 1
12/12/2022 01:55:31 AM script INFO: SUCCESS!@#KODE 1!@#USER_ID 9!@#ACTIVITY_CODE 1
12/12/2022 01:55:31 AM script INFO: SUCCESS!@#KODE 1!@#USER_ID 9!@#ACTIVITY_CODE 3
12/12/2022 01:55:31 AM script INFO: SUCCESS!@#KODE 1!@#USER_ID 9!@#ACTIVITY_CODE 1
12/12/2022 01:55:31 AM script INFO: SUCCESS!@#KODE 1!@#USER_ID 9!@#ACTIVITY_CODE 1
12/12/2022 01:55:32 AM script INFO: SUCCESS!@#KODE 1!@#USER_ID 9!@#ACTIVITY_CODE 2
12/12/2022 01:55:32 AM script INFO: SUCCESS!@#KODE 1!@#USER_ID 9!@#ACTIVITY_CODE 2
12/12/2022 01:55:32 AM script INFO: SUCCESS!@#KODE 1!@#USER_ID 9!@#ACTIVITY_CODE 3
12/12/2022 01:55:32 AM script INFO: SUCCESS!@#KODE 1!@#USER_ID 9!@#ACTIVITY_CODE 3
12/12/2022 01:55:32 AM script INFO: SUCCESS!@#KODE 1!@#USER_ID 9!@#ACTIVITY_CODE 3
12/12/2022 01:55:33 AM script INFO: SUCCESS!@#KODE 1!@#USER_ID 9!@#ACTIVITY_CODE 2
12/12/2022 01:55:33 AM script INFO: SUCCESS!@#KODE 1!@#USER_ID 9!@#ACTIVITY_CODE 1
12/12/2022 01:55:33 AM script INFO: SUCCESS!@#KODE 1!@#USER_ID 9!@#ACTIVITY_CODE 1
12/12/2022 01:55:33 AM script INFO: SUCCESS!@#KODE 1!@#USER_ID 9!@#ACTIVITY_CODE 2
12/12/2022 01:55:33 AM script INFO: SUCCESS!@#KODE 1!@#USER_ID 9!@#ACTIVITY_CODE 1
12/12/2022 01:55:34 AM script INFO: SUCCESS!@#KODE 1!@#USER_ID 9!@#ACTIVITY_CODE 3
12/12/2022 01:55:34 AM script INFO: SUCCESS!@#KODE 1!@#USER_ID 9!@#ACTIVITY_CODE 2
12/12/2022 01:55:34 AM script INFO: SUCCESS!@#KODE 1!@#USER_ID 9!@#ACTIVITY_CODE 2
12/12/2022 01:55:34 AM script INFO: SUCCESS!@#KODE 1!@#USER_ID 9!@#ACTIVITY_CODE 1
12/12/2022 01:55:35 AM script INFO: SUCCESS!@#KODE 1!@#USER_ID 9!@#ACTIVITY_CODE 3
12/12/2022 01:55:35 AM script INFO: SUCCESS!@#KODE 1!@#USER_ID 9!@#ACTIVITY_CODE 3
12/12/2022 01:55:35 AM script INFO: SUCCESS!@#KODE 1!@#USER_ID 9!@#ACTIVITY_CODE 3
12/12/2022 01:55:35 AM script INFO: SUCCESS!@#KODE 1!@#USER_ID 9!@#ACTIVITY_CODE 1
12/12/2022 01:55:35 AM script INFO: SUCCESS!@#KODE 1!@#USER_ID 9!@#ACTIVITY_CODE 3
12/12/2022 01:55:35 AM script INFO: SUCCESS!@#KODE 1!@#USER_ID 9!@#ACTIVITY_CODE 2
12/12/2022 01:55:36 AM script INFO: SUCCESS!@#KODE 1!@#USER_ID 9!@#ACTIVITY_CODE 1
12/12/2022 01:55:36 AM script INFO: SUCCESS!@#KODE 1!@#USER_ID 9!@#ACTIVITY_CODE 2
12/12/2022 01:55:36 AM script INFO: SUCCESS!@#KODE 1!@#USER_ID 9!@#ACTIVITY_CODE 3
12/12/2022 01:55:36 AM script INFO: SUCCESS!@#KODE 1!@#USER_ID 9!@#ACTIVITY_CODE 2
12/12/2022 01:55:37 AM script INFO: SUCCESS!@#KODE 1!@#USER_ID 9!@#ACTIVITY_CODE 2
12/12/2022 01:55:37 AM script INFO: SUCCESS!@#KODE 1!@#USER_ID 9!@#ACTIVITY_CODE 2
12/12/2022 01:55:37 AM script INFO: SUCCESS!@#KODE 1!@#USER_ID 9!@#ACTIVITY_CODE 3
12/12/2022 01:55:37 AM script INFO: SUCCESS!@#KODE 1!@#USER_ID 9!@#ACTIVITY_CODE 1
12/12/2022 01:55:37 AM script INFO: SUCCESS!@#KODE 1!@#USER_ID 9!@#ACTIVITY_CODE 4
12/12/2022 01:55:37 AM script INFO: SUCCESS!@#KODE 1!@#USER_ID 9!@#ACTIVITY_CODE 3
12/12/2022 01:55:38 AM script INFO: SUCCESS!@#KODE 1!@#USER_ID 9!@#ACTIVITY_CODE 1
12/12/2022 01:55:38 AM script INFO: SUCCESS!@#KODE 1!@#USER_ID 9!@#ACTIVITY_CODE 4
12/12/2022 01:55:38 AM script INFO: SUCCESS!@#KODE 1!@#USER_ID 9!@#ACTIVITY_CODE 2
12/12/2022 01:55:38 AM script INFO: SUCCESS!@#KODE 1!@#USER_ID 9!@#ACTIVITY_CODE 2
12/12/2022 01:55:39 AM script INFO: SUCCESS!@#KODE 1!@#USER_ID 9!@#ACTIVITY_CODE 3
12/12/2022 01:55:39 AM script INFO: SUCCESS!@#KODE 1!@#USER_ID 9!@#ACTIVITY_CODE 2
12/12/2022 01:55:39 AM script INFO: SUCCESS!@#KODE 1!@#USER_ID 9!@#ACTIVITY_CODE 4
12/12/2022 01:55:39 AM script INFO: SUCCESS!@#KODE 1!@#USER_ID 9!@#ACTIVITY_CODE 3
12/12/2022 01:55:39 AM script INFO: SUCCESS!@#KODE 1!@#USER_ID 9!@#ACTIVITY_CODE 1
12/12/2022 01:55:40 AM script INFO: SUCCESS!@#KODE 1!@#USER_ID 9!@#ACTIVITY_CODE 2
12/12/2022 01:55:40 AM script INFO: SUCCESS!@#KODE 1!@#USER_ID 9!@#ACTIVITY_CODE 1
12/12/2022 01:55:40 AM script INFO: SUCCESS!@#KODE 1!@#USER_ID 9!@#ACTIVITY_CODE 1
12/12/2022 01:55:40 AM script INFO: SUCCESS!@#KODE 1!@#USER_ID 9!@#ACTIVITY_CODE 2
12/12/2022 01:55:40 AM script INFO: SUCCESS!@#KODE 1!@#USER_ID 9!@#ACTIVITY_CODE 1
12/12/2022 01:55:40 AM script INFO: SUCCESS!@#KODE 1!@#USER_ID 9!@#ACTIVITY_CODE 1
12/12/2022 01:55:40 AM script INFO: SUCCESS!@#KODE 1!@#USER_ID 9!@#ACTIVITY_CODE 1
12/12/2022 01:55:41 AM script INFO: SUCCESS!@#KODE 1!@#USER_ID 9!@#ACTIVITY_CODE 4
12/12/2022 01:55:41 AM script INFO: SUCCESS!@#KODE 1!@#USER_ID 9!@#ACTIVITY_CODE 3
12/12/2022 01:55:41 AM script INFO: SUCCESS!@#KODE 1!@#USER_ID 9!@#ACTIVITY_CODE 3
12/12/2022 01:55:41 AM script INFO: SUCCESS!@#KODE 1!@#USER_ID 9!@#ACTIVITY_CODE 1
12/12/2022 01:55:41 AM script INFO: SUCCESS!@#KODE 1!@#USER_ID 9!@#ACTIVITY_CODE 3
12/12/2022 01:55:41 AM script INFO: SUCCESS!@#KODE 1!@#USER_ID 9!@#ACTIVITY_CODE 1
12/12/2022 01:55:41 AM script INFO: SUCCESS!@#KODE 1!@#USER_ID 9!@#ACTIVITY_CODE 3
12/12/2022 01:55:42 AM script INFO: SUCCESS!@#KODE 1!@#USER_ID 9!@#ACTIVITY_CODE 4
12/12/2022 01:55:42 AM script INFO: SUCCESS!@#KODE 1!@#USER_ID 9!@#ACTIVITY_CODE 3
12/12/2022 01:55:42 AM script INFO: SUCCESS!@#KODE 1!@#USER_ID 9!@#ACTIVITY_CODE 1
12/12/2022 01:55:42 AM script INFO: SUCCESS!@#KODE 1!@#USER_ID 9!@#ACTIVITY_CODE 1
12/12/2022 01:55:42 AM script INFO: SUCCESS!@#KODE 1!@#USER_ID 9!@#ACTIVITY_CODE 4
12/12/2022 01:55:42 AM script INFO: SUCCESS!@#KODE 1!@#USER_ID 9!@#ACTIVITY_CODE 1
12/12/2022 01:55:42 AM script INFO: SUCCESS!@#KODE 1!@#USER_ID 9!@#ACTIVITY_CODE 4
12/12/2022 01:55:43 AM script INFO: SUCCESS!@#KODE 1!@#USER_ID 9!@#ACTIVITY_CODE 2
12/12/2022 01:55:43 AM script INFO: SUCCESS!@#KODE 1!@#USER_ID 9!@#ACTIVITY_CODE 2
12/12/2022 01:55:43 AM script INFO: SUCCESS!@#KODE 1!@#USER_ID 9!@#ACTIVITY_CODE 4
12/12/2022 01:55:43 AM script INFO: SUCCESS!@#KODE 1!@#USER_ID 9!@#ACTIVITY_CODE 2
12/12/2022 01:55:44 AM script INFO: SUCCESS!@#KODE 1!@#USER_ID 9!@#ACTIVITY_CODE 2
12/12/2022 01:55:44 AM script INFO: SUCCESS!@#KODE 1!@#USER_ID 9!@#ACTIVITY_CODE 3
12/12/2022 01:55:44 AM script INFO: SUCCESS!@#KODE 1!@#USER_ID 9!@#ACTIVITY_CODE 1
12/12/2022 01:55:44 AM script INFO: SUCCESS!@#KODE 1!@#USER_ID 9!@#ACTIVITY_CODE 3
12/12/2022 01:55:44 AM script INFO: SUCCESS!@#KODE 1!@#USER_ID 9!@#ACTIVITY_CODE 3
12/12/2022 01:55:45 AM script INFO: SUCCESS!@#KODE 1!@#USER_ID 9!@#ACTIVITY_CODE 1
12/12/2022 01:55:45 AM script INFO: SUCCESS!@#KODE 1!@#USER_ID 9!@#ACTIVITY_CODE 1
12/12/2022 01:55:45 AM script INFO: SUCCESS!@#KODE 1!@#USER_ID 9!@#ACTIVITY_CODE 4
12/12/2022 01:55:45 AM script INFO: SUCCESS!@#KODE 1!@#USER_ID 9!@#ACTIVITY_CODE 3
12/12/2022 01:55:45 AM script INFO: SUCCESS!@#KODE 1!@#USER_ID 9!@#ACTIVITY_CODE 2
12/12/2022 01:55:46 AM script INFO: SUCCESS!@#KODE 1!@#USER_ID 9!@#ACTIVITY_CODE 2
12/12/2022 01:55:46 AM script INFO: SUCCESS!@#KODE 1!@#USER_ID 9!@#ACTIVITY_CODE 2
12/12/2022 01:55:46 AM script INFO: SUCCESS!@#KODE 1!@#USER_ID 9!@#ACTIVITY_CODE 3
12/12/2022 01:55:46 AM script INFO: SUCCESS!@#KODE 1!@#USER_ID 9!@#ACTIVITY_CODE 2
12/12/2022 01:55:46 AM script INFO: SUCCESS!@#KODE 1!@#USER_ID 9!@#ACTIVITY_CODE 1
12/12/2022 01:55:47 AM script INFO: SUCCESS!@#KODE 1!@#USER_ID 9!@#ACTIVITY_CODE 4
12/12/2022 01:55:47 AM script INFO: SUCCESS!@#KODE 1!@#USER_ID 9!@#ACTIVITY_CODE 2
12/12/2022 01:55:47 AM script INFO: SUCCESS!@#KODE 1!@#USER_ID 9!@#ACTIVITY_CODE 1
12/12/2022 01:55:47 AM script INFO: SUCCESS!@#KODE 1!@#USER_ID 9!@#ACTIVITY_CODE 2
12/12/2022 01:55:48 AM script INFO: SUCCESS!@#KODE 1!@#USER_ID 9!@#ACTIVITY_CODE 3
12/12/2022 01:55:48 AM script INFO: SUCCESS!@#KODE 1!@#USER_ID 9!@#ACTIVITY_CODE 1
12/12/2022 01:55:48 AM script INFO: SUCCESS!@#KODE 1!@#USER_ID 9!@#ACTIVITY_CODE 3
12/12/2022 01:55:48 AM script INFO: SUCCESS!@#KODE 1!@#USER_ID 9!@#ACTIVITY_CODE 2
12/12/2022 01:55:48 AM script INFO: SUCCESS!@#KODE 1!@#USER_ID 9!@#ACTIVITY_CODE 2
12/12/2022 01:55:49 AM script INFO: SUCCESS!@#KODE 1!@#USER_ID 9!@#ACTIVITY_CODE 3
12/12/2022 01:55:49 AM script INFO: SUCCESS!@#KODE 1!@#USER_ID 9!@#ACTIVITY_CODE 1
12/12/2022 01:55:49 AM script INFO: SUCCESS!@#KODE 1!@#USER_ID 9!@#ACTIVITY_CODE 2
12/12/2022 01:55:49 AM script INFO: SUCCESS!@#KODE 1!@#USER_ID 9!@#ACTIVITY_CODE 2
12/12/2022 01:55:50 AM script INFO: SUCCESS!@#KODE 1!@#USER_ID 9!@#ACTIVITY_CODE 2
12/12/2022 01:55:50 AM script INFO: SUCCESS!@#KODE 1!@#USER_ID 9!@#ACTIVITY_CODE 4
12/12/2022 01:55:50 AM script INFO: Duration: 118.53016710281372
12/12/2022 01:55:50 AM script INFO: mengakhiri-quiz
12/12/2022 01:55:53 AM script INFO: SUCCESS!@#KODE 1!@#USER_ID 9!@#ACTIVITY_CODE 5
12/12/2022 01:55:53 AM script INFO: berhasil-submit
