12/11/2022 03:11:15 PM script INFO: Prepared chrome options..
12/11/2022 03:11:16 PM script INFO: Initialized chrome browser..
12/11/2022 03:11:16 PM script INFO: mengakses-homepage
12/11/2022 03:12:02 PM script INFO: mengakses-login-page
12/11/2022 03:12:04 PM script INFO: mengakses-site-home
12/11/2022 03:12:05 PM script INFO: mengakses-site-course
12/11/2022 03:12:22 PM script INFO: mengakses-quiz
12/11/2022 03:12:24 PM script INFO: mengakses-start-quiz-page
12/11/2022 03:12:40 PM script INFO: memulai-quiz
12/11/2022 03:12:40 PM script INFO: SUCCESS!@#KODE 1!@#USER_ID 90!@#ACTIVITY_CODE 5
12/11/2022 03:12:50 PM script INFO: SUCCESS!@#KODE 1!@#USER_ID 90!@#ACTIVITY_CODE 3
12/11/2022 03:12:51 PM script INFO: SUCCESS!@#KODE 1!@#USER_ID 90!@#ACTIVITY_CODE 2
12/11/2022 03:12:51 PM script INFO: SUCCESS!@#KODE 1!@#USER_ID 90!@#ACTIVITY_CODE 3
12/11/2022 03:12:51 PM script INFO: SUCCESS!@#KODE 1!@#USER_ID 90!@#ACTIVITY_CODE 1
12/11/2022 03:12:51 PM script INFO: SUCCESS!@#KODE 1!@#USER_ID 90!@#ACTIVITY_CODE 1
12/11/2022 03:12:51 PM script INFO: SUCCESS!@#KODE 1!@#USER_ID 90!@#ACTIVITY_CODE 4
12/11/2022 03:12:51 PM script INFO: SUCCESS!@#KODE 1!@#USER_ID 90!@#ACTIVITY_CODE 1
12/11/2022 03:12:51 PM script INFO: SUCCESS!@#KODE 1!@#USER_ID 90!@#ACTIVITY_CODE 5
12/11/2022 03:12:51 PM script INFO: SUCCESS!@#KODE 1!@#USER_ID 90!@#ACTIVITY_CODE 5
12/11/2022 03:12:53 PM script INFO: SUCCESS!@#KODE 1!@#USER_ID 90!@#ACTIVITY_CODE 4
12/11/2022 03:12:54 PM script INFO: SUCCESS!@#KODE 1!@#USER_ID 90!@#ACTIVITY_CODE 2
12/11/2022 03:12:54 PM script INFO: SUCCESS!@#KODE 1!@#USER_ID 90!@#ACTIVITY_CODE 5
12/11/2022 03:12:54 PM script INFO: SUCCESS!@#KODE 1!@#USER_ID 90!@#ACTIVITY_CODE 5
12/11/2022 03:12:56 PM script INFO: SUCCESS!@#KODE 1!@#USER_ID 90!@#ACTIVITY_CODE 5
12/11/2022 03:12:56 PM script INFO: SUCCESS!@#KODE 1!@#USER_ID 90!@#ACTIVITY_CODE 5
12/11/2022 03:12:59 PM script INFO: SUCCESS!@#KODE 1!@#USER_ID 90!@#ACTIVITY_CODE 5
12/11/2022 03:12:59 PM script INFO: SUCCESS!@#KODE 1!@#USER_ID 90!@#ACTIVITY_CODE 5
12/11/2022 03:13:01 PM script INFO: SUCCESS!@#KODE 1!@#USER_ID 90!@#ACTIVITY_CODE 3
12/11/2022 03:13:01 PM script INFO: SUCCESS!@#KODE 1!@#USER_ID 90!@#ACTIVITY_CODE 1
12/11/2022 03:13:01 PM script INFO: SUCCESS!@#KODE 1!@#USER_ID 90!@#ACTIVITY_CODE 4
12/11/2022 03:13:01 PM script INFO: SUCCESS!@#KODE 1!@#USER_ID 90!@#ACTIVITY_CODE 5
12/11/2022 03:13:01 PM script INFO: SUCCESS!@#KODE 1!@#USER_ID 90!@#ACTIVITY_CODE 5
12/11/2022 03:13:04 PM script INFO: SUCCESS!@#KODE 1!@#USER_ID 90!@#ACTIVITY_CODE 3
12/11/2022 03:13:04 PM script INFO: SUCCESS!@#KODE 1!@#USER_ID 90!@#ACTIVITY_CODE 3
12/11/2022 03:13:04 PM script INFO: SUCCESS!@#KODE 1!@#USER_ID 90!@#ACTIVITY_CODE 3
12/11/2022 03:13:04 PM script INFO: SUCCESS!@#KODE 1!@#USER_ID 90!@#ACTIVITY_CODE 3
12/11/2022 03:13:04 PM script INFO: SUCCESS!@#KODE 1!@#USER_ID 90!@#ACTIVITY_CODE 1
12/11/2022 03:13:04 PM script INFO: SUCCESS!@#KODE 1!@#USER_ID 90!@#ACTIVITY_CODE 5
12/11/2022 03:13:04 PM script INFO: SUCCESS!@#KODE 1!@#USER_ID 90!@#ACTIVITY_CODE 5
12/11/2022 03:13:07 PM script INFO: SUCCESS!@#KODE 1!@#USER_ID 90!@#ACTIVITY_CODE 3
12/11/2022 03:13:07 PM script INFO: SUCCESS!@#KODE 1!@#USER_ID 90!@#ACTIVITY_CODE 1
12/11/2022 03:13:07 PM script INFO: SUCCESS!@#KODE 1!@#USER_ID 90!@#ACTIVITY_CODE 2
12/11/2022 03:13:07 PM script INFO: SUCCESS!@#KODE 1!@#USER_ID 90!@#ACTIVITY_CODE 2
12/11/2022 03:13:07 PM script INFO: SUCCESS!@#KODE 1!@#USER_ID 90!@#ACTIVITY_CODE 2
12/11/2022 03:13:07 PM script INFO: SUCCESS!@#KODE 1!@#USER_ID 90!@#ACTIVITY_CODE 1
12/11/2022 03:13:07 PM script INFO: SUCCESS!@#KODE 1!@#USER_ID 90!@#ACTIVITY_CODE 1
12/11/2022 03:13:07 PM script INFO: SUCCESS!@#KODE 1!@#USER_ID 90!@#ACTIVITY_CODE 4
12/11/2022 03:13:07 PM script INFO: SUCCESS!@#KODE 1!@#USER_ID 90!@#ACTIVITY_CODE 2
12/11/2022 03:13:08 PM script INFO: SUCCESS!@#KODE 1!@#USER_ID 90!@#ACTIVITY_CODE 1
12/11/2022 03:13:08 PM script INFO: SUCCESS!@#KODE 1!@#USER_ID 90!@#ACTIVITY_CODE 1
12/11/2022 03:13:08 PM script INFO: SUCCESS!@#KODE 1!@#USER_ID 90!@#ACTIVITY_CODE 1
12/11/2022 03:13:08 PM script INFO: SUCCESS!@#KODE 1!@#USER_ID 90!@#ACTIVITY_CODE 3
12/11/2022 03:13:08 PM script INFO: SUCCESS!@#KODE 1!@#USER_ID 90!@#ACTIVITY_CODE 3
12/11/2022 03:13:08 PM script INFO: SUCCESS!@#KODE 1!@#USER_ID 90!@#ACTIVITY_CODE 5
12/11/2022 03:13:08 PM script INFO: SUCCESS!@#KODE 1!@#USER_ID 90!@#ACTIVITY_CODE 5
12/11/2022 03:13:10 PM script INFO: SUCCESS!@#KODE 1!@#USER_ID 90!@#ACTIVITY_CODE 2
12/11/2022 03:13:10 PM script INFO: SUCCESS!@#KODE 1!@#USER_ID 90!@#ACTIVITY_CODE 3
12/11/2022 03:13:10 PM script INFO: SUCCESS!@#KODE 1!@#USER_ID 90!@#ACTIVITY_CODE 3
12/11/2022 03:13:11 PM script INFO: SUCCESS!@#KODE 1!@#USER_ID 90!@#ACTIVITY_CODE 1
12/11/2022 03:13:11 PM script INFO: SUCCESS!@#KODE 1!@#USER_ID 90!@#ACTIVITY_CODE 5
12/11/2022 03:13:11 PM script INFO: SUCCESS!@#KODE 1!@#USER_ID 90!@#ACTIVITY_CODE 5
12/11/2022 03:13:13 PM script INFO: SUCCESS!@#KODE 1!@#USER_ID 90!@#ACTIVITY_CODE 1
12/11/2022 03:13:13 PM script INFO: SUCCESS!@#KODE 1!@#USER_ID 90!@#ACTIVITY_CODE 1
12/11/2022 03:13:13 PM script INFO: SUCCESS!@#KODE 1!@#USER_ID 90!@#ACTIVITY_CODE 1
12/11/2022 03:13:13 PM script INFO: SUCCESS!@#KODE 1!@#USER_ID 90!@#ACTIVITY_CODE 5
12/11/2022 03:13:13 PM script INFO: SUCCESS!@#KODE 1!@#USER_ID 90!@#ACTIVITY_CODE 5
12/11/2022 03:13:16 PM script INFO: SUCCESS!@#KODE 1!@#USER_ID 90!@#ACTIVITY_CODE 2
12/11/2022 03:13:16 PM script INFO: SUCCESS!@#KODE 1!@#USER_ID 90!@#ACTIVITY_CODE 3
12/11/2022 03:13:16 PM script INFO: SUCCESS!@#KODE 1!@#USER_ID 90!@#ACTIVITY_CODE 2
12/11/2022 03:13:16 PM script INFO: SUCCESS!@#KODE 1!@#USER_ID 90!@#ACTIVITY_CODE 1
12/11/2022 03:13:16 PM script INFO: SUCCESS!@#KODE 1!@#USER_ID 90!@#ACTIVITY_CODE 2
12/11/2022 03:13:16 PM script INFO: SUCCESS!@#KODE 1!@#USER_ID 90!@#ACTIVITY_CODE 5
12/11/2022 03:13:16 PM script INFO: SUCCESS!@#KODE 1!@#USER_ID 90!@#ACTIVITY_CODE 5
12/11/2022 03:13:19 PM script INFO: SUCCESS!@#KODE 1!@#USER_ID 90!@#ACTIVITY_CODE 5
12/11/2022 03:13:19 PM script INFO: SUCCESS!@#KODE 1!@#USER_ID 90!@#ACTIVITY_CODE 5
12/11/2022 03:13:21 PM script INFO: SUCCESS!@#KODE 1!@#USER_ID 90!@#ACTIVITY_CODE 1
12/11/2022 03:13:21 PM script INFO: SUCCESS!@#KODE 1!@#USER_ID 90!@#ACTIVITY_CODE 2
12/11/2022 03:13:21 PM script INFO: SUCCESS!@#KODE 1!@#USER_ID 90!@#ACTIVITY_CODE 3
12/11/2022 03:13:21 PM script INFO: SUCCESS!@#KODE 1!@#USER_ID 90!@#ACTIVITY_CODE 3
12/11/2022 03:13:22 PM script INFO: SUCCESS!@#KODE 1!@#USER_ID 90!@#ACTIVITY_CODE 2
12/11/2022 03:13:22 PM script INFO: SUCCESS!@#KODE 1!@#USER_ID 90!@#ACTIVITY_CODE 4
12/11/2022 03:13:22 PM script INFO: SUCCESS!@#KODE 1!@#USER_ID 90!@#ACTIVITY_CODE 2
12/11/2022 03:13:22 PM script INFO: SUCCESS!@#KODE 1!@#USER_ID 90!@#ACTIVITY_CODE 1
12/11/2022 03:13:22 PM script INFO: SUCCESS!@#KODE 1!@#USER_ID 90!@#ACTIVITY_CODE 3
12/11/2022 03:13:22 PM script INFO: SUCCESS!@#KODE 1!@#USER_ID 90!@#ACTIVITY_CODE 4
12/11/2022 03:13:22 PM script INFO: SUCCESS!@#KODE 1!@#USER_ID 90!@#ACTIVITY_CODE 1
12/11/2022 03:13:22 PM script INFO: SUCCESS!@#KODE 1!@#USER_ID 90!@#ACTIVITY_CODE 3
12/11/2022 03:13:22 PM script INFO: SUCCESS!@#KODE 1!@#USER_ID 90!@#ACTIVITY_CODE 3
12/11/2022 03:13:22 PM script INFO: SUCCESS!@#KODE 1!@#USER_ID 90!@#ACTIVITY_CODE 1
12/11/2022 03:13:22 PM script INFO: SUCCESS!@#KODE 1!@#USER_ID 90!@#ACTIVITY_CODE 2
12/11/2022 03:13:23 PM script INFO: SUCCESS!@#KODE 1!@#USER_ID 90!@#ACTIVITY_CODE 3
12/11/2022 03:13:23 PM script INFO: SUCCESS!@#KODE 1!@#USER_ID 90!@#ACTIVITY_CODE 2
12/11/2022 03:13:23 PM script INFO: SUCCESS!@#KODE 1!@#USER_ID 90!@#ACTIVITY_CODE 3
12/11/2022 03:13:23 PM script INFO: SUCCESS!@#KODE 1!@#USER_ID 90!@#ACTIVITY_CODE 2
12/11/2022 03:13:23 PM script INFO: SUCCESS!@#KODE 1!@#USER_ID 90!@#ACTIVITY_CODE 4
12/11/2022 03:13:23 PM script INFO: SUCCESS!@#KODE 1!@#USER_ID 90!@#ACTIVITY_CODE 3
12/11/2022 03:13:23 PM script INFO: SUCCESS!@#KODE 1!@#USER_ID 90!@#ACTIVITY_CODE 3
12/11/2022 03:13:23 PM script INFO: SUCCESS!@#KODE 1!@#USER_ID 90!@#ACTIVITY_CODE 2
12/11/2022 03:13:23 PM script INFO: SUCCESS!@#KODE 1!@#USER_ID 90!@#ACTIVITY_CODE 1
12/11/2022 03:13:23 PM script INFO: SUCCESS!@#KODE 1!@#USER_ID 90!@#ACTIVITY_CODE 3
12/11/2022 03:13:23 PM script INFO: SUCCESS!@#KODE 1!@#USER_ID 90!@#ACTIVITY_CODE 2
12/11/2022 03:13:23 PM script INFO: SUCCESS!@#KODE 1!@#USER_ID 90!@#ACTIVITY_CODE 1
12/11/2022 03:13:24 PM script INFO: SUCCESS!@#KODE 1!@#USER_ID 90!@#ACTIVITY_CODE 4
12/11/2022 03:13:24 PM script INFO: SUCCESS!@#KODE 1!@#USER_ID 90!@#ACTIVITY_CODE 1
12/11/2022 03:13:24 PM script INFO: SUCCESS!@#KODE 1!@#USER_ID 90!@#ACTIVITY_CODE 2
12/11/2022 03:13:24 PM script INFO: SUCCESS!@#KODE 1!@#USER_ID 90!@#ACTIVITY_CODE 2
12/11/2022 03:13:24 PM script INFO: SUCCESS!@#KODE 1!@#USER_ID 90!@#ACTIVITY_CODE 2
12/11/2022 03:13:24 PM script INFO: SUCCESS!@#KODE 1!@#USER_ID 90!@#ACTIVITY_CODE 2
12/11/2022 03:13:24 PM script INFO: Duration: 33.84619164466858
12/11/2022 03:13:24 PM script INFO: mengakhiri-quiz
12/11/2022 03:13:27 PM script INFO: SUCCESS!@#KODE 1!@#USER_ID 90!@#ACTIVITY_CODE 5
12/11/2022 03:13:27 PM script INFO: berhasil-submit
