12/10/2022 08:53:26 AM script INFO: Prepared chrome options..
12/10/2022 08:53:29 AM script INFO: Initialized chrome browser..
12/10/2022 08:53:29 AM script INFO: mengakses-homepage
12/10/2022 08:54:09 AM script INFO: mengakses-login-page
12/10/2022 08:54:23 AM script INFO: mengakses-site-home
12/10/2022 08:54:42 AM script INFO: mengakses-site-course
12/10/2022 08:55:03 AM script INFO: mengakses-quiz
12/10/2022 08:55:05 AM script INFO: mengakses-start-quiz-page
12/10/2022 08:55:08 AM script INFO: memulai-quiz
12/10/2022 08:55:08 AM script INFO: SUCCESS!@#KODE 1!@#USER_ID 78!@#ACTIVITY_CODE 5
12/10/2022 08:55:19 AM script INFO: SUCCESS!@#KODE 1!@#USER_ID 78!@#ACTIVITY_CODE 3
12/10/2022 08:55:19 AM script INFO: SUCCESS!@#KODE 1!@#USER_ID 78!@#ACTIVITY_CODE 3
12/10/2022 08:55:19 AM script INFO: SUCCESS!@#KODE 1!@#USER_ID 78!@#ACTIVITY_CODE 5
12/10/2022 08:55:19 AM script INFO: SUCCESS!@#KODE 1!@#USER_ID 78!@#ACTIVITY_CODE 5
12/10/2022 08:55:21 AM script INFO: SUCCESS!@#KODE 1!@#USER_ID 78!@#ACTIVITY_CODE 5
12/10/2022 08:55:21 AM script INFO: SUCCESS!@#KODE 1!@#USER_ID 78!@#ACTIVITY_CODE 5
12/10/2022 08:55:24 AM script INFO: SUCCESS!@#KODE 1!@#USER_ID 78!@#ACTIVITY_CODE 5
12/10/2022 08:55:24 AM script INFO: SUCCESS!@#KODE 1!@#USER_ID 78!@#ACTIVITY_CODE 5
12/10/2022 08:55:27 AM script INFO: SUCCESS!@#KODE 1!@#USER_ID 78!@#ACTIVITY_CODE 3
12/10/2022 08:55:27 AM script INFO: SUCCESS!@#KODE 1!@#USER_ID 78!@#ACTIVITY_CODE 3
12/10/2022 08:55:27 AM script INFO: SUCCESS!@#KODE 1!@#USER_ID 78!@#ACTIVITY_CODE 1
12/10/2022 08:55:27 AM script INFO: SUCCESS!@#KODE 1!@#USER_ID 78!@#ACTIVITY_CODE 1
12/10/2022 08:55:27 AM script INFO: SUCCESS!@#KODE 1!@#USER_ID 78!@#ACTIVITY_CODE 4
12/10/2022 08:55:27 AM script INFO: SUCCESS!@#KODE 1!@#USER_ID 78!@#ACTIVITY_CODE 3
12/10/2022 08:55:27 AM script INFO: SUCCESS!@#KODE 1!@#USER_ID 78!@#ACTIVITY_CODE 1
12/10/2022 08:55:27 AM script INFO: SUCCESS!@#KODE 1!@#USER_ID 78!@#ACTIVITY_CODE 1
12/10/2022 08:55:27 AM script INFO: SUCCESS!@#KODE 1!@#USER_ID 78!@#ACTIVITY_CODE 5
12/10/2022 08:55:27 AM script INFO: SUCCESS!@#KODE 1!@#USER_ID 78!@#ACTIVITY_CODE 5
12/10/2022 08:55:30 AM script INFO: SUCCESS!@#KODE 1!@#USER_ID 78!@#ACTIVITY_CODE 1
12/10/2022 08:55:30 AM script INFO: SUCCESS!@#KODE 1!@#USER_ID 78!@#ACTIVITY_CODE 1
12/10/2022 08:55:30 AM script INFO: SUCCESS!@#KODE 1!@#USER_ID 78!@#ACTIVITY_CODE 4
12/10/2022 08:55:30 AM script INFO: SUCCESS!@#KODE 1!@#USER_ID 78!@#ACTIVITY_CODE 2
12/10/2022 08:55:31 AM script INFO: SUCCESS!@#KODE 1!@#USER_ID 78!@#ACTIVITY_CODE 3
12/10/2022 08:55:31 AM script INFO: SUCCESS!@#KODE 1!@#USER_ID 78!@#ACTIVITY_CODE 5
12/10/2022 08:55:31 AM script INFO: SUCCESS!@#KODE 1!@#USER_ID 78!@#ACTIVITY_CODE 5
12/10/2022 08:55:33 AM script INFO: SUCCESS!@#KODE 1!@#USER_ID 78!@#ACTIVITY_CODE 5
12/10/2022 08:55:33 AM script INFO: SUCCESS!@#KODE 1!@#USER_ID 78!@#ACTIVITY_CODE 5
12/10/2022 08:55:36 AM script INFO: SUCCESS!@#KODE 1!@#USER_ID 78!@#ACTIVITY_CODE 1
12/10/2022 08:55:36 AM script INFO: SUCCESS!@#KODE 1!@#USER_ID 78!@#ACTIVITY_CODE 4
12/10/2022 08:55:36 AM script INFO: SUCCESS!@#KODE 1!@#USER_ID 78!@#ACTIVITY_CODE 3
12/10/2022 08:55:37 AM script INFO: SUCCESS!@#KODE 1!@#USER_ID 78!@#ACTIVITY_CODE 1
12/10/2022 08:55:37 AM script INFO: SUCCESS!@#KODE 1!@#USER_ID 78!@#ACTIVITY_CODE 3
12/10/2022 08:55:37 AM script INFO: SUCCESS!@#KODE 1!@#USER_ID 78!@#ACTIVITY_CODE 2
12/10/2022 08:55:37 AM script INFO: SUCCESS!@#KODE 1!@#USER_ID 78!@#ACTIVITY_CODE 1
12/10/2022 08:55:38 AM script INFO: SUCCESS!@#KODE 1!@#USER_ID 78!@#ACTIVITY_CODE 2
12/10/2022 08:55:38 AM script INFO: SUCCESS!@#KODE 1!@#USER_ID 78!@#ACTIVITY_CODE 2
12/10/2022 08:55:38 AM script INFO: SUCCESS!@#KODE 1!@#USER_ID 78!@#ACTIVITY_CODE 4
12/10/2022 08:55:38 AM script INFO: SUCCESS!@#KODE 1!@#USER_ID 78!@#ACTIVITY_CODE 1
12/10/2022 08:55:39 AM script INFO: SUCCESS!@#KODE 1!@#USER_ID 78!@#ACTIVITY_CODE 4
12/10/2022 08:55:39 AM script INFO: SUCCESS!@#KODE 1!@#USER_ID 78!@#ACTIVITY_CODE 3
12/10/2022 08:55:39 AM script INFO: SUCCESS!@#KODE 1!@#USER_ID 78!@#ACTIVITY_CODE 2
12/10/2022 08:55:39 AM script INFO: SUCCESS!@#KODE 1!@#USER_ID 78!@#ACTIVITY_CODE 1
12/10/2022 08:55:40 AM script INFO: SUCCESS!@#KODE 1!@#USER_ID 78!@#ACTIVITY_CODE 4
12/10/2022 08:55:40 AM script INFO: SUCCESS!@#KODE 1!@#USER_ID 78!@#ACTIVITY_CODE 2
12/10/2022 08:55:40 AM script INFO: SUCCESS!@#KODE 1!@#USER_ID 78!@#ACTIVITY_CODE 1
12/10/2022 08:55:40 AM script INFO: SUCCESS!@#KODE 1!@#USER_ID 78!@#ACTIVITY_CODE 4
12/10/2022 08:55:41 AM script INFO: SUCCESS!@#KODE 1!@#USER_ID 78!@#ACTIVITY_CODE 2
12/10/2022 08:55:41 AM script INFO: SUCCESS!@#KODE 1!@#USER_ID 78!@#ACTIVITY_CODE 1
12/10/2022 08:55:41 AM script INFO: Duration: 22.296370029449463
12/10/2022 08:55:41 AM script INFO: mengakhiri-quiz
12/10/2022 08:55:54 AM script INFO: SUCCESS!@#KODE 1!@#USER_ID 78!@#ACTIVITY_CODE 5
12/10/2022 08:55:54 AM script INFO: berhasil-submit
