12/12/2022 01:32:05 AM script INFO: Prepared chrome options..
12/12/2022 01:32:07 AM script INFO: Initialized chrome browser..
12/12/2022 01:32:07 AM script INFO: mengakses-homepage
12/12/2022 01:32:20 AM script INFO: mengakses-login-page
12/12/2022 01:32:21 AM script INFO: mengakses-site-home
12/12/2022 01:32:22 AM script INFO: mengakses-site-course
12/12/2022 01:32:22 AM script INFO: mengakses-quiz
12/12/2022 01:32:23 AM script INFO: mengakses-start-quiz-page
12/12/2022 01:32:24 AM script INFO: memulai-quiz
12/12/2022 01:32:24 AM script INFO: SUCCESS!@#KODE 1!@#USER_ID 72!@#ACTIVITY_CODE 5
12/12/2022 01:32:35 AM script INFO: SUCCESS!@#KODE 1!@#USER_ID 72!@#ACTIVITY_CODE 5
12/12/2022 01:32:35 AM script INFO: SUCCESS!@#KODE 1!@#USER_ID 72!@#ACTIVITY_CODE 5
12/12/2022 01:32:37 AM script INFO: SUCCESS!@#KODE 1!@#USER_ID 72!@#ACTIVITY_CODE 1
12/12/2022 01:32:37 AM script INFO: SUCCESS!@#KODE 1!@#USER_ID 72!@#ACTIVITY_CODE 1
12/12/2022 01:32:37 AM script INFO: SUCCESS!@#KODE 1!@#USER_ID 72!@#ACTIVITY_CODE 3
12/12/2022 01:32:38 AM script INFO: SUCCESS!@#KODE 1!@#USER_ID 72!@#ACTIVITY_CODE 3
12/12/2022 01:32:38 AM script INFO: SUCCESS!@#KODE 1!@#USER_ID 72!@#ACTIVITY_CODE 5
12/12/2022 01:32:38 AM script INFO: SUCCESS!@#KODE 1!@#USER_ID 72!@#ACTIVITY_CODE 5
12/12/2022 01:32:40 AM script INFO: SUCCESS!@#KODE 1!@#USER_ID 72!@#ACTIVITY_CODE 1
12/12/2022 01:32:40 AM script INFO: SUCCESS!@#KODE 1!@#USER_ID 72!@#ACTIVITY_CODE 4
12/12/2022 01:32:40 AM script INFO: SUCCESS!@#KODE 1!@#USER_ID 72!@#ACTIVITY_CODE 3
12/12/2022 01:32:40 AM script INFO: SUCCESS!@#KODE 1!@#USER_ID 72!@#ACTIVITY_CODE 5
12/12/2022 01:32:40 AM script INFO: SUCCESS!@#KODE 1!@#USER_ID 72!@#ACTIVITY_CODE 5
12/12/2022 01:32:43 AM script INFO: SUCCESS!@#KODE 1!@#USER_ID 72!@#ACTIVITY_CODE 5
12/12/2022 01:32:43 AM script INFO: SUCCESS!@#KODE 1!@#USER_ID 72!@#ACTIVITY_CODE 5
12/12/2022 01:32:45 AM script INFO: SUCCESS!@#KODE 1!@#USER_ID 72!@#ACTIVITY_CODE 1
12/12/2022 01:32:45 AM script INFO: SUCCESS!@#KODE 1!@#USER_ID 72!@#ACTIVITY_CODE 4
12/12/2022 01:32:46 AM script INFO: SUCCESS!@#KODE 1!@#USER_ID 72!@#ACTIVITY_CODE 2
12/12/2022 01:32:46 AM script INFO: SUCCESS!@#KODE 1!@#USER_ID 72!@#ACTIVITY_CODE 3
12/12/2022 01:32:46 AM script INFO: SUCCESS!@#KODE 1!@#USER_ID 72!@#ACTIVITY_CODE 1
12/12/2022 01:32:46 AM script INFO: SUCCESS!@#KODE 1!@#USER_ID 72!@#ACTIVITY_CODE 3
12/12/2022 01:32:46 AM script INFO: SUCCESS!@#KODE 1!@#USER_ID 72!@#ACTIVITY_CODE 2
12/12/2022 01:32:46 AM script INFO: SUCCESS!@#KODE 1!@#USER_ID 72!@#ACTIVITY_CODE 2
12/12/2022 01:32:46 AM script INFO: SUCCESS!@#KODE 1!@#USER_ID 72!@#ACTIVITY_CODE 3
12/12/2022 01:32:46 AM script INFO: SUCCESS!@#KODE 1!@#USER_ID 72!@#ACTIVITY_CODE 1
12/12/2022 01:32:46 AM script INFO: SUCCESS!@#KODE 1!@#USER_ID 72!@#ACTIVITY_CODE 1
12/12/2022 01:32:46 AM script INFO: SUCCESS!@#KODE 1!@#USER_ID 72!@#ACTIVITY_CODE 4
12/12/2022 01:32:47 AM script INFO: SUCCESS!@#KODE 1!@#USER_ID 72!@#ACTIVITY_CODE 1
12/12/2022 01:32:47 AM script INFO: SUCCESS!@#KODE 1!@#USER_ID 72!@#ACTIVITY_CODE 2
12/12/2022 01:32:47 AM script INFO: SUCCESS!@#KODE 1!@#USER_ID 72!@#ACTIVITY_CODE 4
12/12/2022 01:32:47 AM script INFO: SUCCESS!@#KODE 1!@#USER_ID 72!@#ACTIVITY_CODE 5
12/12/2022 01:32:47 AM script INFO: SUCCESS!@#KODE 1!@#USER_ID 72!@#ACTIVITY_CODE 5
12/12/2022 01:32:49 AM script INFO: SUCCESS!@#KODE 1!@#USER_ID 72!@#ACTIVITY_CODE 3
12/12/2022 01:32:49 AM script INFO: SUCCESS!@#KODE 1!@#USER_ID 72!@#ACTIVITY_CODE 5
12/12/2022 01:32:49 AM script INFO: SUCCESS!@#KODE 1!@#USER_ID 72!@#ACTIVITY_CODE 5
12/12/2022 01:32:52 AM script INFO: SUCCESS!@#KODE 1!@#USER_ID 72!@#ACTIVITY_CODE 3
12/12/2022 01:32:52 AM script INFO: SUCCESS!@#KODE 1!@#USER_ID 72!@#ACTIVITY_CODE 3
12/12/2022 01:32:52 AM script INFO: SUCCESS!@#KODE 1!@#USER_ID 72!@#ACTIVITY_CODE 1
12/12/2022 01:32:52 AM script INFO: SUCCESS!@#KODE 1!@#USER_ID 72!@#ACTIVITY_CODE 2
12/12/2022 01:32:52 AM script INFO: SUCCESS!@#KODE 1!@#USER_ID 72!@#ACTIVITY_CODE 2
12/12/2022 01:32:52 AM script INFO: SUCCESS!@#KODE 1!@#USER_ID 72!@#ACTIVITY_CODE 5
12/12/2022 01:32:52 AM script INFO: SUCCESS!@#KODE 1!@#USER_ID 72!@#ACTIVITY_CODE 5
12/12/2022 01:32:55 AM script INFO: SUCCESS!@#KODE 1!@#USER_ID 72!@#ACTIVITY_CODE 3
12/12/2022 01:32:55 AM script INFO: SUCCESS!@#KODE 1!@#USER_ID 72!@#ACTIVITY_CODE 2
12/12/2022 01:32:55 AM script INFO: SUCCESS!@#KODE 1!@#USER_ID 72!@#ACTIVITY_CODE 3
12/12/2022 01:32:55 AM script INFO: SUCCESS!@#KODE 1!@#USER_ID 72!@#ACTIVITY_CODE 4
12/12/2022 01:32:55 AM script INFO: SUCCESS!@#KODE 1!@#USER_ID 72!@#ACTIVITY_CODE 3
12/12/2022 01:32:55 AM script INFO: SUCCESS!@#KODE 1!@#USER_ID 72!@#ACTIVITY_CODE 2
12/12/2022 01:32:55 AM script INFO: SUCCESS!@#KODE 1!@#USER_ID 72!@#ACTIVITY_CODE 1
12/12/2022 01:32:56 AM script INFO: SUCCESS!@#KODE 1!@#USER_ID 72!@#ACTIVITY_CODE 2
12/12/2022 01:32:56 AM script INFO: SUCCESS!@#KODE 1!@#USER_ID 72!@#ACTIVITY_CODE 5
12/12/2022 01:32:56 AM script INFO: SUCCESS!@#KODE 1!@#USER_ID 72!@#ACTIVITY_CODE 5
12/12/2022 01:32:58 AM script INFO: SUCCESS!@#KODE 1!@#USER_ID 72!@#ACTIVITY_CODE 2
12/12/2022 01:32:58 AM script INFO: SUCCESS!@#KODE 1!@#USER_ID 72!@#ACTIVITY_CODE 3
12/12/2022 01:32:58 AM script INFO: SUCCESS!@#KODE 1!@#USER_ID 72!@#ACTIVITY_CODE 1
12/12/2022 01:32:58 AM script INFO: SUCCESS!@#KODE 1!@#USER_ID 72!@#ACTIVITY_CODE 3
12/12/2022 01:32:59 AM script INFO: SUCCESS!@#KODE 1!@#USER_ID 72!@#ACTIVITY_CODE 4
12/12/2022 01:32:59 AM script INFO: SUCCESS!@#KODE 1!@#USER_ID 72!@#ACTIVITY_CODE 1
12/12/2022 01:32:59 AM script INFO: SUCCESS!@#KODE 1!@#USER_ID 72!@#ACTIVITY_CODE 1
12/12/2022 01:32:59 AM script INFO: SUCCESS!@#KODE 1!@#USER_ID 72!@#ACTIVITY_CODE 5
12/12/2022 01:32:59 AM script INFO: SUCCESS!@#KODE 1!@#USER_ID 72!@#ACTIVITY_CODE 5
12/12/2022 01:33:01 AM script INFO: SUCCESS!@#KODE 1!@#USER_ID 72!@#ACTIVITY_CODE 4
12/12/2022 01:33:01 AM script INFO: SUCCESS!@#KODE 1!@#USER_ID 72!@#ACTIVITY_CODE 1
12/12/2022 01:33:01 AM script INFO: SUCCESS!@#KODE 1!@#USER_ID 72!@#ACTIVITY_CODE 5
12/12/2022 01:33:01 AM script INFO: SUCCESS!@#KODE 1!@#USER_ID 72!@#ACTIVITY_CODE 5
12/12/2022 01:33:04 AM script INFO: SUCCESS!@#KODE 1!@#USER_ID 72!@#ACTIVITY_CODE 3
12/12/2022 01:33:04 AM script INFO: SUCCESS!@#KODE 1!@#USER_ID 72!@#ACTIVITY_CODE 4
12/12/2022 01:33:04 AM script INFO: SUCCESS!@#KODE 1!@#USER_ID 72!@#ACTIVITY_CODE 1
12/12/2022 01:33:04 AM script INFO: SUCCESS!@#KODE 1!@#USER_ID 72!@#ACTIVITY_CODE 1
12/12/2022 01:33:04 AM script INFO: SUCCESS!@#KODE 1!@#USER_ID 72!@#ACTIVITY_CODE 3
12/12/2022 01:33:04 AM script INFO: SUCCESS!@#KODE 1!@#USER_ID 72!@#ACTIVITY_CODE 2
12/12/2022 01:33:04 AM script INFO: SUCCESS!@#KODE 1!@#USER_ID 72!@#ACTIVITY_CODE 3
12/12/2022 01:33:04 AM script INFO: SUCCESS!@#KODE 1!@#USER_ID 72!@#ACTIVITY_CODE 2
12/12/2022 01:33:04 AM script INFO: SUCCESS!@#KODE 1!@#USER_ID 72!@#ACTIVITY_CODE 3
12/12/2022 01:33:04 AM script INFO: SUCCESS!@#KODE 1!@#USER_ID 72!@#ACTIVITY_CODE 4
12/12/2022 01:33:05 AM script INFO: SUCCESS!@#KODE 1!@#USER_ID 72!@#ACTIVITY_CODE 1
12/12/2022 01:33:05 AM script INFO: SUCCESS!@#KODE 1!@#USER_ID 72!@#ACTIVITY_CODE 2
12/12/2022 01:33:05 AM script INFO: SUCCESS!@#KODE 1!@#USER_ID 72!@#ACTIVITY_CODE 2
12/12/2022 01:33:05 AM script INFO: SUCCESS!@#KODE 1!@#USER_ID 72!@#ACTIVITY_CODE 2
12/12/2022 01:33:05 AM script INFO: SUCCESS!@#KODE 1!@#USER_ID 72!@#ACTIVITY_CODE 5
12/12/2022 01:33:05 AM script INFO: SUCCESS!@#KODE 1!@#USER_ID 72!@#ACTIVITY_CODE 5
12/12/2022 01:33:07 AM script INFO: SUCCESS!@#KODE 1!@#USER_ID 72!@#ACTIVITY_CODE 4
12/12/2022 01:33:08 AM script INFO: SUCCESS!@#KODE 1!@#USER_ID 72!@#ACTIVITY_CODE 2
12/12/2022 01:33:08 AM script INFO: SUCCESS!@#KODE 1!@#USER_ID 72!@#ACTIVITY_CODE 2
12/12/2022 01:33:08 AM script INFO: SUCCESS!@#KODE 1!@#USER_ID 72!@#ACTIVITY_CODE 2
12/12/2022 01:33:08 AM script INFO: SUCCESS!@#KODE 1!@#USER_ID 72!@#ACTIVITY_CODE 2
12/12/2022 01:33:08 AM script INFO: SUCCESS!@#KODE 1!@#USER_ID 72!@#ACTIVITY_CODE 3
12/12/2022 01:33:08 AM script INFO: SUCCESS!@#KODE 1!@#USER_ID 72!@#ACTIVITY_CODE 3
12/12/2022 01:33:08 AM script INFO: SUCCESS!@#KODE 1!@#USER_ID 72!@#ACTIVITY_CODE 3
12/12/2022 01:33:08 AM script INFO: SUCCESS!@#KODE 1!@#USER_ID 72!@#ACTIVITY_CODE 3
12/12/2022 01:33:08 AM script INFO: SUCCESS!@#KODE 1!@#USER_ID 72!@#ACTIVITY_CODE 4
12/12/2022 01:33:08 AM script INFO: SUCCESS!@#KODE 1!@#USER_ID 72!@#ACTIVITY_CODE 5
12/12/2022 01:33:08 AM script INFO: SUCCESS!@#KODE 1!@#USER_ID 72!@#ACTIVITY_CODE 5
12/12/2022 01:33:11 AM script INFO: SUCCESS!@#KODE 1!@#USER_ID 72!@#ACTIVITY_CODE 5
12/12/2022 01:33:11 AM script INFO: SUCCESS!@#KODE 1!@#USER_ID 72!@#ACTIVITY_CODE 5
12/12/2022 01:33:13 AM script INFO: SUCCESS!@#KODE 1!@#USER_ID 72!@#ACTIVITY_CODE 1
12/12/2022 01:33:13 AM script INFO: SUCCESS!@#KODE 1!@#USER_ID 72!@#ACTIVITY_CODE 5
12/12/2022 01:33:13 AM script INFO: SUCCESS!@#KODE 1!@#USER_ID 72!@#ACTIVITY_CODE 5
12/12/2022 01:33:16 AM script INFO: SUCCESS!@#KODE 1!@#USER_ID 72!@#ACTIVITY_CODE 2
12/12/2022 01:33:16 AM script INFO: SUCCESS!@#KODE 1!@#USER_ID 72!@#ACTIVITY_CODE 1
12/12/2022 01:33:16 AM script INFO: SUCCESS!@#KODE 1!@#USER_ID 72!@#ACTIVITY_CODE 4
12/12/2022 01:33:16 AM script INFO: SUCCESS!@#KODE 1!@#USER_ID 72!@#ACTIVITY_CODE 3
12/12/2022 01:33:16 AM script INFO: SUCCESS!@#KODE 1!@#USER_ID 72!@#ACTIVITY_CODE 3
12/12/2022 01:33:16 AM script INFO: SUCCESS!@#KODE 1!@#USER_ID 72!@#ACTIVITY_CODE 2
12/12/2022 01:33:16 AM script INFO: SUCCESS!@#KODE 1!@#USER_ID 72!@#ACTIVITY_CODE 5
12/12/2022 01:33:16 AM script INFO: SUCCESS!@#KODE 1!@#USER_ID 72!@#ACTIVITY_CODE 5
12/12/2022 01:33:19 AM script INFO: SUCCESS!@#KODE 1!@#USER_ID 72!@#ACTIVITY_CODE 4
12/12/2022 01:33:19 AM script INFO: SUCCESS!@#KODE 1!@#USER_ID 72!@#ACTIVITY_CODE 1
12/12/2022 01:33:19 AM script INFO: SUCCESS!@#KODE 1!@#USER_ID 72!@#ACTIVITY_CODE 1
12/12/2022 01:33:19 AM script INFO: SUCCESS!@#KODE 1!@#USER_ID 72!@#ACTIVITY_CODE 5
12/12/2022 01:33:19 AM script INFO: SUCCESS!@#KODE 1!@#USER_ID 72!@#ACTIVITY_CODE 5
12/12/2022 01:33:22 AM script INFO: SUCCESS!@#KODE 1!@#USER_ID 72!@#ACTIVITY_CODE 2
12/12/2022 01:33:22 AM script INFO: SUCCESS!@#KODE 1!@#USER_ID 72!@#ACTIVITY_CODE 3
12/12/2022 01:33:22 AM script INFO: SUCCESS!@#KODE 1!@#USER_ID 72!@#ACTIVITY_CODE 3
12/12/2022 01:33:22 AM script INFO: SUCCESS!@#KODE 1!@#USER_ID 72!@#ACTIVITY_CODE 4
12/12/2022 01:33:22 AM script INFO: SUCCESS!@#KODE 1!@#USER_ID 72!@#ACTIVITY_CODE 1
12/12/2022 01:33:22 AM script INFO: SUCCESS!@#KODE 1!@#USER_ID 72!@#ACTIVITY_CODE 1
12/12/2022 01:33:23 AM script INFO: SUCCESS!@#KODE 1!@#USER_ID 72!@#ACTIVITY_CODE 4
12/12/2022 01:33:23 AM script INFO: SUCCESS!@#KODE 1!@#USER_ID 72!@#ACTIVITY_CODE 1
12/12/2022 01:33:23 AM script INFO: SUCCESS!@#KODE 1!@#USER_ID 72!@#ACTIVITY_CODE 2
12/12/2022 01:33:23 AM script INFO: SUCCESS!@#KODE 1!@#USER_ID 72!@#ACTIVITY_CODE 2
12/12/2022 01:33:23 AM script INFO: SUCCESS!@#KODE 1!@#USER_ID 72!@#ACTIVITY_CODE 3
12/12/2022 01:33:23 AM script INFO: SUCCESS!@#KODE 1!@#USER_ID 72!@#ACTIVITY_CODE 3
12/12/2022 01:33:24 AM script INFO: SUCCESS!@#KODE 1!@#USER_ID 72!@#ACTIVITY_CODE 2
12/12/2022 01:33:24 AM script INFO: SUCCESS!@#KODE 1!@#USER_ID 72!@#ACTIVITY_CODE 1
12/12/2022 01:33:24 AM script INFO: SUCCESS!@#KODE 1!@#USER_ID 72!@#ACTIVITY_CODE 1
12/12/2022 01:33:24 AM script INFO: SUCCESS!@#KODE 1!@#USER_ID 72!@#ACTIVITY_CODE 3
12/12/2022 01:33:24 AM script INFO: SUCCESS!@#KODE 1!@#USER_ID 72!@#ACTIVITY_CODE 1
12/12/2022 01:33:24 AM script INFO: SUCCESS!@#KODE 1!@#USER_ID 72!@#ACTIVITY_CODE 2
12/12/2022 01:33:24 AM script INFO: SUCCESS!@#KODE 1!@#USER_ID 72!@#ACTIVITY_CODE 2
12/12/2022 01:33:24 AM script INFO: SUCCESS!@#KODE 1!@#USER_ID 72!@#ACTIVITY_CODE 1
12/12/2022 01:33:24 AM script INFO: SUCCESS!@#KODE 1!@#USER_ID 72!@#ACTIVITY_CODE 1
12/12/2022 01:33:25 AM script INFO: SUCCESS!@#KODE 1!@#USER_ID 72!@#ACTIVITY_CODE 2
12/12/2022 01:33:25 AM script INFO: SUCCESS!@#KODE 1!@#USER_ID 72!@#ACTIVITY_CODE 1
12/12/2022 01:33:25 AM script INFO: SUCCESS!@#KODE 1!@#USER_ID 72!@#ACTIVITY_CODE 2
12/12/2022 01:33:25 AM script INFO: SUCCESS!@#KODE 1!@#USER_ID 72!@#ACTIVITY_CODE 2
12/12/2022 01:33:25 AM script INFO: SUCCESS!@#KODE 1!@#USER_ID 72!@#ACTIVITY_CODE 3
12/12/2022 01:33:25 AM script INFO: SUCCESS!@#KODE 1!@#USER_ID 72!@#ACTIVITY_CODE 1
12/12/2022 01:33:26 AM script INFO: SUCCESS!@#KODE 1!@#USER_ID 72!@#ACTIVITY_CODE 2
12/12/2022 01:33:26 AM script INFO: SUCCESS!@#KODE 1!@#USER_ID 72!@#ACTIVITY_CODE 2
12/12/2022 01:33:26 AM script INFO: SUCCESS!@#KODE 1!@#USER_ID 72!@#ACTIVITY_CODE 3
12/12/2022 01:33:26 AM script INFO: SUCCESS!@#KODE 1!@#USER_ID 72!@#ACTIVITY_CODE 1
12/12/2022 01:33:26 AM script INFO: SUCCESS!@#KODE 1!@#USER_ID 72!@#ACTIVITY_CODE 1
12/12/2022 01:33:26 AM script INFO: SUCCESS!@#KODE 1!@#USER_ID 72!@#ACTIVITY_CODE 3
12/12/2022 01:33:26 AM script INFO: SUCCESS!@#KODE 1!@#USER_ID 72!@#ACTIVITY_CODE 2
12/12/2022 01:33:26 AM script INFO: SUCCESS!@#KODE 1!@#USER_ID 72!@#ACTIVITY_CODE 1
12/12/2022 01:33:27 AM script INFO: SUCCESS!@#KODE 1!@#USER_ID 72!@#ACTIVITY_CODE 1
12/12/2022 01:33:27 AM script INFO: SUCCESS!@#KODE 1!@#USER_ID 72!@#ACTIVITY_CODE 1
12/12/2022 01:33:27 AM script INFO: SUCCESS!@#KODE 1!@#USER_ID 72!@#ACTIVITY_CODE 2
12/12/2022 01:33:27 AM script INFO: SUCCESS!@#KODE 1!@#USER_ID 72!@#ACTIVITY_CODE 2
12/12/2022 01:33:27 AM script INFO: SUCCESS!@#KODE 1!@#USER_ID 72!@#ACTIVITY_CODE 4
12/12/2022 01:33:27 AM script INFO: SUCCESS!@#KODE 1!@#USER_ID 72!@#ACTIVITY_CODE 3
12/12/2022 01:33:28 AM script INFO: SUCCESS!@#KODE 1!@#USER_ID 72!@#ACTIVITY_CODE 2
12/12/2022 01:33:28 AM script INFO: SUCCESS!@#KODE 1!@#USER_ID 72!@#ACTIVITY_CODE 1
12/12/2022 01:33:28 AM script INFO: SUCCESS!@#KODE 1!@#USER_ID 72!@#ACTIVITY_CODE 2
12/12/2022 01:33:28 AM script INFO: SUCCESS!@#KODE 1!@#USER_ID 72!@#ACTIVITY_CODE 2
12/12/2022 01:33:29 AM script INFO: SUCCESS!@#KODE 1!@#USER_ID 72!@#ACTIVITY_CODE 2
12/12/2022 01:33:29 AM script INFO: SUCCESS!@#KODE 1!@#USER_ID 72!@#ACTIVITY_CODE 4
12/12/2022 01:33:29 AM script INFO: SUCCESS!@#KODE 1!@#USER_ID 72!@#ACTIVITY_CODE 1
12/12/2022 01:33:29 AM script INFO: SUCCESS!@#KODE 1!@#USER_ID 72!@#ACTIVITY_CODE 3
12/12/2022 01:33:29 AM script INFO: SUCCESS!@#KODE 1!@#USER_ID 72!@#ACTIVITY_CODE 2
12/12/2022 01:33:29 AM script INFO: SUCCESS!@#KODE 1!@#USER_ID 72!@#ACTIVITY_CODE 1
12/12/2022 01:33:29 AM script INFO: SUCCESS!@#KODE 1!@#USER_ID 72!@#ACTIVITY_CODE 3
12/12/2022 01:33:29 AM script INFO: SUCCESS!@#KODE 1!@#USER_ID 72!@#ACTIVITY_CODE 3
12/12/2022 01:33:30 AM script INFO: SUCCESS!@#KODE 1!@#USER_ID 72!@#ACTIVITY_CODE 3
12/12/2022 01:33:30 AM script INFO: SUCCESS!@#KODE 1!@#USER_ID 72!@#ACTIVITY_CODE 4
12/12/2022 01:33:30 AM script INFO: SUCCESS!@#KODE 1!@#USER_ID 72!@#ACTIVITY_CODE 1
12/12/2022 01:33:30 AM script INFO: SUCCESS!@#KODE 1!@#USER_ID 72!@#ACTIVITY_CODE 2
12/12/2022 01:33:30 AM script INFO: SUCCESS!@#KODE 1!@#USER_ID 72!@#ACTIVITY_CODE 1
12/12/2022 01:33:30 AM script INFO: SUCCESS!@#KODE 1!@#USER_ID 72!@#ACTIVITY_CODE 2
12/12/2022 01:33:30 AM script INFO: SUCCESS!@#KODE 1!@#USER_ID 72!@#ACTIVITY_CODE 3
12/12/2022 01:33:31 AM script INFO: SUCCESS!@#KODE 1!@#USER_ID 72!@#ACTIVITY_CODE 2
12/12/2022 01:33:31 AM script INFO: SUCCESS!@#KODE 1!@#USER_ID 72!@#ACTIVITY_CODE 3
12/12/2022 01:33:31 AM script INFO: SUCCESS!@#KODE 1!@#USER_ID 72!@#ACTIVITY_CODE 1
12/12/2022 01:33:31 AM script INFO: SUCCESS!@#KODE 1!@#USER_ID 72!@#ACTIVITY_CODE 2
12/12/2022 01:33:31 AM script INFO: SUCCESS!@#KODE 1!@#USER_ID 72!@#ACTIVITY_CODE 1
12/12/2022 01:33:31 AM script INFO: SUCCESS!@#KODE 1!@#USER_ID 72!@#ACTIVITY_CODE 3
12/12/2022 01:33:32 AM script INFO: SUCCESS!@#KODE 1!@#USER_ID 72!@#ACTIVITY_CODE 4
12/12/2022 01:33:32 AM script INFO: SUCCESS!@#KODE 1!@#USER_ID 72!@#ACTIVITY_CODE 2
12/12/2022 01:33:32 AM script INFO: SUCCESS!@#KODE 1!@#USER_ID 72!@#ACTIVITY_CODE 4
12/12/2022 01:33:32 AM script INFO: SUCCESS!@#KODE 1!@#USER_ID 72!@#ACTIVITY_CODE 2
12/12/2022 01:33:32 AM script INFO: SUCCESS!@#KODE 1!@#USER_ID 72!@#ACTIVITY_CODE 2
12/12/2022 01:33:32 AM script INFO: SUCCESS!@#KODE 1!@#USER_ID 72!@#ACTIVITY_CODE 1
12/12/2022 01:33:33 AM script INFO: SUCCESS!@#KODE 1!@#USER_ID 72!@#ACTIVITY_CODE 1
12/12/2022 01:33:33 AM script INFO: SUCCESS!@#KODE 1!@#USER_ID 72!@#ACTIVITY_CODE 2
12/12/2022 01:33:33 AM script INFO: SUCCESS!@#KODE 1!@#USER_ID 72!@#ACTIVITY_CODE 2
12/12/2022 01:33:33 AM script INFO: SUCCESS!@#KODE 1!@#USER_ID 72!@#ACTIVITY_CODE 2
12/12/2022 01:33:33 AM script INFO: SUCCESS!@#KODE 1!@#USER_ID 72!@#ACTIVITY_CODE 4
12/12/2022 01:33:34 AM script INFO: SUCCESS!@#KODE 1!@#USER_ID 72!@#ACTIVITY_CODE 2
12/12/2022 01:33:34 AM script INFO: SUCCESS!@#KODE 1!@#USER_ID 72!@#ACTIVITY_CODE 3
12/12/2022 01:33:34 AM script INFO: SUCCESS!@#KODE 1!@#USER_ID 72!@#ACTIVITY_CODE 1
12/12/2022 01:33:34 AM script INFO: SUCCESS!@#KODE 1!@#USER_ID 72!@#ACTIVITY_CODE 2
12/12/2022 01:33:34 AM script INFO: SUCCESS!@#KODE 1!@#USER_ID 72!@#ACTIVITY_CODE 2
12/12/2022 01:33:34 AM script INFO: SUCCESS!@#KODE 1!@#USER_ID 72!@#ACTIVITY_CODE 1
12/12/2022 01:33:35 AM script INFO: SUCCESS!@#KODE 1!@#USER_ID 72!@#ACTIVITY_CODE 4
12/12/2022 01:33:35 AM script INFO: SUCCESS!@#KODE 1!@#USER_ID 72!@#ACTIVITY_CODE 3
12/12/2022 01:33:35 AM script INFO: SUCCESS!@#KODE 1!@#USER_ID 72!@#ACTIVITY_CODE 1
12/12/2022 01:33:35 AM script INFO: SUCCESS!@#KODE 1!@#USER_ID 72!@#ACTIVITY_CODE 2
12/12/2022 01:33:35 AM script INFO: SUCCESS!@#KODE 1!@#USER_ID 72!@#ACTIVITY_CODE 2
12/12/2022 01:33:36 AM script INFO: SUCCESS!@#KODE 1!@#USER_ID 72!@#ACTIVITY_CODE 2
12/12/2022 01:33:36 AM script INFO: SUCCESS!@#KODE 1!@#USER_ID 72!@#ACTIVITY_CODE 1
12/12/2022 01:33:36 AM script INFO: SUCCESS!@#KODE 1!@#USER_ID 72!@#ACTIVITY_CODE 2
12/12/2022 01:33:36 AM script INFO: SUCCESS!@#KODE 1!@#USER_ID 72!@#ACTIVITY_CODE 3
12/12/2022 01:33:36 AM script INFO: SUCCESS!@#KODE 1!@#USER_ID 72!@#ACTIVITY_CODE 4
12/12/2022 01:33:36 AM script INFO: SUCCESS!@#KODE 1!@#USER_ID 72!@#ACTIVITY_CODE 1
12/12/2022 01:33:36 AM script INFO: SUCCESS!@#KODE 1!@#USER_ID 72!@#ACTIVITY_CODE 3
12/12/2022 01:33:37 AM script INFO: SUCCESS!@#KODE 1!@#USER_ID 72!@#ACTIVITY_CODE 4
12/12/2022 01:33:37 AM script INFO: SUCCESS!@#KODE 1!@#USER_ID 72!@#ACTIVITY_CODE 1
12/12/2022 01:33:37 AM script INFO: SUCCESS!@#KODE 1!@#USER_ID 72!@#ACTIVITY_CODE 4
12/12/2022 01:33:37 AM script INFO: SUCCESS!@#KODE 1!@#USER_ID 72!@#ACTIVITY_CODE 1
12/12/2022 01:33:37 AM script INFO: SUCCESS!@#KODE 1!@#USER_ID 72!@#ACTIVITY_CODE 3
12/12/2022 01:33:37 AM script INFO: SUCCESS!@#KODE 1!@#USER_ID 72!@#ACTIVITY_CODE 2
12/12/2022 01:33:37 AM script INFO: SUCCESS!@#KODE 1!@#USER_ID 72!@#ACTIVITY_CODE 1
12/12/2022 01:33:38 AM script INFO: SUCCESS!@#KODE 1!@#USER_ID 72!@#ACTIVITY_CODE 2
12/12/2022 01:33:38 AM script INFO: SUCCESS!@#KODE 1!@#USER_ID 72!@#ACTIVITY_CODE 3
12/12/2022 01:33:38 AM script INFO: SUCCESS!@#KODE 1!@#USER_ID 72!@#ACTIVITY_CODE 4
12/12/2022 01:33:38 AM script INFO: SUCCESS!@#KODE 1!@#USER_ID 72!@#ACTIVITY_CODE 3
12/12/2022 01:33:38 AM script INFO: SUCCESS!@#KODE 1!@#USER_ID 72!@#ACTIVITY_CODE 1
12/12/2022 01:33:38 AM script INFO: SUCCESS!@#KODE 1!@#USER_ID 72!@#ACTIVITY_CODE 4
12/12/2022 01:33:38 AM script INFO: SUCCESS!@#KODE 1!@#USER_ID 72!@#ACTIVITY_CODE 1
12/12/2022 01:33:39 AM script INFO: SUCCESS!@#KODE 1!@#USER_ID 72!@#ACTIVITY_CODE 2
12/12/2022 01:33:39 AM script INFO: SUCCESS!@#KODE 1!@#USER_ID 72!@#ACTIVITY_CODE 2
12/12/2022 01:33:39 AM script INFO: SUCCESS!@#KODE 1!@#USER_ID 72!@#ACTIVITY_CODE 4
12/12/2022 01:33:39 AM script INFO: SUCCESS!@#KODE 1!@#USER_ID 72!@#ACTIVITY_CODE 2
12/12/2022 01:33:39 AM script INFO: SUCCESS!@#KODE 1!@#USER_ID 72!@#ACTIVITY_CODE 1
12/12/2022 01:33:39 AM script INFO: SUCCESS!@#KODE 1!@#USER_ID 72!@#ACTIVITY_CODE 1
12/12/2022 01:33:39 AM script INFO: SUCCESS!@#KODE 1!@#USER_ID 72!@#ACTIVITY_CODE 1
12/12/2022 01:33:39 AM script INFO: SUCCESS!@#KODE 1!@#USER_ID 72!@#ACTIVITY_CODE 1
12/12/2022 01:33:40 AM script INFO: SUCCESS!@#KODE 1!@#USER_ID 72!@#ACTIVITY_CODE 2
12/12/2022 01:33:40 AM script INFO: SUCCESS!@#KODE 1!@#USER_ID 72!@#ACTIVITY_CODE 3
12/12/2022 01:33:40 AM script INFO: SUCCESS!@#KODE 1!@#USER_ID 72!@#ACTIVITY_CODE 2
12/12/2022 01:33:40 AM script INFO: SUCCESS!@#KODE 1!@#USER_ID 72!@#ACTIVITY_CODE 2
12/12/2022 01:33:40 AM script INFO: SUCCESS!@#KODE 1!@#USER_ID 72!@#ACTIVITY_CODE 4
12/12/2022 01:33:41 AM script INFO: SUCCESS!@#KODE 1!@#USER_ID 72!@#ACTIVITY_CODE 1
12/12/2022 01:33:41 AM script INFO: SUCCESS!@#KODE 1!@#USER_ID 72!@#ACTIVITY_CODE 1
12/12/2022 01:33:41 AM script INFO: SUCCESS!@#KODE 1!@#USER_ID 72!@#ACTIVITY_CODE 2
12/12/2022 01:33:41 AM script INFO: SUCCESS!@#KODE 1!@#USER_ID 72!@#ACTIVITY_CODE 3
12/12/2022 01:33:41 AM script INFO: SUCCESS!@#KODE 1!@#USER_ID 72!@#ACTIVITY_CODE 4
12/12/2022 01:33:41 AM script INFO: SUCCESS!@#KODE 1!@#USER_ID 72!@#ACTIVITY_CODE 1
12/12/2022 01:33:41 AM script INFO: SUCCESS!@#KODE 1!@#USER_ID 72!@#ACTIVITY_CODE 4
12/12/2022 01:33:42 AM script INFO: SUCCESS!@#KODE 1!@#USER_ID 72!@#ACTIVITY_CODE 3
12/12/2022 01:33:42 AM script INFO: SUCCESS!@#KODE 1!@#USER_ID 72!@#ACTIVITY_CODE 3
12/12/2022 01:33:42 AM script INFO: SUCCESS!@#KODE 1!@#USER_ID 72!@#ACTIVITY_CODE 3
12/12/2022 01:33:42 AM script INFO: SUCCESS!@#KODE 1!@#USER_ID 72!@#ACTIVITY_CODE 3
12/12/2022 01:33:42 AM script INFO: SUCCESS!@#KODE 1!@#USER_ID 72!@#ACTIVITY_CODE 3
12/12/2022 01:33:42 AM script INFO: SUCCESS!@#KODE 1!@#USER_ID 72!@#ACTIVITY_CODE 1
12/12/2022 01:33:42 AM script INFO: SUCCESS!@#KODE 1!@#USER_ID 72!@#ACTIVITY_CODE 4
12/12/2022 01:33:42 AM script INFO: SUCCESS!@#KODE 1!@#USER_ID 72!@#ACTIVITY_CODE 3
12/12/2022 01:33:42 AM script INFO: Duration: 67.51237511634827
12/12/2022 01:33:42 AM script INFO: mengakhiri-quiz
12/12/2022 01:34:05 AM script INFO: SUCCESS!@#KODE 1!@#USER_ID 72!@#ACTIVITY_CODE 5
12/12/2022 01:34:05 AM script INFO: berhasil-submit
