12/10/2022 08:53:26 AM script INFO: Prepared chrome options..
12/10/2022 08:53:29 AM script INFO: Initialized chrome browser..
12/10/2022 08:53:29 AM script INFO: mengakses-homepage
12/10/2022 08:53:48 AM script INFO: mengakses-login-page
12/10/2022 08:54:20 AM script INFO: mengakses-site-home
12/10/2022 08:54:21 AM main_worker ERROR: Message: element click intercepted: Element <a class="list-group-item list-group-item-action  " href="http://34.70.248.228/?redirect=0" data-key="home" data-isexpandable="0" data-indent="0" data-showdivider="0" data-type="70" data-nodetype="0" data-collapse="0" data-forceopen="0" data-isactive="0" data-hidden="0" data-preceedwithhr="0" data-parent-key="myhome">...</a> is not clickable at point (142, 141). Other element would receive the click: <div class="yui3-widget-mask" style="position: fixed; width: 100%; height: 100%; top: 0px; left: 0px; z-index: 1041;"></div>
  (Session info: headless chrome=107.0.5304.87)
Stacktrace:
#0 0x564cf51ba463 <unknown>
#1 0x564cf4f7e8d8 <unknown>
#2 0x564cf4fc423b <unknown>
#3 0x564cf4fc1a79 <unknown>
#4 0x564cf4fbefe4 <unknown>
#5 0x564cf4fbdb21 <unknown>
#6 0x564cf4fb0421 <unknown>
#7 0x564cf4fdd622 <unknown>
#8 0x564cf4fafba7 <unknown>
#9 0x564cf4fdd78e <unknown>
#10 0x564cf4ff630f <unknown>
#11 0x564cf4fdd443 <unknown>
#12 0x564cf4fae3c5 <unknown>
#13 0x564cf4faf531 <unknown>
#14 0x564cf520cdce <unknown>
#15 0x564cf5210192 <unknown>
#16 0x564cf51f193e <unknown>
#17 0x564cf5211103 <unknown>
#18 0x564cf51e4d85 <unknown>
#19 0x564cf52320a8 <unknown>
#20 0x564cf5232239 <unknown>
#21 0x564cf524d492 <unknown>
#22 0x7f744deab609 start_thread

