12/23/2022 01:06:08 AM script INFO: Prepared chrome options..
12/23/2022 01:06:09 AM script INFO: Initialized chrome browser..
12/23/2022 01:06:09 AM script INFO: mengakses-homepage
12/23/2022 01:07:13 AM script INFO: mengakses-login-page
12/23/2022 01:07:51 AM script INFO: mengakses-site-home
12/23/2022 01:07:59 AM script INFO: mengakses-site-course
12/23/2022 01:08:27 AM script INFO: mengakses-quiz
12/23/2022 01:08:51 AM script INFO: mengakses-start-quiz-page
12/23/2022 01:09:09 AM script INFO: memulai-quiz
12/23/2022 01:09:09 AM script INFO: SUCCESS!@#KODE 1!@#USER_ID 35!@#ACTIVITY_CODE 5
12/23/2022 01:09:20 AM script INFO: SUCCESS!@#KODE 1!@#USER_ID 35!@#ACTIVITY_CODE 1
12/23/2022 01:09:20 AM script INFO: SUCCESS!@#KODE 1!@#USER_ID 35!@#ACTIVITY_CODE 5
12/23/2022 01:09:20 AM script INFO: SUCCESS!@#KODE 1!@#USER_ID 35!@#ACTIVITY_CODE 5
12/23/2022 01:09:22 AM script INFO: SUCCESS!@#KODE 1!@#USER_ID 35!@#ACTIVITY_CODE 4
12/23/2022 01:09:23 AM script INFO: SUCCESS!@#KODE 1!@#USER_ID 35!@#ACTIVITY_CODE 3
12/23/2022 01:09:23 AM script INFO: SUCCESS!@#KODE 1!@#USER_ID 35!@#ACTIVITY_CODE 3
12/23/2022 01:09:23 AM script INFO: SUCCESS!@#KODE 1!@#USER_ID 35!@#ACTIVITY_CODE 1
12/23/2022 01:09:23 AM script INFO: SUCCESS!@#KODE 1!@#USER_ID 35!@#ACTIVITY_CODE 1
12/23/2022 01:09:23 AM script INFO: SUCCESS!@#KODE 1!@#USER_ID 35!@#ACTIVITY_CODE 1
12/23/2022 01:09:23 AM script INFO: SUCCESS!@#KODE 1!@#USER_ID 35!@#ACTIVITY_CODE 2
12/23/2022 01:09:23 AM script INFO: SUCCESS!@#KODE 1!@#USER_ID 35!@#ACTIVITY_CODE 2
12/23/2022 01:09:23 AM script INFO: SUCCESS!@#KODE 1!@#USER_ID 35!@#ACTIVITY_CODE 3
12/23/2022 01:09:23 AM script INFO: SUCCESS!@#KODE 1!@#USER_ID 35!@#ACTIVITY_CODE 3
12/23/2022 01:09:23 AM script INFO: SUCCESS!@#KODE 1!@#USER_ID 35!@#ACTIVITY_CODE 2
12/23/2022 01:09:23 AM script INFO: SUCCESS!@#KODE 1!@#USER_ID 35!@#ACTIVITY_CODE 5
12/23/2022 01:09:23 AM script INFO: SUCCESS!@#KODE 1!@#USER_ID 35!@#ACTIVITY_CODE 5
12/23/2022 01:09:26 AM script INFO: SUCCESS!@#KODE 1!@#USER_ID 35!@#ACTIVITY_CODE 4
12/23/2022 01:09:26 AM script INFO: SUCCESS!@#KODE 1!@#USER_ID 35!@#ACTIVITY_CODE 2
12/23/2022 01:09:26 AM script INFO: SUCCESS!@#KODE 1!@#USER_ID 35!@#ACTIVITY_CODE 1
12/23/2022 01:09:26 AM script INFO: SUCCESS!@#KODE 1!@#USER_ID 35!@#ACTIVITY_CODE 5
12/23/2022 01:09:26 AM script INFO: SUCCESS!@#KODE 1!@#USER_ID 35!@#ACTIVITY_CODE 5
12/23/2022 01:09:29 AM script INFO: SUCCESS!@#KODE 1!@#USER_ID 35!@#ACTIVITY_CODE 2
12/23/2022 01:09:29 AM script INFO: SUCCESS!@#KODE 1!@#USER_ID 35!@#ACTIVITY_CODE 3
12/23/2022 01:09:29 AM script INFO: SUCCESS!@#KODE 1!@#USER_ID 35!@#ACTIVITY_CODE 3
12/23/2022 01:09:29 AM script INFO: SUCCESS!@#KODE 1!@#USER_ID 35!@#ACTIVITY_CODE 1
12/23/2022 01:09:29 AM script INFO: SUCCESS!@#KODE 1!@#USER_ID 35!@#ACTIVITY_CODE 3
12/23/2022 01:09:29 AM script INFO: SUCCESS!@#KODE 1!@#USER_ID 35!@#ACTIVITY_CODE 5
12/23/2022 01:09:29 AM script INFO: SUCCESS!@#KODE 1!@#USER_ID 35!@#ACTIVITY_CODE 5
12/23/2022 01:09:31 AM script INFO: SUCCESS!@#KODE 1!@#USER_ID 35!@#ACTIVITY_CODE 3
12/23/2022 01:09:32 AM script INFO: SUCCESS!@#KODE 1!@#USER_ID 35!@#ACTIVITY_CODE 2
12/23/2022 01:09:32 AM script INFO: SUCCESS!@#KODE 1!@#USER_ID 35!@#ACTIVITY_CODE 2
12/23/2022 01:09:32 AM script INFO: SUCCESS!@#KODE 1!@#USER_ID 35!@#ACTIVITY_CODE 2
12/23/2022 01:09:32 AM script INFO: SUCCESS!@#KODE 1!@#USER_ID 35!@#ACTIVITY_CODE 1
12/23/2022 01:09:32 AM script INFO: SUCCESS!@#KODE 1!@#USER_ID 35!@#ACTIVITY_CODE 5
12/23/2022 01:09:32 AM script INFO: SUCCESS!@#KODE 1!@#USER_ID 35!@#ACTIVITY_CODE 5
12/23/2022 01:09:34 AM script INFO: SUCCESS!@#KODE 1!@#USER_ID 35!@#ACTIVITY_CODE 3
12/23/2022 01:09:34 AM script INFO: SUCCESS!@#KODE 1!@#USER_ID 35!@#ACTIVITY_CODE 4
12/23/2022 01:09:35 AM script INFO: SUCCESS!@#KODE 1!@#USER_ID 35!@#ACTIVITY_CODE 2
12/23/2022 01:09:35 AM script INFO: SUCCESS!@#KODE 1!@#USER_ID 35!@#ACTIVITY_CODE 3
12/23/2022 01:09:35 AM script INFO: SUCCESS!@#KODE 1!@#USER_ID 35!@#ACTIVITY_CODE 2
12/23/2022 01:09:35 AM script INFO: SUCCESS!@#KODE 1!@#USER_ID 35!@#ACTIVITY_CODE 5
12/23/2022 01:09:35 AM script INFO: SUCCESS!@#KODE 1!@#USER_ID 35!@#ACTIVITY_CODE 5
12/23/2022 01:09:37 AM script INFO: SUCCESS!@#KODE 1!@#USER_ID 35!@#ACTIVITY_CODE 3
12/23/2022 01:09:37 AM script INFO: SUCCESS!@#KODE 1!@#USER_ID 35!@#ACTIVITY_CODE 3
12/23/2022 01:09:38 AM script INFO: SUCCESS!@#KODE 1!@#USER_ID 35!@#ACTIVITY_CODE 2
12/23/2022 01:09:38 AM script INFO: SUCCESS!@#KODE 1!@#USER_ID 35!@#ACTIVITY_CODE 3
12/23/2022 01:09:38 AM script INFO: SUCCESS!@#KODE 1!@#USER_ID 35!@#ACTIVITY_CODE 1
12/23/2022 01:09:38 AM script INFO: SUCCESS!@#KODE 1!@#USER_ID 35!@#ACTIVITY_CODE 3
12/23/2022 01:09:38 AM script INFO: Duration: 17.948960542678833
12/23/2022 01:09:38 AM script INFO: mengakhiri-quiz
12/23/2022 01:09:54 AM script INFO: SUCCESS!@#KODE 1!@#USER_ID 35!@#ACTIVITY_CODE 5
12/23/2022 01:09:54 AM script INFO: berhasil-submit
12/23/2022 01:11:24 AM script ERROR: TIMEOUT EXCEPTION!@#KODE 0!@#LOCATION berhasil-submit
12/23/2022 01:11:24 AM main_worker ERROR: Message: None

