12/23/2022 07:04:05 AM script INFO: Prepared chrome options..
12/23/2022 07:04:07 AM script INFO: Initialized chrome browser..
12/23/2022 07:04:07 AM script INFO: mengakses-homepage
12/23/2022 07:04:23 AM script INFO: mengakses-login-page
12/23/2022 07:04:24 AM script INFO: mengakses-site-home
12/23/2022 07:04:24 AM script INFO: mengakses-site-course
12/23/2022 07:04:45 AM script INFO: mengakses-quiz
12/23/2022 07:04:57 AM script INFO: mengakses-start-quiz-page
12/23/2022 07:05:05 AM script INFO: memulai-quiz
12/23/2022 07:05:05 AM script INFO: SUCCESS!@#KODE 1!@#USER_ID 16!@#ACTIVITY_CODE 5
12/23/2022 07:05:16 AM script INFO: SUCCESS!@#KODE 1!@#USER_ID 16!@#ACTIVITY_CODE 5
12/23/2022 07:05:16 AM script INFO: SUCCESS!@#KODE 1!@#USER_ID 16!@#ACTIVITY_CODE 5
12/23/2022 07:05:19 AM script INFO: SUCCESS!@#KODE 1!@#USER_ID 16!@#ACTIVITY_CODE 1
12/23/2022 07:05:19 AM script INFO: SUCCESS!@#KODE 1!@#USER_ID 16!@#ACTIVITY_CODE 3
12/23/2022 07:05:19 AM script INFO: SUCCESS!@#KODE 1!@#USER_ID 16!@#ACTIVITY_CODE 4
12/23/2022 07:05:19 AM script INFO: SUCCESS!@#KODE 1!@#USER_ID 16!@#ACTIVITY_CODE 5
12/23/2022 07:05:19 AM script INFO: SUCCESS!@#KODE 1!@#USER_ID 16!@#ACTIVITY_CODE 5
12/23/2022 07:05:21 AM script INFO: SUCCESS!@#KODE 1!@#USER_ID 16!@#ACTIVITY_CODE 2
12/23/2022 07:05:22 AM script INFO: SUCCESS!@#KODE 1!@#USER_ID 16!@#ACTIVITY_CODE 3
12/23/2022 07:05:22 AM script INFO: SUCCESS!@#KODE 1!@#USER_ID 16!@#ACTIVITY_CODE 1
12/23/2022 07:05:22 AM script INFO: SUCCESS!@#KODE 1!@#USER_ID 16!@#ACTIVITY_CODE 2
12/23/2022 07:05:22 AM script INFO: SUCCESS!@#KODE 1!@#USER_ID 16!@#ACTIVITY_CODE 2
12/23/2022 07:05:22 AM script INFO: SUCCESS!@#KODE 1!@#USER_ID 16!@#ACTIVITY_CODE 5
12/23/2022 07:05:22 AM script INFO: SUCCESS!@#KODE 1!@#USER_ID 16!@#ACTIVITY_CODE 5
12/23/2022 07:05:24 AM script INFO: SUCCESS!@#KODE 1!@#USER_ID 16!@#ACTIVITY_CODE 3
12/23/2022 07:05:25 AM script INFO: SUCCESS!@#KODE 1!@#USER_ID 16!@#ACTIVITY_CODE 2
12/23/2022 07:05:25 AM script INFO: SUCCESS!@#KODE 1!@#USER_ID 16!@#ACTIVITY_CODE 1
12/23/2022 07:05:25 AM script INFO: SUCCESS!@#KODE 1!@#USER_ID 16!@#ACTIVITY_CODE 5
12/23/2022 07:05:25 AM script INFO: SUCCESS!@#KODE 1!@#USER_ID 16!@#ACTIVITY_CODE 5
12/23/2022 07:05:27 AM script INFO: SUCCESS!@#KODE 1!@#USER_ID 16!@#ACTIVITY_CODE 5
12/23/2022 07:05:27 AM script INFO: SUCCESS!@#KODE 1!@#USER_ID 16!@#ACTIVITY_CODE 5
12/23/2022 07:05:30 AM script INFO: SUCCESS!@#KODE 1!@#USER_ID 16!@#ACTIVITY_CODE 2
12/23/2022 07:05:30 AM script INFO: SUCCESS!@#KODE 1!@#USER_ID 16!@#ACTIVITY_CODE 3
12/23/2022 07:05:30 AM script INFO: SUCCESS!@#KODE 1!@#USER_ID 16!@#ACTIVITY_CODE 2
12/23/2022 07:05:30 AM script INFO: SUCCESS!@#KODE 1!@#USER_ID 16!@#ACTIVITY_CODE 5
12/23/2022 07:05:30 AM script INFO: SUCCESS!@#KODE 1!@#USER_ID 16!@#ACTIVITY_CODE 5
12/23/2022 07:05:33 AM script INFO: SUCCESS!@#KODE 1!@#USER_ID 16!@#ACTIVITY_CODE 2
12/23/2022 07:05:33 AM script INFO: SUCCESS!@#KODE 1!@#USER_ID 16!@#ACTIVITY_CODE 1
12/23/2022 07:05:33 AM script INFO: SUCCESS!@#KODE 1!@#USER_ID 16!@#ACTIVITY_CODE 2
12/23/2022 07:05:33 AM script INFO: SUCCESS!@#KODE 1!@#USER_ID 16!@#ACTIVITY_CODE 3
12/23/2022 07:05:33 AM script INFO: SUCCESS!@#KODE 1!@#USER_ID 16!@#ACTIVITY_CODE 4
12/23/2022 07:05:33 AM script INFO: SUCCESS!@#KODE 1!@#USER_ID 16!@#ACTIVITY_CODE 1
12/23/2022 07:05:33 AM script INFO: SUCCESS!@#KODE 1!@#USER_ID 16!@#ACTIVITY_CODE 3
12/23/2022 07:05:33 AM script INFO: SUCCESS!@#KODE 1!@#USER_ID 16!@#ACTIVITY_CODE 3
12/23/2022 07:05:33 AM script INFO: SUCCESS!@#KODE 1!@#USER_ID 16!@#ACTIVITY_CODE 1
12/23/2022 07:05:33 AM script INFO: SUCCESS!@#KODE 1!@#USER_ID 16!@#ACTIVITY_CODE 4
12/23/2022 07:05:33 AM script INFO: SUCCESS!@#KODE 1!@#USER_ID 16!@#ACTIVITY_CODE 3
12/23/2022 07:05:33 AM script INFO: SUCCESS!@#KODE 1!@#USER_ID 16!@#ACTIVITY_CODE 3
12/23/2022 07:05:33 AM script INFO: SUCCESS!@#KODE 1!@#USER_ID 16!@#ACTIVITY_CODE 2
12/23/2022 07:05:33 AM script INFO: SUCCESS!@#KODE 1!@#USER_ID 16!@#ACTIVITY_CODE 2
12/23/2022 07:05:34 AM script INFO: SUCCESS!@#KODE 1!@#USER_ID 16!@#ACTIVITY_CODE 1
12/23/2022 07:05:34 AM script INFO: SUCCESS!@#KODE 1!@#USER_ID 16!@#ACTIVITY_CODE 3
12/23/2022 07:05:34 AM script INFO: SUCCESS!@#KODE 1!@#USER_ID 16!@#ACTIVITY_CODE 2
12/23/2022 07:05:34 AM script INFO: SUCCESS!@#KODE 1!@#USER_ID 16!@#ACTIVITY_CODE 1
12/23/2022 07:05:34 AM script INFO: SUCCESS!@#KODE 1!@#USER_ID 16!@#ACTIVITY_CODE 4
12/23/2022 07:05:34 AM script INFO: SUCCESS!@#KODE 1!@#USER_ID 16!@#ACTIVITY_CODE 3
12/23/2022 07:05:34 AM script INFO: SUCCESS!@#KODE 1!@#USER_ID 16!@#ACTIVITY_CODE 2
12/23/2022 07:05:34 AM script INFO: SUCCESS!@#KODE 1!@#USER_ID 16!@#ACTIVITY_CODE 1
12/23/2022 07:05:34 AM script INFO: Duration: 17.891485691070557
12/23/2022 07:05:34 AM script INFO: mengakhiri-quiz
12/23/2022 07:05:35 AM script INFO: SUCCESS!@#KODE 1!@#USER_ID 16!@#ACTIVITY_CODE 5
12/23/2022 07:05:35 AM script INFO: berhasil-submit
