Nmap scan report for 10.96.0.1
Nmap scan report for 10.96.0.2
Nmap scan report for 10.96.0.3
Nmap scan report for 10.96.0.5
Nmap scan report for 10.96.0.6
Nmap scan report for 10.96.0.7
Nmap scan report for 10.96.0.8
Nmap scan report for 10.96.0.54
Nmap scan report for 10.96.0.55
Nmap scan report for 10.96.0.56
Nmap scan report for 10.96.0.57
Nmap scan report for 10.96.0.58
Nmap scan report for 10.96.0.59
Nmap scan report for 10.96.0.60
Nmap scan report for 10.96.0.61
Nmap scan report for 10.96.0.62
Nmap scan report for 10.96.0.63
Nmap scan report for 10.96.0.64
Nmap scan report for 10.96.0.65
Nmap scan report for 10.96.0.66
Nmap scan report for 10.96.0.67
Nmap scan report for 10.96.0.68
Nmap scan report for 10.96.0.69
Nmap scan report for 10.96.0.70
Nmap scan report for 10.96.0.71
Nmap scan report for 10.96.0.72
Nmap scan report for 10.96.0.73
Nmap scan report for 10.96.0.74
Nmap scan report for 10.96.0.75
Nmap scan report for 10.96.0.76
Nmap scan report for 10.96.0.77
Nmap scan report for 10.96.0.78
Nmap scan report for 10.96.0.79
Nmap scan report for 10.96.0.80
Nmap scan report for 10.96.0.81
Nmap scan report for 10.96.0.82
Nmap scan report for 10.96.0.83
Nmap scan report for 10.96.0.84
Nmap scan report for 10.96.0.85
Nmap scan report for 10.96.0.86
Nmap scan report for 10.96.0.87
Nmap scan report for 10.96.0.88
Nmap scan report for 10.96.0.89
Nmap scan report for 10.96.0.90
Nmap scan report for 10.96.0.91
Nmap scan report for 10.96.0.92
Nmap scan report for 10.96.0.93
Nmap scan report for 10.96.0.94
Nmap scan report for 10.96.0.95
Nmap scan report for 10.96.0.96
Nmap scan report for 10.96.0.97
Nmap scan report for 10.96.0.98
Nmap scan report for 10.96.0.99
Nmap scan report for 10.96.0.100
Nmap scan report for 10.96.0.101
Nmap scan report for 10.96.0.102
Nmap scan report for 10.96.0.103
Nmap scan report for kube-dns-7d5998784c-lxvlk (10.96.1.2)
Nmap scan report for 10.96.1.3
Nmap scan report for 10.96.1.4
Nmap scan report for 10.96.1.61
Nmap scan report for 10.96.1.62
Nmap scan report for 10.96.1.63
Nmap scan report for 10.96.1.64
Nmap scan report for 10.96.1.65
Nmap scan report for 10.96.1.66
Nmap scan report for 10.96.1.67
Nmap scan report for 10.96.1.68
Nmap scan report for 10.96.1.69
Nmap scan report for 10.96.1.70
Nmap scan report for 10.96.1.71
Nmap scan report for 10.96.1.72
Nmap scan report for 10.96.1.73
Nmap scan report for 10.96.1.74
Nmap scan report for 10.96.1.75
Nmap scan report for 10.96.1.76
Nmap scan report for 10.96.1.77
Nmap scan report for 10.96.1.78
Nmap scan report for 10.96.1.79
Nmap scan report for 10.96.1.80
Nmap scan report for 10.96.1.81
Nmap scan report for 10.96.1.82
Nmap scan report for 10.96.1.83
Nmap scan report for 10.96.1.84
Nmap scan report for 10.96.1.85
Nmap scan report for 10.96.1.86
Nmap scan report for 10.96.1.87
Nmap scan report for 10.96.1.88
Nmap scan report for 10.96.1.89
Nmap scan report for 10.96.1.90
Nmap scan report for 10.96.1.91
Nmap scan report for 10.96.1.92
Nmap scan report for 10.96.1.93
Nmap scan report for 10.96.1.94
Nmap scan report for 10.96.1.95
Nmap scan report for 10.96.1.96
Nmap scan report for 10.96.1.97
Nmap scan report for 10.96.1.98
Nmap scan report for 10.96.1.99
Nmap scan report for 10.96.1.100
Nmap scan report for 10.96.1.101
Nmap scan report for 10.96.1.102
Nmap scan report for 10.96.1.103
Nmap scan report for 10.96.1.104
Nmap scan report for 10.96.1.105
Nmap scan report for 10.96.1.106
Nmap scan report for 10.96.1.107
Nmap scan report for 10.96.1.108
Nmap scan report for 10.96.1.109
Nmap scan report for 10.96.1.110
Nmap scan report for 10.96.1.1
Nmap scan report for master-749c9cdf74-q9qx6 (10.96.1.6)
