12/11/2022 03:52:31 PM script INFO: Prepared chrome options..
12/11/2022 03:52:33 PM script INFO: Initialized chrome browser..
12/11/2022 03:52:33 PM script INFO: mengakses-homepage
12/11/2022 03:53:01 PM script INFO: mengakses-login-page
12/11/2022 03:53:02 PM script INFO: mengakses-site-home
12/11/2022 03:53:03 PM script INFO: mengakses-site-course
12/11/2022 03:53:03 PM script INFO: mengakses-quiz
12/11/2022 03:53:04 PM script INFO: mengakses-start-quiz-page
12/11/2022 03:53:05 PM script INFO: memulai-quiz
12/11/2022 03:53:05 PM script INFO: SUCCESS!@#KODE 1!@#USER_ID 94!@#ACTIVITY_CODE 5
12/11/2022 03:53:16 PM script INFO: SUCCESS!@#KODE 1!@#USER_ID 94!@#ACTIVITY_CODE 1
12/11/2022 03:53:16 PM script INFO: SUCCESS!@#KODE 1!@#USER_ID 94!@#ACTIVITY_CODE 1
12/11/2022 03:53:16 PM script INFO: SUCCESS!@#KODE 1!@#USER_ID 94!@#ACTIVITY_CODE 2
12/11/2022 03:53:16 PM script INFO: SUCCESS!@#KODE 1!@#USER_ID 94!@#ACTIVITY_CODE 3
12/11/2022 03:53:16 PM script INFO: SUCCESS!@#KODE 1!@#USER_ID 94!@#ACTIVITY_CODE 5
12/11/2022 03:53:16 PM script INFO: SUCCESS!@#KODE 1!@#USER_ID 94!@#ACTIVITY_CODE 5
12/11/2022 03:53:19 PM script INFO: SUCCESS!@#KODE 1!@#USER_ID 94!@#ACTIVITY_CODE 1
12/11/2022 03:53:19 PM script INFO: SUCCESS!@#KODE 1!@#USER_ID 94!@#ACTIVITY_CODE 5
12/11/2022 03:53:19 PM script INFO: SUCCESS!@#KODE 1!@#USER_ID 94!@#ACTIVITY_CODE 5
12/11/2022 03:53:21 PM script INFO: SUCCESS!@#KODE 1!@#USER_ID 94!@#ACTIVITY_CODE 1
12/11/2022 03:53:21 PM script INFO: SUCCESS!@#KODE 1!@#USER_ID 94!@#ACTIVITY_CODE 2
12/11/2022 03:53:21 PM script INFO: SUCCESS!@#KODE 1!@#USER_ID 94!@#ACTIVITY_CODE 5
12/11/2022 03:53:21 PM script INFO: SUCCESS!@#KODE 1!@#USER_ID 94!@#ACTIVITY_CODE 5
12/11/2022 03:53:24 PM script INFO: SUCCESS!@#KODE 1!@#USER_ID 94!@#ACTIVITY_CODE 5
12/11/2022 03:53:24 PM script INFO: SUCCESS!@#KODE 1!@#USER_ID 94!@#ACTIVITY_CODE 5
12/11/2022 03:53:26 PM script INFO: SUCCESS!@#KODE 1!@#USER_ID 94!@#ACTIVITY_CODE 1
12/11/2022 03:53:27 PM script INFO: SUCCESS!@#KODE 1!@#USER_ID 94!@#ACTIVITY_CODE 2
12/11/2022 03:53:27 PM script INFO: SUCCESS!@#KODE 1!@#USER_ID 94!@#ACTIVITY_CODE 3
12/11/2022 03:53:27 PM script INFO: SUCCESS!@#KODE 1!@#USER_ID 94!@#ACTIVITY_CODE 5
12/11/2022 03:53:27 PM script INFO: SUCCESS!@#KODE 1!@#USER_ID 94!@#ACTIVITY_CODE 5
12/11/2022 03:53:29 PM script INFO: SUCCESS!@#KODE 1!@#USER_ID 94!@#ACTIVITY_CODE 5
12/11/2022 03:53:29 PM script INFO: SUCCESS!@#KODE 1!@#USER_ID 94!@#ACTIVITY_CODE 5
12/11/2022 03:53:32 PM script INFO: SUCCESS!@#KODE 1!@#USER_ID 94!@#ACTIVITY_CODE 2
12/11/2022 03:53:32 PM script INFO: SUCCESS!@#KODE 1!@#USER_ID 94!@#ACTIVITY_CODE 1
12/11/2022 03:53:32 PM script INFO: SUCCESS!@#KODE 1!@#USER_ID 94!@#ACTIVITY_CODE 3
12/11/2022 03:53:32 PM script INFO: SUCCESS!@#KODE 1!@#USER_ID 94!@#ACTIVITY_CODE 3
12/11/2022 03:53:32 PM script INFO: SUCCESS!@#KODE 1!@#USER_ID 94!@#ACTIVITY_CODE 3
12/11/2022 03:53:32 PM script INFO: SUCCESS!@#KODE 1!@#USER_ID 94!@#ACTIVITY_CODE 2
12/11/2022 03:53:32 PM script INFO: SUCCESS!@#KODE 1!@#USER_ID 94!@#ACTIVITY_CODE 1
12/11/2022 03:53:32 PM script INFO: SUCCESS!@#KODE 1!@#USER_ID 94!@#ACTIVITY_CODE 5
12/11/2022 03:53:32 PM script INFO: SUCCESS!@#KODE 1!@#USER_ID 94!@#ACTIVITY_CODE 5
12/11/2022 03:53:35 PM script INFO: SUCCESS!@#KODE 1!@#USER_ID 94!@#ACTIVITY_CODE 1
12/11/2022 03:53:35 PM script INFO: SUCCESS!@#KODE 1!@#USER_ID 94!@#ACTIVITY_CODE 4
12/11/2022 03:53:35 PM script INFO: SUCCESS!@#KODE 1!@#USER_ID 94!@#ACTIVITY_CODE 2
12/11/2022 03:53:35 PM script INFO: SUCCESS!@#KODE 1!@#USER_ID 94!@#ACTIVITY_CODE 5
12/11/2022 03:53:35 PM script INFO: SUCCESS!@#KODE 1!@#USER_ID 94!@#ACTIVITY_CODE 5
12/11/2022 03:53:38 PM script INFO: SUCCESS!@#KODE 1!@#USER_ID 94!@#ACTIVITY_CODE 1
12/11/2022 03:53:38 PM script INFO: SUCCESS!@#KODE 1!@#USER_ID 94!@#ACTIVITY_CODE 3
12/11/2022 03:53:38 PM script INFO: SUCCESS!@#KODE 1!@#USER_ID 94!@#ACTIVITY_CODE 4
12/11/2022 03:53:38 PM script INFO: SUCCESS!@#KODE 1!@#USER_ID 94!@#ACTIVITY_CODE 2
12/11/2022 03:53:38 PM script INFO: SUCCESS!@#KODE 1!@#USER_ID 94!@#ACTIVITY_CODE 1
12/11/2022 03:53:38 PM script INFO: SUCCESS!@#KODE 1!@#USER_ID 94!@#ACTIVITY_CODE 2
12/11/2022 03:53:38 PM script INFO: SUCCESS!@#KODE 1!@#USER_ID 94!@#ACTIVITY_CODE 1
12/11/2022 03:53:38 PM script INFO: SUCCESS!@#KODE 1!@#USER_ID 94!@#ACTIVITY_CODE 3
12/11/2022 03:53:38 PM script INFO: SUCCESS!@#KODE 1!@#USER_ID 94!@#ACTIVITY_CODE 1
12/11/2022 03:53:38 PM script INFO: SUCCESS!@#KODE 1!@#USER_ID 94!@#ACTIVITY_CODE 3
12/11/2022 03:53:38 PM script INFO: SUCCESS!@#KODE 1!@#USER_ID 94!@#ACTIVITY_CODE 3
12/11/2022 03:53:38 PM script INFO: SUCCESS!@#KODE 1!@#USER_ID 94!@#ACTIVITY_CODE 5
12/11/2022 03:53:38 PM script INFO: SUCCESS!@#KODE 1!@#USER_ID 94!@#ACTIVITY_CODE 5
12/11/2022 03:53:41 PM script INFO: SUCCESS!@#KODE 1!@#USER_ID 94!@#ACTIVITY_CODE 5
12/11/2022 03:53:41 PM script INFO: SUCCESS!@#KODE 1!@#USER_ID 94!@#ACTIVITY_CODE 5
12/11/2022 03:53:44 PM script INFO: SUCCESS!@#KODE 1!@#USER_ID 94!@#ACTIVITY_CODE 3
12/11/2022 03:53:44 PM script INFO: SUCCESS!@#KODE 1!@#USER_ID 94!@#ACTIVITY_CODE 1
12/11/2022 03:53:44 PM script INFO: SUCCESS!@#KODE 1!@#USER_ID 94!@#ACTIVITY_CODE 2
12/11/2022 03:53:44 PM script INFO: SUCCESS!@#KODE 1!@#USER_ID 94!@#ACTIVITY_CODE 4
12/11/2022 03:53:44 PM script INFO: SUCCESS!@#KODE 1!@#USER_ID 94!@#ACTIVITY_CODE 1
12/11/2022 03:53:44 PM script INFO: SUCCESS!@#KODE 1!@#USER_ID 94!@#ACTIVITY_CODE 5
12/11/2022 03:53:44 PM script INFO: SUCCESS!@#KODE 1!@#USER_ID 94!@#ACTIVITY_CODE 5
12/11/2022 03:53:46 PM script INFO: SUCCESS!@#KODE 1!@#USER_ID 94!@#ACTIVITY_CODE 1
12/11/2022 03:53:46 PM script INFO: SUCCESS!@#KODE 1!@#USER_ID 94!@#ACTIVITY_CODE 4
12/11/2022 03:53:47 PM script INFO: SUCCESS!@#KODE 1!@#USER_ID 94!@#ACTIVITY_CODE 1
12/11/2022 03:53:47 PM script INFO: SUCCESS!@#KODE 1!@#USER_ID 94!@#ACTIVITY_CODE 5
12/11/2022 03:53:47 PM script INFO: SUCCESS!@#KODE 1!@#USER_ID 94!@#ACTIVITY_CODE 5
12/11/2022 03:53:49 PM script INFO: SUCCESS!@#KODE 1!@#USER_ID 94!@#ACTIVITY_CODE 2
12/11/2022 03:53:49 PM script INFO: SUCCESS!@#KODE 1!@#USER_ID 94!@#ACTIVITY_CODE 4
12/11/2022 03:53:49 PM script INFO: SUCCESS!@#KODE 1!@#USER_ID 94!@#ACTIVITY_CODE 3
12/11/2022 03:53:49 PM script INFO: SUCCESS!@#KODE 1!@#USER_ID 94!@#ACTIVITY_CODE 1
12/11/2022 03:53:49 PM script INFO: SUCCESS!@#KODE 1!@#USER_ID 94!@#ACTIVITY_CODE 4
12/11/2022 03:53:49 PM script INFO: SUCCESS!@#KODE 1!@#USER_ID 94!@#ACTIVITY_CODE 1
12/11/2022 03:53:50 PM script INFO: SUCCESS!@#KODE 1!@#USER_ID 94!@#ACTIVITY_CODE 4
12/11/2022 03:53:50 PM script INFO: SUCCESS!@#KODE 1!@#USER_ID 94!@#ACTIVITY_CODE 1
12/11/2022 03:53:50 PM script INFO: SUCCESS!@#KODE 1!@#USER_ID 94!@#ACTIVITY_CODE 1
12/11/2022 03:53:50 PM script INFO: SUCCESS!@#KODE 1!@#USER_ID 94!@#ACTIVITY_CODE 5
12/11/2022 03:53:50 PM script INFO: SUCCESS!@#KODE 1!@#USER_ID 94!@#ACTIVITY_CODE 5
12/11/2022 03:53:52 PM script INFO: SUCCESS!@#KODE 1!@#USER_ID 94!@#ACTIVITY_CODE 2
12/11/2022 03:53:52 PM script INFO: SUCCESS!@#KODE 1!@#USER_ID 94!@#ACTIVITY_CODE 1
12/11/2022 03:53:52 PM script INFO: SUCCESS!@#KODE 1!@#USER_ID 94!@#ACTIVITY_CODE 4
12/11/2022 03:53:52 PM script INFO: SUCCESS!@#KODE 1!@#USER_ID 94!@#ACTIVITY_CODE 2
12/11/2022 03:53:52 PM script INFO: SUCCESS!@#KODE 1!@#USER_ID 94!@#ACTIVITY_CODE 5
12/11/2022 03:53:52 PM script INFO: SUCCESS!@#KODE 1!@#USER_ID 94!@#ACTIVITY_CODE 5
12/11/2022 03:53:55 PM script INFO: SUCCESS!@#KODE 1!@#USER_ID 94!@#ACTIVITY_CODE 3
12/11/2022 03:53:55 PM script INFO: SUCCESS!@#KODE 1!@#USER_ID 94!@#ACTIVITY_CODE 3
12/11/2022 03:53:55 PM script INFO: SUCCESS!@#KODE 1!@#USER_ID 94!@#ACTIVITY_CODE 2
12/11/2022 03:53:55 PM script INFO: SUCCESS!@#KODE 1!@#USER_ID 94!@#ACTIVITY_CODE 2
12/11/2022 03:53:55 PM script INFO: SUCCESS!@#KODE 1!@#USER_ID 94!@#ACTIVITY_CODE 2
12/11/2022 03:53:56 PM script INFO: SUCCESS!@#KODE 1!@#USER_ID 94!@#ACTIVITY_CODE 2
12/11/2022 03:53:56 PM script INFO: SUCCESS!@#KODE 1!@#USER_ID 94!@#ACTIVITY_CODE 2
12/11/2022 03:53:56 PM script INFO: SUCCESS!@#KODE 1!@#USER_ID 94!@#ACTIVITY_CODE 3
12/11/2022 03:53:56 PM script INFO: SUCCESS!@#KODE 1!@#USER_ID 94!@#ACTIVITY_CODE 2
12/11/2022 03:53:56 PM script INFO: SUCCESS!@#KODE 1!@#USER_ID 94!@#ACTIVITY_CODE 5
12/11/2022 03:53:56 PM script INFO: SUCCESS!@#KODE 1!@#USER_ID 94!@#ACTIVITY_CODE 5
12/11/2022 03:53:59 PM script INFO: SUCCESS!@#KODE 1!@#USER_ID 94!@#ACTIVITY_CODE 2
12/11/2022 03:53:59 PM script INFO: SUCCESS!@#KODE 1!@#USER_ID 94!@#ACTIVITY_CODE 1
12/11/2022 03:53:59 PM script INFO: SUCCESS!@#KODE 1!@#USER_ID 94!@#ACTIVITY_CODE 3
12/11/2022 03:53:59 PM script INFO: SUCCESS!@#KODE 1!@#USER_ID 94!@#ACTIVITY_CODE 3
12/11/2022 03:53:59 PM script INFO: SUCCESS!@#KODE 1!@#USER_ID 94!@#ACTIVITY_CODE 3
12/11/2022 03:53:59 PM script INFO: SUCCESS!@#KODE 1!@#USER_ID 94!@#ACTIVITY_CODE 1
12/11/2022 03:53:59 PM script INFO: SUCCESS!@#KODE 1!@#USER_ID 94!@#ACTIVITY_CODE 1
12/11/2022 03:53:59 PM script INFO: SUCCESS!@#KODE 1!@#USER_ID 94!@#ACTIVITY_CODE 3
12/11/2022 03:53:59 PM script INFO: SUCCESS!@#KODE 1!@#USER_ID 94!@#ACTIVITY_CODE 1
12/11/2022 03:53:59 PM script INFO: SUCCESS!@#KODE 1!@#USER_ID 94!@#ACTIVITY_CODE 3
12/11/2022 03:53:59 PM script INFO: SUCCESS!@#KODE 1!@#USER_ID 94!@#ACTIVITY_CODE 4
12/11/2022 03:53:59 PM script INFO: SUCCESS!@#KODE 1!@#USER_ID 94!@#ACTIVITY_CODE 2
12/11/2022 03:53:59 PM script INFO: SUCCESS!@#KODE 1!@#USER_ID 94!@#ACTIVITY_CODE 5
12/11/2022 03:53:59 PM script INFO: SUCCESS!@#KODE 1!@#USER_ID 94!@#ACTIVITY_CODE 5
12/11/2022 03:54:02 PM script INFO: SUCCESS!@#KODE 1!@#USER_ID 94!@#ACTIVITY_CODE 4
12/11/2022 03:54:02 PM script INFO: SUCCESS!@#KODE 1!@#USER_ID 94!@#ACTIVITY_CODE 1
12/11/2022 03:54:02 PM script INFO: SUCCESS!@#KODE 1!@#USER_ID 94!@#ACTIVITY_CODE 1
12/11/2022 03:54:02 PM script INFO: SUCCESS!@#KODE 1!@#USER_ID 94!@#ACTIVITY_CODE 3
12/11/2022 03:54:02 PM script INFO: SUCCESS!@#KODE 1!@#USER_ID 94!@#ACTIVITY_CODE 2
12/11/2022 03:54:02 PM script INFO: SUCCESS!@#KODE 1!@#USER_ID 94!@#ACTIVITY_CODE 1
12/11/2022 03:54:02 PM script INFO: SUCCESS!@#KODE 1!@#USER_ID 94!@#ACTIVITY_CODE 1
12/11/2022 03:54:03 PM script INFO: SUCCESS!@#KODE 1!@#USER_ID 94!@#ACTIVITY_CODE 4
12/11/2022 03:54:03 PM script INFO: SUCCESS!@#KODE 1!@#USER_ID 94!@#ACTIVITY_CODE 3
12/11/2022 03:54:03 PM script INFO: SUCCESS!@#KODE 1!@#USER_ID 94!@#ACTIVITY_CODE 2
12/11/2022 03:54:03 PM script INFO: SUCCESS!@#KODE 1!@#USER_ID 94!@#ACTIVITY_CODE 2
12/11/2022 03:54:03 PM script INFO: SUCCESS!@#KODE 1!@#USER_ID 94!@#ACTIVITY_CODE 2
12/11/2022 03:54:03 PM script INFO: SUCCESS!@#KODE 1!@#USER_ID 94!@#ACTIVITY_CODE 3
12/11/2022 03:54:03 PM script INFO: SUCCESS!@#KODE 1!@#USER_ID 94!@#ACTIVITY_CODE 2
12/11/2022 03:54:04 PM script INFO: SUCCESS!@#KODE 1!@#USER_ID 94!@#ACTIVITY_CODE 3
12/11/2022 03:54:04 PM script INFO: SUCCESS!@#KODE 1!@#USER_ID 94!@#ACTIVITY_CODE 2
12/11/2022 03:54:04 PM script INFO: SUCCESS!@#KODE 1!@#USER_ID 94!@#ACTIVITY_CODE 3
12/11/2022 03:54:04 PM script INFO: SUCCESS!@#KODE 1!@#USER_ID 94!@#ACTIVITY_CODE 2
12/11/2022 03:54:04 PM script INFO: SUCCESS!@#KODE 1!@#USER_ID 94!@#ACTIVITY_CODE 1
12/11/2022 03:54:04 PM script INFO: SUCCESS!@#KODE 1!@#USER_ID 94!@#ACTIVITY_CODE 4
12/11/2022 03:54:04 PM script INFO: SUCCESS!@#KODE 1!@#USER_ID 94!@#ACTIVITY_CODE 1
12/11/2022 03:54:04 PM script INFO: SUCCESS!@#KODE 1!@#USER_ID 94!@#ACTIVITY_CODE 4
12/11/2022 03:54:05 PM script INFO: SUCCESS!@#KODE 1!@#USER_ID 94!@#ACTIVITY_CODE 2
12/11/2022 03:54:05 PM script INFO: SUCCESS!@#KODE 1!@#USER_ID 94!@#ACTIVITY_CODE 3
12/11/2022 03:54:05 PM script INFO: SUCCESS!@#KODE 1!@#USER_ID 94!@#ACTIVITY_CODE 2
12/11/2022 03:54:05 PM script INFO: SUCCESS!@#KODE 1!@#USER_ID 94!@#ACTIVITY_CODE 1
12/11/2022 03:54:05 PM script INFO: SUCCESS!@#KODE 1!@#USER_ID 94!@#ACTIVITY_CODE 4
12/11/2022 03:54:05 PM script INFO: SUCCESS!@#KODE 1!@#USER_ID 94!@#ACTIVITY_CODE 1
12/11/2022 03:54:05 PM script INFO: SUCCESS!@#KODE 1!@#USER_ID 94!@#ACTIVITY_CODE 2
12/11/2022 03:54:06 PM script INFO: SUCCESS!@#KODE 1!@#USER_ID 94!@#ACTIVITY_CODE 2
12/11/2022 03:54:06 PM script INFO: SUCCESS!@#KODE 1!@#USER_ID 94!@#ACTIVITY_CODE 1
12/11/2022 03:54:06 PM script INFO: SUCCESS!@#KODE 1!@#USER_ID 94!@#ACTIVITY_CODE 1
12/11/2022 03:54:06 PM script INFO: SUCCESS!@#KODE 1!@#USER_ID 94!@#ACTIVITY_CODE 2
12/11/2022 03:54:06 PM script INFO: SUCCESS!@#KODE 1!@#USER_ID 94!@#ACTIVITY_CODE 3
12/11/2022 03:54:06 PM script INFO: SUCCESS!@#KODE 1!@#USER_ID 94!@#ACTIVITY_CODE 4
12/11/2022 03:54:06 PM script INFO: SUCCESS!@#KODE 1!@#USER_ID 94!@#ACTIVITY_CODE 3
12/11/2022 03:54:06 PM script INFO: SUCCESS!@#KODE 1!@#USER_ID 94!@#ACTIVITY_CODE 1
12/11/2022 03:54:06 PM script INFO: SUCCESS!@#KODE 1!@#USER_ID 94!@#ACTIVITY_CODE 3
12/11/2022 03:54:06 PM script INFO: SUCCESS!@#KODE 1!@#USER_ID 94!@#ACTIVITY_CODE 3
12/11/2022 03:54:06 PM script INFO: SUCCESS!@#KODE 1!@#USER_ID 94!@#ACTIVITY_CODE 2
12/11/2022 03:54:07 PM script INFO: SUCCESS!@#KODE 1!@#USER_ID 94!@#ACTIVITY_CODE 2
12/11/2022 03:54:07 PM script INFO: SUCCESS!@#KODE 1!@#USER_ID 94!@#ACTIVITY_CODE 3
12/11/2022 03:54:07 PM script INFO: SUCCESS!@#KODE 1!@#USER_ID 94!@#ACTIVITY_CODE 1
12/11/2022 03:54:07 PM script INFO: SUCCESS!@#KODE 1!@#USER_ID 94!@#ACTIVITY_CODE 3
12/11/2022 03:54:07 PM script INFO: SUCCESS!@#KODE 1!@#USER_ID 94!@#ACTIVITY_CODE 2
12/11/2022 03:54:07 PM script INFO: SUCCESS!@#KODE 1!@#USER_ID 94!@#ACTIVITY_CODE 2
12/11/2022 03:54:07 PM script INFO: SUCCESS!@#KODE 1!@#USER_ID 94!@#ACTIVITY_CODE 2
12/11/2022 03:54:07 PM script INFO: SUCCESS!@#KODE 1!@#USER_ID 94!@#ACTIVITY_CODE 1
12/11/2022 03:54:08 PM script INFO: SUCCESS!@#KODE 1!@#USER_ID 94!@#ACTIVITY_CODE 2
12/11/2022 03:54:08 PM script INFO: SUCCESS!@#KODE 1!@#USER_ID 94!@#ACTIVITY_CODE 1
12/11/2022 03:54:08 PM script INFO: SUCCESS!@#KODE 1!@#USER_ID 94!@#ACTIVITY_CODE 2
12/11/2022 03:54:08 PM script INFO: SUCCESS!@#KODE 1!@#USER_ID 94!@#ACTIVITY_CODE 1
12/11/2022 03:54:08 PM script INFO: SUCCESS!@#KODE 1!@#USER_ID 94!@#ACTIVITY_CODE 1
12/11/2022 03:54:08 PM script INFO: SUCCESS!@#KODE 1!@#USER_ID 94!@#ACTIVITY_CODE 3
12/11/2022 03:54:08 PM script INFO: SUCCESS!@#KODE 1!@#USER_ID 94!@#ACTIVITY_CODE 4
12/11/2022 03:54:08 PM script INFO: SUCCESS!@#KODE 1!@#USER_ID 94!@#ACTIVITY_CODE 1
12/11/2022 03:54:08 PM script INFO: SUCCESS!@#KODE 1!@#USER_ID 94!@#ACTIVITY_CODE 2
12/11/2022 03:54:09 PM script INFO: SUCCESS!@#KODE 1!@#USER_ID 94!@#ACTIVITY_CODE 1
12/11/2022 03:54:09 PM script INFO: SUCCESS!@#KODE 1!@#USER_ID 94!@#ACTIVITY_CODE 2
12/11/2022 03:54:09 PM script INFO: SUCCESS!@#KODE 1!@#USER_ID 94!@#ACTIVITY_CODE 3
12/11/2022 03:54:09 PM script INFO: SUCCESS!@#KODE 1!@#USER_ID 94!@#ACTIVITY_CODE 2
12/11/2022 03:54:09 PM script INFO: SUCCESS!@#KODE 1!@#USER_ID 94!@#ACTIVITY_CODE 1
12/11/2022 03:54:09 PM script INFO: SUCCESS!@#KODE 1!@#USER_ID 94!@#ACTIVITY_CODE 3
12/11/2022 03:54:09 PM script INFO: SUCCESS!@#KODE 1!@#USER_ID 94!@#ACTIVITY_CODE 2
12/11/2022 03:54:09 PM script INFO: SUCCESS!@#KODE 1!@#USER_ID 94!@#ACTIVITY_CODE 3
12/11/2022 03:54:10 PM script INFO: SUCCESS!@#KODE 1!@#USER_ID 94!@#ACTIVITY_CODE 2
12/11/2022 03:54:10 PM script INFO: SUCCESS!@#KODE 1!@#USER_ID 94!@#ACTIVITY_CODE 4
12/11/2022 03:54:10 PM script INFO: SUCCESS!@#KODE 1!@#USER_ID 94!@#ACTIVITY_CODE 3
12/11/2022 03:54:10 PM script INFO: SUCCESS!@#KODE 1!@#USER_ID 94!@#ACTIVITY_CODE 3
12/11/2022 03:54:10 PM script INFO: SUCCESS!@#KODE 1!@#USER_ID 94!@#ACTIVITY_CODE 2
12/11/2022 03:54:10 PM script INFO: SUCCESS!@#KODE 1!@#USER_ID 94!@#ACTIVITY_CODE 3
12/11/2022 03:54:10 PM script INFO: SUCCESS!@#KODE 1!@#USER_ID 94!@#ACTIVITY_CODE 3
12/11/2022 03:54:10 PM script INFO: SUCCESS!@#KODE 1!@#USER_ID 94!@#ACTIVITY_CODE 2
12/11/2022 03:54:10 PM script INFO: SUCCESS!@#KODE 1!@#USER_ID 94!@#ACTIVITY_CODE 3
12/11/2022 03:54:11 PM script INFO: SUCCESS!@#KODE 1!@#USER_ID 94!@#ACTIVITY_CODE 2
12/11/2022 03:54:11 PM script INFO: SUCCESS!@#KODE 1!@#USER_ID 94!@#ACTIVITY_CODE 3
12/11/2022 03:54:11 PM script INFO: SUCCESS!@#KODE 1!@#USER_ID 94!@#ACTIVITY_CODE 1
12/11/2022 03:54:11 PM script INFO: SUCCESS!@#KODE 1!@#USER_ID 94!@#ACTIVITY_CODE 4
12/11/2022 03:54:11 PM script INFO: SUCCESS!@#KODE 1!@#USER_ID 94!@#ACTIVITY_CODE 2
12/11/2022 03:54:11 PM script INFO: SUCCESS!@#KODE 1!@#USER_ID 94!@#ACTIVITY_CODE 2
12/11/2022 03:54:12 PM script INFO: SUCCESS!@#KODE 1!@#USER_ID 94!@#ACTIVITY_CODE 2
12/11/2022 03:54:12 PM script INFO: SUCCESS!@#KODE 1!@#USER_ID 94!@#ACTIVITY_CODE 2
12/11/2022 03:54:12 PM script INFO: SUCCESS!@#KODE 1!@#USER_ID 94!@#ACTIVITY_CODE 2
12/11/2022 03:54:12 PM script INFO: SUCCESS!@#KODE 1!@#USER_ID 94!@#ACTIVITY_CODE 1
12/11/2022 03:54:12 PM script INFO: SUCCESS!@#KODE 1!@#USER_ID 94!@#ACTIVITY_CODE 2
12/11/2022 03:54:12 PM script INFO: SUCCESS!@#KODE 1!@#USER_ID 94!@#ACTIVITY_CODE 2
12/11/2022 03:54:12 PM script INFO: SUCCESS!@#KODE 1!@#USER_ID 94!@#ACTIVITY_CODE 1
12/11/2022 03:54:13 PM script INFO: SUCCESS!@#KODE 1!@#USER_ID 94!@#ACTIVITY_CODE 2
12/11/2022 03:54:13 PM script INFO: SUCCESS!@#KODE 1!@#USER_ID 94!@#ACTIVITY_CODE 1
12/11/2022 03:54:13 PM script INFO: SUCCESS!@#KODE 1!@#USER_ID 94!@#ACTIVITY_CODE 3
12/11/2022 03:54:13 PM script INFO: SUCCESS!@#KODE 1!@#USER_ID 94!@#ACTIVITY_CODE 4
12/11/2022 03:54:13 PM script INFO: SUCCESS!@#KODE 1!@#USER_ID 94!@#ACTIVITY_CODE 2
12/11/2022 03:54:13 PM script INFO: SUCCESS!@#KODE 1!@#USER_ID 94!@#ACTIVITY_CODE 1
12/11/2022 03:54:13 PM script INFO: SUCCESS!@#KODE 1!@#USER_ID 94!@#ACTIVITY_CODE 1
12/11/2022 03:54:13 PM script INFO: SUCCESS!@#KODE 1!@#USER_ID 94!@#ACTIVITY_CODE 4
12/11/2022 03:54:14 PM script INFO: SUCCESS!@#KODE 1!@#USER_ID 94!@#ACTIVITY_CODE 3
12/11/2022 03:54:14 PM script INFO: SUCCESS!@#KODE 1!@#USER_ID 94!@#ACTIVITY_CODE 1
12/11/2022 03:54:14 PM script INFO: SUCCESS!@#KODE 1!@#USER_ID 94!@#ACTIVITY_CODE 2
12/11/2022 03:54:14 PM script INFO: SUCCESS!@#KODE 1!@#USER_ID 94!@#ACTIVITY_CODE 2
12/11/2022 03:54:14 PM script INFO: SUCCESS!@#KODE 1!@#USER_ID 94!@#ACTIVITY_CODE 1
12/11/2022 03:54:14 PM script INFO: SUCCESS!@#KODE 1!@#USER_ID 94!@#ACTIVITY_CODE 1
12/11/2022 03:54:14 PM script INFO: SUCCESS!@#KODE 1!@#USER_ID 94!@#ACTIVITY_CODE 2
12/11/2022 03:54:14 PM script INFO: SUCCESS!@#KODE 1!@#USER_ID 94!@#ACTIVITY_CODE 1
12/11/2022 03:54:15 PM script INFO: SUCCESS!@#KODE 1!@#USER_ID 94!@#ACTIVITY_CODE 3
12/11/2022 03:54:15 PM script INFO: SUCCESS!@#KODE 1!@#USER_ID 94!@#ACTIVITY_CODE 3
12/11/2022 03:54:15 PM script INFO: SUCCESS!@#KODE 1!@#USER_ID 94!@#ACTIVITY_CODE 1
12/11/2022 03:54:15 PM script INFO: SUCCESS!@#KODE 1!@#USER_ID 94!@#ACTIVITY_CODE 3
12/11/2022 03:54:15 PM script INFO: SUCCESS!@#KODE 1!@#USER_ID 94!@#ACTIVITY_CODE 4
12/11/2022 03:54:15 PM script INFO: SUCCESS!@#KODE 1!@#USER_ID 94!@#ACTIVITY_CODE 3
12/11/2022 03:54:15 PM script INFO: SUCCESS!@#KODE 1!@#USER_ID 94!@#ACTIVITY_CODE 2
12/11/2022 03:54:15 PM script INFO: SUCCESS!@#KODE 1!@#USER_ID 94!@#ACTIVITY_CODE 2
12/11/2022 03:54:16 PM script INFO: SUCCESS!@#KODE 1!@#USER_ID 94!@#ACTIVITY_CODE 2
12/11/2022 03:54:16 PM script INFO: SUCCESS!@#KODE 1!@#USER_ID 94!@#ACTIVITY_CODE 3
12/11/2022 03:54:16 PM script INFO: SUCCESS!@#KODE 1!@#USER_ID 94!@#ACTIVITY_CODE 3
12/11/2022 03:54:16 PM script INFO: SUCCESS!@#KODE 1!@#USER_ID 94!@#ACTIVITY_CODE 3
12/11/2022 03:54:16 PM script INFO: SUCCESS!@#KODE 1!@#USER_ID 94!@#ACTIVITY_CODE 2
12/11/2022 03:54:16 PM script INFO: SUCCESS!@#KODE 1!@#USER_ID 94!@#ACTIVITY_CODE 3
12/11/2022 03:54:17 PM script INFO: SUCCESS!@#KODE 1!@#USER_ID 94!@#ACTIVITY_CODE 2
12/11/2022 03:54:17 PM script INFO: SUCCESS!@#KODE 1!@#USER_ID 94!@#ACTIVITY_CODE 1
12/11/2022 03:54:17 PM script INFO: SUCCESS!@#KODE 1!@#USER_ID 94!@#ACTIVITY_CODE 2
12/11/2022 03:54:17 PM script INFO: SUCCESS!@#KODE 1!@#USER_ID 94!@#ACTIVITY_CODE 4
12/11/2022 03:54:17 PM script INFO: SUCCESS!@#KODE 1!@#USER_ID 94!@#ACTIVITY_CODE 3
12/11/2022 03:54:17 PM script INFO: SUCCESS!@#KODE 1!@#USER_ID 94!@#ACTIVITY_CODE 1
12/11/2022 03:54:17 PM script INFO: SUCCESS!@#KODE 1!@#USER_ID 94!@#ACTIVITY_CODE 3
12/11/2022 03:54:17 PM script INFO: SUCCESS!@#KODE 1!@#USER_ID 94!@#ACTIVITY_CODE 4
12/11/2022 03:54:17 PM script INFO: SUCCESS!@#KODE 1!@#USER_ID 94!@#ACTIVITY_CODE 1
12/11/2022 03:54:17 PM script INFO: SUCCESS!@#KODE 1!@#USER_ID 94!@#ACTIVITY_CODE 1
12/11/2022 03:54:18 PM script INFO: SUCCESS!@#KODE 1!@#USER_ID 94!@#ACTIVITY_CODE 4
12/11/2022 03:54:18 PM script INFO: SUCCESS!@#KODE 1!@#USER_ID 94!@#ACTIVITY_CODE 1
12/11/2022 03:54:18 PM script INFO: SUCCESS!@#KODE 1!@#USER_ID 94!@#ACTIVITY_CODE 1
12/11/2022 03:54:18 PM script INFO: SUCCESS!@#KODE 1!@#USER_ID 94!@#ACTIVITY_CODE 1
12/11/2022 03:54:18 PM script INFO: SUCCESS!@#KODE 1!@#USER_ID 94!@#ACTIVITY_CODE 4
12/11/2022 03:54:18 PM script INFO: SUCCESS!@#KODE 1!@#USER_ID 94!@#ACTIVITY_CODE 2
12/11/2022 03:54:18 PM script INFO: SUCCESS!@#KODE 1!@#USER_ID 94!@#ACTIVITY_CODE 3
12/11/2022 03:54:18 PM script INFO: SUCCESS!@#KODE 1!@#USER_ID 94!@#ACTIVITY_CODE 3
12/11/2022 03:54:18 PM script INFO: SUCCESS!@#KODE 1!@#USER_ID 94!@#ACTIVITY_CODE 1
12/11/2022 03:54:19 PM script INFO: SUCCESS!@#KODE 1!@#USER_ID 94!@#ACTIVITY_CODE 2
12/11/2022 03:54:19 PM script INFO: SUCCESS!@#KODE 1!@#USER_ID 94!@#ACTIVITY_CODE 1
12/11/2022 03:54:19 PM script INFO: SUCCESS!@#KODE 1!@#USER_ID 94!@#ACTIVITY_CODE 2
12/11/2022 03:54:19 PM script INFO: SUCCESS!@#KODE 1!@#USER_ID 94!@#ACTIVITY_CODE 1
12/11/2022 03:54:19 PM script INFO: SUCCESS!@#KODE 1!@#USER_ID 94!@#ACTIVITY_CODE 4
12/11/2022 03:54:19 PM script INFO: SUCCESS!@#KODE 1!@#USER_ID 94!@#ACTIVITY_CODE 3
12/11/2022 03:54:19 PM script INFO: SUCCESS!@#KODE 1!@#USER_ID 94!@#ACTIVITY_CODE 2
12/11/2022 03:54:19 PM script INFO: Duration: 63.5490300655365
12/11/2022 03:54:19 PM script INFO: mengakhiri-quiz
12/11/2022 03:54:20 PM script INFO: SUCCESS!@#KODE 1!@#USER_ID 94!@#ACTIVITY_CODE 5
12/11/2022 03:54:20 PM script INFO: berhasil-submit
12/11/2022 03:55:50 PM script ERROR: TIMEOUT EXCEPTION!@#KODE 0!@#LOCATION berhasil-submit
12/11/2022 03:55:50 PM main_worker ERROR: Message: None

