12/12/2022 01:44:27 AM script INFO: Prepared chrome options..
12/12/2022 01:44:28 AM script INFO: Initialized chrome browser..
12/12/2022 01:44:28 AM script INFO: mengakses-homepage
12/12/2022 01:44:56 AM script INFO: mengakses-login-page
12/12/2022 01:44:57 AM script INFO: mengakses-site-home
12/12/2022 01:44:58 AM script INFO: mengakses-site-course
12/12/2022 01:44:59 AM script INFO: mengakses-quiz
12/12/2022 01:44:59 AM script INFO: mengakses-start-quiz-page
12/12/2022 01:45:00 AM script INFO: memulai-quiz
12/12/2022 01:45:00 AM script INFO: SUCCESS!@#KODE 1!@#USER_ID 99!@#ACTIVITY_CODE 5
12/12/2022 01:45:11 AM script INFO: SUCCESS!@#KODE 1!@#USER_ID 99!@#ACTIVITY_CODE 2
12/12/2022 01:45:11 AM script INFO: SUCCESS!@#KODE 1!@#USER_ID 99!@#ACTIVITY_CODE 1
12/12/2022 01:45:11 AM script INFO: SUCCESS!@#KODE 1!@#USER_ID 99!@#ACTIVITY_CODE 5
12/12/2022 01:45:11 AM script INFO: SUCCESS!@#KODE 1!@#USER_ID 99!@#ACTIVITY_CODE 5
12/12/2022 01:45:14 AM script INFO: SUCCESS!@#KODE 1!@#USER_ID 99!@#ACTIVITY_CODE 1
12/12/2022 01:45:14 AM script INFO: SUCCESS!@#KODE 1!@#USER_ID 99!@#ACTIVITY_CODE 5
12/12/2022 01:45:14 AM script INFO: SUCCESS!@#KODE 1!@#USER_ID 99!@#ACTIVITY_CODE 5
12/12/2022 01:45:16 AM script INFO: SUCCESS!@#KODE 1!@#USER_ID 99!@#ACTIVITY_CODE 5
12/12/2022 01:45:16 AM script INFO: SUCCESS!@#KODE 1!@#USER_ID 99!@#ACTIVITY_CODE 5
12/12/2022 01:45:19 AM script INFO: SUCCESS!@#KODE 1!@#USER_ID 99!@#ACTIVITY_CODE 1
12/12/2022 01:45:19 AM script INFO: SUCCESS!@#KODE 1!@#USER_ID 99!@#ACTIVITY_CODE 1
12/12/2022 01:45:19 AM script INFO: SUCCESS!@#KODE 1!@#USER_ID 99!@#ACTIVITY_CODE 4
12/12/2022 01:45:19 AM script INFO: SUCCESS!@#KODE 1!@#USER_ID 99!@#ACTIVITY_CODE 5
12/12/2022 01:45:19 AM script INFO: SUCCESS!@#KODE 1!@#USER_ID 99!@#ACTIVITY_CODE 5
12/12/2022 01:45:22 AM script INFO: SUCCESS!@#KODE 1!@#USER_ID 99!@#ACTIVITY_CODE 3
12/12/2022 01:45:22 AM script INFO: SUCCESS!@#KODE 1!@#USER_ID 99!@#ACTIVITY_CODE 5
12/12/2022 01:45:22 AM script INFO: SUCCESS!@#KODE 1!@#USER_ID 99!@#ACTIVITY_CODE 5
12/12/2022 01:45:24 AM script INFO: SUCCESS!@#KODE 1!@#USER_ID 99!@#ACTIVITY_CODE 2
12/12/2022 01:45:24 AM script INFO: SUCCESS!@#KODE 1!@#USER_ID 99!@#ACTIVITY_CODE 5
12/12/2022 01:45:24 AM script INFO: SUCCESS!@#KODE 1!@#USER_ID 99!@#ACTIVITY_CODE 5
12/12/2022 01:45:27 AM script INFO: SUCCESS!@#KODE 1!@#USER_ID 99!@#ACTIVITY_CODE 5
12/12/2022 01:45:27 AM script INFO: SUCCESS!@#KODE 1!@#USER_ID 99!@#ACTIVITY_CODE 5
12/12/2022 01:45:29 AM script INFO: SUCCESS!@#KODE 1!@#USER_ID 99!@#ACTIVITY_CODE 2
12/12/2022 01:45:30 AM script INFO: SUCCESS!@#KODE 1!@#USER_ID 99!@#ACTIVITY_CODE 2
12/12/2022 01:45:30 AM script INFO: SUCCESS!@#KODE 1!@#USER_ID 99!@#ACTIVITY_CODE 2
12/12/2022 01:45:30 AM script INFO: SUCCESS!@#KODE 1!@#USER_ID 99!@#ACTIVITY_CODE 1
12/12/2022 01:45:30 AM script INFO: SUCCESS!@#KODE 1!@#USER_ID 99!@#ACTIVITY_CODE 2
12/12/2022 01:45:30 AM script INFO: SUCCESS!@#KODE 1!@#USER_ID 99!@#ACTIVITY_CODE 2
12/12/2022 01:45:30 AM script INFO: SUCCESS!@#KODE 1!@#USER_ID 99!@#ACTIVITY_CODE 2
12/12/2022 01:45:30 AM script INFO: SUCCESS!@#KODE 1!@#USER_ID 99!@#ACTIVITY_CODE 5
12/12/2022 01:45:30 AM script INFO: SUCCESS!@#KODE 1!@#USER_ID 99!@#ACTIVITY_CODE 5
12/12/2022 01:45:33 AM script INFO: SUCCESS!@#KODE 1!@#USER_ID 99!@#ACTIVITY_CODE 3
12/12/2022 01:45:33 AM script INFO: SUCCESS!@#KODE 1!@#USER_ID 99!@#ACTIVITY_CODE 2
12/12/2022 01:45:33 AM script INFO: SUCCESS!@#KODE 1!@#USER_ID 99!@#ACTIVITY_CODE 3
12/12/2022 01:45:33 AM script INFO: SUCCESS!@#KODE 1!@#USER_ID 99!@#ACTIVITY_CODE 1
12/12/2022 01:45:33 AM script INFO: SUCCESS!@#KODE 1!@#USER_ID 99!@#ACTIVITY_CODE 3
12/12/2022 01:45:33 AM script INFO: SUCCESS!@#KODE 1!@#USER_ID 99!@#ACTIVITY_CODE 1
12/12/2022 01:45:34 AM script INFO: SUCCESS!@#KODE 1!@#USER_ID 99!@#ACTIVITY_CODE 2
12/12/2022 01:45:34 AM script INFO: SUCCESS!@#KODE 1!@#USER_ID 99!@#ACTIVITY_CODE 3
12/12/2022 01:45:34 AM script INFO: SUCCESS!@#KODE 1!@#USER_ID 99!@#ACTIVITY_CODE 2
12/12/2022 01:45:34 AM script INFO: SUCCESS!@#KODE 1!@#USER_ID 99!@#ACTIVITY_CODE 1
12/12/2022 01:45:34 AM script INFO: SUCCESS!@#KODE 1!@#USER_ID 99!@#ACTIVITY_CODE 1
12/12/2022 01:45:34 AM script INFO: SUCCESS!@#KODE 1!@#USER_ID 99!@#ACTIVITY_CODE 2
12/12/2022 01:45:34 AM script INFO: SUCCESS!@#KODE 1!@#USER_ID 99!@#ACTIVITY_CODE 1
12/12/2022 01:45:34 AM script INFO: SUCCESS!@#KODE 1!@#USER_ID 99!@#ACTIVITY_CODE 2
12/12/2022 01:45:34 AM script INFO: SUCCESS!@#KODE 1!@#USER_ID 99!@#ACTIVITY_CODE 5
12/12/2022 01:45:34 AM script INFO: SUCCESS!@#KODE 1!@#USER_ID 99!@#ACTIVITY_CODE 5
12/12/2022 01:45:37 AM script INFO: SUCCESS!@#KODE 1!@#USER_ID 99!@#ACTIVITY_CODE 1
12/12/2022 01:45:37 AM script INFO: SUCCESS!@#KODE 1!@#USER_ID 99!@#ACTIVITY_CODE 2
12/12/2022 01:45:37 AM script INFO: SUCCESS!@#KODE 1!@#USER_ID 99!@#ACTIVITY_CODE 1
12/12/2022 01:45:37 AM script INFO: SUCCESS!@#KODE 1!@#USER_ID 99!@#ACTIVITY_CODE 1
12/12/2022 01:45:37 AM script INFO: SUCCESS!@#KODE 1!@#USER_ID 99!@#ACTIVITY_CODE 2
12/12/2022 01:45:37 AM script INFO: SUCCESS!@#KODE 1!@#USER_ID 99!@#ACTIVITY_CODE 2
12/12/2022 01:45:38 AM script INFO: SUCCESS!@#KODE 1!@#USER_ID 99!@#ACTIVITY_CODE 2
12/12/2022 01:45:38 AM script INFO: SUCCESS!@#KODE 1!@#USER_ID 99!@#ACTIVITY_CODE 2
12/12/2022 01:45:38 AM script INFO: SUCCESS!@#KODE 1!@#USER_ID 99!@#ACTIVITY_CODE 5
12/12/2022 01:45:38 AM script INFO: SUCCESS!@#KODE 1!@#USER_ID 99!@#ACTIVITY_CODE 5
12/12/2022 01:45:40 AM script INFO: SUCCESS!@#KODE 1!@#USER_ID 99!@#ACTIVITY_CODE 1
12/12/2022 01:45:40 AM script INFO: SUCCESS!@#KODE 1!@#USER_ID 99!@#ACTIVITY_CODE 4
12/12/2022 01:45:40 AM script INFO: SUCCESS!@#KODE 1!@#USER_ID 99!@#ACTIVITY_CODE 1
12/12/2022 01:45:41 AM script INFO: SUCCESS!@#KODE 1!@#USER_ID 99!@#ACTIVITY_CODE 1
12/12/2022 01:45:41 AM script INFO: SUCCESS!@#KODE 1!@#USER_ID 99!@#ACTIVITY_CODE 3
12/12/2022 01:45:41 AM script INFO: SUCCESS!@#KODE 1!@#USER_ID 99!@#ACTIVITY_CODE 4
12/12/2022 01:45:41 AM script INFO: SUCCESS!@#KODE 1!@#USER_ID 99!@#ACTIVITY_CODE 5
12/12/2022 01:45:41 AM script INFO: SUCCESS!@#KODE 1!@#USER_ID 99!@#ACTIVITY_CODE 5
12/12/2022 01:45:44 AM script INFO: SUCCESS!@#KODE 1!@#USER_ID 99!@#ACTIVITY_CODE 2
12/12/2022 01:45:44 AM script INFO: SUCCESS!@#KODE 1!@#USER_ID 99!@#ACTIVITY_CODE 3
12/12/2022 01:45:44 AM script INFO: SUCCESS!@#KODE 1!@#USER_ID 99!@#ACTIVITY_CODE 4
12/12/2022 01:45:44 AM script INFO: SUCCESS!@#KODE 1!@#USER_ID 99!@#ACTIVITY_CODE 3
12/12/2022 01:45:44 AM script INFO: SUCCESS!@#KODE 1!@#USER_ID 99!@#ACTIVITY_CODE 1
12/12/2022 01:45:44 AM script INFO: SUCCESS!@#KODE 1!@#USER_ID 99!@#ACTIVITY_CODE 2
12/12/2022 01:45:44 AM script INFO: SUCCESS!@#KODE 1!@#USER_ID 99!@#ACTIVITY_CODE 4
12/12/2022 01:45:45 AM script INFO: SUCCESS!@#KODE 1!@#USER_ID 99!@#ACTIVITY_CODE 2
12/12/2022 01:45:45 AM script INFO: SUCCESS!@#KODE 1!@#USER_ID 99!@#ACTIVITY_CODE 1
12/12/2022 01:45:45 AM script INFO: SUCCESS!@#KODE 1!@#USER_ID 99!@#ACTIVITY_CODE 3
12/12/2022 01:45:45 AM script INFO: SUCCESS!@#KODE 1!@#USER_ID 99!@#ACTIVITY_CODE 2
12/12/2022 01:45:45 AM script INFO: SUCCESS!@#KODE 1!@#USER_ID 99!@#ACTIVITY_CODE 2
12/12/2022 01:45:46 AM script INFO: SUCCESS!@#KODE 1!@#USER_ID 99!@#ACTIVITY_CODE 2
12/12/2022 01:45:46 AM script INFO: SUCCESS!@#KODE 1!@#USER_ID 99!@#ACTIVITY_CODE 4
12/12/2022 01:45:46 AM script INFO: SUCCESS!@#KODE 1!@#USER_ID 99!@#ACTIVITY_CODE 2
12/12/2022 01:45:46 AM script INFO: SUCCESS!@#KODE 1!@#USER_ID 99!@#ACTIVITY_CODE 3
12/12/2022 01:45:46 AM script INFO: SUCCESS!@#KODE 1!@#USER_ID 99!@#ACTIVITY_CODE 2
12/12/2022 01:45:46 AM script INFO: SUCCESS!@#KODE 1!@#USER_ID 99!@#ACTIVITY_CODE 1
12/12/2022 01:45:47 AM script INFO: SUCCESS!@#KODE 1!@#USER_ID 99!@#ACTIVITY_CODE 2
12/12/2022 01:45:47 AM script INFO: SUCCESS!@#KODE 1!@#USER_ID 99!@#ACTIVITY_CODE 3
12/12/2022 01:45:47 AM script INFO: SUCCESS!@#KODE 1!@#USER_ID 99!@#ACTIVITY_CODE 3
12/12/2022 01:45:47 AM script INFO: SUCCESS!@#KODE 1!@#USER_ID 99!@#ACTIVITY_CODE 3
12/12/2022 01:45:47 AM script INFO: SUCCESS!@#KODE 1!@#USER_ID 99!@#ACTIVITY_CODE 3
12/12/2022 01:45:47 AM script INFO: SUCCESS!@#KODE 1!@#USER_ID 99!@#ACTIVITY_CODE 1
12/12/2022 01:45:47 AM script INFO: SUCCESS!@#KODE 1!@#USER_ID 99!@#ACTIVITY_CODE 4
12/12/2022 01:45:47 AM script INFO: SUCCESS!@#KODE 1!@#USER_ID 99!@#ACTIVITY_CODE 3
12/12/2022 01:45:47 AM script INFO: SUCCESS!@#KODE 1!@#USER_ID 99!@#ACTIVITY_CODE 2
12/12/2022 01:45:48 AM script INFO: SUCCESS!@#KODE 1!@#USER_ID 99!@#ACTIVITY_CODE 2
12/12/2022 01:45:48 AM script INFO: SUCCESS!@#KODE 1!@#USER_ID 99!@#ACTIVITY_CODE 2
12/12/2022 01:45:48 AM script INFO: SUCCESS!@#KODE 1!@#USER_ID 99!@#ACTIVITY_CODE 3
12/12/2022 01:45:48 AM script INFO: SUCCESS!@#KODE 1!@#USER_ID 99!@#ACTIVITY_CODE 2
12/12/2022 01:45:48 AM script INFO: SUCCESS!@#KODE 1!@#USER_ID 99!@#ACTIVITY_CODE 4
12/12/2022 01:45:48 AM script INFO: SUCCESS!@#KODE 1!@#USER_ID 99!@#ACTIVITY_CODE 3
12/12/2022 01:45:48 AM script INFO: Duration: 37.32381558418274
12/12/2022 01:45:48 AM script INFO: mengakhiri-quiz
12/12/2022 01:45:49 AM script INFO: SUCCESS!@#KODE 1!@#USER_ID 99!@#ACTIVITY_CODE 5
12/12/2022 01:45:49 AM script INFO: berhasil-submit
