12/11/2022 03:52:31 PM script INFO: Prepared chrome options..
12/11/2022 03:52:32 PM script INFO: Initialized chrome browser..
12/11/2022 03:52:32 PM script INFO: mengakses-homepage
12/11/2022 03:52:39 PM script INFO: mengakses-login-page
12/11/2022 03:52:41 PM script INFO: mengakses-site-home
12/11/2022 03:52:42 PM script INFO: mengakses-site-course
12/11/2022 03:52:43 PM script INFO: mengakses-quiz
12/11/2022 03:52:44 PM script INFO: mengakses-start-quiz-page
12/11/2022 03:52:45 PM script INFO: memulai-quiz
12/11/2022 03:52:45 PM script INFO: SUCCESS!@#KODE 1!@#USER_ID 22!@#ACTIVITY_CODE 5
12/11/2022 03:52:56 PM script INFO: SUCCESS!@#KODE 1!@#USER_ID 22!@#ACTIVITY_CODE 3
12/11/2022 03:52:56 PM script INFO: SUCCESS!@#KODE 1!@#USER_ID 22!@#ACTIVITY_CODE 5
12/11/2022 03:52:56 PM script INFO: SUCCESS!@#KODE 1!@#USER_ID 22!@#ACTIVITY_CODE 5
12/11/2022 03:52:59 PM script INFO: SUCCESS!@#KODE 1!@#USER_ID 22!@#ACTIVITY_CODE 1
12/11/2022 03:52:59 PM script INFO: SUCCESS!@#KODE 1!@#USER_ID 22!@#ACTIVITY_CODE 4
12/11/2022 03:52:59 PM script INFO: SUCCESS!@#KODE 1!@#USER_ID 22!@#ACTIVITY_CODE 3
12/11/2022 03:52:59 PM script INFO: SUCCESS!@#KODE 1!@#USER_ID 22!@#ACTIVITY_CODE 1
12/11/2022 03:52:59 PM script INFO: SUCCESS!@#KODE 1!@#USER_ID 22!@#ACTIVITY_CODE 4
12/11/2022 03:52:59 PM script INFO: SUCCESS!@#KODE 1!@#USER_ID 22!@#ACTIVITY_CODE 3
12/11/2022 03:52:59 PM script INFO: SUCCESS!@#KODE 1!@#USER_ID 22!@#ACTIVITY_CODE 5
12/11/2022 03:52:59 PM script INFO: SUCCESS!@#KODE 1!@#USER_ID 22!@#ACTIVITY_CODE 5
12/11/2022 03:53:02 PM script INFO: SUCCESS!@#KODE 1!@#USER_ID 22!@#ACTIVITY_CODE 2
12/11/2022 03:53:02 PM script INFO: SUCCESS!@#KODE 1!@#USER_ID 22!@#ACTIVITY_CODE 5
12/11/2022 03:53:02 PM script INFO: SUCCESS!@#KODE 1!@#USER_ID 22!@#ACTIVITY_CODE 5
12/11/2022 03:53:04 PM script INFO: SUCCESS!@#KODE 1!@#USER_ID 22!@#ACTIVITY_CODE 5
12/11/2022 03:53:04 PM script INFO: SUCCESS!@#KODE 1!@#USER_ID 22!@#ACTIVITY_CODE 5
12/11/2022 03:53:07 PM script INFO: SUCCESS!@#KODE 1!@#USER_ID 22!@#ACTIVITY_CODE 1
12/11/2022 03:53:07 PM script INFO: SUCCESS!@#KODE 1!@#USER_ID 22!@#ACTIVITY_CODE 5
12/11/2022 03:53:07 PM script INFO: SUCCESS!@#KODE 1!@#USER_ID 22!@#ACTIVITY_CODE 5
12/11/2022 03:53:09 PM script INFO: SUCCESS!@#KODE 1!@#USER_ID 22!@#ACTIVITY_CODE 1
12/11/2022 03:53:09 PM script INFO: SUCCESS!@#KODE 1!@#USER_ID 22!@#ACTIVITY_CODE 1
12/11/2022 03:53:10 PM script INFO: SUCCESS!@#KODE 1!@#USER_ID 22!@#ACTIVITY_CODE 3
12/11/2022 03:53:10 PM script INFO: SUCCESS!@#KODE 1!@#USER_ID 22!@#ACTIVITY_CODE 1
12/11/2022 03:53:10 PM script INFO: SUCCESS!@#KODE 1!@#USER_ID 22!@#ACTIVITY_CODE 2
12/11/2022 03:53:10 PM script INFO: SUCCESS!@#KODE 1!@#USER_ID 22!@#ACTIVITY_CODE 1
12/11/2022 03:53:10 PM script INFO: SUCCESS!@#KODE 1!@#USER_ID 22!@#ACTIVITY_CODE 2
12/11/2022 03:53:10 PM script INFO: SUCCESS!@#KODE 1!@#USER_ID 22!@#ACTIVITY_CODE 3
12/11/2022 03:53:10 PM script INFO: SUCCESS!@#KODE 1!@#USER_ID 22!@#ACTIVITY_CODE 2
12/11/2022 03:53:10 PM script INFO: SUCCESS!@#KODE 1!@#USER_ID 22!@#ACTIVITY_CODE 4
12/11/2022 03:53:10 PM script INFO: SUCCESS!@#KODE 1!@#USER_ID 22!@#ACTIVITY_CODE 3
12/11/2022 03:53:10 PM script INFO: SUCCESS!@#KODE 1!@#USER_ID 22!@#ACTIVITY_CODE 5
12/11/2022 03:53:10 PM script INFO: SUCCESS!@#KODE 1!@#USER_ID 22!@#ACTIVITY_CODE 5
12/11/2022 03:53:13 PM script INFO: SUCCESS!@#KODE 1!@#USER_ID 22!@#ACTIVITY_CODE 2
12/11/2022 03:53:13 PM script INFO: SUCCESS!@#KODE 1!@#USER_ID 22!@#ACTIVITY_CODE 2
12/11/2022 03:53:13 PM script INFO: SUCCESS!@#KODE 1!@#USER_ID 22!@#ACTIVITY_CODE 3
12/11/2022 03:53:13 PM script INFO: SUCCESS!@#KODE 1!@#USER_ID 22!@#ACTIVITY_CODE 3
12/11/2022 03:53:13 PM script INFO: SUCCESS!@#KODE 1!@#USER_ID 22!@#ACTIVITY_CODE 1
12/11/2022 03:53:14 PM script INFO: SUCCESS!@#KODE 1!@#USER_ID 22!@#ACTIVITY_CODE 2
12/11/2022 03:53:14 PM script INFO: SUCCESS!@#KODE 1!@#USER_ID 22!@#ACTIVITY_CODE 1
12/11/2022 03:53:14 PM script INFO: SUCCESS!@#KODE 1!@#USER_ID 22!@#ACTIVITY_CODE 3
12/11/2022 03:53:14 PM script INFO: SUCCESS!@#KODE 1!@#USER_ID 22!@#ACTIVITY_CODE 3
12/11/2022 03:53:14 PM script INFO: SUCCESS!@#KODE 1!@#USER_ID 22!@#ACTIVITY_CODE 1
12/11/2022 03:53:14 PM script INFO: SUCCESS!@#KODE 1!@#USER_ID 22!@#ACTIVITY_CODE 3
12/11/2022 03:53:14 PM script INFO: SUCCESS!@#KODE 1!@#USER_ID 22!@#ACTIVITY_CODE 2
12/11/2022 03:53:14 PM script INFO: SUCCESS!@#KODE 1!@#USER_ID 22!@#ACTIVITY_CODE 5
12/11/2022 03:53:14 PM script INFO: SUCCESS!@#KODE 1!@#USER_ID 22!@#ACTIVITY_CODE 5
12/11/2022 03:53:17 PM script INFO: SUCCESS!@#KODE 1!@#USER_ID 22!@#ACTIVITY_CODE 1
12/11/2022 03:53:17 PM script INFO: SUCCESS!@#KODE 1!@#USER_ID 22!@#ACTIVITY_CODE 3
12/11/2022 03:53:17 PM script INFO: SUCCESS!@#KODE 1!@#USER_ID 22!@#ACTIVITY_CODE 1
12/11/2022 03:53:17 PM script INFO: SUCCESS!@#KODE 1!@#USER_ID 22!@#ACTIVITY_CODE 2
12/11/2022 03:53:17 PM script INFO: SUCCESS!@#KODE 1!@#USER_ID 22!@#ACTIVITY_CODE 1
12/11/2022 03:53:17 PM script INFO: SUCCESS!@#KODE 1!@#USER_ID 22!@#ACTIVITY_CODE 3
12/11/2022 03:53:17 PM script INFO: SUCCESS!@#KODE 1!@#USER_ID 22!@#ACTIVITY_CODE 2
12/11/2022 03:53:17 PM script INFO: SUCCESS!@#KODE 1!@#USER_ID 22!@#ACTIVITY_CODE 1
12/11/2022 03:53:17 PM script INFO: SUCCESS!@#KODE 1!@#USER_ID 22!@#ACTIVITY_CODE 1
12/11/2022 03:53:17 PM script INFO: SUCCESS!@#KODE 1!@#USER_ID 22!@#ACTIVITY_CODE 1
12/11/2022 03:53:17 PM script INFO: SUCCESS!@#KODE 1!@#USER_ID 22!@#ACTIVITY_CODE 4
12/11/2022 03:53:18 PM script INFO: SUCCESS!@#KODE 1!@#USER_ID 22!@#ACTIVITY_CODE 2
12/11/2022 03:53:18 PM script INFO: SUCCESS!@#KODE 1!@#USER_ID 22!@#ACTIVITY_CODE 4
12/11/2022 03:53:18 PM script INFO: SUCCESS!@#KODE 1!@#USER_ID 22!@#ACTIVITY_CODE 2
12/11/2022 03:53:18 PM script INFO: SUCCESS!@#KODE 1!@#USER_ID 22!@#ACTIVITY_CODE 3
12/11/2022 03:53:18 PM script INFO: SUCCESS!@#KODE 1!@#USER_ID 22!@#ACTIVITY_CODE 1
12/11/2022 03:53:18 PM script INFO: SUCCESS!@#KODE 1!@#USER_ID 22!@#ACTIVITY_CODE 5
12/11/2022 03:53:18 PM script INFO: SUCCESS!@#KODE 1!@#USER_ID 22!@#ACTIVITY_CODE 5
12/11/2022 03:53:20 PM script INFO: SUCCESS!@#KODE 1!@#USER_ID 22!@#ACTIVITY_CODE 5
12/11/2022 03:53:20 PM script INFO: SUCCESS!@#KODE 1!@#USER_ID 22!@#ACTIVITY_CODE 5
12/11/2022 03:53:23 PM script INFO: SUCCESS!@#KODE 1!@#USER_ID 22!@#ACTIVITY_CODE 4
12/11/2022 03:53:23 PM script INFO: SUCCESS!@#KODE 1!@#USER_ID 22!@#ACTIVITY_CODE 5
12/11/2022 03:53:23 PM script INFO: SUCCESS!@#KODE 1!@#USER_ID 22!@#ACTIVITY_CODE 5
12/11/2022 03:53:26 PM script INFO: SUCCESS!@#KODE 1!@#USER_ID 22!@#ACTIVITY_CODE 5
12/11/2022 03:53:26 PM script INFO: SUCCESS!@#KODE 1!@#USER_ID 22!@#ACTIVITY_CODE 5
12/11/2022 03:53:28 PM script INFO: SUCCESS!@#KODE 1!@#USER_ID 22!@#ACTIVITY_CODE 1
12/11/2022 03:53:28 PM script INFO: SUCCESS!@#KODE 1!@#USER_ID 22!@#ACTIVITY_CODE 1
12/11/2022 03:53:28 PM script INFO: SUCCESS!@#KODE 1!@#USER_ID 22!@#ACTIVITY_CODE 2
12/11/2022 03:53:28 PM script INFO: SUCCESS!@#KODE 1!@#USER_ID 22!@#ACTIVITY_CODE 1
12/11/2022 03:53:28 PM script INFO: SUCCESS!@#KODE 1!@#USER_ID 22!@#ACTIVITY_CODE 1
12/11/2022 03:53:28 PM script INFO: SUCCESS!@#KODE 1!@#USER_ID 22!@#ACTIVITY_CODE 5
12/11/2022 03:53:28 PM script INFO: SUCCESS!@#KODE 1!@#USER_ID 22!@#ACTIVITY_CODE 5
12/11/2022 03:53:31 PM script INFO: SUCCESS!@#KODE 1!@#USER_ID 22!@#ACTIVITY_CODE 2
12/11/2022 03:53:31 PM script INFO: SUCCESS!@#KODE 1!@#USER_ID 22!@#ACTIVITY_CODE 5
12/11/2022 03:53:31 PM script INFO: SUCCESS!@#KODE 1!@#USER_ID 22!@#ACTIVITY_CODE 5
12/11/2022 03:53:34 PM script INFO: SUCCESS!@#KODE 1!@#USER_ID 22!@#ACTIVITY_CODE 1
12/11/2022 03:53:34 PM script INFO: SUCCESS!@#KODE 1!@#USER_ID 22!@#ACTIVITY_CODE 1
12/11/2022 03:53:34 PM script INFO: SUCCESS!@#KODE 1!@#USER_ID 22!@#ACTIVITY_CODE 3
12/11/2022 03:53:34 PM script INFO: SUCCESS!@#KODE 1!@#USER_ID 22!@#ACTIVITY_CODE 2
12/11/2022 03:53:34 PM script INFO: SUCCESS!@#KODE 1!@#USER_ID 22!@#ACTIVITY_CODE 3
12/11/2022 03:53:34 PM script INFO: SUCCESS!@#KODE 1!@#USER_ID 22!@#ACTIVITY_CODE 5
12/11/2022 03:53:34 PM script INFO: SUCCESS!@#KODE 1!@#USER_ID 22!@#ACTIVITY_CODE 5
12/11/2022 03:53:37 PM script INFO: SUCCESS!@#KODE 1!@#USER_ID 22!@#ACTIVITY_CODE 1
12/11/2022 03:53:37 PM script INFO: SUCCESS!@#KODE 1!@#USER_ID 22!@#ACTIVITY_CODE 1
12/11/2022 03:53:37 PM script INFO: SUCCESS!@#KODE 1!@#USER_ID 22!@#ACTIVITY_CODE 1
12/11/2022 03:53:37 PM script INFO: SUCCESS!@#KODE 1!@#USER_ID 22!@#ACTIVITY_CODE 5
12/11/2022 03:53:37 PM script INFO: SUCCESS!@#KODE 1!@#USER_ID 22!@#ACTIVITY_CODE 5
12/11/2022 03:53:39 PM script INFO: SUCCESS!@#KODE 1!@#USER_ID 22!@#ACTIVITY_CODE 2
12/11/2022 03:53:39 PM script INFO: SUCCESS!@#KODE 1!@#USER_ID 22!@#ACTIVITY_CODE 5
12/11/2022 03:53:39 PM script INFO: SUCCESS!@#KODE 1!@#USER_ID 22!@#ACTIVITY_CODE 5
12/11/2022 03:53:42 PM script INFO: SUCCESS!@#KODE 1!@#USER_ID 22!@#ACTIVITY_CODE 2
12/11/2022 03:53:42 PM script INFO: SUCCESS!@#KODE 1!@#USER_ID 22!@#ACTIVITY_CODE 2
12/11/2022 03:53:42 PM script INFO: SUCCESS!@#KODE 1!@#USER_ID 22!@#ACTIVITY_CODE 1
12/11/2022 03:53:42 PM script INFO: SUCCESS!@#KODE 1!@#USER_ID 22!@#ACTIVITY_CODE 1
12/11/2022 03:53:43 PM script INFO: SUCCESS!@#KODE 1!@#USER_ID 22!@#ACTIVITY_CODE 2
12/11/2022 03:53:43 PM script INFO: SUCCESS!@#KODE 1!@#USER_ID 22!@#ACTIVITY_CODE 1
12/11/2022 03:53:43 PM script INFO: SUCCESS!@#KODE 1!@#USER_ID 22!@#ACTIVITY_CODE 1
12/11/2022 03:53:43 PM script INFO: SUCCESS!@#KODE 1!@#USER_ID 22!@#ACTIVITY_CODE 1
12/11/2022 03:53:43 PM script INFO: SUCCESS!@#KODE 1!@#USER_ID 22!@#ACTIVITY_CODE 1
12/11/2022 03:53:43 PM script INFO: SUCCESS!@#KODE 1!@#USER_ID 22!@#ACTIVITY_CODE 1
12/11/2022 03:53:43 PM script INFO: SUCCESS!@#KODE 1!@#USER_ID 22!@#ACTIVITY_CODE 3
12/11/2022 03:53:43 PM script INFO: SUCCESS!@#KODE 1!@#USER_ID 22!@#ACTIVITY_CODE 2
12/11/2022 03:53:43 PM script INFO: SUCCESS!@#KODE 1!@#USER_ID 22!@#ACTIVITY_CODE 4
12/11/2022 03:53:43 PM script INFO: SUCCESS!@#KODE 1!@#USER_ID 22!@#ACTIVITY_CODE 3
12/11/2022 03:53:43 PM script INFO: SUCCESS!@#KODE 1!@#USER_ID 22!@#ACTIVITY_CODE 3
12/11/2022 03:53:43 PM script INFO: SUCCESS!@#KODE 1!@#USER_ID 22!@#ACTIVITY_CODE 3
12/11/2022 03:53:43 PM script INFO: SUCCESS!@#KODE 1!@#USER_ID 22!@#ACTIVITY_CODE 3
12/11/2022 03:53:44 PM script INFO: SUCCESS!@#KODE 1!@#USER_ID 22!@#ACTIVITY_CODE 1
12/11/2022 03:53:44 PM script INFO: SUCCESS!@#KODE 1!@#USER_ID 22!@#ACTIVITY_CODE 2
12/11/2022 03:53:44 PM script INFO: SUCCESS!@#KODE 1!@#USER_ID 22!@#ACTIVITY_CODE 1
12/11/2022 03:53:44 PM script INFO: SUCCESS!@#KODE 1!@#USER_ID 22!@#ACTIVITY_CODE 4
12/11/2022 03:53:44 PM script INFO: SUCCESS!@#KODE 1!@#USER_ID 22!@#ACTIVITY_CODE 1
12/11/2022 03:53:44 PM script INFO: SUCCESS!@#KODE 1!@#USER_ID 22!@#ACTIVITY_CODE 4
12/11/2022 03:53:44 PM script INFO: SUCCESS!@#KODE 1!@#USER_ID 22!@#ACTIVITY_CODE 3
12/11/2022 03:53:44 PM script INFO: SUCCESS!@#KODE 1!@#USER_ID 22!@#ACTIVITY_CODE 3
12/11/2022 03:53:44 PM script INFO: SUCCESS!@#KODE 1!@#USER_ID 22!@#ACTIVITY_CODE 1
12/11/2022 03:53:44 PM script INFO: SUCCESS!@#KODE 1!@#USER_ID 22!@#ACTIVITY_CODE 2
12/11/2022 03:53:45 PM script INFO: SUCCESS!@#KODE 1!@#USER_ID 22!@#ACTIVITY_CODE 2
12/11/2022 03:53:45 PM script INFO: SUCCESS!@#KODE 1!@#USER_ID 22!@#ACTIVITY_CODE 1
12/11/2022 03:53:45 PM script INFO: SUCCESS!@#KODE 1!@#USER_ID 22!@#ACTIVITY_CODE 1
12/11/2022 03:53:45 PM script INFO: SUCCESS!@#KODE 1!@#USER_ID 22!@#ACTIVITY_CODE 3
12/11/2022 03:53:45 PM script INFO: SUCCESS!@#KODE 1!@#USER_ID 22!@#ACTIVITY_CODE 4
12/11/2022 03:53:45 PM script INFO: SUCCESS!@#KODE 1!@#USER_ID 22!@#ACTIVITY_CODE 3
12/11/2022 03:53:45 PM script INFO: SUCCESS!@#KODE 1!@#USER_ID 22!@#ACTIVITY_CODE 1
12/11/2022 03:53:45 PM script INFO: SUCCESS!@#KODE 1!@#USER_ID 22!@#ACTIVITY_CODE 4
12/11/2022 03:53:45 PM script INFO: SUCCESS!@#KODE 1!@#USER_ID 22!@#ACTIVITY_CODE 1
12/11/2022 03:53:45 PM script INFO: SUCCESS!@#KODE 1!@#USER_ID 22!@#ACTIVITY_CODE 1
12/11/2022 03:53:45 PM script INFO: SUCCESS!@#KODE 1!@#USER_ID 22!@#ACTIVITY_CODE 3
12/11/2022 03:53:46 PM script INFO: SUCCESS!@#KODE 1!@#USER_ID 22!@#ACTIVITY_CODE 3
12/11/2022 03:53:46 PM script INFO: SUCCESS!@#KODE 1!@#USER_ID 22!@#ACTIVITY_CODE 4
12/11/2022 03:53:46 PM script INFO: SUCCESS!@#KODE 1!@#USER_ID 22!@#ACTIVITY_CODE 1
12/11/2022 03:53:46 PM script INFO: SUCCESS!@#KODE 1!@#USER_ID 22!@#ACTIVITY_CODE 3
12/11/2022 03:53:46 PM script INFO: SUCCESS!@#KODE 1!@#USER_ID 22!@#ACTIVITY_CODE 3
12/11/2022 03:53:46 PM script INFO: SUCCESS!@#KODE 1!@#USER_ID 22!@#ACTIVITY_CODE 1
12/11/2022 03:53:46 PM script INFO: SUCCESS!@#KODE 1!@#USER_ID 22!@#ACTIVITY_CODE 1
12/11/2022 03:53:46 PM script INFO: SUCCESS!@#KODE 1!@#USER_ID 22!@#ACTIVITY_CODE 2
12/11/2022 03:53:46 PM script INFO: SUCCESS!@#KODE 1!@#USER_ID 22!@#ACTIVITY_CODE 3
12/11/2022 03:53:47 PM script INFO: SUCCESS!@#KODE 1!@#USER_ID 22!@#ACTIVITY_CODE 2
12/11/2022 03:53:47 PM script INFO: SUCCESS!@#KODE 1!@#USER_ID 22!@#ACTIVITY_CODE 2
12/11/2022 03:53:47 PM script INFO: SUCCESS!@#KODE 1!@#USER_ID 22!@#ACTIVITY_CODE 1
12/11/2022 03:53:47 PM script INFO: SUCCESS!@#KODE 1!@#USER_ID 22!@#ACTIVITY_CODE 4
12/11/2022 03:53:47 PM script INFO: SUCCESS!@#KODE 1!@#USER_ID 22!@#ACTIVITY_CODE 2
12/11/2022 03:53:47 PM script INFO: SUCCESS!@#KODE 1!@#USER_ID 22!@#ACTIVITY_CODE 2
12/11/2022 03:53:47 PM script INFO: SUCCESS!@#KODE 1!@#USER_ID 22!@#ACTIVITY_CODE 1
12/11/2022 03:53:47 PM script INFO: SUCCESS!@#KODE 1!@#USER_ID 22!@#ACTIVITY_CODE 3
12/11/2022 03:53:48 PM script INFO: SUCCESS!@#KODE 1!@#USER_ID 22!@#ACTIVITY_CODE 3
12/11/2022 03:53:48 PM script INFO: SUCCESS!@#KODE 1!@#USER_ID 22!@#ACTIVITY_CODE 2
12/11/2022 03:53:48 PM script INFO: SUCCESS!@#KODE 1!@#USER_ID 22!@#ACTIVITY_CODE 1
12/11/2022 03:53:48 PM script INFO: SUCCESS!@#KODE 1!@#USER_ID 22!@#ACTIVITY_CODE 1
12/11/2022 03:53:48 PM script INFO: SUCCESS!@#KODE 1!@#USER_ID 22!@#ACTIVITY_CODE 3
12/11/2022 03:53:48 PM script INFO: SUCCESS!@#KODE 1!@#USER_ID 22!@#ACTIVITY_CODE 2
12/11/2022 03:53:48 PM script INFO: SUCCESS!@#KODE 1!@#USER_ID 22!@#ACTIVITY_CODE 3
12/11/2022 03:53:48 PM script INFO: SUCCESS!@#KODE 1!@#USER_ID 22!@#ACTIVITY_CODE 1
12/11/2022 03:53:48 PM script INFO: SUCCESS!@#KODE 1!@#USER_ID 22!@#ACTIVITY_CODE 3
12/11/2022 03:53:49 PM script INFO: SUCCESS!@#KODE 1!@#USER_ID 22!@#ACTIVITY_CODE 1
12/11/2022 03:53:49 PM script INFO: SUCCESS!@#KODE 1!@#USER_ID 22!@#ACTIVITY_CODE 2
12/11/2022 03:53:49 PM script INFO: SUCCESS!@#KODE 1!@#USER_ID 22!@#ACTIVITY_CODE 1
12/11/2022 03:53:49 PM script INFO: SUCCESS!@#KODE 1!@#USER_ID 22!@#ACTIVITY_CODE 1
12/11/2022 03:53:49 PM script INFO: SUCCESS!@#KODE 1!@#USER_ID 22!@#ACTIVITY_CODE 1
12/11/2022 03:53:49 PM script INFO: SUCCESS!@#KODE 1!@#USER_ID 22!@#ACTIVITY_CODE 2
12/11/2022 03:53:50 PM script INFO: SUCCESS!@#KODE 1!@#USER_ID 22!@#ACTIVITY_CODE 2
12/11/2022 03:53:50 PM script INFO: SUCCESS!@#KODE 1!@#USER_ID 22!@#ACTIVITY_CODE 4
12/11/2022 03:53:50 PM script INFO: SUCCESS!@#KODE 1!@#USER_ID 22!@#ACTIVITY_CODE 2
12/11/2022 03:53:50 PM script INFO: SUCCESS!@#KODE 1!@#USER_ID 22!@#ACTIVITY_CODE 2
12/11/2022 03:53:50 PM script INFO: SUCCESS!@#KODE 1!@#USER_ID 22!@#ACTIVITY_CODE 3
12/11/2022 03:53:50 PM script INFO: SUCCESS!@#KODE 1!@#USER_ID 22!@#ACTIVITY_CODE 1
12/11/2022 03:53:51 PM script INFO: SUCCESS!@#KODE 1!@#USER_ID 22!@#ACTIVITY_CODE 3
12/11/2022 03:53:51 PM script INFO: SUCCESS!@#KODE 1!@#USER_ID 22!@#ACTIVITY_CODE 3
12/11/2022 03:53:51 PM script INFO: SUCCESS!@#KODE 1!@#USER_ID 22!@#ACTIVITY_CODE 2
12/11/2022 03:53:51 PM script INFO: SUCCESS!@#KODE 1!@#USER_ID 22!@#ACTIVITY_CODE 2
12/11/2022 03:53:51 PM script INFO: SUCCESS!@#KODE 1!@#USER_ID 22!@#ACTIVITY_CODE 2
12/11/2022 03:53:52 PM script INFO: SUCCESS!@#KODE 1!@#USER_ID 22!@#ACTIVITY_CODE 4
12/11/2022 03:53:52 PM script INFO: SUCCESS!@#KODE 1!@#USER_ID 22!@#ACTIVITY_CODE 1
12/11/2022 03:53:52 PM script INFO: SUCCESS!@#KODE 1!@#USER_ID 22!@#ACTIVITY_CODE 3
12/11/2022 03:53:52 PM script INFO: SUCCESS!@#KODE 1!@#USER_ID 22!@#ACTIVITY_CODE 3
12/11/2022 03:53:52 PM script INFO: SUCCESS!@#KODE 1!@#USER_ID 22!@#ACTIVITY_CODE 3
12/11/2022 03:53:52 PM script INFO: SUCCESS!@#KODE 1!@#USER_ID 22!@#ACTIVITY_CODE 3
12/11/2022 03:53:52 PM script INFO: SUCCESS!@#KODE 1!@#USER_ID 22!@#ACTIVITY_CODE 1
12/11/2022 03:53:52 PM script INFO: SUCCESS!@#KODE 1!@#USER_ID 22!@#ACTIVITY_CODE 4
12/11/2022 03:53:52 PM script INFO: SUCCESS!@#KODE 1!@#USER_ID 22!@#ACTIVITY_CODE 3
12/11/2022 03:53:53 PM script INFO: SUCCESS!@#KODE 1!@#USER_ID 22!@#ACTIVITY_CODE 2
12/11/2022 03:53:53 PM script INFO: SUCCESS!@#KODE 1!@#USER_ID 22!@#ACTIVITY_CODE 2
12/11/2022 03:53:53 PM script INFO: SUCCESS!@#KODE 1!@#USER_ID 22!@#ACTIVITY_CODE 3
12/11/2022 03:53:53 PM script INFO: SUCCESS!@#KODE 1!@#USER_ID 22!@#ACTIVITY_CODE 2
12/11/2022 03:53:54 PM script INFO: SUCCESS!@#KODE 1!@#USER_ID 22!@#ACTIVITY_CODE 2
12/11/2022 03:53:54 PM script INFO: SUCCESS!@#KODE 1!@#USER_ID 22!@#ACTIVITY_CODE 3
12/11/2022 03:53:54 PM script INFO: SUCCESS!@#KODE 1!@#USER_ID 22!@#ACTIVITY_CODE 1
12/11/2022 03:53:54 PM script INFO: SUCCESS!@#KODE 1!@#USER_ID 22!@#ACTIVITY_CODE 1
12/11/2022 03:53:54 PM script INFO: SUCCESS!@#KODE 1!@#USER_ID 22!@#ACTIVITY_CODE 3
12/11/2022 03:53:54 PM script INFO: SUCCESS!@#KODE 1!@#USER_ID 22!@#ACTIVITY_CODE 2
12/11/2022 03:53:54 PM script INFO: SUCCESS!@#KODE 1!@#USER_ID 22!@#ACTIVITY_CODE 1
12/11/2022 03:53:54 PM script INFO: SUCCESS!@#KODE 1!@#USER_ID 22!@#ACTIVITY_CODE 3
12/11/2022 03:53:55 PM script INFO: SUCCESS!@#KODE 1!@#USER_ID 22!@#ACTIVITY_CODE 3
12/11/2022 03:53:55 PM script INFO: SUCCESS!@#KODE 1!@#USER_ID 22!@#ACTIVITY_CODE 2
12/11/2022 03:53:55 PM script INFO: SUCCESS!@#KODE 1!@#USER_ID 22!@#ACTIVITY_CODE 1
12/11/2022 03:53:55 PM script INFO: SUCCESS!@#KODE 1!@#USER_ID 22!@#ACTIVITY_CODE 4
12/11/2022 03:53:55 PM script INFO: SUCCESS!@#KODE 1!@#USER_ID 22!@#ACTIVITY_CODE 3
12/11/2022 03:53:55 PM script INFO: SUCCESS!@#KODE 1!@#USER_ID 22!@#ACTIVITY_CODE 1
12/11/2022 03:53:56 PM script INFO: SUCCESS!@#KODE 1!@#USER_ID 22!@#ACTIVITY_CODE 2
12/11/2022 03:53:56 PM script INFO: SUCCESS!@#KODE 1!@#USER_ID 22!@#ACTIVITY_CODE 2
12/11/2022 03:53:56 PM script INFO: SUCCESS!@#KODE 1!@#USER_ID 22!@#ACTIVITY_CODE 2
12/11/2022 03:53:56 PM script INFO: SUCCESS!@#KODE 1!@#USER_ID 22!@#ACTIVITY_CODE 3
12/11/2022 03:53:56 PM script INFO: SUCCESS!@#KODE 1!@#USER_ID 22!@#ACTIVITY_CODE 4
12/11/2022 03:53:57 PM script INFO: SUCCESS!@#KODE 1!@#USER_ID 22!@#ACTIVITY_CODE 3
12/11/2022 03:53:57 PM script INFO: SUCCESS!@#KODE 1!@#USER_ID 22!@#ACTIVITY_CODE 1
12/11/2022 03:53:57 PM script INFO: SUCCESS!@#KODE 1!@#USER_ID 22!@#ACTIVITY_CODE 4
12/11/2022 03:53:57 PM script INFO: SUCCESS!@#KODE 1!@#USER_ID 22!@#ACTIVITY_CODE 1
12/11/2022 03:53:57 PM script INFO: SUCCESS!@#KODE 1!@#USER_ID 22!@#ACTIVITY_CODE 1
12/11/2022 03:53:57 PM script INFO: SUCCESS!@#KODE 1!@#USER_ID 22!@#ACTIVITY_CODE 3
12/11/2022 03:53:57 PM script INFO: SUCCESS!@#KODE 1!@#USER_ID 22!@#ACTIVITY_CODE 4
12/11/2022 03:53:57 PM script INFO: SUCCESS!@#KODE 1!@#USER_ID 22!@#ACTIVITY_CODE 1
12/11/2022 03:53:58 PM script INFO: SUCCESS!@#KODE 1!@#USER_ID 22!@#ACTIVITY_CODE 3
12/11/2022 03:53:58 PM script INFO: SUCCESS!@#KODE 1!@#USER_ID 22!@#ACTIVITY_CODE 1
12/11/2022 03:53:58 PM script INFO: SUCCESS!@#KODE 1!@#USER_ID 22!@#ACTIVITY_CODE 1
12/11/2022 03:53:58 PM script INFO: SUCCESS!@#KODE 1!@#USER_ID 22!@#ACTIVITY_CODE 2
12/11/2022 03:53:58 PM script INFO: SUCCESS!@#KODE 1!@#USER_ID 22!@#ACTIVITY_CODE 1
12/11/2022 03:53:58 PM script INFO: SUCCESS!@#KODE 1!@#USER_ID 22!@#ACTIVITY_CODE 2
12/11/2022 03:53:59 PM script INFO: SUCCESS!@#KODE 1!@#USER_ID 22!@#ACTIVITY_CODE 2
12/11/2022 03:53:59 PM script INFO: SUCCESS!@#KODE 1!@#USER_ID 22!@#ACTIVITY_CODE 3
12/11/2022 03:53:59 PM script INFO: SUCCESS!@#KODE 1!@#USER_ID 22!@#ACTIVITY_CODE 3
12/11/2022 03:54:00 PM script INFO: SUCCESS!@#KODE 1!@#USER_ID 22!@#ACTIVITY_CODE 2
12/11/2022 03:54:00 PM script INFO: SUCCESS!@#KODE 1!@#USER_ID 22!@#ACTIVITY_CODE 2
12/11/2022 03:54:00 PM script INFO: SUCCESS!@#KODE 1!@#USER_ID 22!@#ACTIVITY_CODE 2
12/11/2022 03:54:01 PM script INFO: SUCCESS!@#KODE 1!@#USER_ID 22!@#ACTIVITY_CODE 2
12/11/2022 03:54:01 PM script INFO: SUCCESS!@#KODE 1!@#USER_ID 22!@#ACTIVITY_CODE 1
12/11/2022 03:54:01 PM script INFO: SUCCESS!@#KODE 1!@#USER_ID 22!@#ACTIVITY_CODE 3
12/11/2022 03:54:01 PM script INFO: SUCCESS!@#KODE 1!@#USER_ID 22!@#ACTIVITY_CODE 1
12/11/2022 03:54:01 PM script INFO: SUCCESS!@#KODE 1!@#USER_ID 22!@#ACTIVITY_CODE 2
12/11/2022 03:54:01 PM script INFO: SUCCESS!@#KODE 1!@#USER_ID 22!@#ACTIVITY_CODE 4
12/11/2022 03:54:01 PM script INFO: SUCCESS!@#KODE 1!@#USER_ID 22!@#ACTIVITY_CODE 3
12/11/2022 03:54:02 PM script INFO: SUCCESS!@#KODE 1!@#USER_ID 22!@#ACTIVITY_CODE 1
12/11/2022 03:54:02 PM script INFO: SUCCESS!@#KODE 1!@#USER_ID 22!@#ACTIVITY_CODE 3
12/11/2022 03:54:02 PM script INFO: SUCCESS!@#KODE 1!@#USER_ID 22!@#ACTIVITY_CODE 3
12/11/2022 03:54:02 PM script INFO: SUCCESS!@#KODE 1!@#USER_ID 22!@#ACTIVITY_CODE 2
12/11/2022 03:54:02 PM script INFO: SUCCESS!@#KODE 1!@#USER_ID 22!@#ACTIVITY_CODE 1
12/11/2022 03:54:02 PM script INFO: SUCCESS!@#KODE 1!@#USER_ID 22!@#ACTIVITY_CODE 3
12/11/2022 03:54:03 PM script INFO: SUCCESS!@#KODE 1!@#USER_ID 22!@#ACTIVITY_CODE 2
12/11/2022 03:54:03 PM script INFO: SUCCESS!@#KODE 1!@#USER_ID 22!@#ACTIVITY_CODE 2
12/11/2022 03:54:03 PM script INFO: SUCCESS!@#KODE 1!@#USER_ID 22!@#ACTIVITY_CODE 1
12/11/2022 03:54:04 PM script INFO: SUCCESS!@#KODE 1!@#USER_ID 22!@#ACTIVITY_CODE 2
12/11/2022 03:54:04 PM script INFO: SUCCESS!@#KODE 1!@#USER_ID 22!@#ACTIVITY_CODE 2
12/11/2022 03:54:04 PM script INFO: SUCCESS!@#KODE 1!@#USER_ID 22!@#ACTIVITY_CODE 3
12/11/2022 03:54:04 PM script INFO: Duration: 67.96563744544983
12/11/2022 03:54:04 PM script INFO: mengakhiri-quiz
12/11/2022 03:54:33 PM script INFO: SUCCESS!@#KODE 1!@#USER_ID 22!@#ACTIVITY_CODE 5
12/11/2022 03:54:33 PM script INFO: berhasil-submit
