12/23/2022 02:03:35 AM script INFO: Prepared chrome options..
12/23/2022 02:03:37 AM script INFO: Initialized chrome browser..
12/23/2022 02:03:37 AM script INFO: mengakses-homepage
12/23/2022 02:04:04 AM script INFO: mengakses-login-page
12/23/2022 02:05:18 AM script INFO: mengakses-site-home
12/23/2022 02:05:19 AM main_worker ERROR: Message: element click intercepted: Element <a class="list-group-item list-group-item-action  " href="http://35.238.154.97/?redirect=0" data-key="home" data-isexpandable="0" data-indent="0" data-showdivider="0" data-type="70" data-nodetype="0" data-collapse="0" data-forceopen="0" data-isactive="0" data-hidden="0" data-preceedwithhr="0" data-parent-key="myhome">...</a> is not clickable at point (142, 141). Other element would receive the click: <div class="yui3-widget-mask" style="position: fixed; width: 100%; height: 100%; top: 0px; left: 0px; z-index: 1042;"></div>
  (Session info: headless chrome=107.0.5304.87)
Stacktrace:
#0 0x56136f9a6463 <unknown>
#1 0x56136f76a8d8 <unknown>
#2 0x56136f7b023b <unknown>
#3 0x56136f7ada79 <unknown>
#4 0x56136f7aafe4 <unknown>
#5 0x56136f7a9b21 <unknown>
#6 0x56136f79c421 <unknown>
#7 0x56136f7c9622 <unknown>
#8 0x56136f79bba7 <unknown>
#9 0x56136f7c978e <unknown>
#10 0x56136f7e230f <unknown>
#11 0x56136f7c9443 <unknown>
#12 0x56136f79a3c5 <unknown>
#13 0x56136f79b531 <unknown>
#14 0x56136f9f8dce <unknown>
#15 0x56136f9fc192 <unknown>
#16 0x56136f9dd93e <unknown>
#17 0x56136f9fd103 <unknown>
#18 0x56136f9d0d85 <unknown>
#19 0x56136fa1e0a8 <unknown>
#20 0x56136fa1e239 <unknown>
#21 0x56136fa39492 <unknown>
#22 0x7fe02d4ca609 start_thread

