12/10/2022 09:03:33 AM script INFO: Prepared chrome options..
12/10/2022 09:03:34 AM script INFO: Initialized chrome browser..
12/10/2022 09:03:34 AM script INFO: mengakses-homepage
12/10/2022 09:04:14 AM script INFO: mengakses-login-page
12/10/2022 09:04:44 AM script INFO: mengakses-site-home
12/10/2022 09:04:47 AM script INFO: mengakses-site-course
12/10/2022 09:05:12 AM script INFO: mengakses-quiz
12/10/2022 09:05:13 AM script INFO: mengakses-start-quiz-page
12/10/2022 09:05:14 AM script INFO: memulai-quiz
12/10/2022 09:05:14 AM script INFO: SUCCESS!@#KODE 1!@#USER_ID 26!@#ACTIVITY_CODE 5
12/10/2022 09:05:26 AM script INFO: SUCCESS!@#KODE 1!@#USER_ID 26!@#ACTIVITY_CODE 3
12/10/2022 09:05:26 AM script INFO: SUCCESS!@#KODE 1!@#USER_ID 26!@#ACTIVITY_CODE 2
12/10/2022 09:05:26 AM script INFO: SUCCESS!@#KODE 1!@#USER_ID 26!@#ACTIVITY_CODE 3
12/10/2022 09:05:26 AM script INFO: SUCCESS!@#KODE 1!@#USER_ID 26!@#ACTIVITY_CODE 3
12/10/2022 09:05:26 AM script INFO: SUCCESS!@#KODE 1!@#USER_ID 26!@#ACTIVITY_CODE 3
12/10/2022 09:05:27 AM script INFO: SUCCESS!@#KODE 1!@#USER_ID 26!@#ACTIVITY_CODE 3
12/10/2022 09:05:27 AM script INFO: SUCCESS!@#KODE 1!@#USER_ID 26!@#ACTIVITY_CODE 5
12/10/2022 09:05:27 AM script INFO: SUCCESS!@#KODE 1!@#USER_ID 26!@#ACTIVITY_CODE 5
12/10/2022 09:05:29 AM script INFO: SUCCESS!@#KODE 1!@#USER_ID 26!@#ACTIVITY_CODE 3
12/10/2022 09:05:29 AM script INFO: SUCCESS!@#KODE 1!@#USER_ID 26!@#ACTIVITY_CODE 3
12/10/2022 09:05:30 AM script INFO: SUCCESS!@#KODE 1!@#USER_ID 26!@#ACTIVITY_CODE 2
12/10/2022 09:05:30 AM script INFO: SUCCESS!@#KODE 1!@#USER_ID 26!@#ACTIVITY_CODE 5
12/10/2022 09:05:30 AM script INFO: SUCCESS!@#KODE 1!@#USER_ID 26!@#ACTIVITY_CODE 5
12/10/2022 09:05:33 AM script INFO: SUCCESS!@#KODE 1!@#USER_ID 26!@#ACTIVITY_CODE 2
12/10/2022 09:05:33 AM script INFO: SUCCESS!@#KODE 1!@#USER_ID 26!@#ACTIVITY_CODE 3
12/10/2022 09:05:33 AM script INFO: SUCCESS!@#KODE 1!@#USER_ID 26!@#ACTIVITY_CODE 5
12/10/2022 09:05:33 AM script INFO: SUCCESS!@#KODE 1!@#USER_ID 26!@#ACTIVITY_CODE 5
12/10/2022 09:05:35 AM script INFO: SUCCESS!@#KODE 1!@#USER_ID 26!@#ACTIVITY_CODE 5
12/10/2022 09:05:35 AM script INFO: SUCCESS!@#KODE 1!@#USER_ID 26!@#ACTIVITY_CODE 5
12/10/2022 09:05:38 AM script INFO: SUCCESS!@#KODE 1!@#USER_ID 26!@#ACTIVITY_CODE 5
12/10/2022 09:05:38 AM script INFO: SUCCESS!@#KODE 1!@#USER_ID 26!@#ACTIVITY_CODE 5
12/10/2022 09:05:41 AM script INFO: SUCCESS!@#KODE 1!@#USER_ID 26!@#ACTIVITY_CODE 3
12/10/2022 09:05:41 AM script INFO: SUCCESS!@#KODE 1!@#USER_ID 26!@#ACTIVITY_CODE 3
12/10/2022 09:05:41 AM script INFO: SUCCESS!@#KODE 1!@#USER_ID 26!@#ACTIVITY_CODE 3
12/10/2022 09:05:41 AM script INFO: SUCCESS!@#KODE 1!@#USER_ID 26!@#ACTIVITY_CODE 5
12/10/2022 09:05:41 AM script INFO: SUCCESS!@#KODE 1!@#USER_ID 26!@#ACTIVITY_CODE 5
12/10/2022 09:05:44 AM script INFO: SUCCESS!@#KODE 1!@#USER_ID 26!@#ACTIVITY_CODE 2
12/10/2022 09:05:44 AM script INFO: SUCCESS!@#KODE 1!@#USER_ID 26!@#ACTIVITY_CODE 1
12/10/2022 09:05:44 AM script INFO: SUCCESS!@#KODE 1!@#USER_ID 26!@#ACTIVITY_CODE 4
12/10/2022 09:05:45 AM script INFO: SUCCESS!@#KODE 1!@#USER_ID 26!@#ACTIVITY_CODE 1
12/10/2022 09:05:45 AM script INFO: SUCCESS!@#KODE 1!@#USER_ID 26!@#ACTIVITY_CODE 2
12/10/2022 09:05:45 AM script INFO: SUCCESS!@#KODE 1!@#USER_ID 26!@#ACTIVITY_CODE 3
12/10/2022 09:05:45 AM script INFO: SUCCESS!@#KODE 1!@#USER_ID 26!@#ACTIVITY_CODE 5
12/10/2022 09:05:45 AM script INFO: SUCCESS!@#KODE 1!@#USER_ID 26!@#ACTIVITY_CODE 5
12/10/2022 09:05:48 AM script INFO: SUCCESS!@#KODE 1!@#USER_ID 26!@#ACTIVITY_CODE 1
12/10/2022 09:05:48 AM script INFO: SUCCESS!@#KODE 1!@#USER_ID 26!@#ACTIVITY_CODE 5
12/10/2022 09:05:48 AM script INFO: SUCCESS!@#KODE 1!@#USER_ID 26!@#ACTIVITY_CODE 5
12/10/2022 09:05:50 AM script INFO: SUCCESS!@#KODE 1!@#USER_ID 26!@#ACTIVITY_CODE 5
12/10/2022 09:05:50 AM script INFO: SUCCESS!@#KODE 1!@#USER_ID 26!@#ACTIVITY_CODE 5
12/10/2022 09:05:53 AM script INFO: SUCCESS!@#KODE 1!@#USER_ID 26!@#ACTIVITY_CODE 5
12/10/2022 09:05:53 AM script INFO: SUCCESS!@#KODE 1!@#USER_ID 26!@#ACTIVITY_CODE 5
12/10/2022 09:05:55 AM script INFO: SUCCESS!@#KODE 1!@#USER_ID 26!@#ACTIVITY_CODE 5
12/10/2022 09:05:55 AM script INFO: SUCCESS!@#KODE 1!@#USER_ID 26!@#ACTIVITY_CODE 5
12/10/2022 09:05:58 AM script INFO: SUCCESS!@#KODE 1!@#USER_ID 26!@#ACTIVITY_CODE 1
12/10/2022 09:05:59 AM script INFO: SUCCESS!@#KODE 1!@#USER_ID 26!@#ACTIVITY_CODE 2
12/10/2022 09:05:59 AM script INFO: SUCCESS!@#KODE 1!@#USER_ID 26!@#ACTIVITY_CODE 4
12/10/2022 09:06:00 AM script INFO: SUCCESS!@#KODE 1!@#USER_ID 26!@#ACTIVITY_CODE 2
12/10/2022 09:06:00 AM script INFO: SUCCESS!@#KODE 1!@#USER_ID 26!@#ACTIVITY_CODE 2
12/10/2022 09:06:01 AM script INFO: SUCCESS!@#KODE 1!@#USER_ID 26!@#ACTIVITY_CODE 2
12/10/2022 09:06:01 AM script INFO: SUCCESS!@#KODE 1!@#USER_ID 26!@#ACTIVITY_CODE 2
12/10/2022 09:06:02 AM script INFO: SUCCESS!@#KODE 1!@#USER_ID 26!@#ACTIVITY_CODE 1
12/10/2022 09:06:02 AM script INFO: SUCCESS!@#KODE 1!@#USER_ID 26!@#ACTIVITY_CODE 1
12/10/2022 09:06:02 AM script INFO: SUCCESS!@#KODE 1!@#USER_ID 26!@#ACTIVITY_CODE 3
12/10/2022 09:06:03 AM script INFO: SUCCESS!@#KODE 1!@#USER_ID 26!@#ACTIVITY_CODE 3
12/10/2022 09:06:03 AM script INFO: SUCCESS!@#KODE 1!@#USER_ID 26!@#ACTIVITY_CODE 3
12/10/2022 09:06:03 AM script INFO: SUCCESS!@#KODE 1!@#USER_ID 26!@#ACTIVITY_CODE 3
12/10/2022 09:06:03 AM script INFO: SUCCESS!@#KODE 1!@#USER_ID 26!@#ACTIVITY_CODE 3
12/10/2022 09:06:04 AM script INFO: SUCCESS!@#KODE 1!@#USER_ID 26!@#ACTIVITY_CODE 1
12/10/2022 09:06:04 AM script INFO: SUCCESS!@#KODE 1!@#USER_ID 26!@#ACTIVITY_CODE 1
12/10/2022 09:06:04 AM script INFO: SUCCESS!@#KODE 1!@#USER_ID 26!@#ACTIVITY_CODE 2
12/10/2022 09:06:04 AM script INFO: SUCCESS!@#KODE 1!@#USER_ID 26!@#ACTIVITY_CODE 3
12/10/2022 09:06:05 AM script INFO: SUCCESS!@#KODE 1!@#USER_ID 26!@#ACTIVITY_CODE 1
12/10/2022 09:06:05 AM script INFO: SUCCESS!@#KODE 1!@#USER_ID 26!@#ACTIVITY_CODE 2
12/10/2022 09:06:06 AM script INFO: SUCCESS!@#KODE 1!@#USER_ID 26!@#ACTIVITY_CODE 3
12/10/2022 09:06:06 AM script INFO: SUCCESS!@#KODE 1!@#USER_ID 26!@#ACTIVITY_CODE 1
12/10/2022 09:06:07 AM script INFO: SUCCESS!@#KODE 1!@#USER_ID 26!@#ACTIVITY_CODE 1
12/10/2022 09:06:08 AM script INFO: SUCCESS!@#KODE 1!@#USER_ID 26!@#ACTIVITY_CODE 3
12/10/2022 09:06:09 AM script INFO: SUCCESS!@#KODE 1!@#USER_ID 26!@#ACTIVITY_CODE 2
12/10/2022 09:06:10 AM script INFO: SUCCESS!@#KODE 1!@#USER_ID 26!@#ACTIVITY_CODE 1
12/10/2022 09:06:11 AM script INFO: SUCCESS!@#KODE 1!@#USER_ID 26!@#ACTIVITY_CODE 2
12/10/2022 09:06:12 AM script INFO: SUCCESS!@#KODE 1!@#USER_ID 26!@#ACTIVITY_CODE 2
12/10/2022 09:06:12 AM script INFO: SUCCESS!@#KODE 1!@#USER_ID 26!@#ACTIVITY_CODE 3
12/10/2022 09:06:13 AM script INFO: SUCCESS!@#KODE 1!@#USER_ID 26!@#ACTIVITY_CODE 4
12/10/2022 09:06:14 AM script INFO: SUCCESS!@#KODE 1!@#USER_ID 26!@#ACTIVITY_CODE 2
12/10/2022 09:06:14 AM script INFO: SUCCESS!@#KODE 1!@#USER_ID 26!@#ACTIVITY_CODE 3
12/10/2022 09:06:15 AM script INFO: SUCCESS!@#KODE 1!@#USER_ID 26!@#ACTIVITY_CODE 2
12/10/2022 09:06:15 AM script INFO: SUCCESS!@#KODE 1!@#USER_ID 26!@#ACTIVITY_CODE 3
12/10/2022 09:06:15 AM script INFO: SUCCESS!@#KODE 1!@#USER_ID 26!@#ACTIVITY_CODE 2
12/10/2022 09:06:16 AM script INFO: SUCCESS!@#KODE 1!@#USER_ID 26!@#ACTIVITY_CODE 1
12/10/2022 09:06:16 AM script INFO: SUCCESS!@#KODE 1!@#USER_ID 26!@#ACTIVITY_CODE 3
12/10/2022 09:06:16 AM script INFO: SUCCESS!@#KODE 1!@#USER_ID 26!@#ACTIVITY_CODE 1
12/10/2022 09:06:16 AM script INFO: SUCCESS!@#KODE 1!@#USER_ID 26!@#ACTIVITY_CODE 3
12/10/2022 09:06:17 AM script INFO: SUCCESS!@#KODE 1!@#USER_ID 26!@#ACTIVITY_CODE 2
12/10/2022 09:06:17 AM script INFO: SUCCESS!@#KODE 1!@#USER_ID 26!@#ACTIVITY_CODE 3
12/10/2022 09:06:17 AM script INFO: SUCCESS!@#KODE 1!@#USER_ID 26!@#ACTIVITY_CODE 3
12/10/2022 09:06:17 AM script INFO: SUCCESS!@#KODE 1!@#USER_ID 26!@#ACTIVITY_CODE 3
12/10/2022 09:06:18 AM script INFO: SUCCESS!@#KODE 1!@#USER_ID 26!@#ACTIVITY_CODE 4
12/10/2022 09:06:18 AM script INFO: SUCCESS!@#KODE 1!@#USER_ID 26!@#ACTIVITY_CODE 2
12/10/2022 09:06:18 AM script INFO: SUCCESS!@#KODE 1!@#USER_ID 26!@#ACTIVITY_CODE 3
12/10/2022 09:06:18 AM script INFO: SUCCESS!@#KODE 1!@#USER_ID 26!@#ACTIVITY_CODE 3
12/10/2022 09:06:19 AM script INFO: SUCCESS!@#KODE 1!@#USER_ID 26!@#ACTIVITY_CODE 4
12/10/2022 09:06:19 AM script INFO: SUCCESS!@#KODE 1!@#USER_ID 26!@#ACTIVITY_CODE 1
12/10/2022 09:06:19 AM script INFO: SUCCESS!@#KODE 1!@#USER_ID 26!@#ACTIVITY_CODE 2
12/10/2022 09:06:20 AM script INFO: SUCCESS!@#KODE 1!@#USER_ID 26!@#ACTIVITY_CODE 1
12/10/2022 09:06:20 AM script INFO: SUCCESS!@#KODE 1!@#USER_ID 26!@#ACTIVITY_CODE 3
12/10/2022 09:06:20 AM script INFO: SUCCESS!@#KODE 1!@#USER_ID 26!@#ACTIVITY_CODE 1
12/10/2022 09:06:20 AM script INFO: SUCCESS!@#KODE 1!@#USER_ID 26!@#ACTIVITY_CODE 1
12/10/2022 09:06:20 AM script INFO: SUCCESS!@#KODE 1!@#USER_ID 26!@#ACTIVITY_CODE 1
12/10/2022 09:06:20 AM script INFO: Duration: 54.836185455322266
12/10/2022 09:06:20 AM script INFO: mengakhiri-quiz
12/10/2022 09:06:21 AM script INFO: SUCCESS!@#KODE 1!@#USER_ID 26!@#ACTIVITY_CODE 5
12/10/2022 09:06:21 AM script INFO: berhasil-submit
12/10/2022 09:07:51 AM script ERROR: TIMEOUT EXCEPTION!@#KODE 0!@#LOCATION berhasil-submit
12/10/2022 09:07:51 AM main_worker ERROR: Message: None

