12/23/2022 07:04:05 AM script INFO: Prepared chrome options..
12/23/2022 07:04:07 AM script INFO: Initialized chrome browser..
12/23/2022 07:04:07 AM script INFO: mengakses-homepage
12/23/2022 07:04:16 AM script INFO: mengakses-login-page
12/23/2022 07:04:17 AM script INFO: mengakses-site-home
12/23/2022 07:04:18 AM script INFO: mengakses-site-course
12/23/2022 07:04:19 AM script INFO: mengakses-quiz
12/23/2022 07:04:19 AM script INFO: mengakses-start-quiz-page
12/23/2022 07:04:20 AM script INFO: memulai-quiz
12/23/2022 07:04:20 AM script INFO: SUCCESS!@#KODE 1!@#USER_ID 80!@#ACTIVITY_CODE 5
12/23/2022 07:04:31 AM script INFO: SUCCESS!@#KODE 1!@#USER_ID 80!@#ACTIVITY_CODE 3
12/23/2022 07:04:31 AM script INFO: SUCCESS!@#KODE 1!@#USER_ID 80!@#ACTIVITY_CODE 3
12/23/2022 07:04:31 AM script INFO: SUCCESS!@#KODE 1!@#USER_ID 80!@#ACTIVITY_CODE 1
12/23/2022 07:04:31 AM script INFO: SUCCESS!@#KODE 1!@#USER_ID 80!@#ACTIVITY_CODE 4
12/23/2022 07:04:32 AM script INFO: SUCCESS!@#KODE 1!@#USER_ID 80!@#ACTIVITY_CODE 2
12/23/2022 07:04:32 AM script INFO: SUCCESS!@#KODE 1!@#USER_ID 80!@#ACTIVITY_CODE 1
12/23/2022 07:04:32 AM script INFO: SUCCESS!@#KODE 1!@#USER_ID 80!@#ACTIVITY_CODE 5
12/23/2022 07:04:32 AM script INFO: SUCCESS!@#KODE 1!@#USER_ID 80!@#ACTIVITY_CODE 5
12/23/2022 07:04:34 AM script INFO: SUCCESS!@#KODE 1!@#USER_ID 80!@#ACTIVITY_CODE 2
12/23/2022 07:04:34 AM script INFO: SUCCESS!@#KODE 1!@#USER_ID 80!@#ACTIVITY_CODE 1
12/23/2022 07:04:35 AM script INFO: SUCCESS!@#KODE 1!@#USER_ID 80!@#ACTIVITY_CODE 2
12/23/2022 07:04:35 AM script INFO: SUCCESS!@#KODE 1!@#USER_ID 80!@#ACTIVITY_CODE 5
12/23/2022 07:04:35 AM script INFO: SUCCESS!@#KODE 1!@#USER_ID 80!@#ACTIVITY_CODE 5
12/23/2022 07:04:37 AM script INFO: SUCCESS!@#KODE 1!@#USER_ID 80!@#ACTIVITY_CODE 3
12/23/2022 07:04:37 AM script INFO: SUCCESS!@#KODE 1!@#USER_ID 80!@#ACTIVITY_CODE 1
12/23/2022 07:04:37 AM script INFO: SUCCESS!@#KODE 1!@#USER_ID 80!@#ACTIVITY_CODE 2
12/23/2022 07:04:37 AM script INFO: SUCCESS!@#KODE 1!@#USER_ID 80!@#ACTIVITY_CODE 5
12/23/2022 07:04:37 AM script INFO: SUCCESS!@#KODE 1!@#USER_ID 80!@#ACTIVITY_CODE 5
12/23/2022 07:04:40 AM script INFO: SUCCESS!@#KODE 1!@#USER_ID 80!@#ACTIVITY_CODE 3
12/23/2022 07:04:40 AM script INFO: SUCCESS!@#KODE 1!@#USER_ID 80!@#ACTIVITY_CODE 1
12/23/2022 07:04:40 AM script INFO: SUCCESS!@#KODE 1!@#USER_ID 80!@#ACTIVITY_CODE 5
12/23/2022 07:04:40 AM script INFO: SUCCESS!@#KODE 1!@#USER_ID 80!@#ACTIVITY_CODE 5
12/23/2022 07:04:43 AM script INFO: SUCCESS!@#KODE 1!@#USER_ID 80!@#ACTIVITY_CODE 2
12/23/2022 07:04:43 AM script INFO: SUCCESS!@#KODE 1!@#USER_ID 80!@#ACTIVITY_CODE 2
12/23/2022 07:04:43 AM script INFO: SUCCESS!@#KODE 1!@#USER_ID 80!@#ACTIVITY_CODE 5
12/23/2022 07:04:43 AM script INFO: SUCCESS!@#KODE 1!@#USER_ID 80!@#ACTIVITY_CODE 5
12/23/2022 07:04:45 AM script INFO: SUCCESS!@#KODE 1!@#USER_ID 80!@#ACTIVITY_CODE 4
12/23/2022 07:04:45 AM script INFO: SUCCESS!@#KODE 1!@#USER_ID 80!@#ACTIVITY_CODE 3
12/23/2022 07:04:46 AM script INFO: SUCCESS!@#KODE 1!@#USER_ID 80!@#ACTIVITY_CODE 2
12/23/2022 07:04:46 AM script INFO: SUCCESS!@#KODE 1!@#USER_ID 80!@#ACTIVITY_CODE 5
12/23/2022 07:04:46 AM script INFO: SUCCESS!@#KODE 1!@#USER_ID 80!@#ACTIVITY_CODE 5
12/23/2022 07:04:48 AM script INFO: SUCCESS!@#KODE 1!@#USER_ID 80!@#ACTIVITY_CODE 3
12/23/2022 07:04:48 AM script INFO: SUCCESS!@#KODE 1!@#USER_ID 80!@#ACTIVITY_CODE 2
12/23/2022 07:04:48 AM script INFO: SUCCESS!@#KODE 1!@#USER_ID 80!@#ACTIVITY_CODE 2
12/23/2022 07:04:49 AM script INFO: SUCCESS!@#KODE 1!@#USER_ID 80!@#ACTIVITY_CODE 4
12/23/2022 07:04:49 AM script INFO: SUCCESS!@#KODE 1!@#USER_ID 80!@#ACTIVITY_CODE 1
12/23/2022 07:04:49 AM script INFO: SUCCESS!@#KODE 1!@#USER_ID 80!@#ACTIVITY_CODE 2
12/23/2022 07:04:49 AM script INFO: SUCCESS!@#KODE 1!@#USER_ID 80!@#ACTIVITY_CODE 2
12/23/2022 07:04:49 AM script INFO: SUCCESS!@#KODE 1!@#USER_ID 80!@#ACTIVITY_CODE 3
12/23/2022 07:04:49 AM script INFO: SUCCESS!@#KODE 1!@#USER_ID 80!@#ACTIVITY_CODE 3
12/23/2022 07:04:49 AM script INFO: SUCCESS!@#KODE 1!@#USER_ID 80!@#ACTIVITY_CODE 3
12/23/2022 07:04:49 AM script INFO: SUCCESS!@#KODE 1!@#USER_ID 80!@#ACTIVITY_CODE 2
12/23/2022 07:04:49 AM script INFO: SUCCESS!@#KODE 1!@#USER_ID 80!@#ACTIVITY_CODE 3
12/23/2022 07:04:49 AM script INFO: SUCCESS!@#KODE 1!@#USER_ID 80!@#ACTIVITY_CODE 1
12/23/2022 07:04:50 AM script INFO: SUCCESS!@#KODE 1!@#USER_ID 80!@#ACTIVITY_CODE 1
12/23/2022 07:04:50 AM script INFO: SUCCESS!@#KODE 1!@#USER_ID 80!@#ACTIVITY_CODE 1
12/23/2022 07:04:50 AM script INFO: SUCCESS!@#KODE 1!@#USER_ID 80!@#ACTIVITY_CODE 4
12/23/2022 07:04:50 AM script INFO: SUCCESS!@#KODE 1!@#USER_ID 80!@#ACTIVITY_CODE 2
12/23/2022 07:04:50 AM script INFO: Duration: 18.821410179138184
12/23/2022 07:04:50 AM script INFO: mengakhiri-quiz
12/23/2022 07:04:51 AM script INFO: SUCCESS!@#KODE 1!@#USER_ID 80!@#ACTIVITY_CODE 5
12/23/2022 07:04:51 AM script INFO: berhasil-submit
