12/23/2022 07:11:47 AM script INFO: Prepared chrome options..
12/23/2022 07:11:48 AM script INFO: Initialized chrome browser..
12/23/2022 07:11:48 AM script INFO: mengakses-homepage
12/23/2022 07:12:01 AM script INFO: mengakses-login-page
12/23/2022 07:12:02 AM script INFO: mengakses-site-home
12/23/2022 07:12:03 AM script INFO: mengakses-site-course
12/23/2022 07:12:03 AM script INFO: mengakses-quiz
12/23/2022 07:12:04 AM script INFO: mengakses-start-quiz-page
12/23/2022 07:12:05 AM script INFO: memulai-quiz
12/23/2022 07:12:05 AM script INFO: SUCCESS!@#KODE 1!@#USER_ID 72!@#ACTIVITY_CODE 5
12/23/2022 07:12:15 AM script INFO: SUCCESS!@#KODE 1!@#USER_ID 72!@#ACTIVITY_CODE 1
12/23/2022 07:12:16 AM script INFO: SUCCESS!@#KODE 1!@#USER_ID 72!@#ACTIVITY_CODE 3
12/23/2022 07:12:16 AM script INFO: SUCCESS!@#KODE 1!@#USER_ID 72!@#ACTIVITY_CODE 5
12/23/2022 07:12:16 AM script INFO: SUCCESS!@#KODE 1!@#USER_ID 72!@#ACTIVITY_CODE 5
12/23/2022 07:12:18 AM script INFO: SUCCESS!@#KODE 1!@#USER_ID 72!@#ACTIVITY_CODE 5
12/23/2022 07:12:18 AM script INFO: SUCCESS!@#KODE 1!@#USER_ID 72!@#ACTIVITY_CODE 5
12/23/2022 07:12:21 AM script INFO: SUCCESS!@#KODE 1!@#USER_ID 72!@#ACTIVITY_CODE 5
12/23/2022 07:12:21 AM script INFO: SUCCESS!@#KODE 1!@#USER_ID 72!@#ACTIVITY_CODE 5
12/23/2022 07:12:23 AM script INFO: SUCCESS!@#KODE 1!@#USER_ID 72!@#ACTIVITY_CODE 1
12/23/2022 07:12:23 AM script INFO: SUCCESS!@#KODE 1!@#USER_ID 72!@#ACTIVITY_CODE 4
12/23/2022 07:12:23 AM script INFO: SUCCESS!@#KODE 1!@#USER_ID 72!@#ACTIVITY_CODE 3
12/23/2022 07:12:23 AM script INFO: SUCCESS!@#KODE 1!@#USER_ID 72!@#ACTIVITY_CODE 1
12/23/2022 07:12:24 AM script INFO: SUCCESS!@#KODE 1!@#USER_ID 72!@#ACTIVITY_CODE 2
12/23/2022 07:12:24 AM script INFO: SUCCESS!@#KODE 1!@#USER_ID 72!@#ACTIVITY_CODE 1
12/23/2022 07:12:24 AM script INFO: SUCCESS!@#KODE 1!@#USER_ID 72!@#ACTIVITY_CODE 2
12/23/2022 07:12:24 AM script INFO: SUCCESS!@#KODE 1!@#USER_ID 72!@#ACTIVITY_CODE 1
12/23/2022 07:12:24 AM script INFO: SUCCESS!@#KODE 1!@#USER_ID 72!@#ACTIVITY_CODE 3
12/23/2022 07:12:24 AM script INFO: SUCCESS!@#KODE 1!@#USER_ID 72!@#ACTIVITY_CODE 5
12/23/2022 07:12:24 AM script INFO: SUCCESS!@#KODE 1!@#USER_ID 72!@#ACTIVITY_CODE 5
12/23/2022 07:12:27 AM script INFO: SUCCESS!@#KODE 1!@#USER_ID 72!@#ACTIVITY_CODE 3
12/23/2022 07:12:27 AM script INFO: SUCCESS!@#KODE 1!@#USER_ID 72!@#ACTIVITY_CODE 1
12/23/2022 07:12:27 AM script INFO: SUCCESS!@#KODE 1!@#USER_ID 72!@#ACTIVITY_CODE 5
12/23/2022 07:12:27 AM script INFO: SUCCESS!@#KODE 1!@#USER_ID 72!@#ACTIVITY_CODE 5
12/23/2022 07:12:29 AM script INFO: SUCCESS!@#KODE 1!@#USER_ID 72!@#ACTIVITY_CODE 2
12/23/2022 07:12:29 AM script INFO: SUCCESS!@#KODE 1!@#USER_ID 72!@#ACTIVITY_CODE 1
12/23/2022 07:12:29 AM script INFO: SUCCESS!@#KODE 1!@#USER_ID 72!@#ACTIVITY_CODE 5
12/23/2022 07:12:29 AM script INFO: SUCCESS!@#KODE 1!@#USER_ID 72!@#ACTIVITY_CODE 5
12/23/2022 07:12:32 AM script INFO: SUCCESS!@#KODE 1!@#USER_ID 72!@#ACTIVITY_CODE 5
12/23/2022 07:12:32 AM script INFO: SUCCESS!@#KODE 1!@#USER_ID 72!@#ACTIVITY_CODE 5
12/23/2022 07:12:34 AM script INFO: SUCCESS!@#KODE 1!@#USER_ID 72!@#ACTIVITY_CODE 1
12/23/2022 07:12:34 AM script INFO: SUCCESS!@#KODE 1!@#USER_ID 72!@#ACTIVITY_CODE 1
12/23/2022 07:12:35 AM script INFO: SUCCESS!@#KODE 1!@#USER_ID 72!@#ACTIVITY_CODE 3
12/23/2022 07:12:35 AM script INFO: SUCCESS!@#KODE 1!@#USER_ID 72!@#ACTIVITY_CODE 5
12/23/2022 07:12:35 AM script INFO: SUCCESS!@#KODE 1!@#USER_ID 72!@#ACTIVITY_CODE 5
12/23/2022 07:12:37 AM script INFO: SUCCESS!@#KODE 1!@#USER_ID 72!@#ACTIVITY_CODE 1
12/23/2022 07:12:37 AM script INFO: SUCCESS!@#KODE 1!@#USER_ID 72!@#ACTIVITY_CODE 4
12/23/2022 07:12:37 AM script INFO: SUCCESS!@#KODE 1!@#USER_ID 72!@#ACTIVITY_CODE 5
12/23/2022 07:12:37 AM script INFO: SUCCESS!@#KODE 1!@#USER_ID 72!@#ACTIVITY_CODE 5
12/23/2022 07:12:40 AM script INFO: SUCCESS!@#KODE 1!@#USER_ID 72!@#ACTIVITY_CODE 2
12/23/2022 07:12:40 AM script INFO: SUCCESS!@#KODE 1!@#USER_ID 72!@#ACTIVITY_CODE 1
12/23/2022 07:12:40 AM script INFO: SUCCESS!@#KODE 1!@#USER_ID 72!@#ACTIVITY_CODE 2
12/23/2022 07:12:40 AM script INFO: SUCCESS!@#KODE 1!@#USER_ID 72!@#ACTIVITY_CODE 1
12/23/2022 07:12:40 AM script INFO: SUCCESS!@#KODE 1!@#USER_ID 72!@#ACTIVITY_CODE 3
12/23/2022 07:12:40 AM script INFO: SUCCESS!@#KODE 1!@#USER_ID 72!@#ACTIVITY_CODE 5
12/23/2022 07:12:40 AM script INFO: SUCCESS!@#KODE 1!@#USER_ID 72!@#ACTIVITY_CODE 5
12/23/2022 07:12:43 AM script INFO: SUCCESS!@#KODE 1!@#USER_ID 72!@#ACTIVITY_CODE 2
12/23/2022 07:12:43 AM script INFO: SUCCESS!@#KODE 1!@#USER_ID 72!@#ACTIVITY_CODE 2
12/23/2022 07:12:43 AM script INFO: SUCCESS!@#KODE 1!@#USER_ID 72!@#ACTIVITY_CODE 2
12/23/2022 07:12:43 AM script INFO: SUCCESS!@#KODE 1!@#USER_ID 72!@#ACTIVITY_CODE 3
12/23/2022 07:12:43 AM script INFO: SUCCESS!@#KODE 1!@#USER_ID 72!@#ACTIVITY_CODE 5
12/23/2022 07:12:43 AM script INFO: SUCCESS!@#KODE 1!@#USER_ID 72!@#ACTIVITY_CODE 5
12/23/2022 07:12:46 AM script INFO: SUCCESS!@#KODE 1!@#USER_ID 72!@#ACTIVITY_CODE 1
12/23/2022 07:12:46 AM script INFO: SUCCESS!@#KODE 1!@#USER_ID 72!@#ACTIVITY_CODE 2
12/23/2022 07:12:46 AM script INFO: SUCCESS!@#KODE 1!@#USER_ID 72!@#ACTIVITY_CODE 3
12/23/2022 07:12:46 AM script INFO: SUCCESS!@#KODE 1!@#USER_ID 72!@#ACTIVITY_CODE 2
12/23/2022 07:12:46 AM script INFO: SUCCESS!@#KODE 1!@#USER_ID 72!@#ACTIVITY_CODE 2
12/23/2022 07:12:46 AM script INFO: SUCCESS!@#KODE 1!@#USER_ID 72!@#ACTIVITY_CODE 3
12/23/2022 07:12:46 AM script INFO: SUCCESS!@#KODE 1!@#USER_ID 72!@#ACTIVITY_CODE 3
12/23/2022 07:12:47 AM script INFO: SUCCESS!@#KODE 1!@#USER_ID 72!@#ACTIVITY_CODE 2
12/23/2022 07:12:47 AM script INFO: SUCCESS!@#KODE 1!@#USER_ID 72!@#ACTIVITY_CODE 2
12/23/2022 07:12:47 AM script INFO: SUCCESS!@#KODE 1!@#USER_ID 72!@#ACTIVITY_CODE 1
12/23/2022 07:12:47 AM script INFO: SUCCESS!@#KODE 1!@#USER_ID 72!@#ACTIVITY_CODE 4
12/23/2022 07:12:47 AM script INFO: SUCCESS!@#KODE 1!@#USER_ID 72!@#ACTIVITY_CODE 2
12/23/2022 07:12:47 AM script INFO: SUCCESS!@#KODE 1!@#USER_ID 72!@#ACTIVITY_CODE 1
12/23/2022 07:12:47 AM script INFO: SUCCESS!@#KODE 1!@#USER_ID 72!@#ACTIVITY_CODE 2
12/23/2022 07:12:47 AM script INFO: SUCCESS!@#KODE 1!@#USER_ID 72!@#ACTIVITY_CODE 3
12/23/2022 07:12:47 AM script INFO: SUCCESS!@#KODE 1!@#USER_ID 72!@#ACTIVITY_CODE 3
12/23/2022 07:12:47 AM script INFO: SUCCESS!@#KODE 1!@#USER_ID 72!@#ACTIVITY_CODE 2
12/23/2022 07:12:48 AM script INFO: SUCCESS!@#KODE 1!@#USER_ID 72!@#ACTIVITY_CODE 4
12/23/2022 07:12:48 AM script INFO: SUCCESS!@#KODE 1!@#USER_ID 72!@#ACTIVITY_CODE 3
12/23/2022 07:12:48 AM script INFO: SUCCESS!@#KODE 1!@#USER_ID 72!@#ACTIVITY_CODE 3
12/23/2022 07:12:48 AM script INFO: SUCCESS!@#KODE 1!@#USER_ID 72!@#ACTIVITY_CODE 1
12/23/2022 07:12:48 AM script INFO: SUCCESS!@#KODE 1!@#USER_ID 72!@#ACTIVITY_CODE 1
12/23/2022 07:12:48 AM script INFO: SUCCESS!@#KODE 1!@#USER_ID 72!@#ACTIVITY_CODE 3
12/23/2022 07:12:48 AM script INFO: SUCCESS!@#KODE 1!@#USER_ID 72!@#ACTIVITY_CODE 4
12/23/2022 07:12:48 AM script INFO: SUCCESS!@#KODE 1!@#USER_ID 72!@#ACTIVITY_CODE 2
12/23/2022 07:12:48 AM script INFO: SUCCESS!@#KODE 1!@#USER_ID 72!@#ACTIVITY_CODE 2
12/23/2022 07:12:48 AM script INFO: SUCCESS!@#KODE 1!@#USER_ID 72!@#ACTIVITY_CODE 3
12/23/2022 07:12:48 AM script INFO: SUCCESS!@#KODE 1!@#USER_ID 72!@#ACTIVITY_CODE 1
12/23/2022 07:12:48 AM script INFO: SUCCESS!@#KODE 1!@#USER_ID 72!@#ACTIVITY_CODE 3
12/23/2022 07:12:49 AM script INFO: SUCCESS!@#KODE 1!@#USER_ID 72!@#ACTIVITY_CODE 4
12/23/2022 07:12:49 AM script INFO: SUCCESS!@#KODE 1!@#USER_ID 72!@#ACTIVITY_CODE 1
12/23/2022 07:12:49 AM script INFO: SUCCESS!@#KODE 1!@#USER_ID 72!@#ACTIVITY_CODE 4
12/23/2022 07:12:49 AM script INFO: SUCCESS!@#KODE 1!@#USER_ID 72!@#ACTIVITY_CODE 2
12/23/2022 07:12:49 AM script INFO: SUCCESS!@#KODE 1!@#USER_ID 72!@#ACTIVITY_CODE 3
12/23/2022 07:12:49 AM script INFO: SUCCESS!@#KODE 1!@#USER_ID 72!@#ACTIVITY_CODE 2
12/23/2022 07:12:49 AM script INFO: SUCCESS!@#KODE 1!@#USER_ID 72!@#ACTIVITY_CODE 3
12/23/2022 07:12:49 AM script INFO: SUCCESS!@#KODE 1!@#USER_ID 72!@#ACTIVITY_CODE 2
12/23/2022 07:12:49 AM script INFO: SUCCESS!@#KODE 1!@#USER_ID 72!@#ACTIVITY_CODE 2
12/23/2022 07:12:49 AM script INFO: SUCCESS!@#KODE 1!@#USER_ID 72!@#ACTIVITY_CODE 4
12/23/2022 07:12:50 AM script INFO: SUCCESS!@#KODE 1!@#USER_ID 72!@#ACTIVITY_CODE 1
12/23/2022 07:12:50 AM script INFO: SUCCESS!@#KODE 1!@#USER_ID 72!@#ACTIVITY_CODE 3
12/23/2022 07:12:50 AM script INFO: SUCCESS!@#KODE 1!@#USER_ID 72!@#ACTIVITY_CODE 2
12/23/2022 07:12:50 AM script INFO: SUCCESS!@#KODE 1!@#USER_ID 72!@#ACTIVITY_CODE 1
12/23/2022 07:12:50 AM script INFO: SUCCESS!@#KODE 1!@#USER_ID 72!@#ACTIVITY_CODE 1
12/23/2022 07:12:50 AM script INFO: SUCCESS!@#KODE 1!@#USER_ID 72!@#ACTIVITY_CODE 4
12/23/2022 07:12:50 AM script INFO: SUCCESS!@#KODE 1!@#USER_ID 72!@#ACTIVITY_CODE 3
12/23/2022 07:12:50 AM script INFO: SUCCESS!@#KODE 1!@#USER_ID 72!@#ACTIVITY_CODE 1
12/23/2022 07:12:50 AM script INFO: Duration: 34.63434028625488
12/23/2022 07:12:50 AM script INFO: mengakhiri-quiz
12/23/2022 07:12:51 AM script INFO: SUCCESS!@#KODE 1!@#USER_ID 72!@#ACTIVITY_CODE 5
12/23/2022 07:12:51 AM script INFO: berhasil-submit
