12/23/2022 01:17:54 AM script INFO: Prepared chrome options..
12/23/2022 01:17:55 AM script INFO: Initialized chrome browser..
12/23/2022 01:17:55 AM script INFO: mengakses-homepage
12/23/2022 01:19:06 AM script INFO: mengakses-login-page
12/23/2022 01:19:46 AM script INFO: mengakses-site-home
12/23/2022 01:20:00 AM script INFO: mengakses-site-course
12/23/2022 01:20:20 AM script INFO: mengakses-quiz
12/23/2022 01:20:30 AM script INFO: mengakses-start-quiz-page
12/23/2022 01:20:46 AM script INFO: memulai-quiz
12/23/2022 01:20:46 AM script INFO: SUCCESS!@#KODE 1!@#USER_ID 75!@#ACTIVITY_CODE 5
12/23/2022 01:20:57 AM script INFO: SUCCESS!@#KODE 1!@#USER_ID 75!@#ACTIVITY_CODE 1
12/23/2022 01:20:57 AM script INFO: SUCCESS!@#KODE 1!@#USER_ID 75!@#ACTIVITY_CODE 3
12/23/2022 01:20:57 AM script INFO: SUCCESS!@#KODE 1!@#USER_ID 75!@#ACTIVITY_CODE 2
12/23/2022 01:20:57 AM script INFO: SUCCESS!@#KODE 1!@#USER_ID 75!@#ACTIVITY_CODE 5
12/23/2022 01:20:57 AM script INFO: SUCCESS!@#KODE 1!@#USER_ID 75!@#ACTIVITY_CODE 5
12/23/2022 01:21:00 AM script INFO: SUCCESS!@#KODE 1!@#USER_ID 75!@#ACTIVITY_CODE 3
12/23/2022 01:21:00 AM script INFO: SUCCESS!@#KODE 1!@#USER_ID 75!@#ACTIVITY_CODE 5
12/23/2022 01:21:00 AM script INFO: SUCCESS!@#KODE 1!@#USER_ID 75!@#ACTIVITY_CODE 5
12/23/2022 01:21:02 AM script INFO: SUCCESS!@#KODE 1!@#USER_ID 75!@#ACTIVITY_CODE 3
12/23/2022 01:21:02 AM script INFO: SUCCESS!@#KODE 1!@#USER_ID 75!@#ACTIVITY_CODE 5
12/23/2022 01:21:02 AM script INFO: SUCCESS!@#KODE 1!@#USER_ID 75!@#ACTIVITY_CODE 5
12/23/2022 01:21:05 AM script INFO: SUCCESS!@#KODE 1!@#USER_ID 75!@#ACTIVITY_CODE 1
12/23/2022 01:21:05 AM script INFO: SUCCESS!@#KODE 1!@#USER_ID 75!@#ACTIVITY_CODE 4
12/23/2022 01:21:05 AM script INFO: SUCCESS!@#KODE 1!@#USER_ID 75!@#ACTIVITY_CODE 3
12/23/2022 01:21:05 AM script INFO: SUCCESS!@#KODE 1!@#USER_ID 75!@#ACTIVITY_CODE 3
12/23/2022 01:21:05 AM script INFO: SUCCESS!@#KODE 1!@#USER_ID 75!@#ACTIVITY_CODE 3
12/23/2022 01:21:05 AM script INFO: SUCCESS!@#KODE 1!@#USER_ID 75!@#ACTIVITY_CODE 2
12/23/2022 01:21:05 AM script INFO: SUCCESS!@#KODE 1!@#USER_ID 75!@#ACTIVITY_CODE 3
12/23/2022 01:21:05 AM script INFO: SUCCESS!@#KODE 1!@#USER_ID 75!@#ACTIVITY_CODE 1
12/23/2022 01:21:05 AM script INFO: SUCCESS!@#KODE 1!@#USER_ID 75!@#ACTIVITY_CODE 4
12/23/2022 01:21:06 AM script INFO: SUCCESS!@#KODE 1!@#USER_ID 75!@#ACTIVITY_CODE 2
12/23/2022 01:21:06 AM script INFO: SUCCESS!@#KODE 1!@#USER_ID 75!@#ACTIVITY_CODE 2
12/23/2022 01:21:06 AM script INFO: SUCCESS!@#KODE 1!@#USER_ID 75!@#ACTIVITY_CODE 2
12/23/2022 01:21:06 AM script INFO: SUCCESS!@#KODE 1!@#USER_ID 75!@#ACTIVITY_CODE 5
12/23/2022 01:21:06 AM script INFO: SUCCESS!@#KODE 1!@#USER_ID 75!@#ACTIVITY_CODE 5
12/23/2022 01:21:08 AM script INFO: SUCCESS!@#KODE 1!@#USER_ID 75!@#ACTIVITY_CODE 2
12/23/2022 01:21:08 AM script INFO: SUCCESS!@#KODE 1!@#USER_ID 75!@#ACTIVITY_CODE 1
12/23/2022 01:21:09 AM script INFO: SUCCESS!@#KODE 1!@#USER_ID 75!@#ACTIVITY_CODE 2
12/23/2022 01:21:09 AM script INFO: SUCCESS!@#KODE 1!@#USER_ID 75!@#ACTIVITY_CODE 2
12/23/2022 01:21:09 AM script INFO: SUCCESS!@#KODE 1!@#USER_ID 75!@#ACTIVITY_CODE 1
12/23/2022 01:21:09 AM script INFO: SUCCESS!@#KODE 1!@#USER_ID 75!@#ACTIVITY_CODE 5
12/23/2022 01:21:09 AM script INFO: SUCCESS!@#KODE 1!@#USER_ID 75!@#ACTIVITY_CODE 5
12/23/2022 01:21:11 AM script INFO: SUCCESS!@#KODE 1!@#USER_ID 75!@#ACTIVITY_CODE 2
12/23/2022 01:21:11 AM script INFO: SUCCESS!@#KODE 1!@#USER_ID 75!@#ACTIVITY_CODE 5
12/23/2022 01:21:11 AM script INFO: SUCCESS!@#KODE 1!@#USER_ID 75!@#ACTIVITY_CODE 5
12/23/2022 01:21:14 AM script INFO: SUCCESS!@#KODE 1!@#USER_ID 75!@#ACTIVITY_CODE 3
12/23/2022 01:21:14 AM script INFO: SUCCESS!@#KODE 1!@#USER_ID 75!@#ACTIVITY_CODE 1
12/23/2022 01:21:14 AM script INFO: SUCCESS!@#KODE 1!@#USER_ID 75!@#ACTIVITY_CODE 2
12/23/2022 01:21:14 AM script INFO: SUCCESS!@#KODE 1!@#USER_ID 75!@#ACTIVITY_CODE 3
12/23/2022 01:21:14 AM script INFO: SUCCESS!@#KODE 1!@#USER_ID 75!@#ACTIVITY_CODE 2
12/23/2022 01:21:14 AM script INFO: SUCCESS!@#KODE 1!@#USER_ID 75!@#ACTIVITY_CODE 2
12/23/2022 01:21:14 AM script INFO: SUCCESS!@#KODE 1!@#USER_ID 75!@#ACTIVITY_CODE 3
12/23/2022 01:21:15 AM script INFO: SUCCESS!@#KODE 1!@#USER_ID 75!@#ACTIVITY_CODE 2
12/23/2022 01:21:15 AM script INFO: SUCCESS!@#KODE 1!@#USER_ID 75!@#ACTIVITY_CODE 4
12/23/2022 01:21:15 AM script INFO: SUCCESS!@#KODE 1!@#USER_ID 75!@#ACTIVITY_CODE 3
12/23/2022 01:21:15 AM script INFO: SUCCESS!@#KODE 1!@#USER_ID 75!@#ACTIVITY_CODE 5
12/23/2022 01:21:15 AM script INFO: SUCCESS!@#KODE 1!@#USER_ID 75!@#ACTIVITY_CODE 5
12/23/2022 01:21:17 AM script INFO: SUCCESS!@#KODE 1!@#USER_ID 75!@#ACTIVITY_CODE 1
12/23/2022 01:21:17 AM script INFO: SUCCESS!@#KODE 1!@#USER_ID 75!@#ACTIVITY_CODE 1
12/23/2022 01:21:17 AM script INFO: SUCCESS!@#KODE 1!@#USER_ID 75!@#ACTIVITY_CODE 5
12/23/2022 01:21:17 AM script INFO: SUCCESS!@#KODE 1!@#USER_ID 75!@#ACTIVITY_CODE 5
12/23/2022 01:21:20 AM script INFO: SUCCESS!@#KODE 1!@#USER_ID 75!@#ACTIVITY_CODE 3
12/23/2022 01:21:20 AM script INFO: SUCCESS!@#KODE 1!@#USER_ID 75!@#ACTIVITY_CODE 5
12/23/2022 01:21:20 AM script INFO: SUCCESS!@#KODE 1!@#USER_ID 75!@#ACTIVITY_CODE 5
12/23/2022 01:21:22 AM script INFO: SUCCESS!@#KODE 1!@#USER_ID 75!@#ACTIVITY_CODE 4
12/23/2022 01:21:22 AM script INFO: SUCCESS!@#KODE 1!@#USER_ID 75!@#ACTIVITY_CODE 5
12/23/2022 01:21:22 AM script INFO: SUCCESS!@#KODE 1!@#USER_ID 75!@#ACTIVITY_CODE 5
12/23/2022 01:21:25 AM script INFO: SUCCESS!@#KODE 1!@#USER_ID 75!@#ACTIVITY_CODE 5
12/23/2022 01:21:25 AM script INFO: SUCCESS!@#KODE 1!@#USER_ID 75!@#ACTIVITY_CODE 5
12/23/2022 01:21:28 AM script INFO: SUCCESS!@#KODE 1!@#USER_ID 75!@#ACTIVITY_CODE 2
12/23/2022 01:21:28 AM script INFO: SUCCESS!@#KODE 1!@#USER_ID 75!@#ACTIVITY_CODE 1
12/23/2022 01:21:28 AM script INFO: SUCCESS!@#KODE 1!@#USER_ID 75!@#ACTIVITY_CODE 3
12/23/2022 01:21:28 AM script INFO: SUCCESS!@#KODE 1!@#USER_ID 75!@#ACTIVITY_CODE 2
12/23/2022 01:21:28 AM script INFO: SUCCESS!@#KODE 1!@#USER_ID 75!@#ACTIVITY_CODE 2
12/23/2022 01:21:28 AM script INFO: SUCCESS!@#KODE 1!@#USER_ID 75!@#ACTIVITY_CODE 1
12/23/2022 01:21:28 AM script INFO: SUCCESS!@#KODE 1!@#USER_ID 75!@#ACTIVITY_CODE 2
12/23/2022 01:21:28 AM script INFO: SUCCESS!@#KODE 1!@#USER_ID 75!@#ACTIVITY_CODE 1
12/23/2022 01:21:28 AM script INFO: SUCCESS!@#KODE 1!@#USER_ID 75!@#ACTIVITY_CODE 1
12/23/2022 01:21:28 AM script INFO: SUCCESS!@#KODE 1!@#USER_ID 75!@#ACTIVITY_CODE 3
12/23/2022 01:21:28 AM script INFO: SUCCESS!@#KODE 1!@#USER_ID 75!@#ACTIVITY_CODE 4
12/23/2022 01:21:28 AM script INFO: SUCCESS!@#KODE 1!@#USER_ID 75!@#ACTIVITY_CODE 3
12/23/2022 01:21:29 AM script INFO: SUCCESS!@#KODE 1!@#USER_ID 75!@#ACTIVITY_CODE 3
12/23/2022 01:21:29 AM script INFO: SUCCESS!@#KODE 1!@#USER_ID 75!@#ACTIVITY_CODE 1
12/23/2022 01:21:29 AM script INFO: SUCCESS!@#KODE 1!@#USER_ID 75!@#ACTIVITY_CODE 3
12/23/2022 01:21:29 AM script INFO: SUCCESS!@#KODE 1!@#USER_ID 75!@#ACTIVITY_CODE 2
12/23/2022 01:21:29 AM script INFO: SUCCESS!@#KODE 1!@#USER_ID 75!@#ACTIVITY_CODE 3
12/23/2022 01:21:29 AM script INFO: SUCCESS!@#KODE 1!@#USER_ID 75!@#ACTIVITY_CODE 2
12/23/2022 01:21:29 AM script INFO: SUCCESS!@#KODE 1!@#USER_ID 75!@#ACTIVITY_CODE 3
12/23/2022 01:21:29 AM script INFO: SUCCESS!@#KODE 1!@#USER_ID 75!@#ACTIVITY_CODE 3
12/23/2022 01:21:29 AM script INFO: SUCCESS!@#KODE 1!@#USER_ID 75!@#ACTIVITY_CODE 2
12/23/2022 01:21:29 AM script INFO: SUCCESS!@#KODE 1!@#USER_ID 75!@#ACTIVITY_CODE 3
12/23/2022 01:21:29 AM script INFO: SUCCESS!@#KODE 1!@#USER_ID 75!@#ACTIVITY_CODE 3
12/23/2022 01:21:29 AM script INFO: SUCCESS!@#KODE 1!@#USER_ID 75!@#ACTIVITY_CODE 3
12/23/2022 01:21:29 AM script INFO: SUCCESS!@#KODE 1!@#USER_ID 75!@#ACTIVITY_CODE 4
12/23/2022 01:21:30 AM script INFO: SUCCESS!@#KODE 1!@#USER_ID 75!@#ACTIVITY_CODE 1
12/23/2022 01:21:30 AM script INFO: SUCCESS!@#KODE 1!@#USER_ID 75!@#ACTIVITY_CODE 1
12/23/2022 01:21:30 AM script INFO: SUCCESS!@#KODE 1!@#USER_ID 75!@#ACTIVITY_CODE 4
12/23/2022 01:21:30 AM script INFO: SUCCESS!@#KODE 1!@#USER_ID 75!@#ACTIVITY_CODE 2
12/23/2022 01:21:30 AM script INFO: SUCCESS!@#KODE 1!@#USER_ID 75!@#ACTIVITY_CODE 4
12/23/2022 01:21:30 AM script INFO: SUCCESS!@#KODE 1!@#USER_ID 75!@#ACTIVITY_CODE 3
12/23/2022 01:21:30 AM script INFO: SUCCESS!@#KODE 1!@#USER_ID 75!@#ACTIVITY_CODE 1
12/23/2022 01:21:30 AM script INFO: SUCCESS!@#KODE 1!@#USER_ID 75!@#ACTIVITY_CODE 1
12/23/2022 01:21:30 AM script INFO: SUCCESS!@#KODE 1!@#USER_ID 75!@#ACTIVITY_CODE 2
12/23/2022 01:21:30 AM script INFO: SUCCESS!@#KODE 1!@#USER_ID 75!@#ACTIVITY_CODE 2
12/23/2022 01:21:30 AM script INFO: SUCCESS!@#KODE 1!@#USER_ID 75!@#ACTIVITY_CODE 1
12/23/2022 01:21:30 AM script INFO: SUCCESS!@#KODE 1!@#USER_ID 75!@#ACTIVITY_CODE 1
12/23/2022 01:21:30 AM script INFO: SUCCESS!@#KODE 1!@#USER_ID 75!@#ACTIVITY_CODE 1
12/23/2022 01:21:30 AM script INFO: SUCCESS!@#KODE 1!@#USER_ID 75!@#ACTIVITY_CODE 2
12/23/2022 01:21:30 AM script INFO: Duration: 33.663198471069336
12/23/2022 01:21:30 AM script INFO: mengakhiri-quiz
12/23/2022 01:21:45 AM script INFO: SUCCESS!@#KODE 1!@#USER_ID 75!@#ACTIVITY_CODE 5
12/23/2022 01:21:45 AM script INFO: berhasil-submit
12/23/2022 01:23:15 AM script ERROR: TIMEOUT EXCEPTION!@#KODE 0!@#LOCATION berhasil-submit
12/23/2022 01:23:15 AM main_worker ERROR: Message: None

