12/21/2022 02:29:40 PM script INFO: Prepared chrome options..
12/21/2022 02:29:42 PM script INFO: Initialized chrome browser..
12/21/2022 02:29:42 PM script INFO: mengakses-homepage
12/21/2022 02:30:03 PM script INFO: mengakses-login-page
12/21/2022 02:30:05 PM script INFO: mengakses-site-home
12/21/2022 02:30:06 PM script INFO: mengakses-site-course
12/21/2022 02:30:08 PM script INFO: mengakses-quiz
12/21/2022 02:30:09 PM script INFO: mengakses-start-quiz-page
12/21/2022 02:30:10 PM script INFO: memulai-quiz
12/21/2022 02:30:10 PM script INFO: SUCCESS!@#KODE 1!@#USER_ID 8!@#ACTIVITY_CODE 5
12/21/2022 02:30:21 PM script INFO: SUCCESS!@#KODE 1!@#USER_ID 8!@#ACTIVITY_CODE 5
12/21/2022 02:30:21 PM script INFO: SUCCESS!@#KODE 1!@#USER_ID 8!@#ACTIVITY_CODE 5
12/21/2022 02:30:23 PM script INFO: SUCCESS!@#KODE 1!@#USER_ID 8!@#ACTIVITY_CODE 1
12/21/2022 02:30:23 PM script INFO: SUCCESS!@#KODE 1!@#USER_ID 8!@#ACTIVITY_CODE 1
12/21/2022 02:30:23 PM script INFO: SUCCESS!@#KODE 1!@#USER_ID 8!@#ACTIVITY_CODE 5
12/21/2022 02:30:23 PM script INFO: SUCCESS!@#KODE 1!@#USER_ID 8!@#ACTIVITY_CODE 5
12/21/2022 02:30:26 PM script INFO: SUCCESS!@#KODE 1!@#USER_ID 8!@#ACTIVITY_CODE 2
12/21/2022 02:30:26 PM script INFO: SUCCESS!@#KODE 1!@#USER_ID 8!@#ACTIVITY_CODE 3
12/21/2022 02:30:26 PM script INFO: SUCCESS!@#KODE 1!@#USER_ID 8!@#ACTIVITY_CODE 5
12/21/2022 02:30:26 PM script INFO: SUCCESS!@#KODE 1!@#USER_ID 8!@#ACTIVITY_CODE 5
12/21/2022 02:30:29 PM script INFO: SUCCESS!@#KODE 1!@#USER_ID 8!@#ACTIVITY_CODE 2
12/21/2022 02:30:29 PM script INFO: SUCCESS!@#KODE 1!@#USER_ID 8!@#ACTIVITY_CODE 3
12/21/2022 02:30:29 PM script INFO: SUCCESS!@#KODE 1!@#USER_ID 8!@#ACTIVITY_CODE 3
12/21/2022 02:30:29 PM script INFO: SUCCESS!@#KODE 1!@#USER_ID 8!@#ACTIVITY_CODE 5
12/21/2022 02:30:29 PM script INFO: SUCCESS!@#KODE 1!@#USER_ID 8!@#ACTIVITY_CODE 5
12/21/2022 02:30:31 PM script INFO: SUCCESS!@#KODE 1!@#USER_ID 8!@#ACTIVITY_CODE 1
12/21/2022 02:30:32 PM script INFO: SUCCESS!@#KODE 1!@#USER_ID 8!@#ACTIVITY_CODE 2
12/21/2022 02:30:32 PM script INFO: SUCCESS!@#KODE 1!@#USER_ID 8!@#ACTIVITY_CODE 5
12/21/2022 02:30:32 PM script INFO: SUCCESS!@#KODE 1!@#USER_ID 8!@#ACTIVITY_CODE 5
12/21/2022 02:30:34 PM script INFO: SUCCESS!@#KODE 1!@#USER_ID 8!@#ACTIVITY_CODE 1
12/21/2022 02:30:34 PM script INFO: SUCCESS!@#KODE 1!@#USER_ID 8!@#ACTIVITY_CODE 5
12/21/2022 02:30:34 PM script INFO: SUCCESS!@#KODE 1!@#USER_ID 8!@#ACTIVITY_CODE 5
12/21/2022 02:30:37 PM script INFO: SUCCESS!@#KODE 1!@#USER_ID 8!@#ACTIVITY_CODE 2
12/21/2022 02:30:37 PM script INFO: SUCCESS!@#KODE 1!@#USER_ID 8!@#ACTIVITY_CODE 3
12/21/2022 02:30:37 PM script INFO: SUCCESS!@#KODE 1!@#USER_ID 8!@#ACTIVITY_CODE 3
12/21/2022 02:30:37 PM script INFO: SUCCESS!@#KODE 1!@#USER_ID 8!@#ACTIVITY_CODE 3
12/21/2022 02:30:37 PM script INFO: SUCCESS!@#KODE 1!@#USER_ID 8!@#ACTIVITY_CODE 3
12/21/2022 02:30:37 PM script INFO: SUCCESS!@#KODE 1!@#USER_ID 8!@#ACTIVITY_CODE 3
12/21/2022 02:30:37 PM script INFO: SUCCESS!@#KODE 1!@#USER_ID 8!@#ACTIVITY_CODE 3
12/21/2022 02:30:37 PM script INFO: SUCCESS!@#KODE 1!@#USER_ID 8!@#ACTIVITY_CODE 2
12/21/2022 02:30:37 PM script INFO: SUCCESS!@#KODE 1!@#USER_ID 8!@#ACTIVITY_CODE 2
12/21/2022 02:30:37 PM script INFO: SUCCESS!@#KODE 1!@#USER_ID 8!@#ACTIVITY_CODE 1
12/21/2022 02:30:38 PM script INFO: SUCCESS!@#KODE 1!@#USER_ID 8!@#ACTIVITY_CODE 2
12/21/2022 02:30:38 PM script INFO: SUCCESS!@#KODE 1!@#USER_ID 8!@#ACTIVITY_CODE 1
12/21/2022 02:30:38 PM script INFO: SUCCESS!@#KODE 1!@#USER_ID 8!@#ACTIVITY_CODE 4
12/21/2022 02:30:38 PM script INFO: SUCCESS!@#KODE 1!@#USER_ID 8!@#ACTIVITY_CODE 3
12/21/2022 02:30:38 PM script INFO: SUCCESS!@#KODE 1!@#USER_ID 8!@#ACTIVITY_CODE 1
12/21/2022 02:30:38 PM script INFO: SUCCESS!@#KODE 1!@#USER_ID 8!@#ACTIVITY_CODE 4
12/21/2022 02:30:38 PM script INFO: SUCCESS!@#KODE 1!@#USER_ID 8!@#ACTIVITY_CODE 2
12/21/2022 02:30:38 PM script INFO: SUCCESS!@#KODE 1!@#USER_ID 8!@#ACTIVITY_CODE 4
12/21/2022 02:30:38 PM script INFO: SUCCESS!@#KODE 1!@#USER_ID 8!@#ACTIVITY_CODE 2
12/21/2022 02:30:38 PM script INFO: SUCCESS!@#KODE 1!@#USER_ID 8!@#ACTIVITY_CODE 1
12/21/2022 02:30:38 PM script INFO: SUCCESS!@#KODE 1!@#USER_ID 8!@#ACTIVITY_CODE 1
12/21/2022 02:30:38 PM script INFO: SUCCESS!@#KODE 1!@#USER_ID 8!@#ACTIVITY_CODE 1
12/21/2022 02:30:38 PM script INFO: SUCCESS!@#KODE 1!@#USER_ID 8!@#ACTIVITY_CODE 3
12/21/2022 02:30:39 PM script INFO: SUCCESS!@#KODE 1!@#USER_ID 8!@#ACTIVITY_CODE 2
12/21/2022 02:30:39 PM script INFO: SUCCESS!@#KODE 1!@#USER_ID 8!@#ACTIVITY_CODE 1
12/21/2022 02:30:39 PM script INFO: SUCCESS!@#KODE 1!@#USER_ID 8!@#ACTIVITY_CODE 4
12/21/2022 02:30:39 PM script INFO: Duration: 18.04568910598755
12/21/2022 02:30:39 PM script INFO: mengakhiri-quiz
12/21/2022 02:30:41 PM script INFO: SUCCESS!@#KODE 1!@#USER_ID 8!@#ACTIVITY_CODE 5
12/21/2022 02:30:41 PM script INFO: berhasil-submit
