12/23/2022 04:26:04 AM script INFO: Prepared chrome options..
12/23/2022 04:26:05 AM script INFO: Initialized chrome browser..
12/23/2022 04:26:05 AM script INFO: mengakses-homepage
12/23/2022 04:26:22 AM script INFO: mengakses-login-page
12/23/2022 04:27:03 AM script INFO: mengakses-site-home
12/23/2022 04:27:16 AM script INFO: mengakses-site-course
12/23/2022 04:27:52 AM script INFO: mengakses-quiz
12/23/2022 04:28:04 AM script INFO: mengakses-start-quiz-page
12/23/2022 04:28:30 AM script INFO: memulai-quiz
12/23/2022 04:28:30 AM script INFO: SUCCESS!@#KODE 1!@#USER_ID 33!@#ACTIVITY_CODE 5
12/23/2022 04:28:40 AM script INFO: SUCCESS!@#KODE 1!@#USER_ID 33!@#ACTIVITY_CODE 3
12/23/2022 04:28:41 AM script INFO: SUCCESS!@#KODE 1!@#USER_ID 33!@#ACTIVITY_CODE 1
12/23/2022 04:28:41 AM script INFO: SUCCESS!@#KODE 1!@#USER_ID 33!@#ACTIVITY_CODE 5
12/23/2022 04:28:41 AM script INFO: SUCCESS!@#KODE 1!@#USER_ID 33!@#ACTIVITY_CODE 5
12/23/2022 04:28:43 AM script INFO: SUCCESS!@#KODE 1!@#USER_ID 33!@#ACTIVITY_CODE 3
12/23/2022 04:28:43 AM script INFO: SUCCESS!@#KODE 1!@#USER_ID 33!@#ACTIVITY_CODE 1
12/23/2022 04:28:43 AM script INFO: SUCCESS!@#KODE 1!@#USER_ID 33!@#ACTIVITY_CODE 3
12/23/2022 04:28:43 AM script INFO: SUCCESS!@#KODE 1!@#USER_ID 33!@#ACTIVITY_CODE 4
12/23/2022 04:28:43 AM script INFO: SUCCESS!@#KODE 1!@#USER_ID 33!@#ACTIVITY_CODE 2
12/23/2022 04:28:43 AM script INFO: SUCCESS!@#KODE 1!@#USER_ID 33!@#ACTIVITY_CODE 1
12/23/2022 04:28:44 AM script INFO: SUCCESS!@#KODE 1!@#USER_ID 33!@#ACTIVITY_CODE 4
12/23/2022 04:28:44 AM script INFO: SUCCESS!@#KODE 1!@#USER_ID 33!@#ACTIVITY_CODE 3
12/23/2022 04:28:44 AM script INFO: SUCCESS!@#KODE 1!@#USER_ID 33!@#ACTIVITY_CODE 3
12/23/2022 04:28:44 AM script INFO: SUCCESS!@#KODE 1!@#USER_ID 33!@#ACTIVITY_CODE 1
12/23/2022 04:28:44 AM script INFO: SUCCESS!@#KODE 1!@#USER_ID 33!@#ACTIVITY_CODE 5
12/23/2022 04:28:44 AM script INFO: SUCCESS!@#KODE 1!@#USER_ID 33!@#ACTIVITY_CODE 5
12/23/2022 04:28:46 AM script INFO: SUCCESS!@#KODE 1!@#USER_ID 33!@#ACTIVITY_CODE 2
12/23/2022 04:28:46 AM script INFO: SUCCESS!@#KODE 1!@#USER_ID 33!@#ACTIVITY_CODE 1
12/23/2022 04:28:47 AM script INFO: SUCCESS!@#KODE 1!@#USER_ID 33!@#ACTIVITY_CODE 2
12/23/2022 04:28:47 AM script INFO: SUCCESS!@#KODE 1!@#USER_ID 33!@#ACTIVITY_CODE 2
12/23/2022 04:28:47 AM script INFO: SUCCESS!@#KODE 1!@#USER_ID 33!@#ACTIVITY_CODE 1
12/23/2022 04:28:47 AM script INFO: SUCCESS!@#KODE 1!@#USER_ID 33!@#ACTIVITY_CODE 3
12/23/2022 04:28:47 AM script INFO: SUCCESS!@#KODE 1!@#USER_ID 33!@#ACTIVITY_CODE 3
12/23/2022 04:28:47 AM script INFO: SUCCESS!@#KODE 1!@#USER_ID 33!@#ACTIVITY_CODE 3
12/23/2022 04:28:47 AM script INFO: SUCCESS!@#KODE 1!@#USER_ID 33!@#ACTIVITY_CODE 5
12/23/2022 04:28:47 AM script INFO: SUCCESS!@#KODE 1!@#USER_ID 33!@#ACTIVITY_CODE 5
12/23/2022 04:28:49 AM script INFO: SUCCESS!@#KODE 1!@#USER_ID 33!@#ACTIVITY_CODE 4
12/23/2022 04:28:49 AM script INFO: SUCCESS!@#KODE 1!@#USER_ID 33!@#ACTIVITY_CODE 5
12/23/2022 04:28:49 AM script INFO: SUCCESS!@#KODE 1!@#USER_ID 33!@#ACTIVITY_CODE 5
12/23/2022 04:28:52 AM script INFO: SUCCESS!@#KODE 1!@#USER_ID 33!@#ACTIVITY_CODE 2
12/23/2022 04:28:52 AM script INFO: SUCCESS!@#KODE 1!@#USER_ID 33!@#ACTIVITY_CODE 3
12/23/2022 04:28:52 AM script INFO: SUCCESS!@#KODE 1!@#USER_ID 33!@#ACTIVITY_CODE 1
12/23/2022 04:28:52 AM script INFO: SUCCESS!@#KODE 1!@#USER_ID 33!@#ACTIVITY_CODE 1
12/23/2022 04:28:52 AM script INFO: SUCCESS!@#KODE 1!@#USER_ID 33!@#ACTIVITY_CODE 5
12/23/2022 04:28:52 AM script INFO: SUCCESS!@#KODE 1!@#USER_ID 33!@#ACTIVITY_CODE 5
12/23/2022 04:28:55 AM script INFO: SUCCESS!@#KODE 1!@#USER_ID 33!@#ACTIVITY_CODE 2
12/23/2022 04:28:55 AM script INFO: SUCCESS!@#KODE 1!@#USER_ID 33!@#ACTIVITY_CODE 2
12/23/2022 04:28:55 AM script INFO: SUCCESS!@#KODE 1!@#USER_ID 33!@#ACTIVITY_CODE 1
12/23/2022 04:28:55 AM script INFO: SUCCESS!@#KODE 1!@#USER_ID 33!@#ACTIVITY_CODE 4
12/23/2022 04:28:55 AM script INFO: SUCCESS!@#KODE 1!@#USER_ID 33!@#ACTIVITY_CODE 2
12/23/2022 04:28:55 AM script INFO: SUCCESS!@#KODE 1!@#USER_ID 33!@#ACTIVITY_CODE 3
12/23/2022 04:28:55 AM script INFO: SUCCESS!@#KODE 1!@#USER_ID 33!@#ACTIVITY_CODE 5
12/23/2022 04:28:55 AM script INFO: SUCCESS!@#KODE 1!@#USER_ID 33!@#ACTIVITY_CODE 5
12/23/2022 04:28:58 AM script INFO: SUCCESS!@#KODE 1!@#USER_ID 33!@#ACTIVITY_CODE 3
12/23/2022 04:28:58 AM script INFO: SUCCESS!@#KODE 1!@#USER_ID 33!@#ACTIVITY_CODE 2
12/23/2022 04:28:58 AM script INFO: SUCCESS!@#KODE 1!@#USER_ID 33!@#ACTIVITY_CODE 3
12/23/2022 04:28:58 AM script INFO: SUCCESS!@#KODE 1!@#USER_ID 33!@#ACTIVITY_CODE 2
12/23/2022 04:28:58 AM script INFO: SUCCESS!@#KODE 1!@#USER_ID 33!@#ACTIVITY_CODE 1
12/23/2022 04:28:58 AM script INFO: SUCCESS!@#KODE 1!@#USER_ID 33!@#ACTIVITY_CODE 5
12/23/2022 04:28:58 AM script INFO: SUCCESS!@#KODE 1!@#USER_ID 33!@#ACTIVITY_CODE 5
12/23/2022 04:29:01 AM script INFO: SUCCESS!@#KODE 1!@#USER_ID 33!@#ACTIVITY_CODE 3
12/23/2022 04:29:01 AM script INFO: SUCCESS!@#KODE 1!@#USER_ID 33!@#ACTIVITY_CODE 3
12/23/2022 04:29:01 AM script INFO: SUCCESS!@#KODE 1!@#USER_ID 33!@#ACTIVITY_CODE 1
12/23/2022 04:29:01 AM script INFO: SUCCESS!@#KODE 1!@#USER_ID 33!@#ACTIVITY_CODE 5
12/23/2022 04:29:01 AM script INFO: SUCCESS!@#KODE 1!@#USER_ID 33!@#ACTIVITY_CODE 5
12/23/2022 04:29:03 AM script INFO: SUCCESS!@#KODE 1!@#USER_ID 33!@#ACTIVITY_CODE 5
12/23/2022 04:29:03 AM script INFO: SUCCESS!@#KODE 1!@#USER_ID 33!@#ACTIVITY_CODE 5
12/23/2022 04:29:06 AM script INFO: SUCCESS!@#KODE 1!@#USER_ID 33!@#ACTIVITY_CODE 5
12/23/2022 04:29:06 AM script INFO: SUCCESS!@#KODE 1!@#USER_ID 33!@#ACTIVITY_CODE 5
12/23/2022 04:29:08 AM script INFO: SUCCESS!@#KODE 1!@#USER_ID 33!@#ACTIVITY_CODE 1
12/23/2022 04:29:09 AM script INFO: SUCCESS!@#KODE 1!@#USER_ID 33!@#ACTIVITY_CODE 3
12/23/2022 04:29:09 AM script INFO: SUCCESS!@#KODE 1!@#USER_ID 33!@#ACTIVITY_CODE 5
12/23/2022 04:29:09 AM script INFO: SUCCESS!@#KODE 1!@#USER_ID 33!@#ACTIVITY_CODE 5
12/23/2022 04:29:11 AM script INFO: SUCCESS!@#KODE 1!@#USER_ID 33!@#ACTIVITY_CODE 3
12/23/2022 04:29:11 AM script INFO: SUCCESS!@#KODE 1!@#USER_ID 33!@#ACTIVITY_CODE 2
12/23/2022 04:29:11 AM script INFO: SUCCESS!@#KODE 1!@#USER_ID 33!@#ACTIVITY_CODE 2
12/23/2022 04:29:11 AM script INFO: SUCCESS!@#KODE 1!@#USER_ID 33!@#ACTIVITY_CODE 1
12/23/2022 04:29:12 AM script INFO: SUCCESS!@#KODE 1!@#USER_ID 33!@#ACTIVITY_CODE 2
12/23/2022 04:29:12 AM script INFO: SUCCESS!@#KODE 1!@#USER_ID 33!@#ACTIVITY_CODE 3
12/23/2022 04:29:12 AM script INFO: SUCCESS!@#KODE 1!@#USER_ID 33!@#ACTIVITY_CODE 3
12/23/2022 04:29:12 AM script INFO: SUCCESS!@#KODE 1!@#USER_ID 33!@#ACTIVITY_CODE 2
12/23/2022 04:29:12 AM script INFO: SUCCESS!@#KODE 1!@#USER_ID 33!@#ACTIVITY_CODE 1
12/23/2022 04:29:12 AM script INFO: SUCCESS!@#KODE 1!@#USER_ID 33!@#ACTIVITY_CODE 2
12/23/2022 04:29:12 AM script INFO: SUCCESS!@#KODE 1!@#USER_ID 33!@#ACTIVITY_CODE 2
12/23/2022 04:29:12 AM script INFO: SUCCESS!@#KODE 1!@#USER_ID 33!@#ACTIVITY_CODE 4
12/23/2022 04:29:12 AM script INFO: SUCCESS!@#KODE 1!@#USER_ID 33!@#ACTIVITY_CODE 2
12/23/2022 04:29:13 AM script INFO: SUCCESS!@#KODE 1!@#USER_ID 33!@#ACTIVITY_CODE 2
12/23/2022 04:29:13 AM script INFO: SUCCESS!@#KODE 1!@#USER_ID 33!@#ACTIVITY_CODE 2
12/23/2022 04:29:13 AM script INFO: SUCCESS!@#KODE 1!@#USER_ID 33!@#ACTIVITY_CODE 2
12/23/2022 04:29:13 AM script INFO: SUCCESS!@#KODE 1!@#USER_ID 33!@#ACTIVITY_CODE 3
12/23/2022 04:29:13 AM script INFO: SUCCESS!@#KODE 1!@#USER_ID 33!@#ACTIVITY_CODE 3
12/23/2022 04:29:13 AM script INFO: SUCCESS!@#KODE 1!@#USER_ID 33!@#ACTIVITY_CODE 1
12/23/2022 04:29:13 AM script INFO: SUCCESS!@#KODE 1!@#USER_ID 33!@#ACTIVITY_CODE 3
12/23/2022 04:29:13 AM script INFO: SUCCESS!@#KODE 1!@#USER_ID 33!@#ACTIVITY_CODE 4
12/23/2022 04:29:13 AM script INFO: SUCCESS!@#KODE 1!@#USER_ID 33!@#ACTIVITY_CODE 2
12/23/2022 04:29:13 AM script INFO: SUCCESS!@#KODE 1!@#USER_ID 33!@#ACTIVITY_CODE 1
12/23/2022 04:29:13 AM script INFO: SUCCESS!@#KODE 1!@#USER_ID 33!@#ACTIVITY_CODE 1
12/23/2022 04:29:13 AM script INFO: SUCCESS!@#KODE 1!@#USER_ID 33!@#ACTIVITY_CODE 2
12/23/2022 04:29:14 AM script INFO: SUCCESS!@#KODE 1!@#USER_ID 33!@#ACTIVITY_CODE 2
12/23/2022 04:29:14 AM script INFO: SUCCESS!@#KODE 1!@#USER_ID 33!@#ACTIVITY_CODE 1
12/23/2022 04:29:14 AM script INFO: SUCCESS!@#KODE 1!@#USER_ID 33!@#ACTIVITY_CODE 3
12/23/2022 04:29:14 AM script INFO: SUCCESS!@#KODE 1!@#USER_ID 33!@#ACTIVITY_CODE 2
12/23/2022 04:29:14 AM script INFO: SUCCESS!@#KODE 1!@#USER_ID 33!@#ACTIVITY_CODE 3
12/23/2022 04:29:14 AM script INFO: SUCCESS!@#KODE 1!@#USER_ID 33!@#ACTIVITY_CODE 3
12/23/2022 04:29:14 AM script INFO: SUCCESS!@#KODE 1!@#USER_ID 33!@#ACTIVITY_CODE 2
12/23/2022 04:29:14 AM script INFO: SUCCESS!@#KODE 1!@#USER_ID 33!@#ACTIVITY_CODE 3
12/23/2022 04:29:14 AM script INFO: SUCCESS!@#KODE 1!@#USER_ID 33!@#ACTIVITY_CODE 2
12/23/2022 04:29:14 AM script INFO: SUCCESS!@#KODE 1!@#USER_ID 33!@#ACTIVITY_CODE 3
12/23/2022 04:29:14 AM script INFO: Duration: 33.96527862548828
12/23/2022 04:29:14 AM script INFO: mengakhiri-quiz
12/23/2022 04:29:24 AM script INFO: SUCCESS!@#KODE 1!@#USER_ID 33!@#ACTIVITY_CODE 5
12/23/2022 04:29:24 AM script INFO: berhasil-submit
12/23/2022 04:30:54 AM script ERROR: TIMEOUT EXCEPTION!@#KODE 0!@#LOCATION berhasil-submit
12/23/2022 04:30:54 AM main_worker ERROR: Message: None

