12/23/2022 02:03:35 AM script INFO: Prepared chrome options..
12/23/2022 02:03:37 AM script INFO: Initialized chrome browser..
12/23/2022 02:03:37 AM script INFO: mengakses-homepage
12/23/2022 02:04:06 AM script INFO: mengakses-login-page
12/23/2022 02:04:34 AM script INFO: mengakses-site-home
12/23/2022 02:05:15 AM script INFO: mengakses-site-course
12/23/2022 02:05:16 AM script INFO: mengakses-quiz
12/23/2022 02:06:46 AM script ERROR: TIMEOUT EXCEPTION!@#KODE 0!@#LOCATION mengakses-quiz
12/23/2022 02:06:46 AM main_worker ERROR: Message: None

