12/21/2022 01:47:55 PM script INFO: Prepared chrome options..
12/21/2022 01:47:56 PM script INFO: Initialized chrome browser..
12/21/2022 01:47:56 PM script INFO: mengakses-homepage
12/21/2022 01:48:27 PM script INFO: mengakses-login-page
12/21/2022 01:48:53 PM script INFO: mengakses-site-home
12/21/2022 01:48:57 PM script INFO: mengakses-site-course
12/21/2022 01:49:24 PM script INFO: mengakses-quiz
12/21/2022 01:49:25 PM script INFO: mengakses-start-quiz-page
12/21/2022 01:49:26 PM script INFO: memulai-quiz
12/21/2022 01:49:26 PM script INFO: SUCCESS!@#KODE 1!@#USER_ID 76!@#ACTIVITY_CODE 5
12/21/2022 01:49:37 PM script INFO: SUCCESS!@#KODE 1!@#USER_ID 76!@#ACTIVITY_CODE 2
12/21/2022 01:49:37 PM script INFO: SUCCESS!@#KODE 1!@#USER_ID 76!@#ACTIVITY_CODE 5
12/21/2022 01:49:37 PM script INFO: SUCCESS!@#KODE 1!@#USER_ID 76!@#ACTIVITY_CODE 5
12/21/2022 01:49:39 PM script INFO: SUCCESS!@#KODE 1!@#USER_ID 76!@#ACTIVITY_CODE 2
12/21/2022 01:49:39 PM script INFO: SUCCESS!@#KODE 1!@#USER_ID 76!@#ACTIVITY_CODE 2
12/21/2022 01:49:40 PM script INFO: SUCCESS!@#KODE 1!@#USER_ID 76!@#ACTIVITY_CODE 1
12/21/2022 01:49:40 PM script INFO: SUCCESS!@#KODE 1!@#USER_ID 76!@#ACTIVITY_CODE 4
12/21/2022 01:49:40 PM script INFO: SUCCESS!@#KODE 1!@#USER_ID 76!@#ACTIVITY_CODE 3
12/21/2022 01:49:40 PM script INFO: SUCCESS!@#KODE 1!@#USER_ID 76!@#ACTIVITY_CODE 5
12/21/2022 01:49:40 PM script INFO: SUCCESS!@#KODE 1!@#USER_ID 76!@#ACTIVITY_CODE 5
12/21/2022 01:49:42 PM script INFO: SUCCESS!@#KODE 1!@#USER_ID 76!@#ACTIVITY_CODE 1
12/21/2022 01:49:42 PM script INFO: SUCCESS!@#KODE 1!@#USER_ID 76!@#ACTIVITY_CODE 3
12/21/2022 01:49:42 PM script INFO: SUCCESS!@#KODE 1!@#USER_ID 76!@#ACTIVITY_CODE 5
12/21/2022 01:49:42 PM script INFO: SUCCESS!@#KODE 1!@#USER_ID 76!@#ACTIVITY_CODE 5
12/21/2022 01:49:45 PM script INFO: SUCCESS!@#KODE 1!@#USER_ID 76!@#ACTIVITY_CODE 3
12/21/2022 01:49:45 PM script INFO: SUCCESS!@#KODE 1!@#USER_ID 76!@#ACTIVITY_CODE 3
12/21/2022 01:49:45 PM script INFO: SUCCESS!@#KODE 1!@#USER_ID 76!@#ACTIVITY_CODE 5
12/21/2022 01:49:45 PM script INFO: SUCCESS!@#KODE 1!@#USER_ID 76!@#ACTIVITY_CODE 5
12/21/2022 01:49:48 PM script INFO: SUCCESS!@#KODE 1!@#USER_ID 76!@#ACTIVITY_CODE 1
12/21/2022 01:49:48 PM script INFO: SUCCESS!@#KODE 1!@#USER_ID 76!@#ACTIVITY_CODE 3
12/21/2022 01:49:48 PM script INFO: SUCCESS!@#KODE 1!@#USER_ID 76!@#ACTIVITY_CODE 4
12/21/2022 01:49:48 PM script INFO: SUCCESS!@#KODE 1!@#USER_ID 76!@#ACTIVITY_CODE 2
12/21/2022 01:49:48 PM script INFO: SUCCESS!@#KODE 1!@#USER_ID 76!@#ACTIVITY_CODE 2
12/21/2022 01:49:48 PM script INFO: SUCCESS!@#KODE 1!@#USER_ID 76!@#ACTIVITY_CODE 2
12/21/2022 01:49:48 PM script INFO: SUCCESS!@#KODE 1!@#USER_ID 76!@#ACTIVITY_CODE 1
12/21/2022 01:49:48 PM script INFO: SUCCESS!@#KODE 1!@#USER_ID 76!@#ACTIVITY_CODE 1
12/21/2022 01:49:48 PM script INFO: SUCCESS!@#KODE 1!@#USER_ID 76!@#ACTIVITY_CODE 5
12/21/2022 01:49:48 PM script INFO: SUCCESS!@#KODE 1!@#USER_ID 76!@#ACTIVITY_CODE 5
12/21/2022 01:49:51 PM script INFO: SUCCESS!@#KODE 1!@#USER_ID 76!@#ACTIVITY_CODE 3
12/21/2022 01:49:51 PM script INFO: SUCCESS!@#KODE 1!@#USER_ID 76!@#ACTIVITY_CODE 1
12/21/2022 01:49:51 PM script INFO: SUCCESS!@#KODE 1!@#USER_ID 76!@#ACTIVITY_CODE 1
12/21/2022 01:49:51 PM script INFO: SUCCESS!@#KODE 1!@#USER_ID 76!@#ACTIVITY_CODE 2
12/21/2022 01:49:51 PM script INFO: SUCCESS!@#KODE 1!@#USER_ID 76!@#ACTIVITY_CODE 5
12/21/2022 01:49:51 PM script INFO: SUCCESS!@#KODE 1!@#USER_ID 76!@#ACTIVITY_CODE 5
12/21/2022 01:49:53 PM script INFO: SUCCESS!@#KODE 1!@#USER_ID 76!@#ACTIVITY_CODE 1
12/21/2022 01:49:54 PM script INFO: SUCCESS!@#KODE 1!@#USER_ID 76!@#ACTIVITY_CODE 1
12/21/2022 01:49:54 PM script INFO: SUCCESS!@#KODE 1!@#USER_ID 76!@#ACTIVITY_CODE 2
12/21/2022 01:49:54 PM script INFO: SUCCESS!@#KODE 1!@#USER_ID 76!@#ACTIVITY_CODE 1
12/21/2022 01:49:54 PM script INFO: SUCCESS!@#KODE 1!@#USER_ID 76!@#ACTIVITY_CODE 1
12/21/2022 01:49:54 PM script INFO: SUCCESS!@#KODE 1!@#USER_ID 76!@#ACTIVITY_CODE 1
12/21/2022 01:49:54 PM script INFO: SUCCESS!@#KODE 1!@#USER_ID 76!@#ACTIVITY_CODE 5
12/21/2022 01:49:54 PM script INFO: SUCCESS!@#KODE 1!@#USER_ID 76!@#ACTIVITY_CODE 5
12/21/2022 01:49:56 PM script INFO: SUCCESS!@#KODE 1!@#USER_ID 76!@#ACTIVITY_CODE 2
12/21/2022 01:49:56 PM script INFO: SUCCESS!@#KODE 1!@#USER_ID 76!@#ACTIVITY_CODE 1
12/21/2022 01:49:57 PM script INFO: SUCCESS!@#KODE 1!@#USER_ID 76!@#ACTIVITY_CODE 2
12/21/2022 01:49:57 PM script INFO: SUCCESS!@#KODE 1!@#USER_ID 76!@#ACTIVITY_CODE 5
12/21/2022 01:49:57 PM script INFO: SUCCESS!@#KODE 1!@#USER_ID 76!@#ACTIVITY_CODE 5
12/21/2022 01:49:59 PM script INFO: SUCCESS!@#KODE 1!@#USER_ID 76!@#ACTIVITY_CODE 3
12/21/2022 01:49:59 PM script INFO: SUCCESS!@#KODE 1!@#USER_ID 76!@#ACTIVITY_CODE 1
12/21/2022 01:49:59 PM script INFO: SUCCESS!@#KODE 1!@#USER_ID 76!@#ACTIVITY_CODE 1
12/21/2022 01:49:59 PM script INFO: SUCCESS!@#KODE 1!@#USER_ID 76!@#ACTIVITY_CODE 2
12/21/2022 01:49:59 PM script INFO: SUCCESS!@#KODE 1!@#USER_ID 76!@#ACTIVITY_CODE 5
12/21/2022 01:49:59 PM script INFO: SUCCESS!@#KODE 1!@#USER_ID 76!@#ACTIVITY_CODE 5
12/21/2022 01:50:02 PM script INFO: SUCCESS!@#KODE 1!@#USER_ID 76!@#ACTIVITY_CODE 5
12/21/2022 01:50:02 PM script INFO: SUCCESS!@#KODE 1!@#USER_ID 76!@#ACTIVITY_CODE 5
12/21/2022 01:50:04 PM script INFO: SUCCESS!@#KODE 1!@#USER_ID 76!@#ACTIVITY_CODE 5
12/21/2022 01:50:04 PM script INFO: SUCCESS!@#KODE 1!@#USER_ID 76!@#ACTIVITY_CODE 5
12/21/2022 01:50:07 PM script INFO: SUCCESS!@#KODE 1!@#USER_ID 76!@#ACTIVITY_CODE 3
12/21/2022 01:50:07 PM script INFO: SUCCESS!@#KODE 1!@#USER_ID 76!@#ACTIVITY_CODE 5
12/21/2022 01:50:07 PM script INFO: SUCCESS!@#KODE 1!@#USER_ID 76!@#ACTIVITY_CODE 5
12/21/2022 01:50:10 PM script INFO: SUCCESS!@#KODE 1!@#USER_ID 76!@#ACTIVITY_CODE 1
12/21/2022 01:50:10 PM script INFO: SUCCESS!@#KODE 1!@#USER_ID 76!@#ACTIVITY_CODE 2
12/21/2022 01:50:10 PM script INFO: SUCCESS!@#KODE 1!@#USER_ID 76!@#ACTIVITY_CODE 5
12/21/2022 01:50:10 PM script INFO: SUCCESS!@#KODE 1!@#USER_ID 76!@#ACTIVITY_CODE 5
12/21/2022 01:50:12 PM script INFO: SUCCESS!@#KODE 1!@#USER_ID 76!@#ACTIVITY_CODE 2
12/21/2022 01:50:13 PM script INFO: SUCCESS!@#KODE 1!@#USER_ID 76!@#ACTIVITY_CODE 2
12/21/2022 01:50:13 PM script INFO: SUCCESS!@#KODE 1!@#USER_ID 76!@#ACTIVITY_CODE 3
12/21/2022 01:50:13 PM script INFO: SUCCESS!@#KODE 1!@#USER_ID 76!@#ACTIVITY_CODE 3
12/21/2022 01:50:13 PM script INFO: SUCCESS!@#KODE 1!@#USER_ID 76!@#ACTIVITY_CODE 2
12/21/2022 01:50:13 PM script INFO: SUCCESS!@#KODE 1!@#USER_ID 76!@#ACTIVITY_CODE 2
12/21/2022 01:50:13 PM script INFO: SUCCESS!@#KODE 1!@#USER_ID 76!@#ACTIVITY_CODE 1
12/21/2022 01:50:13 PM script INFO: SUCCESS!@#KODE 1!@#USER_ID 76!@#ACTIVITY_CODE 2
12/21/2022 01:50:13 PM script INFO: SUCCESS!@#KODE 1!@#USER_ID 76!@#ACTIVITY_CODE 3
12/21/2022 01:50:13 PM script INFO: SUCCESS!@#KODE 1!@#USER_ID 76!@#ACTIVITY_CODE 5
12/21/2022 01:50:13 PM script INFO: SUCCESS!@#KODE 1!@#USER_ID 76!@#ACTIVITY_CODE 5
12/21/2022 01:50:16 PM script INFO: SUCCESS!@#KODE 1!@#USER_ID 76!@#ACTIVITY_CODE 5
12/21/2022 01:50:16 PM script INFO: SUCCESS!@#KODE 1!@#USER_ID 76!@#ACTIVITY_CODE 5
12/21/2022 01:50:19 PM script INFO: SUCCESS!@#KODE 1!@#USER_ID 76!@#ACTIVITY_CODE 2
12/21/2022 01:50:19 PM script INFO: SUCCESS!@#KODE 1!@#USER_ID 76!@#ACTIVITY_CODE 5
12/21/2022 01:50:19 PM script INFO: SUCCESS!@#KODE 1!@#USER_ID 76!@#ACTIVITY_CODE 5
12/21/2022 01:50:21 PM script INFO: SUCCESS!@#KODE 1!@#USER_ID 76!@#ACTIVITY_CODE 3
12/21/2022 01:50:21 PM script INFO: SUCCESS!@#KODE 1!@#USER_ID 76!@#ACTIVITY_CODE 2
12/21/2022 01:50:21 PM script INFO: SUCCESS!@#KODE 1!@#USER_ID 76!@#ACTIVITY_CODE 3
12/21/2022 01:50:22 PM script INFO: SUCCESS!@#KODE 1!@#USER_ID 76!@#ACTIVITY_CODE 3
12/21/2022 01:50:22 PM script INFO: SUCCESS!@#KODE 1!@#USER_ID 76!@#ACTIVITY_CODE 2
12/21/2022 01:50:22 PM script INFO: SUCCESS!@#KODE 1!@#USER_ID 76!@#ACTIVITY_CODE 2
12/21/2022 01:50:22 PM script INFO: SUCCESS!@#KODE 1!@#USER_ID 76!@#ACTIVITY_CODE 2
12/21/2022 01:50:22 PM script INFO: SUCCESS!@#KODE 1!@#USER_ID 76!@#ACTIVITY_CODE 3
12/21/2022 01:50:22 PM script INFO: SUCCESS!@#KODE 1!@#USER_ID 76!@#ACTIVITY_CODE 2
12/21/2022 01:50:22 PM script INFO: SUCCESS!@#KODE 1!@#USER_ID 76!@#ACTIVITY_CODE 3
12/21/2022 01:50:23 PM script INFO: SUCCESS!@#KODE 1!@#USER_ID 76!@#ACTIVITY_CODE 1
12/21/2022 01:50:23 PM script INFO: SUCCESS!@#KODE 1!@#USER_ID 76!@#ACTIVITY_CODE 2
12/21/2022 01:50:23 PM script INFO: SUCCESS!@#KODE 1!@#USER_ID 76!@#ACTIVITY_CODE 1
12/21/2022 01:50:23 PM script INFO: SUCCESS!@#KODE 1!@#USER_ID 76!@#ACTIVITY_CODE 3
12/21/2022 01:50:23 PM script INFO: SUCCESS!@#KODE 1!@#USER_ID 76!@#ACTIVITY_CODE 1
12/21/2022 01:50:23 PM script INFO: SUCCESS!@#KODE 1!@#USER_ID 76!@#ACTIVITY_CODE 1
12/21/2022 01:50:23 PM script INFO: SUCCESS!@#KODE 1!@#USER_ID 76!@#ACTIVITY_CODE 1
12/21/2022 01:50:23 PM script INFO: SUCCESS!@#KODE 1!@#USER_ID 76!@#ACTIVITY_CODE 1
12/21/2022 01:50:23 PM script INFO: SUCCESS!@#KODE 1!@#USER_ID 76!@#ACTIVITY_CODE 3
12/21/2022 01:50:23 PM script INFO: SUCCESS!@#KODE 1!@#USER_ID 76!@#ACTIVITY_CODE 1
12/21/2022 01:50:24 PM script INFO: SUCCESS!@#KODE 1!@#USER_ID 76!@#ACTIVITY_CODE 3
12/21/2022 01:50:24 PM script INFO: SUCCESS!@#KODE 1!@#USER_ID 76!@#ACTIVITY_CODE 1
12/21/2022 01:50:24 PM script INFO: SUCCESS!@#KODE 1!@#USER_ID 76!@#ACTIVITY_CODE 1
12/21/2022 01:50:24 PM script INFO: SUCCESS!@#KODE 1!@#USER_ID 76!@#ACTIVITY_CODE 2
12/21/2022 01:50:24 PM script INFO: SUCCESS!@#KODE 1!@#USER_ID 76!@#ACTIVITY_CODE 1
12/21/2022 01:50:24 PM script INFO: SUCCESS!@#KODE 1!@#USER_ID 76!@#ACTIVITY_CODE 4
12/21/2022 01:50:24 PM script INFO: SUCCESS!@#KODE 1!@#USER_ID 76!@#ACTIVITY_CODE 3
12/21/2022 01:50:24 PM script INFO: SUCCESS!@#KODE 1!@#USER_ID 76!@#ACTIVITY_CODE 3
12/21/2022 01:50:25 PM script INFO: SUCCESS!@#KODE 1!@#USER_ID 76!@#ACTIVITY_CODE 2
12/21/2022 01:50:25 PM script INFO: SUCCESS!@#KODE 1!@#USER_ID 76!@#ACTIVITY_CODE 1
12/21/2022 01:50:25 PM script INFO: SUCCESS!@#KODE 1!@#USER_ID 76!@#ACTIVITY_CODE 3
12/21/2022 01:50:25 PM script INFO: SUCCESS!@#KODE 1!@#USER_ID 76!@#ACTIVITY_CODE 3
12/21/2022 01:50:25 PM script INFO: SUCCESS!@#KODE 1!@#USER_ID 76!@#ACTIVITY_CODE 2
12/21/2022 01:50:25 PM script INFO: SUCCESS!@#KODE 1!@#USER_ID 76!@#ACTIVITY_CODE 3
12/21/2022 01:50:25 PM script INFO: SUCCESS!@#KODE 1!@#USER_ID 76!@#ACTIVITY_CODE 1
12/21/2022 01:50:25 PM script INFO: SUCCESS!@#KODE 1!@#USER_ID 76!@#ACTIVITY_CODE 3
12/21/2022 01:50:26 PM script INFO: SUCCESS!@#KODE 1!@#USER_ID 76!@#ACTIVITY_CODE 2
12/21/2022 01:50:26 PM script INFO: SUCCESS!@#KODE 1!@#USER_ID 76!@#ACTIVITY_CODE 1
12/21/2022 01:50:26 PM script INFO: SUCCESS!@#KODE 1!@#USER_ID 76!@#ACTIVITY_CODE 2
12/21/2022 01:50:26 PM script INFO: SUCCESS!@#KODE 1!@#USER_ID 76!@#ACTIVITY_CODE 2
12/21/2022 01:50:26 PM script INFO: SUCCESS!@#KODE 1!@#USER_ID 76!@#ACTIVITY_CODE 1
12/21/2022 01:50:27 PM script INFO: SUCCESS!@#KODE 1!@#USER_ID 76!@#ACTIVITY_CODE 2
12/21/2022 01:50:27 PM script INFO: SUCCESS!@#KODE 1!@#USER_ID 76!@#ACTIVITY_CODE 1
12/21/2022 01:50:27 PM script INFO: SUCCESS!@#KODE 1!@#USER_ID 76!@#ACTIVITY_CODE 2
12/21/2022 01:50:27 PM script INFO: SUCCESS!@#KODE 1!@#USER_ID 76!@#ACTIVITY_CODE 1
12/21/2022 01:50:27 PM script INFO: SUCCESS!@#KODE 1!@#USER_ID 76!@#ACTIVITY_CODE 2
12/21/2022 01:50:28 PM script INFO: SUCCESS!@#KODE 1!@#USER_ID 76!@#ACTIVITY_CODE 3
12/21/2022 01:50:28 PM script INFO: SUCCESS!@#KODE 1!@#USER_ID 76!@#ACTIVITY_CODE 3
12/21/2022 01:50:28 PM script INFO: SUCCESS!@#KODE 1!@#USER_ID 76!@#ACTIVITY_CODE 4
12/21/2022 01:50:28 PM script INFO: SUCCESS!@#KODE 1!@#USER_ID 76!@#ACTIVITY_CODE 3
12/21/2022 01:50:28 PM script INFO: SUCCESS!@#KODE 1!@#USER_ID 76!@#ACTIVITY_CODE 1
12/21/2022 01:50:28 PM script INFO: SUCCESS!@#KODE 1!@#USER_ID 76!@#ACTIVITY_CODE 4
12/21/2022 01:50:28 PM script INFO: SUCCESS!@#KODE 1!@#USER_ID 76!@#ACTIVITY_CODE 2
12/21/2022 01:50:29 PM script INFO: SUCCESS!@#KODE 1!@#USER_ID 76!@#ACTIVITY_CODE 4
12/21/2022 01:50:29 PM script INFO: SUCCESS!@#KODE 1!@#USER_ID 76!@#ACTIVITY_CODE 1
12/21/2022 01:50:29 PM script INFO: SUCCESS!@#KODE 1!@#USER_ID 76!@#ACTIVITY_CODE 2
12/21/2022 01:50:29 PM script INFO: SUCCESS!@#KODE 1!@#USER_ID 76!@#ACTIVITY_CODE 1
12/21/2022 01:50:29 PM script INFO: SUCCESS!@#KODE 1!@#USER_ID 76!@#ACTIVITY_CODE 1
12/21/2022 01:50:29 PM script INFO: SUCCESS!@#KODE 1!@#USER_ID 76!@#ACTIVITY_CODE 4
12/21/2022 01:50:29 PM script INFO: SUCCESS!@#KODE 1!@#USER_ID 76!@#ACTIVITY_CODE 3
12/21/2022 01:50:30 PM script INFO: SUCCESS!@#KODE 1!@#USER_ID 76!@#ACTIVITY_CODE 3
12/21/2022 01:50:30 PM script INFO: SUCCESS!@#KODE 1!@#USER_ID 76!@#ACTIVITY_CODE 2
12/21/2022 01:50:30 PM script INFO: SUCCESS!@#KODE 1!@#USER_ID 76!@#ACTIVITY_CODE 2
12/21/2022 01:50:30 PM script INFO: SUCCESS!@#KODE 1!@#USER_ID 76!@#ACTIVITY_CODE 3
12/21/2022 01:50:30 PM script INFO: SUCCESS!@#KODE 1!@#USER_ID 76!@#ACTIVITY_CODE 2
12/21/2022 01:50:31 PM script INFO: SUCCESS!@#KODE 1!@#USER_ID 76!@#ACTIVITY_CODE 2
12/21/2022 01:50:31 PM script INFO: SUCCESS!@#KODE 1!@#USER_ID 76!@#ACTIVITY_CODE 4
12/21/2022 01:50:31 PM script INFO: SUCCESS!@#KODE 1!@#USER_ID 76!@#ACTIVITY_CODE 2
12/21/2022 01:50:31 PM script INFO: SUCCESS!@#KODE 1!@#USER_ID 76!@#ACTIVITY_CODE 1
12/21/2022 01:50:32 PM script INFO: SUCCESS!@#KODE 1!@#USER_ID 76!@#ACTIVITY_CODE 2
12/21/2022 01:50:32 PM script INFO: SUCCESS!@#KODE 1!@#USER_ID 76!@#ACTIVITY_CODE 2
12/21/2022 01:50:32 PM script INFO: SUCCESS!@#KODE 1!@#USER_ID 76!@#ACTIVITY_CODE 3
12/21/2022 01:50:32 PM script INFO: SUCCESS!@#KODE 1!@#USER_ID 76!@#ACTIVITY_CODE 2
12/21/2022 01:50:33 PM script INFO: SUCCESS!@#KODE 1!@#USER_ID 76!@#ACTIVITY_CODE 2
12/21/2022 01:50:33 PM script INFO: SUCCESS!@#KODE 1!@#USER_ID 76!@#ACTIVITY_CODE 3
12/21/2022 01:50:33 PM script INFO: SUCCESS!@#KODE 1!@#USER_ID 76!@#ACTIVITY_CODE 3
12/21/2022 01:50:33 PM script INFO: SUCCESS!@#KODE 1!@#USER_ID 76!@#ACTIVITY_CODE 1
12/21/2022 01:50:33 PM script INFO: SUCCESS!@#KODE 1!@#USER_ID 76!@#ACTIVITY_CODE 1
12/21/2022 01:50:33 PM script INFO: SUCCESS!@#KODE 1!@#USER_ID 76!@#ACTIVITY_CODE 1
12/21/2022 01:50:34 PM script INFO: SUCCESS!@#KODE 1!@#USER_ID 76!@#ACTIVITY_CODE 4
12/21/2022 01:50:34 PM script INFO: SUCCESS!@#KODE 1!@#USER_ID 76!@#ACTIVITY_CODE 1
12/21/2022 01:50:34 PM script INFO: SUCCESS!@#KODE 1!@#USER_ID 76!@#ACTIVITY_CODE 3
12/21/2022 01:50:34 PM script INFO: SUCCESS!@#KODE 1!@#USER_ID 76!@#ACTIVITY_CODE 4
12/21/2022 01:50:34 PM script INFO: SUCCESS!@#KODE 1!@#USER_ID 76!@#ACTIVITY_CODE 1
12/21/2022 01:50:34 PM script INFO: SUCCESS!@#KODE 1!@#USER_ID 76!@#ACTIVITY_CODE 4
12/21/2022 01:50:34 PM script INFO: SUCCESS!@#KODE 1!@#USER_ID 76!@#ACTIVITY_CODE 1
12/21/2022 01:50:35 PM script INFO: SUCCESS!@#KODE 1!@#USER_ID 76!@#ACTIVITY_CODE 2
12/21/2022 01:50:35 PM script INFO: SUCCESS!@#KODE 1!@#USER_ID 76!@#ACTIVITY_CODE 1
12/21/2022 01:50:35 PM script INFO: SUCCESS!@#KODE 1!@#USER_ID 76!@#ACTIVITY_CODE 1
12/21/2022 01:50:35 PM script INFO: SUCCESS!@#KODE 1!@#USER_ID 76!@#ACTIVITY_CODE 4
12/21/2022 01:50:35 PM script INFO: SUCCESS!@#KODE 1!@#USER_ID 76!@#ACTIVITY_CODE 3
12/21/2022 01:50:35 PM script INFO: SUCCESS!@#KODE 1!@#USER_ID 76!@#ACTIVITY_CODE 2
12/21/2022 01:50:35 PM script INFO: SUCCESS!@#KODE 1!@#USER_ID 76!@#ACTIVITY_CODE 1
12/21/2022 01:50:36 PM script INFO: SUCCESS!@#KODE 1!@#USER_ID 76!@#ACTIVITY_CODE 2
12/21/2022 01:50:36 PM script INFO: SUCCESS!@#KODE 1!@#USER_ID 76!@#ACTIVITY_CODE 2
12/21/2022 01:50:36 PM script INFO: SUCCESS!@#KODE 1!@#USER_ID 76!@#ACTIVITY_CODE 2
12/21/2022 01:50:36 PM script INFO: SUCCESS!@#KODE 1!@#USER_ID 76!@#ACTIVITY_CODE 1
12/21/2022 01:50:37 PM script INFO: SUCCESS!@#KODE 1!@#USER_ID 76!@#ACTIVITY_CODE 1
12/21/2022 01:50:37 PM script INFO: SUCCESS!@#KODE 1!@#USER_ID 76!@#ACTIVITY_CODE 2
12/21/2022 01:50:37 PM script INFO: SUCCESS!@#KODE 1!@#USER_ID 76!@#ACTIVITY_CODE 1
12/21/2022 01:50:37 PM script INFO: SUCCESS!@#KODE 1!@#USER_ID 76!@#ACTIVITY_CODE 4
12/21/2022 01:50:37 PM script INFO: SUCCESS!@#KODE 1!@#USER_ID 76!@#ACTIVITY_CODE 1
12/21/2022 01:50:37 PM script INFO: SUCCESS!@#KODE 1!@#USER_ID 76!@#ACTIVITY_CODE 3
12/21/2022 01:50:38 PM script INFO: SUCCESS!@#KODE 1!@#USER_ID 76!@#ACTIVITY_CODE 2
12/21/2022 01:50:38 PM script INFO: SUCCESS!@#KODE 1!@#USER_ID 76!@#ACTIVITY_CODE 4
12/21/2022 01:50:38 PM script INFO: SUCCESS!@#KODE 1!@#USER_ID 76!@#ACTIVITY_CODE 2
12/21/2022 01:50:38 PM script INFO: SUCCESS!@#KODE 1!@#USER_ID 76!@#ACTIVITY_CODE 1
12/21/2022 01:50:39 PM script INFO: SUCCESS!@#KODE 1!@#USER_ID 76!@#ACTIVITY_CODE 4
12/21/2022 01:50:39 PM script INFO: SUCCESS!@#KODE 1!@#USER_ID 76!@#ACTIVITY_CODE 2
12/21/2022 01:50:39 PM script INFO: SUCCESS!@#KODE 1!@#USER_ID 76!@#ACTIVITY_CODE 1
12/21/2022 01:50:39 PM script INFO: SUCCESS!@#KODE 1!@#USER_ID 76!@#ACTIVITY_CODE 1
12/21/2022 01:50:39 PM script INFO: SUCCESS!@#KODE 1!@#USER_ID 76!@#ACTIVITY_CODE 4
12/21/2022 01:50:40 PM script INFO: SUCCESS!@#KODE 1!@#USER_ID 76!@#ACTIVITY_CODE 2
12/21/2022 01:50:40 PM script INFO: SUCCESS!@#KODE 1!@#USER_ID 76!@#ACTIVITY_CODE 2
12/21/2022 01:50:40 PM script INFO: SUCCESS!@#KODE 1!@#USER_ID 76!@#ACTIVITY_CODE 2
12/21/2022 01:50:41 PM script INFO: SUCCESS!@#KODE 1!@#USER_ID 76!@#ACTIVITY_CODE 2
12/21/2022 01:50:41 PM script INFO: SUCCESS!@#KODE 1!@#USER_ID 76!@#ACTIVITY_CODE 1
12/21/2022 01:50:41 PM script INFO: SUCCESS!@#KODE 1!@#USER_ID 76!@#ACTIVITY_CODE 1
12/21/2022 01:50:41 PM script INFO: SUCCESS!@#KODE 1!@#USER_ID 76!@#ACTIVITY_CODE 4
12/21/2022 01:50:41 PM script INFO: SUCCESS!@#KODE 1!@#USER_ID 76!@#ACTIVITY_CODE 3
12/21/2022 01:50:41 PM script INFO: SUCCESS!@#KODE 1!@#USER_ID 76!@#ACTIVITY_CODE 1
12/21/2022 01:50:42 PM script INFO: SUCCESS!@#KODE 1!@#USER_ID 76!@#ACTIVITY_CODE 2
12/21/2022 01:50:42 PM script INFO: SUCCESS!@#KODE 1!@#USER_ID 76!@#ACTIVITY_CODE 1
12/21/2022 01:50:42 PM script INFO: SUCCESS!@#KODE 1!@#USER_ID 76!@#ACTIVITY_CODE 1
12/21/2022 01:50:42 PM script INFO: SUCCESS!@#KODE 1!@#USER_ID 76!@#ACTIVITY_CODE 2
12/21/2022 01:50:42 PM script INFO: SUCCESS!@#KODE 1!@#USER_ID 76!@#ACTIVITY_CODE 1
12/21/2022 01:50:42 PM script INFO: SUCCESS!@#KODE 1!@#USER_ID 76!@#ACTIVITY_CODE 1
12/21/2022 01:50:43 PM script INFO: SUCCESS!@#KODE 1!@#USER_ID 76!@#ACTIVITY_CODE 2
12/21/2022 01:50:43 PM script INFO: SUCCESS!@#KODE 1!@#USER_ID 76!@#ACTIVITY_CODE 1
12/21/2022 01:50:43 PM script INFO: SUCCESS!@#KODE 1!@#USER_ID 76!@#ACTIVITY_CODE 1
12/21/2022 01:50:43 PM script INFO: SUCCESS!@#KODE 1!@#USER_ID 76!@#ACTIVITY_CODE 1
12/21/2022 01:50:43 PM script INFO: SUCCESS!@#KODE 1!@#USER_ID 76!@#ACTIVITY_CODE 1
12/21/2022 01:50:43 PM script INFO: SUCCESS!@#KODE 1!@#USER_ID 76!@#ACTIVITY_CODE 3
12/21/2022 01:50:43 PM script INFO: SUCCESS!@#KODE 1!@#USER_ID 76!@#ACTIVITY_CODE 1
12/21/2022 01:50:44 PM script INFO: SUCCESS!@#KODE 1!@#USER_ID 76!@#ACTIVITY_CODE 2
12/21/2022 01:50:44 PM script INFO: SUCCESS!@#KODE 1!@#USER_ID 76!@#ACTIVITY_CODE 2
12/21/2022 01:50:44 PM script INFO: SUCCESS!@#KODE 1!@#USER_ID 76!@#ACTIVITY_CODE 4
12/21/2022 01:50:44 PM script INFO: SUCCESS!@#KODE 1!@#USER_ID 76!@#ACTIVITY_CODE 2
12/21/2022 01:50:44 PM script INFO: SUCCESS!@#KODE 1!@#USER_ID 76!@#ACTIVITY_CODE 1
12/21/2022 01:50:45 PM script INFO: SUCCESS!@#KODE 1!@#USER_ID 76!@#ACTIVITY_CODE 2
12/21/2022 01:50:45 PM script INFO: SUCCESS!@#KODE 1!@#USER_ID 76!@#ACTIVITY_CODE 2
12/21/2022 01:50:45 PM script INFO: SUCCESS!@#KODE 1!@#USER_ID 76!@#ACTIVITY_CODE 2
12/21/2022 01:50:45 PM script INFO: SUCCESS!@#KODE 1!@#USER_ID 76!@#ACTIVITY_CODE 3
12/21/2022 01:50:46 PM script INFO: SUCCESS!@#KODE 1!@#USER_ID 76!@#ACTIVITY_CODE 2
12/21/2022 01:50:46 PM script INFO: SUCCESS!@#KODE 1!@#USER_ID 76!@#ACTIVITY_CODE 3
12/21/2022 01:50:46 PM script INFO: SUCCESS!@#KODE 1!@#USER_ID 76!@#ACTIVITY_CODE 3
12/21/2022 01:50:46 PM script INFO: SUCCESS!@#KODE 1!@#USER_ID 76!@#ACTIVITY_CODE 1
12/21/2022 01:50:46 PM script INFO: SUCCESS!@#KODE 1!@#USER_ID 76!@#ACTIVITY_CODE 3
12/21/2022 01:50:46 PM script INFO: SUCCESS!@#KODE 1!@#USER_ID 76!@#ACTIVITY_CODE 2
12/21/2022 01:50:46 PM script INFO: SUCCESS!@#KODE 1!@#USER_ID 76!@#ACTIVITY_CODE 3
12/21/2022 01:50:47 PM script INFO: SUCCESS!@#KODE 1!@#USER_ID 76!@#ACTIVITY_CODE 3
12/21/2022 01:50:47 PM script INFO: SUCCESS!@#KODE 1!@#USER_ID 76!@#ACTIVITY_CODE 1
12/21/2022 01:50:47 PM script INFO: SUCCESS!@#KODE 1!@#USER_ID 76!@#ACTIVITY_CODE 1
12/21/2022 01:50:47 PM script INFO: SUCCESS!@#KODE 1!@#USER_ID 76!@#ACTIVITY_CODE 3
12/21/2022 01:50:47 PM script INFO: SUCCESS!@#KODE 1!@#USER_ID 76!@#ACTIVITY_CODE 1
12/21/2022 01:50:47 PM script INFO: SUCCESS!@#KODE 1!@#USER_ID 76!@#ACTIVITY_CODE 4
12/21/2022 01:50:48 PM script INFO: SUCCESS!@#KODE 1!@#USER_ID 76!@#ACTIVITY_CODE 2
12/21/2022 01:50:48 PM script INFO: SUCCESS!@#KODE 1!@#USER_ID 76!@#ACTIVITY_CODE 2
12/21/2022 01:50:48 PM script INFO: SUCCESS!@#KODE 1!@#USER_ID 76!@#ACTIVITY_CODE 3
12/21/2022 01:50:48 PM script INFO: SUCCESS!@#KODE 1!@#USER_ID 76!@#ACTIVITY_CODE 4
12/21/2022 01:50:48 PM script INFO: SUCCESS!@#KODE 1!@#USER_ID 76!@#ACTIVITY_CODE 2
12/21/2022 01:50:49 PM script INFO: SUCCESS!@#KODE 1!@#USER_ID 76!@#ACTIVITY_CODE 2
12/21/2022 01:50:49 PM script INFO: SUCCESS!@#KODE 1!@#USER_ID 76!@#ACTIVITY_CODE 2
12/21/2022 01:50:49 PM script INFO: SUCCESS!@#KODE 1!@#USER_ID 76!@#ACTIVITY_CODE 3
12/21/2022 01:50:49 PM script INFO: SUCCESS!@#KODE 1!@#USER_ID 76!@#ACTIVITY_CODE 1
12/21/2022 01:50:49 PM script INFO: SUCCESS!@#KODE 1!@#USER_ID 76!@#ACTIVITY_CODE 3
12/21/2022 01:50:49 PM script INFO: SUCCESS!@#KODE 1!@#USER_ID 76!@#ACTIVITY_CODE 3
12/21/2022 01:50:49 PM script INFO: SUCCESS!@#KODE 1!@#USER_ID 76!@#ACTIVITY_CODE 1
12/21/2022 01:50:49 PM script INFO: Duration: 72.76651549339294
12/21/2022 01:50:49 PM script INFO: mengakhiri-quiz
12/21/2022 01:51:09 PM script INFO: SUCCESS!@#KODE 1!@#USER_ID 76!@#ACTIVITY_CODE 5
12/21/2022 01:51:09 PM script INFO: berhasil-submit
