12/11/2022 03:05:19 PM script INFO: Prepared chrome options..
12/11/2022 03:05:20 PM script INFO: Initialized chrome browser..
12/11/2022 03:05:20 PM script INFO: mengakses-homepage
12/11/2022 03:05:37 PM script INFO: mengakses-login-page
12/11/2022 03:05:39 PM script INFO: mengakses-site-home
12/11/2022 03:05:40 PM script INFO: mengakses-site-course
12/11/2022 03:05:42 PM script INFO: mengakses-quiz
12/11/2022 03:05:44 PM script INFO: mengakses-start-quiz-page
12/11/2022 03:05:47 PM script INFO: memulai-quiz
12/11/2022 03:05:47 PM script INFO: SUCCESS!@#KODE 1!@#USER_ID 47!@#ACTIVITY_CODE 5
12/11/2022 03:05:57 PM script INFO: SUCCESS!@#KODE 1!@#USER_ID 47!@#ACTIVITY_CODE 5
12/11/2022 03:05:57 PM script INFO: SUCCESS!@#KODE 1!@#USER_ID 47!@#ACTIVITY_CODE 5
12/11/2022 03:06:00 PM script INFO: SUCCESS!@#KODE 1!@#USER_ID 47!@#ACTIVITY_CODE 3
12/11/2022 03:06:00 PM script INFO: SUCCESS!@#KODE 1!@#USER_ID 47!@#ACTIVITY_CODE 5
12/11/2022 03:06:00 PM script INFO: SUCCESS!@#KODE 1!@#USER_ID 47!@#ACTIVITY_CODE 5
12/11/2022 03:06:02 PM script INFO: SUCCESS!@#KODE 1!@#USER_ID 47!@#ACTIVITY_CODE 5
12/11/2022 03:06:02 PM script INFO: SUCCESS!@#KODE 1!@#USER_ID 47!@#ACTIVITY_CODE 5
12/11/2022 03:06:05 PM script INFO: SUCCESS!@#KODE 1!@#USER_ID 47!@#ACTIVITY_CODE 3
12/11/2022 03:06:05 PM script INFO: SUCCESS!@#KODE 1!@#USER_ID 47!@#ACTIVITY_CODE 5
12/11/2022 03:06:05 PM script INFO: SUCCESS!@#KODE 1!@#USER_ID 47!@#ACTIVITY_CODE 5
12/11/2022 03:06:07 PM script INFO: SUCCESS!@#KODE 1!@#USER_ID 47!@#ACTIVITY_CODE 5
12/11/2022 03:06:07 PM script INFO: SUCCESS!@#KODE 1!@#USER_ID 47!@#ACTIVITY_CODE 5
12/11/2022 03:06:10 PM script INFO: SUCCESS!@#KODE 1!@#USER_ID 47!@#ACTIVITY_CODE 2
12/11/2022 03:06:10 PM script INFO: SUCCESS!@#KODE 1!@#USER_ID 47!@#ACTIVITY_CODE 3
12/11/2022 03:06:10 PM script INFO: SUCCESS!@#KODE 1!@#USER_ID 47!@#ACTIVITY_CODE 5
12/11/2022 03:06:10 PM script INFO: SUCCESS!@#KODE 1!@#USER_ID 47!@#ACTIVITY_CODE 5
12/11/2022 03:06:13 PM script INFO: SUCCESS!@#KODE 1!@#USER_ID 47!@#ACTIVITY_CODE 1
12/11/2022 03:06:13 PM script INFO: SUCCESS!@#KODE 1!@#USER_ID 47!@#ACTIVITY_CODE 2
12/11/2022 03:06:13 PM script INFO: SUCCESS!@#KODE 1!@#USER_ID 47!@#ACTIVITY_CODE 2
12/11/2022 03:06:13 PM script INFO: SUCCESS!@#KODE 1!@#USER_ID 47!@#ACTIVITY_CODE 2
12/11/2022 03:06:13 PM script INFO: SUCCESS!@#KODE 1!@#USER_ID 47!@#ACTIVITY_CODE 2
12/11/2022 03:06:13 PM script INFO: SUCCESS!@#KODE 1!@#USER_ID 47!@#ACTIVITY_CODE 1
12/11/2022 03:06:13 PM script INFO: SUCCESS!@#KODE 1!@#USER_ID 47!@#ACTIVITY_CODE 1
12/11/2022 03:06:14 PM script INFO: SUCCESS!@#KODE 1!@#USER_ID 47!@#ACTIVITY_CODE 3
12/11/2022 03:06:14 PM script INFO: SUCCESS!@#KODE 1!@#USER_ID 47!@#ACTIVITY_CODE 2
12/11/2022 03:06:14 PM script INFO: SUCCESS!@#KODE 1!@#USER_ID 47!@#ACTIVITY_CODE 3
12/11/2022 03:06:14 PM script INFO: SUCCESS!@#KODE 1!@#USER_ID 47!@#ACTIVITY_CODE 1
12/11/2022 03:06:14 PM script INFO: SUCCESS!@#KODE 1!@#USER_ID 47!@#ACTIVITY_CODE 4
12/11/2022 03:06:14 PM script INFO: SUCCESS!@#KODE 1!@#USER_ID 47!@#ACTIVITY_CODE 1
12/11/2022 03:06:14 PM script INFO: SUCCESS!@#KODE 1!@#USER_ID 47!@#ACTIVITY_CODE 4
12/11/2022 03:06:14 PM script INFO: SUCCESS!@#KODE 1!@#USER_ID 47!@#ACTIVITY_CODE 3
12/11/2022 03:06:14 PM script INFO: SUCCESS!@#KODE 1!@#USER_ID 47!@#ACTIVITY_CODE 3
12/11/2022 03:06:14 PM script INFO: SUCCESS!@#KODE 1!@#USER_ID 47!@#ACTIVITY_CODE 2
12/11/2022 03:06:14 PM script INFO: SUCCESS!@#KODE 1!@#USER_ID 47!@#ACTIVITY_CODE 1
12/11/2022 03:06:14 PM script INFO: SUCCESS!@#KODE 1!@#USER_ID 47!@#ACTIVITY_CODE 1
12/11/2022 03:06:14 PM script INFO: SUCCESS!@#KODE 1!@#USER_ID 47!@#ACTIVITY_CODE 3
12/11/2022 03:06:14 PM script INFO: SUCCESS!@#KODE 1!@#USER_ID 47!@#ACTIVITY_CODE 1
12/11/2022 03:06:14 PM script INFO: SUCCESS!@#KODE 1!@#USER_ID 47!@#ACTIVITY_CODE 1
12/11/2022 03:06:15 PM script INFO: SUCCESS!@#KODE 1!@#USER_ID 47!@#ACTIVITY_CODE 4
12/11/2022 03:06:15 PM script INFO: SUCCESS!@#KODE 1!@#USER_ID 47!@#ACTIVITY_CODE 1
12/11/2022 03:06:15 PM script INFO: SUCCESS!@#KODE 1!@#USER_ID 47!@#ACTIVITY_CODE 1
12/11/2022 03:06:15 PM script INFO: SUCCESS!@#KODE 1!@#USER_ID 47!@#ACTIVITY_CODE 1
12/11/2022 03:06:15 PM script INFO: SUCCESS!@#KODE 1!@#USER_ID 47!@#ACTIVITY_CODE 4
12/11/2022 03:06:15 PM script INFO: SUCCESS!@#KODE 1!@#USER_ID 47!@#ACTIVITY_CODE 3
12/11/2022 03:06:15 PM script INFO: SUCCESS!@#KODE 1!@#USER_ID 47!@#ACTIVITY_CODE 1
12/11/2022 03:06:15 PM script INFO: SUCCESS!@#KODE 1!@#USER_ID 47!@#ACTIVITY_CODE 2
12/11/2022 03:06:15 PM script INFO: SUCCESS!@#KODE 1!@#USER_ID 47!@#ACTIVITY_CODE 2
12/11/2022 03:06:15 PM script INFO: SUCCESS!@#KODE 1!@#USER_ID 47!@#ACTIVITY_CODE 1
12/11/2022 03:06:15 PM script INFO: Duration: 17.9740469455719
12/11/2022 03:06:15 PM script INFO: mengakhiri-quiz
12/11/2022 03:06:25 PM script INFO: SUCCESS!@#KODE 1!@#USER_ID 47!@#ACTIVITY_CODE 5
12/11/2022 03:06:25 PM script INFO: berhasil-submit
