Nmap scan report for 10.96.0.1
Nmap scan report for 10.96.0.2
Nmap scan report for 10.96.0.3
Nmap scan report for 10.96.0.5
Nmap scan report for 10.96.0.6
Nmap scan report for 10.96.0.7
Nmap scan report for kube-dns-7d5998784c-hj55f (10.96.0.8)
Nmap scan report for 10.96.0.9
Nmap scan report for 10.96.0.10
Nmap scan report for 10.96.0.11
Nmap scan report for 10.96.0.12
Nmap scan report for 10.96.0.13
Nmap scan report for 10.96.0.14
Nmap scan report for 10.96.0.15
Nmap scan report for 10.96.0.16
Nmap scan report for 10.96.0.17
Nmap scan report for 10.96.0.18
Nmap scan report for 10.96.0.19
Nmap scan report for 10.96.0.20
Nmap scan report for 10.96.0.21
Nmap scan report for 10.96.0.22
Nmap scan report for 10.96.0.23
Nmap scan report for 10.96.0.24
Nmap scan report for 10.96.0.25
Nmap scan report for 10.96.0.26
Nmap scan report for 10.96.0.27
Nmap scan report for 10.96.0.28
Nmap scan report for 10.96.0.29
Nmap scan report for 10.96.0.30
Nmap scan report for 10.96.0.31
Nmap scan report for 10.96.0.32
Nmap scan report for 10.96.0.33
Nmap scan report for 10.96.0.34
Nmap scan report for 10.96.0.35
Nmap scan report for 10.96.0.36
Nmap scan report for 10.96.0.37
Nmap scan report for 10.96.0.38
Nmap scan report for 10.96.0.39
Nmap scan report for 10.96.0.40
Nmap scan report for 10.96.0.41
Nmap scan report for 10.96.0.42
Nmap scan report for 10.96.0.43
Nmap scan report for 10.96.0.44
Nmap scan report for 10.96.0.45
Nmap scan report for 10.96.0.46
Nmap scan report for 10.96.0.47
Nmap scan report for 10.96.0.48
Nmap scan report for 10.96.0.49
Nmap scan report for 10.96.0.50
Nmap scan report for 10.96.0.51
Nmap scan report for 10.96.0.52
Nmap scan report for 10.96.0.53
Nmap scan report for 10.96.1.2
Nmap scan report for 10.96.1.3
Nmap scan report for 10.96.1.4
Nmap scan report for 10.96.1.5
Nmap scan report for 10.96.1.7
Nmap scan report for 10.96.1.8
Nmap scan report for 10.96.1.9
Nmap scan report for 10.96.1.10
Nmap scan report for 10.96.1.11
Nmap scan report for 10.96.1.12
Nmap scan report for 10.96.1.13
Nmap scan report for 10.96.1.14
Nmap scan report for 10.96.1.15
Nmap scan report for 10.96.1.16
Nmap scan report for 10.96.1.17
Nmap scan report for 10.96.1.18
Nmap scan report for 10.96.1.19
Nmap scan report for 10.96.1.20
Nmap scan report for 10.96.1.21
Nmap scan report for 10.96.1.22
Nmap scan report for 10.96.1.23
Nmap scan report for 10.96.1.24
Nmap scan report for 10.96.1.25
Nmap scan report for 10.96.1.26
Nmap scan report for 10.96.1.27
Nmap scan report for 10.96.1.28
Nmap scan report for 10.96.1.29
Nmap scan report for 10.96.1.30
Nmap scan report for 10.96.1.31
Nmap scan report for 10.96.1.32
Nmap scan report for 10.96.1.33
Nmap scan report for 10.96.1.34
Nmap scan report for 10.96.1.35
Nmap scan report for 10.96.1.36
Nmap scan report for 10.96.1.37
Nmap scan report for 10.96.1.38
Nmap scan report for 10.96.1.39
Nmap scan report for 10.96.1.40
Nmap scan report for 10.96.1.41
Nmap scan report for 10.96.1.42
Nmap scan report for 10.96.1.43
Nmap scan report for 10.96.1.44
Nmap scan report for 10.96.1.45
Nmap scan report for 10.96.1.46
Nmap scan report for 10.96.1.47
Nmap scan report for 10.96.1.48
Nmap scan report for 10.96.1.49
Nmap scan report for 10.96.1.50
Nmap scan report for 10.96.1.51
Nmap scan report for 10.96.1.52
Nmap scan report for 10.96.1.53
Nmap scan report for 10.96.1.54
Nmap scan report for 10.96.1.55
Nmap scan report for 10.96.1.56
Nmap scan report for 10.96.1.57
Nmap scan report for 10.96.1.58
Nmap scan report for 10.96.1.59
Nmap scan report for 10.96.1.60
Nmap scan report for 10.96.1.1
Nmap scan report for master-749c9cdf74-q9qx6 (10.96.1.6)
