12/11/2022 03:52:31 PM script INFO: Prepared chrome options..
12/11/2022 03:52:32 PM script INFO: Initialized chrome browser..
12/11/2022 03:52:32 PM script INFO: mengakses-homepage
12/11/2022 03:52:39 PM script INFO: mengakses-login-page
12/11/2022 03:52:41 PM script INFO: mengakses-site-home
12/11/2022 03:53:00 PM script INFO: mengakses-site-course
12/11/2022 03:53:16 PM script INFO: mengakses-quiz
12/11/2022 03:53:16 PM script INFO: mengakses-start-quiz-page
12/11/2022 03:53:18 PM script INFO: memulai-quiz
12/11/2022 03:53:18 PM script INFO: SUCCESS!@#KODE 1!@#USER_ID 24!@#ACTIVITY_CODE 5
12/11/2022 03:53:29 PM script INFO: SUCCESS!@#KODE 1!@#USER_ID 24!@#ACTIVITY_CODE 1
12/11/2022 03:53:29 PM script INFO: SUCCESS!@#KODE 1!@#USER_ID 24!@#ACTIVITY_CODE 4
12/11/2022 03:53:29 PM script INFO: SUCCESS!@#KODE 1!@#USER_ID 24!@#ACTIVITY_CODE 1
12/11/2022 03:53:29 PM script INFO: SUCCESS!@#KODE 1!@#USER_ID 24!@#ACTIVITY_CODE 5
12/11/2022 03:53:29 PM script INFO: SUCCESS!@#KODE 1!@#USER_ID 24!@#ACTIVITY_CODE 5
12/11/2022 03:53:31 PM script INFO: SUCCESS!@#KODE 1!@#USER_ID 24!@#ACTIVITY_CODE 4
12/11/2022 03:53:32 PM script INFO: SUCCESS!@#KODE 1!@#USER_ID 24!@#ACTIVITY_CODE 3
12/11/2022 03:53:32 PM script INFO: SUCCESS!@#KODE 1!@#USER_ID 24!@#ACTIVITY_CODE 1
12/11/2022 03:53:32 PM script INFO: SUCCESS!@#KODE 1!@#USER_ID 24!@#ACTIVITY_CODE 1
12/11/2022 03:53:32 PM script INFO: SUCCESS!@#KODE 1!@#USER_ID 24!@#ACTIVITY_CODE 4
12/11/2022 03:53:32 PM script INFO: SUCCESS!@#KODE 1!@#USER_ID 24!@#ACTIVITY_CODE 5
12/11/2022 03:53:32 PM script INFO: SUCCESS!@#KODE 1!@#USER_ID 24!@#ACTIVITY_CODE 5
12/11/2022 03:53:34 PM script INFO: SUCCESS!@#KODE 1!@#USER_ID 24!@#ACTIVITY_CODE 5
12/11/2022 03:53:34 PM script INFO: SUCCESS!@#KODE 1!@#USER_ID 24!@#ACTIVITY_CODE 5
12/11/2022 03:53:37 PM script INFO: SUCCESS!@#KODE 1!@#USER_ID 24!@#ACTIVITY_CODE 5
12/11/2022 03:53:37 PM script INFO: SUCCESS!@#KODE 1!@#USER_ID 24!@#ACTIVITY_CODE 5
12/11/2022 03:53:39 PM script INFO: SUCCESS!@#KODE 1!@#USER_ID 24!@#ACTIVITY_CODE 5
12/11/2022 03:53:39 PM script INFO: SUCCESS!@#KODE 1!@#USER_ID 24!@#ACTIVITY_CODE 5
12/11/2022 03:53:42 PM script INFO: SUCCESS!@#KODE 1!@#USER_ID 24!@#ACTIVITY_CODE 3
12/11/2022 03:53:42 PM script INFO: SUCCESS!@#KODE 1!@#USER_ID 24!@#ACTIVITY_CODE 1
12/11/2022 03:53:42 PM script INFO: SUCCESS!@#KODE 1!@#USER_ID 24!@#ACTIVITY_CODE 2
12/11/2022 03:53:42 PM script INFO: SUCCESS!@#KODE 1!@#USER_ID 24!@#ACTIVITY_CODE 1
12/11/2022 03:53:42 PM script INFO: SUCCESS!@#KODE 1!@#USER_ID 24!@#ACTIVITY_CODE 4
12/11/2022 03:53:42 PM script INFO: SUCCESS!@#KODE 1!@#USER_ID 24!@#ACTIVITY_CODE 1
12/11/2022 03:53:42 PM script INFO: SUCCESS!@#KODE 1!@#USER_ID 24!@#ACTIVITY_CODE 5
12/11/2022 03:53:42 PM script INFO: SUCCESS!@#KODE 1!@#USER_ID 24!@#ACTIVITY_CODE 5
12/11/2022 03:53:45 PM script INFO: SUCCESS!@#KODE 1!@#USER_ID 24!@#ACTIVITY_CODE 3
12/11/2022 03:53:45 PM script INFO: SUCCESS!@#KODE 1!@#USER_ID 24!@#ACTIVITY_CODE 5
12/11/2022 03:53:45 PM script INFO: SUCCESS!@#KODE 1!@#USER_ID 24!@#ACTIVITY_CODE 5
12/11/2022 03:53:48 PM script INFO: SUCCESS!@#KODE 1!@#USER_ID 24!@#ACTIVITY_CODE 4
12/11/2022 03:53:48 PM script INFO: SUCCESS!@#KODE 1!@#USER_ID 24!@#ACTIVITY_CODE 2
12/11/2022 03:53:48 PM script INFO: SUCCESS!@#KODE 1!@#USER_ID 24!@#ACTIVITY_CODE 4
12/11/2022 03:53:48 PM script INFO: SUCCESS!@#KODE 1!@#USER_ID 24!@#ACTIVITY_CODE 5
12/11/2022 03:53:48 PM script INFO: SUCCESS!@#KODE 1!@#USER_ID 24!@#ACTIVITY_CODE 5
12/11/2022 03:53:51 PM script INFO: SUCCESS!@#KODE 1!@#USER_ID 24!@#ACTIVITY_CODE 1
12/11/2022 03:53:51 PM script INFO: SUCCESS!@#KODE 1!@#USER_ID 24!@#ACTIVITY_CODE 1
12/11/2022 03:53:51 PM script INFO: SUCCESS!@#KODE 1!@#USER_ID 24!@#ACTIVITY_CODE 2
12/11/2022 03:53:51 PM script INFO: SUCCESS!@#KODE 1!@#USER_ID 24!@#ACTIVITY_CODE 1
12/11/2022 03:53:51 PM script INFO: SUCCESS!@#KODE 1!@#USER_ID 24!@#ACTIVITY_CODE 1
12/11/2022 03:53:51 PM script INFO: SUCCESS!@#KODE 1!@#USER_ID 24!@#ACTIVITY_CODE 1
12/11/2022 03:53:51 PM script INFO: SUCCESS!@#KODE 1!@#USER_ID 24!@#ACTIVITY_CODE 1
12/11/2022 03:53:51 PM script INFO: SUCCESS!@#KODE 1!@#USER_ID 24!@#ACTIVITY_CODE 1
12/11/2022 03:53:52 PM script INFO: SUCCESS!@#KODE 1!@#USER_ID 24!@#ACTIVITY_CODE 3
12/11/2022 03:53:52 PM script INFO: SUCCESS!@#KODE 1!@#USER_ID 24!@#ACTIVITY_CODE 1
12/11/2022 03:53:52 PM script INFO: SUCCESS!@#KODE 1!@#USER_ID 24!@#ACTIVITY_CODE 1
12/11/2022 03:53:52 PM script INFO: SUCCESS!@#KODE 1!@#USER_ID 24!@#ACTIVITY_CODE 3
12/11/2022 03:53:52 PM script INFO: SUCCESS!@#KODE 1!@#USER_ID 24!@#ACTIVITY_CODE 3
12/11/2022 03:53:52 PM script INFO: SUCCESS!@#KODE 1!@#USER_ID 24!@#ACTIVITY_CODE 5
12/11/2022 03:53:52 PM script INFO: SUCCESS!@#KODE 1!@#USER_ID 24!@#ACTIVITY_CODE 5
12/11/2022 03:53:55 PM script INFO: SUCCESS!@#KODE 1!@#USER_ID 24!@#ACTIVITY_CODE 1
12/11/2022 03:53:55 PM script INFO: SUCCESS!@#KODE 1!@#USER_ID 24!@#ACTIVITY_CODE 1
12/11/2022 03:53:55 PM script INFO: SUCCESS!@#KODE 1!@#USER_ID 24!@#ACTIVITY_CODE 3
12/11/2022 03:53:55 PM script INFO: SUCCESS!@#KODE 1!@#USER_ID 24!@#ACTIVITY_CODE 3
12/11/2022 03:53:55 PM script INFO: SUCCESS!@#KODE 1!@#USER_ID 24!@#ACTIVITY_CODE 2
12/11/2022 03:53:55 PM script INFO: SUCCESS!@#KODE 1!@#USER_ID 24!@#ACTIVITY_CODE 5
12/11/2022 03:53:55 PM script INFO: SUCCESS!@#KODE 1!@#USER_ID 24!@#ACTIVITY_CODE 5
12/11/2022 03:53:58 PM script INFO: SUCCESS!@#KODE 1!@#USER_ID 24!@#ACTIVITY_CODE 1
12/11/2022 03:53:58 PM script INFO: SUCCESS!@#KODE 1!@#USER_ID 24!@#ACTIVITY_CODE 4
12/11/2022 03:53:58 PM script INFO: SUCCESS!@#KODE 1!@#USER_ID 24!@#ACTIVITY_CODE 1
12/11/2022 03:53:58 PM script INFO: SUCCESS!@#KODE 1!@#USER_ID 24!@#ACTIVITY_CODE 5
12/11/2022 03:53:58 PM script INFO: SUCCESS!@#KODE 1!@#USER_ID 24!@#ACTIVITY_CODE 5
12/11/2022 03:54:01 PM script INFO: SUCCESS!@#KODE 1!@#USER_ID 24!@#ACTIVITY_CODE 3
12/11/2022 03:54:01 PM script INFO: SUCCESS!@#KODE 1!@#USER_ID 24!@#ACTIVITY_CODE 2
12/11/2022 03:54:01 PM script INFO: SUCCESS!@#KODE 1!@#USER_ID 24!@#ACTIVITY_CODE 3
12/11/2022 03:54:02 PM script INFO: SUCCESS!@#KODE 1!@#USER_ID 24!@#ACTIVITY_CODE 2
12/11/2022 03:54:02 PM script INFO: SUCCESS!@#KODE 1!@#USER_ID 24!@#ACTIVITY_CODE 2
12/11/2022 03:54:02 PM script INFO: SUCCESS!@#KODE 1!@#USER_ID 24!@#ACTIVITY_CODE 3
12/11/2022 03:54:02 PM script INFO: SUCCESS!@#KODE 1!@#USER_ID 24!@#ACTIVITY_CODE 4
12/11/2022 03:54:03 PM script INFO: SUCCESS!@#KODE 1!@#USER_ID 24!@#ACTIVITY_CODE 3
12/11/2022 03:54:03 PM script INFO: SUCCESS!@#KODE 1!@#USER_ID 24!@#ACTIVITY_CODE 2
12/11/2022 03:54:03 PM script INFO: SUCCESS!@#KODE 1!@#USER_ID 24!@#ACTIVITY_CODE 3
12/11/2022 03:54:03 PM script INFO: SUCCESS!@#KODE 1!@#USER_ID 24!@#ACTIVITY_CODE 3
12/11/2022 03:54:04 PM script INFO: SUCCESS!@#KODE 1!@#USER_ID 24!@#ACTIVITY_CODE 2
12/11/2022 03:54:04 PM script INFO: SUCCESS!@#KODE 1!@#USER_ID 24!@#ACTIVITY_CODE 5
12/11/2022 03:54:04 PM script INFO: SUCCESS!@#KODE 1!@#USER_ID 24!@#ACTIVITY_CODE 5
12/11/2022 03:54:06 PM script INFO: SUCCESS!@#KODE 1!@#USER_ID 24!@#ACTIVITY_CODE 3
12/11/2022 03:54:06 PM script INFO: SUCCESS!@#KODE 1!@#USER_ID 24!@#ACTIVITY_CODE 5
12/11/2022 03:54:06 PM script INFO: SUCCESS!@#KODE 1!@#USER_ID 24!@#ACTIVITY_CODE 5
12/11/2022 03:54:09 PM script INFO: SUCCESS!@#KODE 1!@#USER_ID 24!@#ACTIVITY_CODE 1
12/11/2022 03:54:09 PM script INFO: SUCCESS!@#KODE 1!@#USER_ID 24!@#ACTIVITY_CODE 3
12/11/2022 03:54:09 PM script INFO: SUCCESS!@#KODE 1!@#USER_ID 24!@#ACTIVITY_CODE 5
12/11/2022 03:54:09 PM script INFO: SUCCESS!@#KODE 1!@#USER_ID 24!@#ACTIVITY_CODE 5
12/11/2022 03:54:12 PM script INFO: SUCCESS!@#KODE 1!@#USER_ID 24!@#ACTIVITY_CODE 3
12/11/2022 03:54:12 PM script INFO: SUCCESS!@#KODE 1!@#USER_ID 24!@#ACTIVITY_CODE 2
12/11/2022 03:54:12 PM script INFO: SUCCESS!@#KODE 1!@#USER_ID 24!@#ACTIVITY_CODE 3
12/11/2022 03:54:12 PM script INFO: SUCCESS!@#KODE 1!@#USER_ID 24!@#ACTIVITY_CODE 3
12/11/2022 03:54:12 PM script INFO: SUCCESS!@#KODE 1!@#USER_ID 24!@#ACTIVITY_CODE 3
12/11/2022 03:54:12 PM script INFO: SUCCESS!@#KODE 1!@#USER_ID 24!@#ACTIVITY_CODE 3
12/11/2022 03:54:12 PM script INFO: SUCCESS!@#KODE 1!@#USER_ID 24!@#ACTIVITY_CODE 2
12/11/2022 03:54:13 PM script INFO: SUCCESS!@#KODE 1!@#USER_ID 24!@#ACTIVITY_CODE 1
12/11/2022 03:54:13 PM script INFO: SUCCESS!@#KODE 1!@#USER_ID 24!@#ACTIVITY_CODE 4
12/11/2022 03:54:13 PM script INFO: SUCCESS!@#KODE 1!@#USER_ID 24!@#ACTIVITY_CODE 1
12/11/2022 03:54:13 PM script INFO: SUCCESS!@#KODE 1!@#USER_ID 24!@#ACTIVITY_CODE 1
12/11/2022 03:54:13 PM script INFO: SUCCESS!@#KODE 1!@#USER_ID 24!@#ACTIVITY_CODE 5
12/11/2022 03:54:13 PM script INFO: SUCCESS!@#KODE 1!@#USER_ID 24!@#ACTIVITY_CODE 5
12/11/2022 03:54:15 PM script INFO: SUCCESS!@#KODE 1!@#USER_ID 24!@#ACTIVITY_CODE 3
12/11/2022 03:54:15 PM script INFO: SUCCESS!@#KODE 1!@#USER_ID 24!@#ACTIVITY_CODE 3
12/11/2022 03:54:16 PM script INFO: SUCCESS!@#KODE 1!@#USER_ID 24!@#ACTIVITY_CODE 3
12/11/2022 03:54:16 PM script INFO: SUCCESS!@#KODE 1!@#USER_ID 24!@#ACTIVITY_CODE 5
12/11/2022 03:54:16 PM script INFO: SUCCESS!@#KODE 1!@#USER_ID 24!@#ACTIVITY_CODE 5
12/11/2022 03:54:18 PM script INFO: SUCCESS!@#KODE 1!@#USER_ID 24!@#ACTIVITY_CODE 1
12/11/2022 03:54:18 PM script INFO: SUCCESS!@#KODE 1!@#USER_ID 24!@#ACTIVITY_CODE 1
12/11/2022 03:54:18 PM script INFO: SUCCESS!@#KODE 1!@#USER_ID 24!@#ACTIVITY_CODE 1
12/11/2022 03:54:18 PM script INFO: SUCCESS!@#KODE 1!@#USER_ID 24!@#ACTIVITY_CODE 4
12/11/2022 03:54:18 PM script INFO: SUCCESS!@#KODE 1!@#USER_ID 24!@#ACTIVITY_CODE 1
12/11/2022 03:54:18 PM script INFO: SUCCESS!@#KODE 1!@#USER_ID 24!@#ACTIVITY_CODE 1
12/11/2022 03:54:18 PM script INFO: SUCCESS!@#KODE 1!@#USER_ID 24!@#ACTIVITY_CODE 4
12/11/2022 03:54:19 PM script INFO: SUCCESS!@#KODE 1!@#USER_ID 24!@#ACTIVITY_CODE 2
12/11/2022 03:54:19 PM script INFO: SUCCESS!@#KODE 1!@#USER_ID 24!@#ACTIVITY_CODE 2
12/11/2022 03:54:19 PM script INFO: SUCCESS!@#KODE 1!@#USER_ID 24!@#ACTIVITY_CODE 2
12/11/2022 03:54:19 PM script INFO: SUCCESS!@#KODE 1!@#USER_ID 24!@#ACTIVITY_CODE 3
12/11/2022 03:54:19 PM script INFO: SUCCESS!@#KODE 1!@#USER_ID 24!@#ACTIVITY_CODE 1
12/11/2022 03:54:19 PM script INFO: SUCCESS!@#KODE 1!@#USER_ID 24!@#ACTIVITY_CODE 2
12/11/2022 03:54:19 PM script INFO: SUCCESS!@#KODE 1!@#USER_ID 24!@#ACTIVITY_CODE 2
12/11/2022 03:54:19 PM script INFO: SUCCESS!@#KODE 1!@#USER_ID 24!@#ACTIVITY_CODE 1
12/11/2022 03:54:19 PM script INFO: SUCCESS!@#KODE 1!@#USER_ID 24!@#ACTIVITY_CODE 2
12/11/2022 03:54:19 PM script INFO: SUCCESS!@#KODE 1!@#USER_ID 24!@#ACTIVITY_CODE 3
12/11/2022 03:54:19 PM script INFO: SUCCESS!@#KODE 1!@#USER_ID 24!@#ACTIVITY_CODE 1
12/11/2022 03:54:19 PM script INFO: SUCCESS!@#KODE 1!@#USER_ID 24!@#ACTIVITY_CODE 1
12/11/2022 03:54:20 PM script INFO: SUCCESS!@#KODE 1!@#USER_ID 24!@#ACTIVITY_CODE 2
12/11/2022 03:54:20 PM script INFO: SUCCESS!@#KODE 1!@#USER_ID 24!@#ACTIVITY_CODE 3
12/11/2022 03:54:20 PM script INFO: SUCCESS!@#KODE 1!@#USER_ID 24!@#ACTIVITY_CODE 2
12/11/2022 03:54:20 PM script INFO: SUCCESS!@#KODE 1!@#USER_ID 24!@#ACTIVITY_CODE 2
12/11/2022 03:54:20 PM script INFO: SUCCESS!@#KODE 1!@#USER_ID 24!@#ACTIVITY_CODE 3
12/11/2022 03:54:20 PM script INFO: SUCCESS!@#KODE 1!@#USER_ID 24!@#ACTIVITY_CODE 2
12/11/2022 03:54:20 PM script INFO: SUCCESS!@#KODE 1!@#USER_ID 24!@#ACTIVITY_CODE 1
12/11/2022 03:54:20 PM script INFO: SUCCESS!@#KODE 1!@#USER_ID 24!@#ACTIVITY_CODE 4
12/11/2022 03:54:20 PM script INFO: SUCCESS!@#KODE 1!@#USER_ID 24!@#ACTIVITY_CODE 3
12/11/2022 03:54:20 PM script INFO: SUCCESS!@#KODE 1!@#USER_ID 24!@#ACTIVITY_CODE 2
12/11/2022 03:54:20 PM script INFO: SUCCESS!@#KODE 1!@#USER_ID 24!@#ACTIVITY_CODE 1
12/11/2022 03:54:21 PM script INFO: SUCCESS!@#KODE 1!@#USER_ID 24!@#ACTIVITY_CODE 3
12/11/2022 03:54:21 PM script INFO: SUCCESS!@#KODE 1!@#USER_ID 24!@#ACTIVITY_CODE 3
12/11/2022 03:54:21 PM script INFO: SUCCESS!@#KODE 1!@#USER_ID 24!@#ACTIVITY_CODE 1
12/11/2022 03:54:21 PM script INFO: SUCCESS!@#KODE 1!@#USER_ID 24!@#ACTIVITY_CODE 1
12/11/2022 03:54:21 PM script INFO: SUCCESS!@#KODE 1!@#USER_ID 24!@#ACTIVITY_CODE 4
12/11/2022 03:54:21 PM script INFO: SUCCESS!@#KODE 1!@#USER_ID 24!@#ACTIVITY_CODE 3
12/11/2022 03:54:21 PM script INFO: SUCCESS!@#KODE 1!@#USER_ID 24!@#ACTIVITY_CODE 3
12/11/2022 03:54:21 PM script INFO: SUCCESS!@#KODE 1!@#USER_ID 24!@#ACTIVITY_CODE 2
12/11/2022 03:54:21 PM script INFO: SUCCESS!@#KODE 1!@#USER_ID 24!@#ACTIVITY_CODE 3
12/11/2022 03:54:21 PM script INFO: SUCCESS!@#KODE 1!@#USER_ID 24!@#ACTIVITY_CODE 1
12/11/2022 03:54:21 PM script INFO: SUCCESS!@#KODE 1!@#USER_ID 24!@#ACTIVITY_CODE 1
12/11/2022 03:54:21 PM script INFO: SUCCESS!@#KODE 1!@#USER_ID 24!@#ACTIVITY_CODE 1
12/11/2022 03:54:21 PM script INFO: SUCCESS!@#KODE 1!@#USER_ID 24!@#ACTIVITY_CODE 2
12/11/2022 03:54:21 PM script INFO: SUCCESS!@#KODE 1!@#USER_ID 24!@#ACTIVITY_CODE 3
12/11/2022 03:54:21 PM script INFO: SUCCESS!@#KODE 1!@#USER_ID 24!@#ACTIVITY_CODE 3
12/11/2022 03:54:21 PM script INFO: SUCCESS!@#KODE 1!@#USER_ID 24!@#ACTIVITY_CODE 3
12/11/2022 03:54:22 PM script INFO: SUCCESS!@#KODE 1!@#USER_ID 24!@#ACTIVITY_CODE 2
12/11/2022 03:54:22 PM script INFO: SUCCESS!@#KODE 1!@#USER_ID 24!@#ACTIVITY_CODE 2
12/11/2022 03:54:22 PM script INFO: SUCCESS!@#KODE 1!@#USER_ID 24!@#ACTIVITY_CODE 3
12/11/2022 03:54:22 PM script INFO: SUCCESS!@#KODE 1!@#USER_ID 24!@#ACTIVITY_CODE 3
12/11/2022 03:54:22 PM script INFO: SUCCESS!@#KODE 1!@#USER_ID 24!@#ACTIVITY_CODE 3
12/11/2022 03:54:22 PM script INFO: SUCCESS!@#KODE 1!@#USER_ID 24!@#ACTIVITY_CODE 3
12/11/2022 03:54:22 PM script INFO: SUCCESS!@#KODE 1!@#USER_ID 24!@#ACTIVITY_CODE 3
12/11/2022 03:54:22 PM script INFO: SUCCESS!@#KODE 1!@#USER_ID 24!@#ACTIVITY_CODE 3
12/11/2022 03:54:22 PM script INFO: SUCCESS!@#KODE 1!@#USER_ID 24!@#ACTIVITY_CODE 1
12/11/2022 03:54:22 PM script INFO: SUCCESS!@#KODE 1!@#USER_ID 24!@#ACTIVITY_CODE 2
12/11/2022 03:54:22 PM script INFO: SUCCESS!@#KODE 1!@#USER_ID 24!@#ACTIVITY_CODE 1
12/11/2022 03:54:22 PM script INFO: SUCCESS!@#KODE 1!@#USER_ID 24!@#ACTIVITY_CODE 3
12/11/2022 03:54:22 PM script INFO: SUCCESS!@#KODE 1!@#USER_ID 24!@#ACTIVITY_CODE 3
12/11/2022 03:54:22 PM script INFO: SUCCESS!@#KODE 1!@#USER_ID 24!@#ACTIVITY_CODE 4
12/11/2022 03:54:22 PM script INFO: SUCCESS!@#KODE 1!@#USER_ID 24!@#ACTIVITY_CODE 1
12/11/2022 03:54:22 PM script INFO: SUCCESS!@#KODE 1!@#USER_ID 24!@#ACTIVITY_CODE 1
12/11/2022 03:54:23 PM script INFO: SUCCESS!@#KODE 1!@#USER_ID 24!@#ACTIVITY_CODE 2
12/11/2022 03:54:23 PM script INFO: SUCCESS!@#KODE 1!@#USER_ID 24!@#ACTIVITY_CODE 2
12/11/2022 03:54:23 PM script INFO: SUCCESS!@#KODE 1!@#USER_ID 24!@#ACTIVITY_CODE 3
12/11/2022 03:54:23 PM script INFO: SUCCESS!@#KODE 1!@#USER_ID 24!@#ACTIVITY_CODE 2
12/11/2022 03:54:23 PM script INFO: SUCCESS!@#KODE 1!@#USER_ID 24!@#ACTIVITY_CODE 2
12/11/2022 03:54:23 PM script INFO: SUCCESS!@#KODE 1!@#USER_ID 24!@#ACTIVITY_CODE 4
12/11/2022 03:54:23 PM script INFO: SUCCESS!@#KODE 1!@#USER_ID 24!@#ACTIVITY_CODE 2
12/11/2022 03:54:23 PM script INFO: SUCCESS!@#KODE 1!@#USER_ID 24!@#ACTIVITY_CODE 1
12/11/2022 03:54:23 PM script INFO: SUCCESS!@#KODE 1!@#USER_ID 24!@#ACTIVITY_CODE 4
12/11/2022 03:54:23 PM script INFO: SUCCESS!@#KODE 1!@#USER_ID 24!@#ACTIVITY_CODE 3
12/11/2022 03:54:23 PM script INFO: SUCCESS!@#KODE 1!@#USER_ID 24!@#ACTIVITY_CODE 1
12/11/2022 03:54:24 PM script INFO: SUCCESS!@#KODE 1!@#USER_ID 24!@#ACTIVITY_CODE 3
12/11/2022 03:54:24 PM script INFO: SUCCESS!@#KODE 1!@#USER_ID 24!@#ACTIVITY_CODE 2
12/11/2022 03:54:24 PM script INFO: SUCCESS!@#KODE 1!@#USER_ID 24!@#ACTIVITY_CODE 3
12/11/2022 03:54:24 PM script INFO: SUCCESS!@#KODE 1!@#USER_ID 24!@#ACTIVITY_CODE 2
12/11/2022 03:54:24 PM script INFO: SUCCESS!@#KODE 1!@#USER_ID 24!@#ACTIVITY_CODE 3
12/11/2022 03:54:24 PM script INFO: SUCCESS!@#KODE 1!@#USER_ID 24!@#ACTIVITY_CODE 1
12/11/2022 03:54:24 PM script INFO: SUCCESS!@#KODE 1!@#USER_ID 24!@#ACTIVITY_CODE 2
12/11/2022 03:54:24 PM script INFO: SUCCESS!@#KODE 1!@#USER_ID 24!@#ACTIVITY_CODE 2
12/11/2022 03:54:24 PM script INFO: SUCCESS!@#KODE 1!@#USER_ID 24!@#ACTIVITY_CODE 1
12/11/2022 03:54:24 PM script INFO: SUCCESS!@#KODE 1!@#USER_ID 24!@#ACTIVITY_CODE 3
12/11/2022 03:54:24 PM script INFO: SUCCESS!@#KODE 1!@#USER_ID 24!@#ACTIVITY_CODE 4
12/11/2022 03:54:24 PM script INFO: SUCCESS!@#KODE 1!@#USER_ID 24!@#ACTIVITY_CODE 2
12/11/2022 03:54:25 PM script INFO: SUCCESS!@#KODE 1!@#USER_ID 24!@#ACTIVITY_CODE 4
12/11/2022 03:54:25 PM script INFO: SUCCESS!@#KODE 1!@#USER_ID 24!@#ACTIVITY_CODE 2
12/11/2022 03:54:25 PM script INFO: SUCCESS!@#KODE 1!@#USER_ID 24!@#ACTIVITY_CODE 4
12/11/2022 03:54:25 PM script INFO: SUCCESS!@#KODE 1!@#USER_ID 24!@#ACTIVITY_CODE 2
12/11/2022 03:54:25 PM script INFO: SUCCESS!@#KODE 1!@#USER_ID 24!@#ACTIVITY_CODE 3
12/11/2022 03:54:25 PM script INFO: SUCCESS!@#KODE 1!@#USER_ID 24!@#ACTIVITY_CODE 1
12/11/2022 03:54:25 PM script INFO: SUCCESS!@#KODE 1!@#USER_ID 24!@#ACTIVITY_CODE 4
12/11/2022 03:54:25 PM script INFO: SUCCESS!@#KODE 1!@#USER_ID 24!@#ACTIVITY_CODE 2
12/11/2022 03:54:25 PM script INFO: SUCCESS!@#KODE 1!@#USER_ID 24!@#ACTIVITY_CODE 3
12/11/2022 03:54:25 PM script INFO: SUCCESS!@#KODE 1!@#USER_ID 24!@#ACTIVITY_CODE 2
12/11/2022 03:54:25 PM script INFO: SUCCESS!@#KODE 1!@#USER_ID 24!@#ACTIVITY_CODE 3
12/11/2022 03:54:25 PM script INFO: SUCCESS!@#KODE 1!@#USER_ID 24!@#ACTIVITY_CODE 1
12/11/2022 03:54:26 PM script INFO: SUCCESS!@#KODE 1!@#USER_ID 24!@#ACTIVITY_CODE 2
12/11/2022 03:54:26 PM script INFO: SUCCESS!@#KODE 1!@#USER_ID 24!@#ACTIVITY_CODE 1
12/11/2022 03:54:26 PM script INFO: SUCCESS!@#KODE 1!@#USER_ID 24!@#ACTIVITY_CODE 3
12/11/2022 03:54:26 PM script INFO: SUCCESS!@#KODE 1!@#USER_ID 24!@#ACTIVITY_CODE 2
12/11/2022 03:54:26 PM script INFO: SUCCESS!@#KODE 1!@#USER_ID 24!@#ACTIVITY_CODE 2
12/11/2022 03:54:26 PM script INFO: SUCCESS!@#KODE 1!@#USER_ID 24!@#ACTIVITY_CODE 2
12/11/2022 03:54:26 PM script INFO: SUCCESS!@#KODE 1!@#USER_ID 24!@#ACTIVITY_CODE 2
12/11/2022 03:54:26 PM script INFO: SUCCESS!@#KODE 1!@#USER_ID 24!@#ACTIVITY_CODE 1
12/11/2022 03:54:26 PM script INFO: SUCCESS!@#KODE 1!@#USER_ID 24!@#ACTIVITY_CODE 3
12/11/2022 03:54:26 PM script INFO: SUCCESS!@#KODE 1!@#USER_ID 24!@#ACTIVITY_CODE 2
12/11/2022 03:54:26 PM script INFO: SUCCESS!@#KODE 1!@#USER_ID 24!@#ACTIVITY_CODE 1
12/11/2022 03:54:26 PM script INFO: SUCCESS!@#KODE 1!@#USER_ID 24!@#ACTIVITY_CODE 3
12/11/2022 03:54:27 PM script INFO: SUCCESS!@#KODE 1!@#USER_ID 24!@#ACTIVITY_CODE 2
12/11/2022 03:54:27 PM script INFO: SUCCESS!@#KODE 1!@#USER_ID 24!@#ACTIVITY_CODE 2
12/11/2022 03:54:27 PM script INFO: SUCCESS!@#KODE 1!@#USER_ID 24!@#ACTIVITY_CODE 4
12/11/2022 03:54:27 PM script INFO: SUCCESS!@#KODE 1!@#USER_ID 24!@#ACTIVITY_CODE 2
12/11/2022 03:54:27 PM script INFO: SUCCESS!@#KODE 1!@#USER_ID 24!@#ACTIVITY_CODE 1
12/11/2022 03:54:27 PM script INFO: SUCCESS!@#KODE 1!@#USER_ID 24!@#ACTIVITY_CODE 3
12/11/2022 03:54:27 PM script INFO: SUCCESS!@#KODE 1!@#USER_ID 24!@#ACTIVITY_CODE 3
12/11/2022 03:54:27 PM script INFO: SUCCESS!@#KODE 1!@#USER_ID 24!@#ACTIVITY_CODE 1
12/11/2022 03:54:27 PM script INFO: SUCCESS!@#KODE 1!@#USER_ID 24!@#ACTIVITY_CODE 2
12/11/2022 03:54:27 PM script INFO: SUCCESS!@#KODE 1!@#USER_ID 24!@#ACTIVITY_CODE 3
12/11/2022 03:54:27 PM script INFO: SUCCESS!@#KODE 1!@#USER_ID 24!@#ACTIVITY_CODE 2
12/11/2022 03:54:27 PM script INFO: SUCCESS!@#KODE 1!@#USER_ID 24!@#ACTIVITY_CODE 2
12/11/2022 03:54:28 PM script INFO: SUCCESS!@#KODE 1!@#USER_ID 24!@#ACTIVITY_CODE 2
12/11/2022 03:54:28 PM script INFO: SUCCESS!@#KODE 1!@#USER_ID 24!@#ACTIVITY_CODE 2
12/11/2022 03:54:28 PM script INFO: SUCCESS!@#KODE 1!@#USER_ID 24!@#ACTIVITY_CODE 1
12/11/2022 03:54:28 PM script INFO: SUCCESS!@#KODE 1!@#USER_ID 24!@#ACTIVITY_CODE 4
12/11/2022 03:54:28 PM script INFO: SUCCESS!@#KODE 1!@#USER_ID 24!@#ACTIVITY_CODE 1
12/11/2022 03:54:28 PM script INFO: SUCCESS!@#KODE 1!@#USER_ID 24!@#ACTIVITY_CODE 4
12/11/2022 03:54:28 PM script INFO: SUCCESS!@#KODE 1!@#USER_ID 24!@#ACTIVITY_CODE 1
12/11/2022 03:54:28 PM script INFO: SUCCESS!@#KODE 1!@#USER_ID 24!@#ACTIVITY_CODE 2
12/11/2022 03:54:28 PM script INFO: SUCCESS!@#KODE 1!@#USER_ID 24!@#ACTIVITY_CODE 2
12/11/2022 03:54:28 PM script INFO: SUCCESS!@#KODE 1!@#USER_ID 24!@#ACTIVITY_CODE 2
12/11/2022 03:54:28 PM script INFO: SUCCESS!@#KODE 1!@#USER_ID 24!@#ACTIVITY_CODE 1
12/11/2022 03:54:28 PM script INFO: SUCCESS!@#KODE 1!@#USER_ID 24!@#ACTIVITY_CODE 3
12/11/2022 03:54:28 PM script INFO: SUCCESS!@#KODE 1!@#USER_ID 24!@#ACTIVITY_CODE 2
12/11/2022 03:54:29 PM script INFO: SUCCESS!@#KODE 1!@#USER_ID 24!@#ACTIVITY_CODE 4
12/11/2022 03:54:29 PM script INFO: SUCCESS!@#KODE 1!@#USER_ID 24!@#ACTIVITY_CODE 2
12/11/2022 03:54:29 PM script INFO: SUCCESS!@#KODE 1!@#USER_ID 24!@#ACTIVITY_CODE 1
12/11/2022 03:54:29 PM script INFO: SUCCESS!@#KODE 1!@#USER_ID 24!@#ACTIVITY_CODE 3
12/11/2022 03:54:29 PM script INFO: SUCCESS!@#KODE 1!@#USER_ID 24!@#ACTIVITY_CODE 1
12/11/2022 03:54:29 PM script INFO: SUCCESS!@#KODE 1!@#USER_ID 24!@#ACTIVITY_CODE 1
12/11/2022 03:54:29 PM script INFO: SUCCESS!@#KODE 1!@#USER_ID 24!@#ACTIVITY_CODE 2
12/11/2022 03:54:29 PM script INFO: SUCCESS!@#KODE 1!@#USER_ID 24!@#ACTIVITY_CODE 4
12/11/2022 03:54:29 PM script INFO: SUCCESS!@#KODE 1!@#USER_ID 24!@#ACTIVITY_CODE 1
12/11/2022 03:54:29 PM script INFO: SUCCESS!@#KODE 1!@#USER_ID 24!@#ACTIVITY_CODE 2
12/11/2022 03:54:29 PM script INFO: SUCCESS!@#KODE 1!@#USER_ID 24!@#ACTIVITY_CODE 1
12/11/2022 03:54:29 PM script INFO: SUCCESS!@#KODE 1!@#USER_ID 24!@#ACTIVITY_CODE 2
12/11/2022 03:54:29 PM script INFO: SUCCESS!@#KODE 1!@#USER_ID 24!@#ACTIVITY_CODE 1
12/11/2022 03:54:29 PM script INFO: SUCCESS!@#KODE 1!@#USER_ID 24!@#ACTIVITY_CODE 3
12/11/2022 03:54:29 PM script INFO: Duration: 60.847798109054565
12/11/2022 03:54:29 PM script INFO: mengakhiri-quiz
12/11/2022 03:54:43 PM script INFO: SUCCESS!@#KODE 1!@#USER_ID 24!@#ACTIVITY_CODE 5
12/11/2022 03:54:43 PM script INFO: berhasil-submit
