12/23/2022 01:17:54 AM script INFO: Prepared chrome options..
12/23/2022 01:17:55 AM script INFO: Initialized chrome browser..
12/23/2022 01:17:55 AM script INFO: mengakses-homepage
12/23/2022 01:19:10 AM script INFO: mengakses-login-page
12/23/2022 01:19:11 AM script INFO: mengakses-site-home
12/23/2022 01:20:42 AM script ERROR: TIMEOUT EXCEPTION!@#KODE 0!@#LOCATION mengakses-site-home
12/23/2022 01:20:42 AM main_worker ERROR: Message: None

