12/12/2022 01:32:05 AM script INFO: Prepared chrome options..
12/12/2022 01:32:07 AM script INFO: Initialized chrome browser..
12/12/2022 01:32:07 AM script INFO: mengakses-homepage
12/12/2022 01:32:15 AM script INFO: mengakses-login-page
12/12/2022 01:32:16 AM script INFO: mengakses-site-home
12/12/2022 01:32:16 AM script INFO: mengakses-site-course
12/12/2022 01:32:17 AM script INFO: mengakses-quiz
12/12/2022 01:32:17 AM script INFO: mengakses-start-quiz-page
12/12/2022 01:32:18 AM script INFO: memulai-quiz
12/12/2022 01:32:18 AM script INFO: SUCCESS!@#KODE 1!@#USER_ID 15!@#ACTIVITY_CODE 5
12/12/2022 01:32:29 AM script INFO: SUCCESS!@#KODE 1!@#USER_ID 15!@#ACTIVITY_CODE 5
12/12/2022 01:32:29 AM script INFO: SUCCESS!@#KODE 1!@#USER_ID 15!@#ACTIVITY_CODE 5
12/12/2022 01:32:31 AM script INFO: SUCCESS!@#KODE 1!@#USER_ID 15!@#ACTIVITY_CODE 1
12/12/2022 01:32:31 AM script INFO: SUCCESS!@#KODE 1!@#USER_ID 15!@#ACTIVITY_CODE 3
12/12/2022 01:32:31 AM script INFO: SUCCESS!@#KODE 1!@#USER_ID 15!@#ACTIVITY_CODE 3
12/12/2022 01:32:32 AM script INFO: SUCCESS!@#KODE 1!@#USER_ID 15!@#ACTIVITY_CODE 2
12/12/2022 01:32:32 AM script INFO: SUCCESS!@#KODE 1!@#USER_ID 15!@#ACTIVITY_CODE 2
12/12/2022 01:32:32 AM script INFO: SUCCESS!@#KODE 1!@#USER_ID 15!@#ACTIVITY_CODE 2
12/12/2022 01:32:32 AM script INFO: SUCCESS!@#KODE 1!@#USER_ID 15!@#ACTIVITY_CODE 5
12/12/2022 01:32:32 AM script INFO: SUCCESS!@#KODE 1!@#USER_ID 15!@#ACTIVITY_CODE 5
12/12/2022 01:32:34 AM script INFO: SUCCESS!@#KODE 1!@#USER_ID 15!@#ACTIVITY_CODE 3
12/12/2022 01:32:35 AM script INFO: SUCCESS!@#KODE 1!@#USER_ID 15!@#ACTIVITY_CODE 2
12/12/2022 01:32:35 AM script INFO: SUCCESS!@#KODE 1!@#USER_ID 15!@#ACTIVITY_CODE 2
12/12/2022 01:32:35 AM script INFO: SUCCESS!@#KODE 1!@#USER_ID 15!@#ACTIVITY_CODE 2
12/12/2022 01:32:35 AM script INFO: SUCCESS!@#KODE 1!@#USER_ID 15!@#ACTIVITY_CODE 3
12/12/2022 01:32:35 AM script INFO: SUCCESS!@#KODE 1!@#USER_ID 15!@#ACTIVITY_CODE 5
12/12/2022 01:32:35 AM script INFO: SUCCESS!@#KODE 1!@#USER_ID 15!@#ACTIVITY_CODE 5
12/12/2022 01:32:37 AM script INFO: SUCCESS!@#KODE 1!@#USER_ID 15!@#ACTIVITY_CODE 5
12/12/2022 01:32:37 AM script INFO: SUCCESS!@#KODE 1!@#USER_ID 15!@#ACTIVITY_CODE 5
12/12/2022 01:32:40 AM script INFO: SUCCESS!@#KODE 1!@#USER_ID 15!@#ACTIVITY_CODE 4
12/12/2022 01:32:40 AM script INFO: SUCCESS!@#KODE 1!@#USER_ID 15!@#ACTIVITY_CODE 5
12/12/2022 01:32:40 AM script INFO: SUCCESS!@#KODE 1!@#USER_ID 15!@#ACTIVITY_CODE 5
12/12/2022 01:32:43 AM script INFO: SUCCESS!@#KODE 1!@#USER_ID 15!@#ACTIVITY_CODE 3
12/12/2022 01:32:43 AM script INFO: SUCCESS!@#KODE 1!@#USER_ID 15!@#ACTIVITY_CODE 5
12/12/2022 01:32:43 AM script INFO: SUCCESS!@#KODE 1!@#USER_ID 15!@#ACTIVITY_CODE 5
12/12/2022 01:32:45 AM script INFO: SUCCESS!@#KODE 1!@#USER_ID 15!@#ACTIVITY_CODE 2
12/12/2022 01:32:46 AM script INFO: SUCCESS!@#KODE 1!@#USER_ID 15!@#ACTIVITY_CODE 2
12/12/2022 01:32:46 AM script INFO: SUCCESS!@#KODE 1!@#USER_ID 15!@#ACTIVITY_CODE 1
12/12/2022 01:32:46 AM script INFO: SUCCESS!@#KODE 1!@#USER_ID 15!@#ACTIVITY_CODE 1
12/12/2022 01:32:46 AM script INFO: SUCCESS!@#KODE 1!@#USER_ID 15!@#ACTIVITY_CODE 1
12/12/2022 01:32:46 AM script INFO: SUCCESS!@#KODE 1!@#USER_ID 15!@#ACTIVITY_CODE 2
12/12/2022 01:32:46 AM script INFO: SUCCESS!@#KODE 1!@#USER_ID 15!@#ACTIVITY_CODE 1
12/12/2022 01:32:46 AM script INFO: SUCCESS!@#KODE 1!@#USER_ID 15!@#ACTIVITY_CODE 3
12/12/2022 01:32:46 AM script INFO: SUCCESS!@#KODE 1!@#USER_ID 15!@#ACTIVITY_CODE 2
12/12/2022 01:32:46 AM script INFO: SUCCESS!@#KODE 1!@#USER_ID 15!@#ACTIVITY_CODE 3
12/12/2022 01:32:47 AM script INFO: SUCCESS!@#KODE 1!@#USER_ID 15!@#ACTIVITY_CODE 2
12/12/2022 01:32:47 AM script INFO: SUCCESS!@#KODE 1!@#USER_ID 15!@#ACTIVITY_CODE 1
12/12/2022 01:32:47 AM script INFO: SUCCESS!@#KODE 1!@#USER_ID 15!@#ACTIVITY_CODE 4
12/12/2022 01:32:47 AM script INFO: SUCCESS!@#KODE 1!@#USER_ID 15!@#ACTIVITY_CODE 5
12/12/2022 01:32:47 AM script INFO: SUCCESS!@#KODE 1!@#USER_ID 15!@#ACTIVITY_CODE 5
12/12/2022 01:32:49 AM script INFO: SUCCESS!@#KODE 1!@#USER_ID 15!@#ACTIVITY_CODE 3
12/12/2022 01:32:49 AM script INFO: SUCCESS!@#KODE 1!@#USER_ID 15!@#ACTIVITY_CODE 5
12/12/2022 01:32:49 AM script INFO: SUCCESS!@#KODE 1!@#USER_ID 15!@#ACTIVITY_CODE 5
12/12/2022 01:32:52 AM script INFO: SUCCESS!@#KODE 1!@#USER_ID 15!@#ACTIVITY_CODE 1
12/12/2022 01:32:52 AM script INFO: SUCCESS!@#KODE 1!@#USER_ID 15!@#ACTIVITY_CODE 1
12/12/2022 01:32:52 AM script INFO: SUCCESS!@#KODE 1!@#USER_ID 15!@#ACTIVITY_CODE 5
12/12/2022 01:32:52 AM script INFO: SUCCESS!@#KODE 1!@#USER_ID 15!@#ACTIVITY_CODE 5
12/12/2022 01:32:55 AM script INFO: SUCCESS!@#KODE 1!@#USER_ID 15!@#ACTIVITY_CODE 1
12/12/2022 01:32:55 AM script INFO: SUCCESS!@#KODE 1!@#USER_ID 15!@#ACTIVITY_CODE 5
12/12/2022 01:32:55 AM script INFO: SUCCESS!@#KODE 1!@#USER_ID 15!@#ACTIVITY_CODE 5
12/12/2022 01:32:57 AM script INFO: SUCCESS!@#KODE 1!@#USER_ID 15!@#ACTIVITY_CODE 2
12/12/2022 01:32:57 AM script INFO: SUCCESS!@#KODE 1!@#USER_ID 15!@#ACTIVITY_CODE 5
12/12/2022 01:32:57 AM script INFO: SUCCESS!@#KODE 1!@#USER_ID 15!@#ACTIVITY_CODE 5
12/12/2022 01:33:00 AM script INFO: SUCCESS!@#KODE 1!@#USER_ID 15!@#ACTIVITY_CODE 1
12/12/2022 01:33:00 AM script INFO: SUCCESS!@#KODE 1!@#USER_ID 15!@#ACTIVITY_CODE 1
12/12/2022 01:33:00 AM script INFO: SUCCESS!@#KODE 1!@#USER_ID 15!@#ACTIVITY_CODE 5
12/12/2022 01:33:00 AM script INFO: SUCCESS!@#KODE 1!@#USER_ID 15!@#ACTIVITY_CODE 5
12/12/2022 01:33:03 AM script INFO: SUCCESS!@#KODE 1!@#USER_ID 15!@#ACTIVITY_CODE 2
12/12/2022 01:33:03 AM script INFO: SUCCESS!@#KODE 1!@#USER_ID 15!@#ACTIVITY_CODE 1
12/12/2022 01:33:03 AM script INFO: SUCCESS!@#KODE 1!@#USER_ID 15!@#ACTIVITY_CODE 4
12/12/2022 01:33:03 AM script INFO: SUCCESS!@#KODE 1!@#USER_ID 15!@#ACTIVITY_CODE 1
12/12/2022 01:33:03 AM script INFO: SUCCESS!@#KODE 1!@#USER_ID 15!@#ACTIVITY_CODE 1
12/12/2022 01:33:03 AM script INFO: SUCCESS!@#KODE 1!@#USER_ID 15!@#ACTIVITY_CODE 4
12/12/2022 01:33:03 AM script INFO: SUCCESS!@#KODE 1!@#USER_ID 15!@#ACTIVITY_CODE 1
12/12/2022 01:33:03 AM script INFO: SUCCESS!@#KODE 1!@#USER_ID 15!@#ACTIVITY_CODE 3
12/12/2022 01:33:03 AM script INFO: SUCCESS!@#KODE 1!@#USER_ID 15!@#ACTIVITY_CODE 2
12/12/2022 01:33:03 AM script INFO: SUCCESS!@#KODE 1!@#USER_ID 15!@#ACTIVITY_CODE 3
12/12/2022 01:33:03 AM script INFO: SUCCESS!@#KODE 1!@#USER_ID 15!@#ACTIVITY_CODE 2
12/12/2022 01:33:04 AM script INFO: SUCCESS!@#KODE 1!@#USER_ID 15!@#ACTIVITY_CODE 2
12/12/2022 01:33:04 AM script INFO: SUCCESS!@#KODE 1!@#USER_ID 15!@#ACTIVITY_CODE 3
12/12/2022 01:33:04 AM script INFO: SUCCESS!@#KODE 1!@#USER_ID 15!@#ACTIVITY_CODE 4
12/12/2022 01:33:04 AM script INFO: SUCCESS!@#KODE 1!@#USER_ID 15!@#ACTIVITY_CODE 1
12/12/2022 01:33:04 AM script INFO: SUCCESS!@#KODE 1!@#USER_ID 15!@#ACTIVITY_CODE 2
12/12/2022 01:33:04 AM script INFO: SUCCESS!@#KODE 1!@#USER_ID 15!@#ACTIVITY_CODE 3
12/12/2022 01:33:04 AM script INFO: SUCCESS!@#KODE 1!@#USER_ID 15!@#ACTIVITY_CODE 5
12/12/2022 01:33:04 AM script INFO: SUCCESS!@#KODE 1!@#USER_ID 15!@#ACTIVITY_CODE 5
12/12/2022 01:33:06 AM script INFO: SUCCESS!@#KODE 1!@#USER_ID 15!@#ACTIVITY_CODE 5
12/12/2022 01:33:06 AM script INFO: SUCCESS!@#KODE 1!@#USER_ID 15!@#ACTIVITY_CODE 5
12/12/2022 01:33:09 AM script INFO: SUCCESS!@#KODE 1!@#USER_ID 15!@#ACTIVITY_CODE 2
12/12/2022 01:33:09 AM script INFO: SUCCESS!@#KODE 1!@#USER_ID 15!@#ACTIVITY_CODE 5
12/12/2022 01:33:09 AM script INFO: SUCCESS!@#KODE 1!@#USER_ID 15!@#ACTIVITY_CODE 5
12/12/2022 01:33:12 AM script INFO: SUCCESS!@#KODE 1!@#USER_ID 15!@#ACTIVITY_CODE 2
12/12/2022 01:33:12 AM script INFO: SUCCESS!@#KODE 1!@#USER_ID 15!@#ACTIVITY_CODE 3
12/12/2022 01:33:12 AM script INFO: SUCCESS!@#KODE 1!@#USER_ID 15!@#ACTIVITY_CODE 5
12/12/2022 01:33:12 AM script INFO: SUCCESS!@#KODE 1!@#USER_ID 15!@#ACTIVITY_CODE 5
12/12/2022 01:33:14 AM script INFO: SUCCESS!@#KODE 1!@#USER_ID 15!@#ACTIVITY_CODE 1
12/12/2022 01:33:15 AM script INFO: SUCCESS!@#KODE 1!@#USER_ID 15!@#ACTIVITY_CODE 4
12/12/2022 01:33:15 AM script INFO: SUCCESS!@#KODE 1!@#USER_ID 15!@#ACTIVITY_CODE 2
12/12/2022 01:33:15 AM script INFO: SUCCESS!@#KODE 1!@#USER_ID 15!@#ACTIVITY_CODE 4
12/12/2022 01:33:15 AM script INFO: SUCCESS!@#KODE 1!@#USER_ID 15!@#ACTIVITY_CODE 3
12/12/2022 01:33:15 AM script INFO: SUCCESS!@#KODE 1!@#USER_ID 15!@#ACTIVITY_CODE 1
12/12/2022 01:33:15 AM script INFO: SUCCESS!@#KODE 1!@#USER_ID 15!@#ACTIVITY_CODE 1
12/12/2022 01:33:15 AM script INFO: SUCCESS!@#KODE 1!@#USER_ID 15!@#ACTIVITY_CODE 4
12/12/2022 01:33:15 AM script INFO: SUCCESS!@#KODE 1!@#USER_ID 15!@#ACTIVITY_CODE 1
12/12/2022 01:33:15 AM script INFO: SUCCESS!@#KODE 1!@#USER_ID 15!@#ACTIVITY_CODE 3
12/12/2022 01:33:15 AM script INFO: SUCCESS!@#KODE 1!@#USER_ID 15!@#ACTIVITY_CODE 1
12/12/2022 01:33:15 AM script INFO: SUCCESS!@#KODE 1!@#USER_ID 15!@#ACTIVITY_CODE 2
12/12/2022 01:33:15 AM script INFO: SUCCESS!@#KODE 1!@#USER_ID 15!@#ACTIVITY_CODE 4
12/12/2022 01:33:16 AM script INFO: SUCCESS!@#KODE 1!@#USER_ID 15!@#ACTIVITY_CODE 1
12/12/2022 01:33:16 AM script INFO: SUCCESS!@#KODE 1!@#USER_ID 15!@#ACTIVITY_CODE 1
12/12/2022 01:33:16 AM script INFO: SUCCESS!@#KODE 1!@#USER_ID 15!@#ACTIVITY_CODE 4
12/12/2022 01:33:16 AM script INFO: SUCCESS!@#KODE 1!@#USER_ID 15!@#ACTIVITY_CODE 3
12/12/2022 01:33:16 AM script INFO: SUCCESS!@#KODE 1!@#USER_ID 15!@#ACTIVITY_CODE 3
12/12/2022 01:33:16 AM script INFO: SUCCESS!@#KODE 1!@#USER_ID 15!@#ACTIVITY_CODE 2
12/12/2022 01:33:16 AM script INFO: SUCCESS!@#KODE 1!@#USER_ID 15!@#ACTIVITY_CODE 2
12/12/2022 01:33:16 AM script INFO: SUCCESS!@#KODE 1!@#USER_ID 15!@#ACTIVITY_CODE 3
12/12/2022 01:33:16 AM script INFO: SUCCESS!@#KODE 1!@#USER_ID 15!@#ACTIVITY_CODE 1
12/12/2022 01:33:16 AM script INFO: SUCCESS!@#KODE 1!@#USER_ID 15!@#ACTIVITY_CODE 2
12/12/2022 01:33:16 AM script INFO: SUCCESS!@#KODE 1!@#USER_ID 15!@#ACTIVITY_CODE 1
12/12/2022 01:33:16 AM script INFO: SUCCESS!@#KODE 1!@#USER_ID 15!@#ACTIVITY_CODE 3
12/12/2022 01:33:16 AM script INFO: SUCCESS!@#KODE 1!@#USER_ID 15!@#ACTIVITY_CODE 1
12/12/2022 01:33:17 AM script INFO: SUCCESS!@#KODE 1!@#USER_ID 15!@#ACTIVITY_CODE 1
12/12/2022 01:33:17 AM script INFO: SUCCESS!@#KODE 1!@#USER_ID 15!@#ACTIVITY_CODE 2
12/12/2022 01:33:17 AM script INFO: SUCCESS!@#KODE 1!@#USER_ID 15!@#ACTIVITY_CODE 1
12/12/2022 01:33:17 AM script INFO: SUCCESS!@#KODE 1!@#USER_ID 15!@#ACTIVITY_CODE 2
12/12/2022 01:33:17 AM script INFO: SUCCESS!@#KODE 1!@#USER_ID 15!@#ACTIVITY_CODE 4
12/12/2022 01:33:17 AM script INFO: SUCCESS!@#KODE 1!@#USER_ID 15!@#ACTIVITY_CODE 1
12/12/2022 01:33:17 AM script INFO: SUCCESS!@#KODE 1!@#USER_ID 15!@#ACTIVITY_CODE 1
12/12/2022 01:33:17 AM script INFO: SUCCESS!@#KODE 1!@#USER_ID 15!@#ACTIVITY_CODE 4
12/12/2022 01:33:17 AM script INFO: SUCCESS!@#KODE 1!@#USER_ID 15!@#ACTIVITY_CODE 3
12/12/2022 01:33:17 AM script INFO: SUCCESS!@#KODE 1!@#USER_ID 15!@#ACTIVITY_CODE 1
12/12/2022 01:33:17 AM script INFO: SUCCESS!@#KODE 1!@#USER_ID 15!@#ACTIVITY_CODE 2
12/12/2022 01:33:17 AM script INFO: SUCCESS!@#KODE 1!@#USER_ID 15!@#ACTIVITY_CODE 4
12/12/2022 01:33:18 AM script INFO: SUCCESS!@#KODE 1!@#USER_ID 15!@#ACTIVITY_CODE 3
12/12/2022 01:33:18 AM script INFO: SUCCESS!@#KODE 1!@#USER_ID 15!@#ACTIVITY_CODE 3
12/12/2022 01:33:18 AM script INFO: SUCCESS!@#KODE 1!@#USER_ID 15!@#ACTIVITY_CODE 3
12/12/2022 01:33:18 AM script INFO: SUCCESS!@#KODE 1!@#USER_ID 15!@#ACTIVITY_CODE 1
12/12/2022 01:33:18 AM script INFO: SUCCESS!@#KODE 1!@#USER_ID 15!@#ACTIVITY_CODE 4
12/12/2022 01:33:18 AM script INFO: SUCCESS!@#KODE 1!@#USER_ID 15!@#ACTIVITY_CODE 3
12/12/2022 01:33:18 AM script INFO: SUCCESS!@#KODE 1!@#USER_ID 15!@#ACTIVITY_CODE 3
12/12/2022 01:33:18 AM script INFO: SUCCESS!@#KODE 1!@#USER_ID 15!@#ACTIVITY_CODE 3
12/12/2022 01:33:18 AM script INFO: SUCCESS!@#KODE 1!@#USER_ID 15!@#ACTIVITY_CODE 2
12/12/2022 01:33:18 AM script INFO: SUCCESS!@#KODE 1!@#USER_ID 15!@#ACTIVITY_CODE 3
12/12/2022 01:33:18 AM script INFO: SUCCESS!@#KODE 1!@#USER_ID 15!@#ACTIVITY_CODE 4
12/12/2022 01:33:18 AM script INFO: SUCCESS!@#KODE 1!@#USER_ID 15!@#ACTIVITY_CODE 3
12/12/2022 01:33:18 AM script INFO: SUCCESS!@#KODE 1!@#USER_ID 15!@#ACTIVITY_CODE 1
12/12/2022 01:33:18 AM script INFO: SUCCESS!@#KODE 1!@#USER_ID 15!@#ACTIVITY_CODE 3
12/12/2022 01:33:18 AM script INFO: SUCCESS!@#KODE 1!@#USER_ID 15!@#ACTIVITY_CODE 3
12/12/2022 01:33:19 AM script INFO: SUCCESS!@#KODE 1!@#USER_ID 15!@#ACTIVITY_CODE 4
12/12/2022 01:33:19 AM script INFO: SUCCESS!@#KODE 1!@#USER_ID 15!@#ACTIVITY_CODE 3
12/12/2022 01:33:19 AM script INFO: SUCCESS!@#KODE 1!@#USER_ID 15!@#ACTIVITY_CODE 1
12/12/2022 01:33:19 AM script INFO: SUCCESS!@#KODE 1!@#USER_ID 15!@#ACTIVITY_CODE 2
12/12/2022 01:33:19 AM script INFO: SUCCESS!@#KODE 1!@#USER_ID 15!@#ACTIVITY_CODE 2
12/12/2022 01:33:19 AM script INFO: SUCCESS!@#KODE 1!@#USER_ID 15!@#ACTIVITY_CODE 3
12/12/2022 01:33:19 AM script INFO: SUCCESS!@#KODE 1!@#USER_ID 15!@#ACTIVITY_CODE 1
12/12/2022 01:33:19 AM script INFO: SUCCESS!@#KODE 1!@#USER_ID 15!@#ACTIVITY_CODE 2
12/12/2022 01:33:19 AM script INFO: SUCCESS!@#KODE 1!@#USER_ID 15!@#ACTIVITY_CODE 1
12/12/2022 01:33:20 AM script INFO: SUCCESS!@#KODE 1!@#USER_ID 15!@#ACTIVITY_CODE 2
12/12/2022 01:33:20 AM script INFO: SUCCESS!@#KODE 1!@#USER_ID 15!@#ACTIVITY_CODE 2
12/12/2022 01:33:20 AM script INFO: SUCCESS!@#KODE 1!@#USER_ID 15!@#ACTIVITY_CODE 2
12/12/2022 01:33:20 AM script INFO: SUCCESS!@#KODE 1!@#USER_ID 15!@#ACTIVITY_CODE 3
12/12/2022 01:33:20 AM script INFO: SUCCESS!@#KODE 1!@#USER_ID 15!@#ACTIVITY_CODE 4
12/12/2022 01:33:20 AM script INFO: SUCCESS!@#KODE 1!@#USER_ID 15!@#ACTIVITY_CODE 2
12/12/2022 01:33:20 AM script INFO: SUCCESS!@#KODE 1!@#USER_ID 15!@#ACTIVITY_CODE 4
12/12/2022 01:33:20 AM script INFO: SUCCESS!@#KODE 1!@#USER_ID 15!@#ACTIVITY_CODE 3
12/12/2022 01:33:21 AM script INFO: SUCCESS!@#KODE 1!@#USER_ID 15!@#ACTIVITY_CODE 2
12/12/2022 01:33:21 AM script INFO: SUCCESS!@#KODE 1!@#USER_ID 15!@#ACTIVITY_CODE 1
12/12/2022 01:33:21 AM script INFO: SUCCESS!@#KODE 1!@#USER_ID 15!@#ACTIVITY_CODE 3
12/12/2022 01:33:21 AM script INFO: SUCCESS!@#KODE 1!@#USER_ID 15!@#ACTIVITY_CODE 4
12/12/2022 01:33:21 AM script INFO: SUCCESS!@#KODE 1!@#USER_ID 15!@#ACTIVITY_CODE 1
12/12/2022 01:33:21 AM script INFO: SUCCESS!@#KODE 1!@#USER_ID 15!@#ACTIVITY_CODE 4
12/12/2022 01:33:21 AM script INFO: SUCCESS!@#KODE 1!@#USER_ID 15!@#ACTIVITY_CODE 2
12/12/2022 01:33:21 AM script INFO: SUCCESS!@#KODE 1!@#USER_ID 15!@#ACTIVITY_CODE 3
12/12/2022 01:33:21 AM script INFO: SUCCESS!@#KODE 1!@#USER_ID 15!@#ACTIVITY_CODE 2
12/12/2022 01:33:22 AM script INFO: SUCCESS!@#KODE 1!@#USER_ID 15!@#ACTIVITY_CODE 2
12/12/2022 01:33:22 AM script INFO: SUCCESS!@#KODE 1!@#USER_ID 15!@#ACTIVITY_CODE 1
12/12/2022 01:33:22 AM script INFO: SUCCESS!@#KODE 1!@#USER_ID 15!@#ACTIVITY_CODE 1
12/12/2022 01:33:22 AM script INFO: SUCCESS!@#KODE 1!@#USER_ID 15!@#ACTIVITY_CODE 3
12/12/2022 01:33:22 AM script INFO: SUCCESS!@#KODE 1!@#USER_ID 15!@#ACTIVITY_CODE 2
12/12/2022 01:33:22 AM script INFO: SUCCESS!@#KODE 1!@#USER_ID 15!@#ACTIVITY_CODE 1
12/12/2022 01:33:22 AM script INFO: SUCCESS!@#KODE 1!@#USER_ID 15!@#ACTIVITY_CODE 4
12/12/2022 01:33:22 AM script INFO: SUCCESS!@#KODE 1!@#USER_ID 15!@#ACTIVITY_CODE 3
12/12/2022 01:33:22 AM script INFO: SUCCESS!@#KODE 1!@#USER_ID 15!@#ACTIVITY_CODE 2
12/12/2022 01:33:22 AM script INFO: SUCCESS!@#KODE 1!@#USER_ID 15!@#ACTIVITY_CODE 3
12/12/2022 01:33:22 AM script INFO: SUCCESS!@#KODE 1!@#USER_ID 15!@#ACTIVITY_CODE 2
12/12/2022 01:33:23 AM script INFO: SUCCESS!@#KODE 1!@#USER_ID 15!@#ACTIVITY_CODE 2
12/12/2022 01:33:23 AM script INFO: SUCCESS!@#KODE 1!@#USER_ID 15!@#ACTIVITY_CODE 3
12/12/2022 01:33:23 AM script INFO: SUCCESS!@#KODE 1!@#USER_ID 15!@#ACTIVITY_CODE 2
12/12/2022 01:33:23 AM script INFO: SUCCESS!@#KODE 1!@#USER_ID 15!@#ACTIVITY_CODE 1
12/12/2022 01:33:23 AM script INFO: SUCCESS!@#KODE 1!@#USER_ID 15!@#ACTIVITY_CODE 1
12/12/2022 01:33:23 AM script INFO: SUCCESS!@#KODE 1!@#USER_ID 15!@#ACTIVITY_CODE 2
12/12/2022 01:33:23 AM script INFO: SUCCESS!@#KODE 1!@#USER_ID 15!@#ACTIVITY_CODE 2
12/12/2022 01:33:23 AM script INFO: SUCCESS!@#KODE 1!@#USER_ID 15!@#ACTIVITY_CODE 1
12/12/2022 01:33:23 AM script INFO: SUCCESS!@#KODE 1!@#USER_ID 15!@#ACTIVITY_CODE 3
12/12/2022 01:33:23 AM script INFO: SUCCESS!@#KODE 1!@#USER_ID 15!@#ACTIVITY_CODE 1
12/12/2022 01:33:23 AM script INFO: SUCCESS!@#KODE 1!@#USER_ID 15!@#ACTIVITY_CODE 1
12/12/2022 01:33:23 AM script INFO: SUCCESS!@#KODE 1!@#USER_ID 15!@#ACTIVITY_CODE 1
12/12/2022 01:33:24 AM script INFO: SUCCESS!@#KODE 1!@#USER_ID 15!@#ACTIVITY_CODE 3
12/12/2022 01:33:24 AM script INFO: SUCCESS!@#KODE 1!@#USER_ID 15!@#ACTIVITY_CODE 3
12/12/2022 01:33:24 AM script INFO: SUCCESS!@#KODE 1!@#USER_ID 15!@#ACTIVITY_CODE 3
12/12/2022 01:33:24 AM script INFO: SUCCESS!@#KODE 1!@#USER_ID 15!@#ACTIVITY_CODE 4
12/12/2022 01:33:24 AM script INFO: SUCCESS!@#KODE 1!@#USER_ID 15!@#ACTIVITY_CODE 3
12/12/2022 01:33:24 AM script INFO: SUCCESS!@#KODE 1!@#USER_ID 15!@#ACTIVITY_CODE 3
12/12/2022 01:33:24 AM script INFO: SUCCESS!@#KODE 1!@#USER_ID 15!@#ACTIVITY_CODE 1
12/12/2022 01:33:24 AM script INFO: SUCCESS!@#KODE 1!@#USER_ID 15!@#ACTIVITY_CODE 3
12/12/2022 01:33:24 AM script INFO: SUCCESS!@#KODE 1!@#USER_ID 15!@#ACTIVITY_CODE 1
12/12/2022 01:33:24 AM script INFO: SUCCESS!@#KODE 1!@#USER_ID 15!@#ACTIVITY_CODE 4
12/12/2022 01:33:24 AM script INFO: SUCCESS!@#KODE 1!@#USER_ID 15!@#ACTIVITY_CODE 1
12/12/2022 01:33:24 AM script INFO: SUCCESS!@#KODE 1!@#USER_ID 15!@#ACTIVITY_CODE 3
12/12/2022 01:33:24 AM script INFO: SUCCESS!@#KODE 1!@#USER_ID 15!@#ACTIVITY_CODE 3
12/12/2022 01:33:24 AM script INFO: SUCCESS!@#KODE 1!@#USER_ID 15!@#ACTIVITY_CODE 2
12/12/2022 01:33:25 AM script INFO: SUCCESS!@#KODE 1!@#USER_ID 15!@#ACTIVITY_CODE 1
12/12/2022 01:33:25 AM script INFO: SUCCESS!@#KODE 1!@#USER_ID 15!@#ACTIVITY_CODE 2
12/12/2022 01:33:25 AM script INFO: SUCCESS!@#KODE 1!@#USER_ID 15!@#ACTIVITY_CODE 3
12/12/2022 01:33:25 AM script INFO: SUCCESS!@#KODE 1!@#USER_ID 15!@#ACTIVITY_CODE 2
12/12/2022 01:33:25 AM script INFO: SUCCESS!@#KODE 1!@#USER_ID 15!@#ACTIVITY_CODE 3
12/12/2022 01:33:25 AM script INFO: SUCCESS!@#KODE 1!@#USER_ID 15!@#ACTIVITY_CODE 1
12/12/2022 01:33:25 AM script INFO: SUCCESS!@#KODE 1!@#USER_ID 15!@#ACTIVITY_CODE 2
12/12/2022 01:33:25 AM script INFO: SUCCESS!@#KODE 1!@#USER_ID 15!@#ACTIVITY_CODE 1
12/12/2022 01:33:25 AM script INFO: SUCCESS!@#KODE 1!@#USER_ID 15!@#ACTIVITY_CODE 4
12/12/2022 01:33:26 AM script INFO: SUCCESS!@#KODE 1!@#USER_ID 15!@#ACTIVITY_CODE 2
12/12/2022 01:33:26 AM script INFO: SUCCESS!@#KODE 1!@#USER_ID 15!@#ACTIVITY_CODE 2
12/12/2022 01:33:26 AM script INFO: SUCCESS!@#KODE 1!@#USER_ID 15!@#ACTIVITY_CODE 4
12/12/2022 01:33:26 AM script INFO: SUCCESS!@#KODE 1!@#USER_ID 15!@#ACTIVITY_CODE 1
12/12/2022 01:33:26 AM script INFO: SUCCESS!@#KODE 1!@#USER_ID 15!@#ACTIVITY_CODE 1
12/12/2022 01:33:26 AM script INFO: SUCCESS!@#KODE 1!@#USER_ID 15!@#ACTIVITY_CODE 1
12/12/2022 01:33:26 AM script INFO: SUCCESS!@#KODE 1!@#USER_ID 15!@#ACTIVITY_CODE 3
12/12/2022 01:33:26 AM script INFO: SUCCESS!@#KODE 1!@#USER_ID 15!@#ACTIVITY_CODE 4
12/12/2022 01:33:26 AM script INFO: SUCCESS!@#KODE 1!@#USER_ID 15!@#ACTIVITY_CODE 2
12/12/2022 01:33:26 AM script INFO: SUCCESS!@#KODE 1!@#USER_ID 15!@#ACTIVITY_CODE 4
12/12/2022 01:33:26 AM script INFO: SUCCESS!@#KODE 1!@#USER_ID 15!@#ACTIVITY_CODE 2
12/12/2022 01:33:27 AM script INFO: SUCCESS!@#KODE 1!@#USER_ID 15!@#ACTIVITY_CODE 1
12/12/2022 01:33:27 AM script INFO: SUCCESS!@#KODE 1!@#USER_ID 15!@#ACTIVITY_CODE 3
12/12/2022 01:33:27 AM script INFO: SUCCESS!@#KODE 1!@#USER_ID 15!@#ACTIVITY_CODE 2
12/12/2022 01:33:27 AM script INFO: SUCCESS!@#KODE 1!@#USER_ID 15!@#ACTIVITY_CODE 1
12/12/2022 01:33:27 AM script INFO: SUCCESS!@#KODE 1!@#USER_ID 15!@#ACTIVITY_CODE 3
12/12/2022 01:33:27 AM script INFO: SUCCESS!@#KODE 1!@#USER_ID 15!@#ACTIVITY_CODE 4
12/12/2022 01:33:27 AM script INFO: SUCCESS!@#KODE 1!@#USER_ID 15!@#ACTIVITY_CODE 3
12/12/2022 01:33:27 AM script INFO: SUCCESS!@#KODE 1!@#USER_ID 15!@#ACTIVITY_CODE 2
12/12/2022 01:33:27 AM script INFO: SUCCESS!@#KODE 1!@#USER_ID 15!@#ACTIVITY_CODE 1
12/12/2022 01:33:27 AM script INFO: SUCCESS!@#KODE 1!@#USER_ID 15!@#ACTIVITY_CODE 3
12/12/2022 01:33:27 AM script INFO: SUCCESS!@#KODE 1!@#USER_ID 15!@#ACTIVITY_CODE 2
12/12/2022 01:33:28 AM script INFO: SUCCESS!@#KODE 1!@#USER_ID 15!@#ACTIVITY_CODE 2
12/12/2022 01:33:28 AM script INFO: SUCCESS!@#KODE 1!@#USER_ID 15!@#ACTIVITY_CODE 3
12/12/2022 01:33:28 AM script INFO: SUCCESS!@#KODE 1!@#USER_ID 15!@#ACTIVITY_CODE 3
12/12/2022 01:33:28 AM script INFO: SUCCESS!@#KODE 1!@#USER_ID 15!@#ACTIVITY_CODE 3
12/12/2022 01:33:28 AM script INFO: SUCCESS!@#KODE 1!@#USER_ID 15!@#ACTIVITY_CODE 2
12/12/2022 01:33:28 AM script INFO: SUCCESS!@#KODE 1!@#USER_ID 15!@#ACTIVITY_CODE 3
12/12/2022 01:33:28 AM script INFO: SUCCESS!@#KODE 1!@#USER_ID 15!@#ACTIVITY_CODE 2
12/12/2022 01:33:28 AM script INFO: SUCCESS!@#KODE 1!@#USER_ID 15!@#ACTIVITY_CODE 3
12/12/2022 01:33:28 AM script INFO: SUCCESS!@#KODE 1!@#USER_ID 15!@#ACTIVITY_CODE 2
12/12/2022 01:33:29 AM script INFO: SUCCESS!@#KODE 1!@#USER_ID 15!@#ACTIVITY_CODE 1
12/12/2022 01:33:29 AM script INFO: SUCCESS!@#KODE 1!@#USER_ID 15!@#ACTIVITY_CODE 4
12/12/2022 01:33:29 AM script INFO: SUCCESS!@#KODE 1!@#USER_ID 15!@#ACTIVITY_CODE 2
12/12/2022 01:33:29 AM script INFO: SUCCESS!@#KODE 1!@#USER_ID 15!@#ACTIVITY_CODE 4
12/12/2022 01:33:29 AM script INFO: SUCCESS!@#KODE 1!@#USER_ID 15!@#ACTIVITY_CODE 1
12/12/2022 01:33:29 AM script INFO: SUCCESS!@#KODE 1!@#USER_ID 15!@#ACTIVITY_CODE 2
12/12/2022 01:33:29 AM script INFO: SUCCESS!@#KODE 1!@#USER_ID 15!@#ACTIVITY_CODE 1
12/12/2022 01:33:29 AM script INFO: Duration: 60.287943840026855
12/12/2022 01:33:29 AM script INFO: mengakhiri-quiz
12/12/2022 01:34:00 AM script INFO: SUCCESS!@#KODE 1!@#USER_ID 15!@#ACTIVITY_CODE 5
12/12/2022 01:34:00 AM script INFO: berhasil-submit
