12/23/2022 03:21:10 AM script INFO: Prepared chrome options..
12/23/2022 03:21:11 AM script INFO: Initialized chrome browser..
12/23/2022 03:21:11 AM script INFO: mengakses-homepage
12/23/2022 03:21:36 AM script INFO: mengakses-login-page
12/23/2022 03:21:37 AM script INFO: mengakses-site-home
12/23/2022 03:21:37 AM script INFO: mengakses-site-course
12/23/2022 03:21:38 AM script INFO: mengakses-quiz
12/23/2022 03:21:39 AM script INFO: mengakses-start-quiz-page
12/23/2022 03:21:40 AM script INFO: memulai-quiz
12/23/2022 03:21:40 AM script INFO: SUCCESS!@#KODE 1!@#USER_ID 28!@#ACTIVITY_CODE 5
12/23/2022 03:21:51 AM script INFO: SUCCESS!@#KODE 1!@#USER_ID 28!@#ACTIVITY_CODE 3
12/23/2022 03:21:51 AM script INFO: SUCCESS!@#KODE 1!@#USER_ID 28!@#ACTIVITY_CODE 2
12/23/2022 03:21:51 AM script INFO: SUCCESS!@#KODE 1!@#USER_ID 28!@#ACTIVITY_CODE 3
12/23/2022 03:21:51 AM script INFO: SUCCESS!@#KODE 1!@#USER_ID 28!@#ACTIVITY_CODE 5
12/23/2022 03:21:51 AM script INFO: SUCCESS!@#KODE 1!@#USER_ID 28!@#ACTIVITY_CODE 5
12/23/2022 03:21:53 AM script INFO: SUCCESS!@#KODE 1!@#USER_ID 28!@#ACTIVITY_CODE 5
12/23/2022 03:21:53 AM script INFO: SUCCESS!@#KODE 1!@#USER_ID 28!@#ACTIVITY_CODE 5
12/23/2022 03:21:56 AM script INFO: SUCCESS!@#KODE 1!@#USER_ID 28!@#ACTIVITY_CODE 5
12/23/2022 03:21:56 AM script INFO: SUCCESS!@#KODE 1!@#USER_ID 28!@#ACTIVITY_CODE 5
12/23/2022 03:21:59 AM script INFO: SUCCESS!@#KODE 1!@#USER_ID 28!@#ACTIVITY_CODE 2
12/23/2022 03:21:59 AM script INFO: SUCCESS!@#KODE 1!@#USER_ID 28!@#ACTIVITY_CODE 3
12/23/2022 03:21:59 AM script INFO: SUCCESS!@#KODE 1!@#USER_ID 28!@#ACTIVITY_CODE 2
12/23/2022 03:21:59 AM script INFO: SUCCESS!@#KODE 1!@#USER_ID 28!@#ACTIVITY_CODE 1
12/23/2022 03:21:59 AM script INFO: SUCCESS!@#KODE 1!@#USER_ID 28!@#ACTIVITY_CODE 5
12/23/2022 03:21:59 AM script INFO: SUCCESS!@#KODE 1!@#USER_ID 28!@#ACTIVITY_CODE 5
12/23/2022 03:22:01 AM script INFO: SUCCESS!@#KODE 1!@#USER_ID 28!@#ACTIVITY_CODE 3
12/23/2022 03:22:02 AM script INFO: SUCCESS!@#KODE 1!@#USER_ID 28!@#ACTIVITY_CODE 3
12/23/2022 03:22:02 AM script INFO: SUCCESS!@#KODE 1!@#USER_ID 28!@#ACTIVITY_CODE 1
12/23/2022 03:22:02 AM script INFO: SUCCESS!@#KODE 1!@#USER_ID 28!@#ACTIVITY_CODE 1
12/23/2022 03:22:02 AM script INFO: SUCCESS!@#KODE 1!@#USER_ID 28!@#ACTIVITY_CODE 1
12/23/2022 03:22:02 AM script INFO: SUCCESS!@#KODE 1!@#USER_ID 28!@#ACTIVITY_CODE 3
12/23/2022 03:22:02 AM script INFO: SUCCESS!@#KODE 1!@#USER_ID 28!@#ACTIVITY_CODE 1
12/23/2022 03:22:02 AM script INFO: SUCCESS!@#KODE 1!@#USER_ID 28!@#ACTIVITY_CODE 5
12/23/2022 03:22:02 AM script INFO: SUCCESS!@#KODE 1!@#USER_ID 28!@#ACTIVITY_CODE 5
12/23/2022 03:22:05 AM script INFO: SUCCESS!@#KODE 1!@#USER_ID 28!@#ACTIVITY_CODE 2
12/23/2022 03:22:05 AM script INFO: SUCCESS!@#KODE 1!@#USER_ID 28!@#ACTIVITY_CODE 5
12/23/2022 03:22:05 AM script INFO: SUCCESS!@#KODE 1!@#USER_ID 28!@#ACTIVITY_CODE 5
12/23/2022 03:22:07 AM script INFO: SUCCESS!@#KODE 1!@#USER_ID 28!@#ACTIVITY_CODE 2
12/23/2022 03:22:07 AM script INFO: SUCCESS!@#KODE 1!@#USER_ID 28!@#ACTIVITY_CODE 3
12/23/2022 03:22:07 AM script INFO: SUCCESS!@#KODE 1!@#USER_ID 28!@#ACTIVITY_CODE 2
12/23/2022 03:22:08 AM script INFO: SUCCESS!@#KODE 1!@#USER_ID 28!@#ACTIVITY_CODE 1
12/23/2022 03:22:08 AM script INFO: SUCCESS!@#KODE 1!@#USER_ID 28!@#ACTIVITY_CODE 5
12/23/2022 03:22:08 AM script INFO: SUCCESS!@#KODE 1!@#USER_ID 28!@#ACTIVITY_CODE 5
12/23/2022 03:22:10 AM script INFO: SUCCESS!@#KODE 1!@#USER_ID 28!@#ACTIVITY_CODE 3
12/23/2022 03:22:10 AM script INFO: SUCCESS!@#KODE 1!@#USER_ID 28!@#ACTIVITY_CODE 5
12/23/2022 03:22:10 AM script INFO: SUCCESS!@#KODE 1!@#USER_ID 28!@#ACTIVITY_CODE 5
12/23/2022 03:22:13 AM script INFO: SUCCESS!@#KODE 1!@#USER_ID 28!@#ACTIVITY_CODE 4
12/23/2022 03:22:13 AM script INFO: SUCCESS!@#KODE 1!@#USER_ID 28!@#ACTIVITY_CODE 3
12/23/2022 03:22:13 AM script INFO: SUCCESS!@#KODE 1!@#USER_ID 28!@#ACTIVITY_CODE 1
12/23/2022 03:22:13 AM script INFO: SUCCESS!@#KODE 1!@#USER_ID 28!@#ACTIVITY_CODE 5
12/23/2022 03:22:13 AM script INFO: SUCCESS!@#KODE 1!@#USER_ID 28!@#ACTIVITY_CODE 5
12/23/2022 03:22:16 AM script INFO: SUCCESS!@#KODE 1!@#USER_ID 28!@#ACTIVITY_CODE 2
12/23/2022 03:22:16 AM script INFO: SUCCESS!@#KODE 1!@#USER_ID 28!@#ACTIVITY_CODE 1
12/23/2022 03:22:16 AM script INFO: SUCCESS!@#KODE 1!@#USER_ID 28!@#ACTIVITY_CODE 5
12/23/2022 03:22:16 AM script INFO: SUCCESS!@#KODE 1!@#USER_ID 28!@#ACTIVITY_CODE 5
12/23/2022 03:22:18 AM script INFO: SUCCESS!@#KODE 1!@#USER_ID 28!@#ACTIVITY_CODE 3
12/23/2022 03:22:19 AM script INFO: SUCCESS!@#KODE 1!@#USER_ID 28!@#ACTIVITY_CODE 4
12/23/2022 03:22:19 AM script INFO: SUCCESS!@#KODE 1!@#USER_ID 28!@#ACTIVITY_CODE 5
12/23/2022 03:22:19 AM script INFO: SUCCESS!@#KODE 1!@#USER_ID 28!@#ACTIVITY_CODE 5
12/23/2022 03:22:21 AM script INFO: SUCCESS!@#KODE 1!@#USER_ID 28!@#ACTIVITY_CODE 2
12/23/2022 03:22:21 AM script INFO: SUCCESS!@#KODE 1!@#USER_ID 28!@#ACTIVITY_CODE 1
12/23/2022 03:22:21 AM script INFO: SUCCESS!@#KODE 1!@#USER_ID 28!@#ACTIVITY_CODE 3
12/23/2022 03:22:21 AM script INFO: SUCCESS!@#KODE 1!@#USER_ID 28!@#ACTIVITY_CODE 4
12/23/2022 03:22:22 AM script INFO: SUCCESS!@#KODE 1!@#USER_ID 28!@#ACTIVITY_CODE 1
12/23/2022 03:22:22 AM script INFO: SUCCESS!@#KODE 1!@#USER_ID 28!@#ACTIVITY_CODE 3
12/23/2022 03:22:22 AM script INFO: SUCCESS!@#KODE 1!@#USER_ID 28!@#ACTIVITY_CODE 1
12/23/2022 03:22:22 AM script INFO: SUCCESS!@#KODE 1!@#USER_ID 28!@#ACTIVITY_CODE 2
12/23/2022 03:22:22 AM script INFO: SUCCESS!@#KODE 1!@#USER_ID 28!@#ACTIVITY_CODE 3
12/23/2022 03:22:22 AM script INFO: SUCCESS!@#KODE 1!@#USER_ID 28!@#ACTIVITY_CODE 3
12/23/2022 03:22:22 AM script INFO: SUCCESS!@#KODE 1!@#USER_ID 28!@#ACTIVITY_CODE 1
12/23/2022 03:22:22 AM script INFO: SUCCESS!@#KODE 1!@#USER_ID 28!@#ACTIVITY_CODE 3
12/23/2022 03:22:22 AM script INFO: SUCCESS!@#KODE 1!@#USER_ID 28!@#ACTIVITY_CODE 1
12/23/2022 03:22:22 AM script INFO: SUCCESS!@#KODE 1!@#USER_ID 28!@#ACTIVITY_CODE 1
12/23/2022 03:22:22 AM script INFO: SUCCESS!@#KODE 1!@#USER_ID 28!@#ACTIVITY_CODE 4
12/23/2022 03:22:22 AM script INFO: SUCCESS!@#KODE 1!@#USER_ID 28!@#ACTIVITY_CODE 2
12/23/2022 03:22:23 AM script INFO: SUCCESS!@#KODE 1!@#USER_ID 28!@#ACTIVITY_CODE 4
12/23/2022 03:22:23 AM script INFO: SUCCESS!@#KODE 1!@#USER_ID 28!@#ACTIVITY_CODE 2
12/23/2022 03:22:23 AM script INFO: SUCCESS!@#KODE 1!@#USER_ID 28!@#ACTIVITY_CODE 2
12/23/2022 03:22:23 AM script INFO: SUCCESS!@#KODE 1!@#USER_ID 28!@#ACTIVITY_CODE 4
12/23/2022 03:22:23 AM script INFO: SUCCESS!@#KODE 1!@#USER_ID 28!@#ACTIVITY_CODE 2
12/23/2022 03:22:23 AM script INFO: SUCCESS!@#KODE 1!@#USER_ID 28!@#ACTIVITY_CODE 1
12/23/2022 03:22:23 AM script INFO: SUCCESS!@#KODE 1!@#USER_ID 28!@#ACTIVITY_CODE 3
12/23/2022 03:22:23 AM script INFO: SUCCESS!@#KODE 1!@#USER_ID 28!@#ACTIVITY_CODE 1
12/23/2022 03:22:24 AM script INFO: SUCCESS!@#KODE 1!@#USER_ID 28!@#ACTIVITY_CODE 2
12/23/2022 03:22:24 AM script INFO: SUCCESS!@#KODE 1!@#USER_ID 28!@#ACTIVITY_CODE 3
12/23/2022 03:22:24 AM script INFO: SUCCESS!@#KODE 1!@#USER_ID 28!@#ACTIVITY_CODE 2
12/23/2022 03:22:24 AM script INFO: SUCCESS!@#KODE 1!@#USER_ID 28!@#ACTIVITY_CODE 1
12/23/2022 03:22:24 AM script INFO: SUCCESS!@#KODE 1!@#USER_ID 28!@#ACTIVITY_CODE 3
12/23/2022 03:22:24 AM script INFO: SUCCESS!@#KODE 1!@#USER_ID 28!@#ACTIVITY_CODE 2
12/23/2022 03:22:24 AM script INFO: SUCCESS!@#KODE 1!@#USER_ID 28!@#ACTIVITY_CODE 2
12/23/2022 03:22:25 AM script INFO: SUCCESS!@#KODE 1!@#USER_ID 28!@#ACTIVITY_CODE 2
12/23/2022 03:22:25 AM script INFO: SUCCESS!@#KODE 1!@#USER_ID 28!@#ACTIVITY_CODE 4
12/23/2022 03:22:25 AM script INFO: SUCCESS!@#KODE 1!@#USER_ID 28!@#ACTIVITY_CODE 1
12/23/2022 03:22:25 AM script INFO: SUCCESS!@#KODE 1!@#USER_ID 28!@#ACTIVITY_CODE 4
12/23/2022 03:22:25 AM script INFO: SUCCESS!@#KODE 1!@#USER_ID 28!@#ACTIVITY_CODE 2
12/23/2022 03:22:25 AM script INFO: SUCCESS!@#KODE 1!@#USER_ID 28!@#ACTIVITY_CODE 3
12/23/2022 03:22:25 AM script INFO: SUCCESS!@#KODE 1!@#USER_ID 28!@#ACTIVITY_CODE 1
12/23/2022 03:22:25 AM script INFO: SUCCESS!@#KODE 1!@#USER_ID 28!@#ACTIVITY_CODE 3
12/23/2022 03:22:25 AM script INFO: SUCCESS!@#KODE 1!@#USER_ID 28!@#ACTIVITY_CODE 2
12/23/2022 03:22:26 AM script INFO: SUCCESS!@#KODE 1!@#USER_ID 28!@#ACTIVITY_CODE 3
12/23/2022 03:22:26 AM script INFO: SUCCESS!@#KODE 1!@#USER_ID 28!@#ACTIVITY_CODE 3
12/23/2022 03:22:26 AM script INFO: SUCCESS!@#KODE 1!@#USER_ID 28!@#ACTIVITY_CODE 3
12/23/2022 03:22:26 AM script INFO: SUCCESS!@#KODE 1!@#USER_ID 28!@#ACTIVITY_CODE 3
12/23/2022 03:22:26 AM script INFO: SUCCESS!@#KODE 1!@#USER_ID 28!@#ACTIVITY_CODE 1
12/23/2022 03:22:26 AM script INFO: SUCCESS!@#KODE 1!@#USER_ID 28!@#ACTIVITY_CODE 3
12/23/2022 03:22:26 AM script INFO: SUCCESS!@#KODE 1!@#USER_ID 28!@#ACTIVITY_CODE 2
12/23/2022 03:22:26 AM script INFO: SUCCESS!@#KODE 1!@#USER_ID 28!@#ACTIVITY_CODE 3
12/23/2022 03:22:26 AM script INFO: SUCCESS!@#KODE 1!@#USER_ID 28!@#ACTIVITY_CODE 3
12/23/2022 03:22:26 AM script INFO: Duration: 35.80713987350464
12/23/2022 03:22:26 AM script INFO: mengakhiri-quiz
12/23/2022 03:22:27 AM script INFO: SUCCESS!@#KODE 1!@#USER_ID 28!@#ACTIVITY_CODE 5
12/23/2022 03:22:27 AM script INFO: berhasil-submit
