12/12/2022 01:44:27 AM script INFO: Prepared chrome options..
12/12/2022 01:44:29 AM script INFO: Initialized chrome browser..
12/12/2022 01:44:29 AM script INFO: mengakses-homepage
12/12/2022 01:45:01 AM script INFO: mengakses-login-page
12/12/2022 01:45:02 AM script INFO: mengakses-site-home
12/12/2022 01:45:03 AM script INFO: mengakses-site-course
12/12/2022 01:45:03 AM script INFO: mengakses-quiz
12/12/2022 01:45:04 AM script INFO: mengakses-start-quiz-page
12/12/2022 01:45:05 AM script INFO: memulai-quiz
12/12/2022 01:45:05 AM script INFO: SUCCESS!@#KODE 1!@#USER_ID 9!@#ACTIVITY_CODE 5
12/12/2022 01:45:16 AM script INFO: SUCCESS!@#KODE 1!@#USER_ID 9!@#ACTIVITY_CODE 5
12/12/2022 01:45:16 AM script INFO: SUCCESS!@#KODE 1!@#USER_ID 9!@#ACTIVITY_CODE 5
12/12/2022 01:45:18 AM script INFO: SUCCESS!@#KODE 1!@#USER_ID 9!@#ACTIVITY_CODE 2
12/12/2022 01:45:18 AM script INFO: SUCCESS!@#KODE 1!@#USER_ID 9!@#ACTIVITY_CODE 5
12/12/2022 01:45:18 AM script INFO: SUCCESS!@#KODE 1!@#USER_ID 9!@#ACTIVITY_CODE 5
12/12/2022 01:45:21 AM script INFO: SUCCESS!@#KODE 1!@#USER_ID 9!@#ACTIVITY_CODE 5
12/12/2022 01:45:21 AM script INFO: SUCCESS!@#KODE 1!@#USER_ID 9!@#ACTIVITY_CODE 5
12/12/2022 01:45:23 AM script INFO: SUCCESS!@#KODE 1!@#USER_ID 9!@#ACTIVITY_CODE 3
12/12/2022 01:45:24 AM script INFO: SUCCESS!@#KODE 1!@#USER_ID 9!@#ACTIVITY_CODE 1
12/12/2022 01:45:24 AM script INFO: SUCCESS!@#KODE 1!@#USER_ID 9!@#ACTIVITY_CODE 5
12/12/2022 01:45:24 AM script INFO: SUCCESS!@#KODE 1!@#USER_ID 9!@#ACTIVITY_CODE 5
12/12/2022 01:45:26 AM script INFO: SUCCESS!@#KODE 1!@#USER_ID 9!@#ACTIVITY_CODE 2
12/12/2022 01:45:26 AM script INFO: SUCCESS!@#KODE 1!@#USER_ID 9!@#ACTIVITY_CODE 5
12/12/2022 01:45:26 AM script INFO: SUCCESS!@#KODE 1!@#USER_ID 9!@#ACTIVITY_CODE 5
12/12/2022 01:45:29 AM script INFO: SUCCESS!@#KODE 1!@#USER_ID 9!@#ACTIVITY_CODE 2
12/12/2022 01:45:29 AM script INFO: SUCCESS!@#KODE 1!@#USER_ID 9!@#ACTIVITY_CODE 2
12/12/2022 01:45:29 AM script INFO: SUCCESS!@#KODE 1!@#USER_ID 9!@#ACTIVITY_CODE 2
12/12/2022 01:45:29 AM script INFO: SUCCESS!@#KODE 1!@#USER_ID 9!@#ACTIVITY_CODE 3
12/12/2022 01:45:29 AM script INFO: SUCCESS!@#KODE 1!@#USER_ID 9!@#ACTIVITY_CODE 3
12/12/2022 01:45:30 AM script INFO: SUCCESS!@#KODE 1!@#USER_ID 9!@#ACTIVITY_CODE 2
12/12/2022 01:45:30 AM script INFO: SUCCESS!@#KODE 1!@#USER_ID 9!@#ACTIVITY_CODE 2
12/12/2022 01:45:30 AM script INFO: SUCCESS!@#KODE 1!@#USER_ID 9!@#ACTIVITY_CODE 3
12/12/2022 01:45:30 AM script INFO: SUCCESS!@#KODE 1!@#USER_ID 9!@#ACTIVITY_CODE 2
12/12/2022 01:45:30 AM script INFO: SUCCESS!@#KODE 1!@#USER_ID 9!@#ACTIVITY_CODE 5
12/12/2022 01:45:30 AM script INFO: SUCCESS!@#KODE 1!@#USER_ID 9!@#ACTIVITY_CODE 5
12/12/2022 01:45:33 AM script INFO: SUCCESS!@#KODE 1!@#USER_ID 9!@#ACTIVITY_CODE 2
12/12/2022 01:45:33 AM script INFO: SUCCESS!@#KODE 1!@#USER_ID 9!@#ACTIVITY_CODE 1
12/12/2022 01:45:33 AM script INFO: SUCCESS!@#KODE 1!@#USER_ID 9!@#ACTIVITY_CODE 5
12/12/2022 01:45:33 AM script INFO: SUCCESS!@#KODE 1!@#USER_ID 9!@#ACTIVITY_CODE 5
12/12/2022 01:45:35 AM script INFO: SUCCESS!@#KODE 1!@#USER_ID 9!@#ACTIVITY_CODE 3
12/12/2022 01:45:35 AM script INFO: SUCCESS!@#KODE 1!@#USER_ID 9!@#ACTIVITY_CODE 1
12/12/2022 01:45:35 AM script INFO: SUCCESS!@#KODE 1!@#USER_ID 9!@#ACTIVITY_CODE 1
12/12/2022 01:45:36 AM script INFO: SUCCESS!@#KODE 1!@#USER_ID 9!@#ACTIVITY_CODE 1
12/12/2022 01:45:36 AM script INFO: SUCCESS!@#KODE 1!@#USER_ID 9!@#ACTIVITY_CODE 3
12/12/2022 01:45:36 AM script INFO: SUCCESS!@#KODE 1!@#USER_ID 9!@#ACTIVITY_CODE 3
12/12/2022 01:45:36 AM script INFO: SUCCESS!@#KODE 1!@#USER_ID 9!@#ACTIVITY_CODE 3
12/12/2022 01:45:36 AM script INFO: SUCCESS!@#KODE 1!@#USER_ID 9!@#ACTIVITY_CODE 2
12/12/2022 01:45:36 AM script INFO: SUCCESS!@#KODE 1!@#USER_ID 9!@#ACTIVITY_CODE 1
12/12/2022 01:45:36 AM script INFO: SUCCESS!@#KODE 1!@#USER_ID 9!@#ACTIVITY_CODE 5
12/12/2022 01:45:36 AM script INFO: SUCCESS!@#KODE 1!@#USER_ID 9!@#ACTIVITY_CODE 5
12/12/2022 01:45:39 AM script INFO: SUCCESS!@#KODE 1!@#USER_ID 9!@#ACTIVITY_CODE 4
12/12/2022 01:45:39 AM script INFO: SUCCESS!@#KODE 1!@#USER_ID 9!@#ACTIVITY_CODE 5
12/12/2022 01:45:39 AM script INFO: SUCCESS!@#KODE 1!@#USER_ID 9!@#ACTIVITY_CODE 5
12/12/2022 01:45:41 AM script INFO: SUCCESS!@#KODE 1!@#USER_ID 9!@#ACTIVITY_CODE 2
12/12/2022 01:45:41 AM script INFO: SUCCESS!@#KODE 1!@#USER_ID 9!@#ACTIVITY_CODE 4
12/12/2022 01:45:41 AM script INFO: SUCCESS!@#KODE 1!@#USER_ID 9!@#ACTIVITY_CODE 5
12/12/2022 01:45:41 AM script INFO: SUCCESS!@#KODE 1!@#USER_ID 9!@#ACTIVITY_CODE 5
12/12/2022 01:45:44 AM script INFO: SUCCESS!@#KODE 1!@#USER_ID 9!@#ACTIVITY_CODE 3
12/12/2022 01:45:44 AM script INFO: SUCCESS!@#KODE 1!@#USER_ID 9!@#ACTIVITY_CODE 2
12/12/2022 01:45:45 AM script INFO: SUCCESS!@#KODE 1!@#USER_ID 9!@#ACTIVITY_CODE 2
12/12/2022 01:45:45 AM script INFO: SUCCESS!@#KODE 1!@#USER_ID 9!@#ACTIVITY_CODE 5
12/12/2022 01:45:45 AM script INFO: SUCCESS!@#KODE 1!@#USER_ID 9!@#ACTIVITY_CODE 5
12/12/2022 01:45:47 AM script INFO: SUCCESS!@#KODE 1!@#USER_ID 9!@#ACTIVITY_CODE 2
12/12/2022 01:45:47 AM script INFO: SUCCESS!@#KODE 1!@#USER_ID 9!@#ACTIVITY_CODE 3
12/12/2022 01:45:47 AM script INFO: SUCCESS!@#KODE 1!@#USER_ID 9!@#ACTIVITY_CODE 3
12/12/2022 01:45:47 AM script INFO: SUCCESS!@#KODE 1!@#USER_ID 9!@#ACTIVITY_CODE 1
12/12/2022 01:45:48 AM script INFO: SUCCESS!@#KODE 1!@#USER_ID 9!@#ACTIVITY_CODE 2
12/12/2022 01:45:48 AM script INFO: SUCCESS!@#KODE 1!@#USER_ID 9!@#ACTIVITY_CODE 2
12/12/2022 01:45:48 AM script INFO: SUCCESS!@#KODE 1!@#USER_ID 9!@#ACTIVITY_CODE 3
12/12/2022 01:45:48 AM script INFO: SUCCESS!@#KODE 1!@#USER_ID 9!@#ACTIVITY_CODE 3
12/12/2022 01:45:48 AM script INFO: SUCCESS!@#KODE 1!@#USER_ID 9!@#ACTIVITY_CODE 3
12/12/2022 01:45:48 AM script INFO: SUCCESS!@#KODE 1!@#USER_ID 9!@#ACTIVITY_CODE 1
12/12/2022 01:45:48 AM script INFO: SUCCESS!@#KODE 1!@#USER_ID 9!@#ACTIVITY_CODE 2
12/12/2022 01:45:48 AM script INFO: SUCCESS!@#KODE 1!@#USER_ID 9!@#ACTIVITY_CODE 2
12/12/2022 01:45:49 AM script INFO: SUCCESS!@#KODE 1!@#USER_ID 9!@#ACTIVITY_CODE 3
12/12/2022 01:45:49 AM script INFO: SUCCESS!@#KODE 1!@#USER_ID 9!@#ACTIVITY_CODE 1
12/12/2022 01:45:49 AM script INFO: SUCCESS!@#KODE 1!@#USER_ID 9!@#ACTIVITY_CODE 4
12/12/2022 01:45:49 AM script INFO: SUCCESS!@#KODE 1!@#USER_ID 9!@#ACTIVITY_CODE 3
12/12/2022 01:45:49 AM script INFO: SUCCESS!@#KODE 1!@#USER_ID 9!@#ACTIVITY_CODE 3
12/12/2022 01:45:49 AM script INFO: SUCCESS!@#KODE 1!@#USER_ID 9!@#ACTIVITY_CODE 1
12/12/2022 01:45:49 AM script INFO: SUCCESS!@#KODE 1!@#USER_ID 9!@#ACTIVITY_CODE 2
12/12/2022 01:45:49 AM script INFO: SUCCESS!@#KODE 1!@#USER_ID 9!@#ACTIVITY_CODE 3
12/12/2022 01:45:49 AM script INFO: SUCCESS!@#KODE 1!@#USER_ID 9!@#ACTIVITY_CODE 3
12/12/2022 01:45:49 AM script INFO: SUCCESS!@#KODE 1!@#USER_ID 9!@#ACTIVITY_CODE 1
12/12/2022 01:45:49 AM script INFO: SUCCESS!@#KODE 1!@#USER_ID 9!@#ACTIVITY_CODE 3
12/12/2022 01:45:49 AM script INFO: SUCCESS!@#KODE 1!@#USER_ID 9!@#ACTIVITY_CODE 1
12/12/2022 01:45:49 AM script INFO: SUCCESS!@#KODE 1!@#USER_ID 9!@#ACTIVITY_CODE 2
12/12/2022 01:45:50 AM script INFO: SUCCESS!@#KODE 1!@#USER_ID 9!@#ACTIVITY_CODE 2
12/12/2022 01:45:50 AM script INFO: SUCCESS!@#KODE 1!@#USER_ID 9!@#ACTIVITY_CODE 2
12/12/2022 01:45:50 AM script INFO: SUCCESS!@#KODE 1!@#USER_ID 9!@#ACTIVITY_CODE 2
12/12/2022 01:45:50 AM script INFO: SUCCESS!@#KODE 1!@#USER_ID 9!@#ACTIVITY_CODE 3
12/12/2022 01:45:50 AM script INFO: SUCCESS!@#KODE 1!@#USER_ID 9!@#ACTIVITY_CODE 2
12/12/2022 01:45:50 AM script INFO: SUCCESS!@#KODE 1!@#USER_ID 9!@#ACTIVITY_CODE 1
12/12/2022 01:45:50 AM script INFO: SUCCESS!@#KODE 1!@#USER_ID 9!@#ACTIVITY_CODE 1
12/12/2022 01:45:50 AM script INFO: SUCCESS!@#KODE 1!@#USER_ID 9!@#ACTIVITY_CODE 4
12/12/2022 01:45:50 AM script INFO: SUCCESS!@#KODE 1!@#USER_ID 9!@#ACTIVITY_CODE 1
12/12/2022 01:45:50 AM script INFO: SUCCESS!@#KODE 1!@#USER_ID 9!@#ACTIVITY_CODE 4
12/12/2022 01:45:50 AM script INFO: SUCCESS!@#KODE 1!@#USER_ID 9!@#ACTIVITY_CODE 1
12/12/2022 01:45:51 AM script INFO: SUCCESS!@#KODE 1!@#USER_ID 9!@#ACTIVITY_CODE 4
12/12/2022 01:45:51 AM script INFO: SUCCESS!@#KODE 1!@#USER_ID 9!@#ACTIVITY_CODE 3
12/12/2022 01:45:51 AM script INFO: SUCCESS!@#KODE 1!@#USER_ID 9!@#ACTIVITY_CODE 1
12/12/2022 01:45:51 AM script INFO: SUCCESS!@#KODE 1!@#USER_ID 9!@#ACTIVITY_CODE 3
12/12/2022 01:45:51 AM script INFO: SUCCESS!@#KODE 1!@#USER_ID 9!@#ACTIVITY_CODE 2
12/12/2022 01:45:51 AM script INFO: SUCCESS!@#KODE 1!@#USER_ID 9!@#ACTIVITY_CODE 4
12/12/2022 01:45:51 AM script INFO: SUCCESS!@#KODE 1!@#USER_ID 9!@#ACTIVITY_CODE 1
12/12/2022 01:45:51 AM script INFO: SUCCESS!@#KODE 1!@#USER_ID 9!@#ACTIVITY_CODE 4
12/12/2022 01:45:51 AM script INFO: SUCCESS!@#KODE 1!@#USER_ID 9!@#ACTIVITY_CODE 1
12/12/2022 01:45:51 AM script INFO: SUCCESS!@#KODE 1!@#USER_ID 9!@#ACTIVITY_CODE 4
12/12/2022 01:45:51 AM script INFO: Duration: 35.696398973464966
12/12/2022 01:45:51 AM script INFO: mengakhiri-quiz
12/12/2022 01:45:52 AM script INFO: SUCCESS!@#KODE 1!@#USER_ID 9!@#ACTIVITY_CODE 5
12/12/2022 01:45:52 AM script INFO: berhasil-submit
12/12/2022 01:47:22 AM script ERROR: TIMEOUT EXCEPTION!@#KODE 0!@#LOCATION berhasil-submit
12/12/2022 01:47:22 AM main_worker ERROR: Message: None

