12/12/2022 01:44:27 AM script INFO: Prepared chrome options..
12/12/2022 01:44:28 AM script INFO: Initialized chrome browser..
12/12/2022 01:44:28 AM script INFO: mengakses-homepage
12/12/2022 01:44:37 AM script INFO: mengakses-login-page
12/12/2022 01:44:38 AM script INFO: mengakses-site-home
12/12/2022 01:44:38 AM script INFO: mengakses-site-course
12/12/2022 01:44:39 AM script INFO: mengakses-quiz
12/12/2022 01:44:39 AM script INFO: mengakses-start-quiz-page
12/12/2022 01:44:40 AM script INFO: memulai-quiz
12/12/2022 01:44:40 AM script INFO: SUCCESS!@#KODE 1!@#USER_ID 19!@#ACTIVITY_CODE 5
12/12/2022 01:44:51 AM script INFO: SUCCESS!@#KODE 1!@#USER_ID 19!@#ACTIVITY_CODE 3
12/12/2022 01:44:51 AM script INFO: SUCCESS!@#KODE 1!@#USER_ID 19!@#ACTIVITY_CODE 5
12/12/2022 01:44:51 AM script INFO: SUCCESS!@#KODE 1!@#USER_ID 19!@#ACTIVITY_CODE 5
12/12/2022 01:44:53 AM script INFO: SUCCESS!@#KODE 1!@#USER_ID 19!@#ACTIVITY_CODE 3
12/12/2022 01:44:54 AM script INFO: SUCCESS!@#KODE 1!@#USER_ID 19!@#ACTIVITY_CODE 1
12/12/2022 01:44:54 AM script INFO: SUCCESS!@#KODE 1!@#USER_ID 19!@#ACTIVITY_CODE 5
12/12/2022 01:44:54 AM script INFO: SUCCESS!@#KODE 1!@#USER_ID 19!@#ACTIVITY_CODE 5
12/12/2022 01:44:56 AM script INFO: SUCCESS!@#KODE 1!@#USER_ID 19!@#ACTIVITY_CODE 1
12/12/2022 01:44:56 AM script INFO: SUCCESS!@#KODE 1!@#USER_ID 19!@#ACTIVITY_CODE 2
12/12/2022 01:44:56 AM script INFO: SUCCESS!@#KODE 1!@#USER_ID 19!@#ACTIVITY_CODE 3
12/12/2022 01:44:56 AM script INFO: SUCCESS!@#KODE 1!@#USER_ID 19!@#ACTIVITY_CODE 3
12/12/2022 01:44:56 AM script INFO: SUCCESS!@#KODE 1!@#USER_ID 19!@#ACTIVITY_CODE 5
12/12/2022 01:44:56 AM script INFO: SUCCESS!@#KODE 1!@#USER_ID 19!@#ACTIVITY_CODE 5
12/12/2022 01:44:59 AM script INFO: SUCCESS!@#KODE 1!@#USER_ID 19!@#ACTIVITY_CODE 1
12/12/2022 01:44:59 AM script INFO: SUCCESS!@#KODE 1!@#USER_ID 19!@#ACTIVITY_CODE 4
12/12/2022 01:44:59 AM script INFO: SUCCESS!@#KODE 1!@#USER_ID 19!@#ACTIVITY_CODE 1
12/12/2022 01:44:59 AM script INFO: SUCCESS!@#KODE 1!@#USER_ID 19!@#ACTIVITY_CODE 1
12/12/2022 01:44:59 AM script INFO: SUCCESS!@#KODE 1!@#USER_ID 19!@#ACTIVITY_CODE 4
12/12/2022 01:44:59 AM script INFO: SUCCESS!@#KODE 1!@#USER_ID 19!@#ACTIVITY_CODE 3
12/12/2022 01:44:59 AM script INFO: SUCCESS!@#KODE 1!@#USER_ID 19!@#ACTIVITY_CODE 3
12/12/2022 01:44:59 AM script INFO: SUCCESS!@#KODE 1!@#USER_ID 19!@#ACTIVITY_CODE 2
12/12/2022 01:44:59 AM script INFO: SUCCESS!@#KODE 1!@#USER_ID 19!@#ACTIVITY_CODE 5
12/12/2022 01:44:59 AM script INFO: SUCCESS!@#KODE 1!@#USER_ID 19!@#ACTIVITY_CODE 5
12/12/2022 01:45:02 AM script INFO: SUCCESS!@#KODE 1!@#USER_ID 19!@#ACTIVITY_CODE 1
12/12/2022 01:45:02 AM script INFO: SUCCESS!@#KODE 1!@#USER_ID 19!@#ACTIVITY_CODE 3
12/12/2022 01:45:02 AM script INFO: SUCCESS!@#KODE 1!@#USER_ID 19!@#ACTIVITY_CODE 3
12/12/2022 01:45:02 AM script INFO: SUCCESS!@#KODE 1!@#USER_ID 19!@#ACTIVITY_CODE 4
12/12/2022 01:45:02 AM script INFO: SUCCESS!@#KODE 1!@#USER_ID 19!@#ACTIVITY_CODE 2
12/12/2022 01:45:02 AM script INFO: SUCCESS!@#KODE 1!@#USER_ID 19!@#ACTIVITY_CODE 3
12/12/2022 01:45:02 AM script INFO: SUCCESS!@#KODE 1!@#USER_ID 19!@#ACTIVITY_CODE 2
12/12/2022 01:45:03 AM script INFO: SUCCESS!@#KODE 1!@#USER_ID 19!@#ACTIVITY_CODE 2
12/12/2022 01:45:03 AM script INFO: SUCCESS!@#KODE 1!@#USER_ID 19!@#ACTIVITY_CODE 1
12/12/2022 01:45:03 AM script INFO: SUCCESS!@#KODE 1!@#USER_ID 19!@#ACTIVITY_CODE 4
12/12/2022 01:45:03 AM script INFO: SUCCESS!@#KODE 1!@#USER_ID 19!@#ACTIVITY_CODE 5
12/12/2022 01:45:03 AM script INFO: SUCCESS!@#KODE 1!@#USER_ID 19!@#ACTIVITY_CODE 5
12/12/2022 01:45:05 AM script INFO: SUCCESS!@#KODE 1!@#USER_ID 19!@#ACTIVITY_CODE 2
12/12/2022 01:45:05 AM script INFO: SUCCESS!@#KODE 1!@#USER_ID 19!@#ACTIVITY_CODE 5
12/12/2022 01:45:05 AM script INFO: SUCCESS!@#KODE 1!@#USER_ID 19!@#ACTIVITY_CODE 5
12/12/2022 01:45:08 AM script INFO: SUCCESS!@#KODE 1!@#USER_ID 19!@#ACTIVITY_CODE 3
12/12/2022 01:45:08 AM script INFO: SUCCESS!@#KODE 1!@#USER_ID 19!@#ACTIVITY_CODE 1
12/12/2022 01:45:08 AM script INFO: SUCCESS!@#KODE 1!@#USER_ID 19!@#ACTIVITY_CODE 3
12/12/2022 01:45:08 AM script INFO: SUCCESS!@#KODE 1!@#USER_ID 19!@#ACTIVITY_CODE 5
12/12/2022 01:45:08 AM script INFO: SUCCESS!@#KODE 1!@#USER_ID 19!@#ACTIVITY_CODE 5
12/12/2022 01:45:11 AM script INFO: SUCCESS!@#KODE 1!@#USER_ID 19!@#ACTIVITY_CODE 1
12/12/2022 01:45:11 AM script INFO: SUCCESS!@#KODE 1!@#USER_ID 19!@#ACTIVITY_CODE 2
12/12/2022 01:45:11 AM script INFO: SUCCESS!@#KODE 1!@#USER_ID 19!@#ACTIVITY_CODE 5
12/12/2022 01:45:11 AM script INFO: SUCCESS!@#KODE 1!@#USER_ID 19!@#ACTIVITY_CODE 5
12/12/2022 01:45:13 AM script INFO: SUCCESS!@#KODE 1!@#USER_ID 19!@#ACTIVITY_CODE 1
12/12/2022 01:45:13 AM script INFO: SUCCESS!@#KODE 1!@#USER_ID 19!@#ACTIVITY_CODE 5
12/12/2022 01:45:13 AM script INFO: SUCCESS!@#KODE 1!@#USER_ID 19!@#ACTIVITY_CODE 5
12/12/2022 01:45:16 AM script INFO: SUCCESS!@#KODE 1!@#USER_ID 19!@#ACTIVITY_CODE 2
12/12/2022 01:45:16 AM script INFO: SUCCESS!@#KODE 1!@#USER_ID 19!@#ACTIVITY_CODE 1
12/12/2022 01:45:16 AM script INFO: SUCCESS!@#KODE 1!@#USER_ID 19!@#ACTIVITY_CODE 2
12/12/2022 01:45:16 AM script INFO: SUCCESS!@#KODE 1!@#USER_ID 19!@#ACTIVITY_CODE 2
12/12/2022 01:45:16 AM script INFO: SUCCESS!@#KODE 1!@#USER_ID 19!@#ACTIVITY_CODE 1
12/12/2022 01:45:16 AM script INFO: SUCCESS!@#KODE 1!@#USER_ID 19!@#ACTIVITY_CODE 1
12/12/2022 01:45:17 AM script INFO: SUCCESS!@#KODE 1!@#USER_ID 19!@#ACTIVITY_CODE 1
12/12/2022 01:45:17 AM script INFO: SUCCESS!@#KODE 1!@#USER_ID 19!@#ACTIVITY_CODE 1
12/12/2022 01:45:17 AM script INFO: SUCCESS!@#KODE 1!@#USER_ID 19!@#ACTIVITY_CODE 5
12/12/2022 01:45:17 AM script INFO: SUCCESS!@#KODE 1!@#USER_ID 19!@#ACTIVITY_CODE 5
12/12/2022 01:45:19 AM script INFO: SUCCESS!@#KODE 1!@#USER_ID 19!@#ACTIVITY_CODE 3
12/12/2022 01:45:19 AM script INFO: SUCCESS!@#KODE 1!@#USER_ID 19!@#ACTIVITY_CODE 3
12/12/2022 01:45:19 AM script INFO: SUCCESS!@#KODE 1!@#USER_ID 19!@#ACTIVITY_CODE 3
12/12/2022 01:45:19 AM script INFO: SUCCESS!@#KODE 1!@#USER_ID 19!@#ACTIVITY_CODE 3
12/12/2022 01:45:19 AM script INFO: SUCCESS!@#KODE 1!@#USER_ID 19!@#ACTIVITY_CODE 2
12/12/2022 01:45:20 AM script INFO: SUCCESS!@#KODE 1!@#USER_ID 19!@#ACTIVITY_CODE 2
12/12/2022 01:45:20 AM script INFO: SUCCESS!@#KODE 1!@#USER_ID 19!@#ACTIVITY_CODE 2
12/12/2022 01:45:20 AM script INFO: SUCCESS!@#KODE 1!@#USER_ID 19!@#ACTIVITY_CODE 1
12/12/2022 01:45:20 AM script INFO: SUCCESS!@#KODE 1!@#USER_ID 19!@#ACTIVITY_CODE 3
12/12/2022 01:45:20 AM script INFO: SUCCESS!@#KODE 1!@#USER_ID 19!@#ACTIVITY_CODE 3
12/12/2022 01:45:20 AM script INFO: SUCCESS!@#KODE 1!@#USER_ID 19!@#ACTIVITY_CODE 2
12/12/2022 01:45:20 AM script INFO: SUCCESS!@#KODE 1!@#USER_ID 19!@#ACTIVITY_CODE 3
12/12/2022 01:45:20 AM script INFO: SUCCESS!@#KODE 1!@#USER_ID 19!@#ACTIVITY_CODE 1
12/12/2022 01:45:20 AM script INFO: SUCCESS!@#KODE 1!@#USER_ID 19!@#ACTIVITY_CODE 2
12/12/2022 01:45:20 AM script INFO: SUCCESS!@#KODE 1!@#USER_ID 19!@#ACTIVITY_CODE 1
12/12/2022 01:45:20 AM script INFO: SUCCESS!@#KODE 1!@#USER_ID 19!@#ACTIVITY_CODE 4
12/12/2022 01:45:20 AM script INFO: SUCCESS!@#KODE 1!@#USER_ID 19!@#ACTIVITY_CODE 5
12/12/2022 01:45:20 AM script INFO: SUCCESS!@#KODE 1!@#USER_ID 19!@#ACTIVITY_CODE 5
12/12/2022 01:45:23 AM script INFO: SUCCESS!@#KODE 1!@#USER_ID 19!@#ACTIVITY_CODE 1
12/12/2022 01:45:23 AM script INFO: SUCCESS!@#KODE 1!@#USER_ID 19!@#ACTIVITY_CODE 3
12/12/2022 01:45:23 AM script INFO: SUCCESS!@#KODE 1!@#USER_ID 19!@#ACTIVITY_CODE 3
12/12/2022 01:45:23 AM script INFO: SUCCESS!@#KODE 1!@#USER_ID 19!@#ACTIVITY_CODE 4
12/12/2022 01:45:23 AM script INFO: SUCCESS!@#KODE 1!@#USER_ID 19!@#ACTIVITY_CODE 2
12/12/2022 01:45:24 AM script INFO: SUCCESS!@#KODE 1!@#USER_ID 19!@#ACTIVITY_CODE 2
12/12/2022 01:45:24 AM script INFO: SUCCESS!@#KODE 1!@#USER_ID 19!@#ACTIVITY_CODE 1
12/12/2022 01:45:24 AM script INFO: SUCCESS!@#KODE 1!@#USER_ID 19!@#ACTIVITY_CODE 1
12/12/2022 01:45:24 AM script INFO: SUCCESS!@#KODE 1!@#USER_ID 19!@#ACTIVITY_CODE 4
12/12/2022 01:45:24 AM script INFO: SUCCESS!@#KODE 1!@#USER_ID 19!@#ACTIVITY_CODE 1
12/12/2022 01:45:24 AM script INFO: SUCCESS!@#KODE 1!@#USER_ID 19!@#ACTIVITY_CODE 3
12/12/2022 01:45:24 AM script INFO: SUCCESS!@#KODE 1!@#USER_ID 19!@#ACTIVITY_CODE 4
12/12/2022 01:45:24 AM script INFO: SUCCESS!@#KODE 1!@#USER_ID 19!@#ACTIVITY_CODE 1
12/12/2022 01:45:24 AM script INFO: SUCCESS!@#KODE 1!@#USER_ID 19!@#ACTIVITY_CODE 3
12/12/2022 01:45:24 AM script INFO: SUCCESS!@#KODE 1!@#USER_ID 19!@#ACTIVITY_CODE 4
12/12/2022 01:45:24 AM script INFO: SUCCESS!@#KODE 1!@#USER_ID 19!@#ACTIVITY_CODE 1
12/12/2022 01:45:24 AM script INFO: SUCCESS!@#KODE 1!@#USER_ID 19!@#ACTIVITY_CODE 2
12/12/2022 01:45:24 AM script INFO: SUCCESS!@#KODE 1!@#USER_ID 19!@#ACTIVITY_CODE 4
12/12/2022 01:45:24 AM script INFO: SUCCESS!@#KODE 1!@#USER_ID 19!@#ACTIVITY_CODE 3
12/12/2022 01:45:25 AM script INFO: SUCCESS!@#KODE 1!@#USER_ID 19!@#ACTIVITY_CODE 3
12/12/2022 01:45:25 AM script INFO: Duration: 33.75529170036316
12/12/2022 01:45:25 AM script INFO: mengakhiri-quiz
12/12/2022 01:45:38 AM script INFO: SUCCESS!@#KODE 1!@#USER_ID 19!@#ACTIVITY_CODE 5
12/12/2022 01:45:38 AM script INFO: berhasil-submit
