12/21/2022 02:29:40 PM script INFO: Prepared chrome options..
12/21/2022 02:29:42 PM script INFO: Initialized chrome browser..
12/21/2022 02:29:42 PM script INFO: mengakses-homepage
12/21/2022 02:30:02 PM script INFO: mengakses-login-page
12/21/2022 02:30:05 PM script INFO: mengakses-site-home
12/21/2022 02:30:06 PM script INFO: mengakses-site-course
12/21/2022 02:30:08 PM script INFO: mengakses-quiz
12/21/2022 02:30:09 PM script INFO: mengakses-start-quiz-page
12/21/2022 02:30:11 PM script INFO: memulai-quiz
12/21/2022 02:30:11 PM script INFO: SUCCESS!@#KODE 1!@#USER_ID 5!@#ACTIVITY_CODE 5
12/21/2022 02:30:22 PM script INFO: SUCCESS!@#KODE 1!@#USER_ID 5!@#ACTIVITY_CODE 3
12/21/2022 02:30:22 PM script INFO: SUCCESS!@#KODE 1!@#USER_ID 5!@#ACTIVITY_CODE 2
12/21/2022 02:30:22 PM script INFO: SUCCESS!@#KODE 1!@#USER_ID 5!@#ACTIVITY_CODE 2
12/21/2022 02:30:22 PM script INFO: SUCCESS!@#KODE 1!@#USER_ID 5!@#ACTIVITY_CODE 5
12/21/2022 02:30:22 PM script INFO: SUCCESS!@#KODE 1!@#USER_ID 5!@#ACTIVITY_CODE 5
12/21/2022 02:30:25 PM script INFO: SUCCESS!@#KODE 1!@#USER_ID 5!@#ACTIVITY_CODE 1
12/21/2022 02:30:25 PM script INFO: SUCCESS!@#KODE 1!@#USER_ID 5!@#ACTIVITY_CODE 3
12/21/2022 02:30:25 PM script INFO: SUCCESS!@#KODE 1!@#USER_ID 5!@#ACTIVITY_CODE 3
12/21/2022 02:30:25 PM script INFO: SUCCESS!@#KODE 1!@#USER_ID 5!@#ACTIVITY_CODE 3
12/21/2022 02:30:25 PM script INFO: SUCCESS!@#KODE 1!@#USER_ID 5!@#ACTIVITY_CODE 3
12/21/2022 02:30:25 PM script INFO: SUCCESS!@#KODE 1!@#USER_ID 5!@#ACTIVITY_CODE 3
12/21/2022 02:30:25 PM script INFO: SUCCESS!@#KODE 1!@#USER_ID 5!@#ACTIVITY_CODE 4
12/21/2022 02:30:25 PM script INFO: SUCCESS!@#KODE 1!@#USER_ID 5!@#ACTIVITY_CODE 1
12/21/2022 02:30:25 PM script INFO: SUCCESS!@#KODE 1!@#USER_ID 5!@#ACTIVITY_CODE 5
12/21/2022 02:30:25 PM script INFO: SUCCESS!@#KODE 1!@#USER_ID 5!@#ACTIVITY_CODE 5
12/21/2022 02:30:28 PM script INFO: SUCCESS!@#KODE 1!@#USER_ID 5!@#ACTIVITY_CODE 5
12/21/2022 02:30:28 PM script INFO: SUCCESS!@#KODE 1!@#USER_ID 5!@#ACTIVITY_CODE 5
12/21/2022 02:30:30 PM script INFO: SUCCESS!@#KODE 1!@#USER_ID 5!@#ACTIVITY_CODE 5
12/21/2022 02:30:30 PM script INFO: SUCCESS!@#KODE 1!@#USER_ID 5!@#ACTIVITY_CODE 5
12/21/2022 02:30:33 PM script INFO: SUCCESS!@#KODE 1!@#USER_ID 5!@#ACTIVITY_CODE 1
12/21/2022 02:30:33 PM script INFO: SUCCESS!@#KODE 1!@#USER_ID 5!@#ACTIVITY_CODE 1
12/21/2022 02:30:33 PM script INFO: SUCCESS!@#KODE 1!@#USER_ID 5!@#ACTIVITY_CODE 4
12/21/2022 02:30:33 PM script INFO: SUCCESS!@#KODE 1!@#USER_ID 5!@#ACTIVITY_CODE 3
12/21/2022 02:30:33 PM script INFO: SUCCESS!@#KODE 1!@#USER_ID 5!@#ACTIVITY_CODE 1
12/21/2022 02:30:33 PM script INFO: SUCCESS!@#KODE 1!@#USER_ID 5!@#ACTIVITY_CODE 4
12/21/2022 02:30:33 PM script INFO: SUCCESS!@#KODE 1!@#USER_ID 5!@#ACTIVITY_CODE 1
12/21/2022 02:30:33 PM script INFO: SUCCESS!@#KODE 1!@#USER_ID 5!@#ACTIVITY_CODE 3
12/21/2022 02:30:33 PM script INFO: SUCCESS!@#KODE 1!@#USER_ID 5!@#ACTIVITY_CODE 5
12/21/2022 02:30:33 PM script INFO: SUCCESS!@#KODE 1!@#USER_ID 5!@#ACTIVITY_CODE 5
12/21/2022 02:30:36 PM script INFO: SUCCESS!@#KODE 1!@#USER_ID 5!@#ACTIVITY_CODE 2
12/21/2022 02:30:36 PM script INFO: SUCCESS!@#KODE 1!@#USER_ID 5!@#ACTIVITY_CODE 5
12/21/2022 02:30:36 PM script INFO: SUCCESS!@#KODE 1!@#USER_ID 5!@#ACTIVITY_CODE 5
12/21/2022 02:30:38 PM script INFO: SUCCESS!@#KODE 1!@#USER_ID 5!@#ACTIVITY_CODE 2
12/21/2022 02:30:39 PM script INFO: SUCCESS!@#KODE 1!@#USER_ID 5!@#ACTIVITY_CODE 2
12/21/2022 02:30:39 PM script INFO: SUCCESS!@#KODE 1!@#USER_ID 5!@#ACTIVITY_CODE 3
12/21/2022 02:30:39 PM script INFO: SUCCESS!@#KODE 1!@#USER_ID 5!@#ACTIVITY_CODE 2
12/21/2022 02:30:39 PM script INFO: SUCCESS!@#KODE 1!@#USER_ID 5!@#ACTIVITY_CODE 2
12/21/2022 02:30:39 PM script INFO: SUCCESS!@#KODE 1!@#USER_ID 5!@#ACTIVITY_CODE 2
12/21/2022 02:30:39 PM script INFO: SUCCESS!@#KODE 1!@#USER_ID 5!@#ACTIVITY_CODE 3
12/21/2022 02:30:39 PM script INFO: SUCCESS!@#KODE 1!@#USER_ID 5!@#ACTIVITY_CODE 3
12/21/2022 02:30:39 PM script INFO: SUCCESS!@#KODE 1!@#USER_ID 5!@#ACTIVITY_CODE 2
12/21/2022 02:30:39 PM script INFO: SUCCESS!@#KODE 1!@#USER_ID 5!@#ACTIVITY_CODE 3
12/21/2022 02:30:39 PM script INFO: SUCCESS!@#KODE 1!@#USER_ID 5!@#ACTIVITY_CODE 3
12/21/2022 02:30:40 PM script INFO: SUCCESS!@#KODE 1!@#USER_ID 5!@#ACTIVITY_CODE 2
12/21/2022 02:30:40 PM script INFO: SUCCESS!@#KODE 1!@#USER_ID 5!@#ACTIVITY_CODE 1
12/21/2022 02:30:40 PM script INFO: SUCCESS!@#KODE 1!@#USER_ID 5!@#ACTIVITY_CODE 2
12/21/2022 02:30:40 PM script INFO: SUCCESS!@#KODE 1!@#USER_ID 5!@#ACTIVITY_CODE 2
12/21/2022 02:30:40 PM script INFO: SUCCESS!@#KODE 1!@#USER_ID 5!@#ACTIVITY_CODE 2
12/21/2022 02:30:40 PM script INFO: Duration: 18.53382158279419
12/21/2022 02:30:40 PM script INFO: mengakhiri-quiz
12/21/2022 02:30:42 PM script INFO: SUCCESS!@#KODE 1!@#USER_ID 5!@#ACTIVITY_CODE 5
12/21/2022 02:30:42 PM script INFO: berhasil-submit
