12/21/2022 01:36:43 PM script INFO: Prepared chrome options..
12/21/2022 01:36:44 PM script INFO: Initialized chrome browser..
12/21/2022 01:36:44 PM script INFO: mengakses-homepage
12/21/2022 01:37:02 PM script INFO: mengakses-login-page
12/21/2022 01:37:08 PM script INFO: mengakses-site-home
12/21/2022 01:37:39 PM script INFO: mengakses-site-course
12/21/2022 01:37:39 PM script INFO: mengakses-quiz
12/21/2022 01:39:09 PM script ERROR: TIMEOUT EXCEPTION!@#KODE 0!@#LOCATION mengakses-quiz
12/21/2022 01:39:09 PM main_worker ERROR: Message: None

