12/11/2022 03:11:15 PM script INFO: Prepared chrome options..
12/11/2022 03:11:16 PM script INFO: Initialized chrome browser..
12/11/2022 03:11:16 PM script INFO: mengakses-homepage
12/11/2022 03:11:46 PM script INFO: mengakses-login-page
12/11/2022 03:11:48 PM script INFO: mengakses-site-home
12/11/2022 03:11:48 PM script INFO: mengakses-site-course
12/11/2022 03:11:49 PM script INFO: mengakses-quiz
12/11/2022 03:11:49 PM script INFO: mengakses-start-quiz-page
12/11/2022 03:11:50 PM script INFO: memulai-quiz
12/11/2022 03:11:50 PM script INFO: SUCCESS!@#KODE 1!@#USER_ID 96!@#ACTIVITY_CODE 5
12/11/2022 03:12:01 PM script INFO: SUCCESS!@#KODE 1!@#USER_ID 96!@#ACTIVITY_CODE 2
12/11/2022 03:12:01 PM script INFO: SUCCESS!@#KODE 1!@#USER_ID 96!@#ACTIVITY_CODE 5
12/11/2022 03:12:01 PM script INFO: SUCCESS!@#KODE 1!@#USER_ID 96!@#ACTIVITY_CODE 5
12/11/2022 03:12:04 PM script INFO: SUCCESS!@#KODE 1!@#USER_ID 96!@#ACTIVITY_CODE 5
12/11/2022 03:12:04 PM script INFO: SUCCESS!@#KODE 1!@#USER_ID 96!@#ACTIVITY_CODE 5
12/11/2022 03:12:06 PM script INFO: SUCCESS!@#KODE 1!@#USER_ID 96!@#ACTIVITY_CODE 3
12/11/2022 03:12:06 PM script INFO: SUCCESS!@#KODE 1!@#USER_ID 96!@#ACTIVITY_CODE 1
12/11/2022 03:12:07 PM script INFO: SUCCESS!@#KODE 1!@#USER_ID 96!@#ACTIVITY_CODE 1
12/11/2022 03:12:07 PM script INFO: SUCCESS!@#KODE 1!@#USER_ID 96!@#ACTIVITY_CODE 5
12/11/2022 03:12:07 PM script INFO: SUCCESS!@#KODE 1!@#USER_ID 96!@#ACTIVITY_CODE 5
12/11/2022 03:12:09 PM script INFO: SUCCESS!@#KODE 1!@#USER_ID 96!@#ACTIVITY_CODE 2
12/11/2022 03:12:09 PM script INFO: SUCCESS!@#KODE 1!@#USER_ID 96!@#ACTIVITY_CODE 3
12/11/2022 03:12:09 PM script INFO: SUCCESS!@#KODE 1!@#USER_ID 96!@#ACTIVITY_CODE 2
12/11/2022 03:12:09 PM script INFO: SUCCESS!@#KODE 1!@#USER_ID 96!@#ACTIVITY_CODE 5
12/11/2022 03:12:09 PM script INFO: SUCCESS!@#KODE 1!@#USER_ID 96!@#ACTIVITY_CODE 5
12/11/2022 03:12:12 PM script INFO: SUCCESS!@#KODE 1!@#USER_ID 96!@#ACTIVITY_CODE 1
12/11/2022 03:12:12 PM script INFO: SUCCESS!@#KODE 1!@#USER_ID 96!@#ACTIVITY_CODE 5
12/11/2022 03:12:12 PM script INFO: SUCCESS!@#KODE 1!@#USER_ID 96!@#ACTIVITY_CODE 5
12/11/2022 03:12:15 PM script INFO: SUCCESS!@#KODE 1!@#USER_ID 96!@#ACTIVITY_CODE 1
12/11/2022 03:12:15 PM script INFO: SUCCESS!@#KODE 1!@#USER_ID 96!@#ACTIVITY_CODE 1
12/11/2022 03:12:15 PM script INFO: SUCCESS!@#KODE 1!@#USER_ID 96!@#ACTIVITY_CODE 2
12/11/2022 03:12:15 PM script INFO: SUCCESS!@#KODE 1!@#USER_ID 96!@#ACTIVITY_CODE 1
12/11/2022 03:12:15 PM script INFO: SUCCESS!@#KODE 1!@#USER_ID 96!@#ACTIVITY_CODE 4
12/11/2022 03:12:15 PM script INFO: SUCCESS!@#KODE 1!@#USER_ID 96!@#ACTIVITY_CODE 3
12/11/2022 03:12:15 PM script INFO: SUCCESS!@#KODE 1!@#USER_ID 96!@#ACTIVITY_CODE 5
12/11/2022 03:12:15 PM script INFO: SUCCESS!@#KODE 1!@#USER_ID 96!@#ACTIVITY_CODE 5
12/11/2022 03:12:18 PM script INFO: SUCCESS!@#KODE 1!@#USER_ID 96!@#ACTIVITY_CODE 3
12/11/2022 03:12:18 PM script INFO: SUCCESS!@#KODE 1!@#USER_ID 96!@#ACTIVITY_CODE 5
12/11/2022 03:12:18 PM script INFO: SUCCESS!@#KODE 1!@#USER_ID 96!@#ACTIVITY_CODE 5
12/11/2022 03:12:20 PM script INFO: SUCCESS!@#KODE 1!@#USER_ID 96!@#ACTIVITY_CODE 2
12/11/2022 03:12:20 PM script INFO: SUCCESS!@#KODE 1!@#USER_ID 96!@#ACTIVITY_CODE 3
12/11/2022 03:12:20 PM script INFO: SUCCESS!@#KODE 1!@#USER_ID 96!@#ACTIVITY_CODE 5
12/11/2022 03:12:20 PM script INFO: SUCCESS!@#KODE 1!@#USER_ID 96!@#ACTIVITY_CODE 5
12/11/2022 03:12:23 PM script INFO: SUCCESS!@#KODE 1!@#USER_ID 96!@#ACTIVITY_CODE 3
12/11/2022 03:12:23 PM script INFO: SUCCESS!@#KODE 1!@#USER_ID 96!@#ACTIVITY_CODE 3
12/11/2022 03:12:23 PM script INFO: SUCCESS!@#KODE 1!@#USER_ID 96!@#ACTIVITY_CODE 2
12/11/2022 03:12:23 PM script INFO: SUCCESS!@#KODE 1!@#USER_ID 96!@#ACTIVITY_CODE 5
12/11/2022 03:12:23 PM script INFO: SUCCESS!@#KODE 1!@#USER_ID 96!@#ACTIVITY_CODE 5
12/11/2022 03:12:26 PM script INFO: SUCCESS!@#KODE 1!@#USER_ID 96!@#ACTIVITY_CODE 1
12/11/2022 03:12:26 PM script INFO: SUCCESS!@#KODE 1!@#USER_ID 96!@#ACTIVITY_CODE 4
12/11/2022 03:12:26 PM script INFO: SUCCESS!@#KODE 1!@#USER_ID 96!@#ACTIVITY_CODE 1
12/11/2022 03:12:26 PM script INFO: SUCCESS!@#KODE 1!@#USER_ID 96!@#ACTIVITY_CODE 2
12/11/2022 03:12:26 PM script INFO: SUCCESS!@#KODE 1!@#USER_ID 96!@#ACTIVITY_CODE 1
12/11/2022 03:12:26 PM script INFO: SUCCESS!@#KODE 1!@#USER_ID 96!@#ACTIVITY_CODE 3
12/11/2022 03:12:26 PM script INFO: SUCCESS!@#KODE 1!@#USER_ID 96!@#ACTIVITY_CODE 1
12/11/2022 03:12:26 PM script INFO: SUCCESS!@#KODE 1!@#USER_ID 96!@#ACTIVITY_CODE 3
12/11/2022 03:12:26 PM script INFO: SUCCESS!@#KODE 1!@#USER_ID 96!@#ACTIVITY_CODE 5
12/11/2022 03:12:26 PM script INFO: SUCCESS!@#KODE 1!@#USER_ID 96!@#ACTIVITY_CODE 5
12/11/2022 03:12:29 PM script INFO: SUCCESS!@#KODE 1!@#USER_ID 96!@#ACTIVITY_CODE 1
12/11/2022 03:12:29 PM script INFO: SUCCESS!@#KODE 1!@#USER_ID 96!@#ACTIVITY_CODE 1
12/11/2022 03:12:29 PM script INFO: SUCCESS!@#KODE 1!@#USER_ID 96!@#ACTIVITY_CODE 5
12/11/2022 03:12:29 PM script INFO: SUCCESS!@#KODE 1!@#USER_ID 96!@#ACTIVITY_CODE 5
12/11/2022 03:12:32 PM script INFO: SUCCESS!@#KODE 1!@#USER_ID 96!@#ACTIVITY_CODE 3
12/11/2022 03:12:32 PM script INFO: SUCCESS!@#KODE 1!@#USER_ID 96!@#ACTIVITY_CODE 3
12/11/2022 03:12:32 PM script INFO: SUCCESS!@#KODE 1!@#USER_ID 96!@#ACTIVITY_CODE 2
12/11/2022 03:12:32 PM script INFO: SUCCESS!@#KODE 1!@#USER_ID 96!@#ACTIVITY_CODE 3
12/11/2022 03:12:32 PM script INFO: SUCCESS!@#KODE 1!@#USER_ID 96!@#ACTIVITY_CODE 1
12/11/2022 03:12:32 PM script INFO: SUCCESS!@#KODE 1!@#USER_ID 96!@#ACTIVITY_CODE 1
12/11/2022 03:12:32 PM script INFO: SUCCESS!@#KODE 1!@#USER_ID 96!@#ACTIVITY_CODE 1
12/11/2022 03:12:32 PM script INFO: SUCCESS!@#KODE 1!@#USER_ID 96!@#ACTIVITY_CODE 1
12/11/2022 03:12:32 PM script INFO: SUCCESS!@#KODE 1!@#USER_ID 96!@#ACTIVITY_CODE 4
12/11/2022 03:12:32 PM script INFO: SUCCESS!@#KODE 1!@#USER_ID 96!@#ACTIVITY_CODE 1
12/11/2022 03:12:33 PM script INFO: SUCCESS!@#KODE 1!@#USER_ID 96!@#ACTIVITY_CODE 4
12/11/2022 03:12:33 PM script INFO: SUCCESS!@#KODE 1!@#USER_ID 96!@#ACTIVITY_CODE 3
12/11/2022 03:12:33 PM script INFO: SUCCESS!@#KODE 1!@#USER_ID 96!@#ACTIVITY_CODE 2
12/11/2022 03:12:33 PM script INFO: SUCCESS!@#KODE 1!@#USER_ID 96!@#ACTIVITY_CODE 2
12/11/2022 03:12:33 PM script INFO: SUCCESS!@#KODE 1!@#USER_ID 96!@#ACTIVITY_CODE 1
12/11/2022 03:12:33 PM script INFO: SUCCESS!@#KODE 1!@#USER_ID 96!@#ACTIVITY_CODE 3
12/11/2022 03:12:33 PM script INFO: SUCCESS!@#KODE 1!@#USER_ID 96!@#ACTIVITY_CODE 3
12/11/2022 03:12:33 PM script INFO: SUCCESS!@#KODE 1!@#USER_ID 96!@#ACTIVITY_CODE 2
12/11/2022 03:12:33 PM script INFO: SUCCESS!@#KODE 1!@#USER_ID 96!@#ACTIVITY_CODE 3
12/11/2022 03:12:34 PM script INFO: SUCCESS!@#KODE 1!@#USER_ID 96!@#ACTIVITY_CODE 2
12/11/2022 03:12:34 PM script INFO: SUCCESS!@#KODE 1!@#USER_ID 96!@#ACTIVITY_CODE 2
12/11/2022 03:12:34 PM script INFO: SUCCESS!@#KODE 1!@#USER_ID 96!@#ACTIVITY_CODE 1
12/11/2022 03:12:34 PM script INFO: SUCCESS!@#KODE 1!@#USER_ID 96!@#ACTIVITY_CODE 1
12/11/2022 03:12:34 PM script INFO: SUCCESS!@#KODE 1!@#USER_ID 96!@#ACTIVITY_CODE 4
12/11/2022 03:12:34 PM script INFO: SUCCESS!@#KODE 1!@#USER_ID 96!@#ACTIVITY_CODE 2
12/11/2022 03:12:34 PM script INFO: SUCCESS!@#KODE 1!@#USER_ID 96!@#ACTIVITY_CODE 3
12/11/2022 03:12:34 PM script INFO: SUCCESS!@#KODE 1!@#USER_ID 96!@#ACTIVITY_CODE 3
12/11/2022 03:12:34 PM script INFO: SUCCESS!@#KODE 1!@#USER_ID 96!@#ACTIVITY_CODE 2
12/11/2022 03:12:34 PM script INFO: SUCCESS!@#KODE 1!@#USER_ID 96!@#ACTIVITY_CODE 2
12/11/2022 03:12:35 PM script INFO: SUCCESS!@#KODE 1!@#USER_ID 96!@#ACTIVITY_CODE 2
12/11/2022 03:12:35 PM script INFO: SUCCESS!@#KODE 1!@#USER_ID 96!@#ACTIVITY_CODE 3
12/11/2022 03:12:35 PM script INFO: SUCCESS!@#KODE 1!@#USER_ID 96!@#ACTIVITY_CODE 2
12/11/2022 03:12:35 PM script INFO: SUCCESS!@#KODE 1!@#USER_ID 96!@#ACTIVITY_CODE 2
12/11/2022 03:12:35 PM script INFO: SUCCESS!@#KODE 1!@#USER_ID 96!@#ACTIVITY_CODE 2
12/11/2022 03:12:35 PM script INFO: SUCCESS!@#KODE 1!@#USER_ID 96!@#ACTIVITY_CODE 4
12/11/2022 03:12:35 PM script INFO: SUCCESS!@#KODE 1!@#USER_ID 96!@#ACTIVITY_CODE 2
12/11/2022 03:12:35 PM script INFO: SUCCESS!@#KODE 1!@#USER_ID 96!@#ACTIVITY_CODE 2
12/11/2022 03:12:36 PM script INFO: SUCCESS!@#KODE 1!@#USER_ID 96!@#ACTIVITY_CODE 2
12/11/2022 03:12:36 PM script INFO: SUCCESS!@#KODE 1!@#USER_ID 96!@#ACTIVITY_CODE 1
12/11/2022 03:12:36 PM script INFO: SUCCESS!@#KODE 1!@#USER_ID 96!@#ACTIVITY_CODE 3
12/11/2022 03:12:36 PM script INFO: SUCCESS!@#KODE 1!@#USER_ID 96!@#ACTIVITY_CODE 3
12/11/2022 03:12:36 PM script INFO: SUCCESS!@#KODE 1!@#USER_ID 96!@#ACTIVITY_CODE 3
12/11/2022 03:12:36 PM script INFO: SUCCESS!@#KODE 1!@#USER_ID 96!@#ACTIVITY_CODE 1
12/11/2022 03:12:36 PM script INFO: SUCCESS!@#KODE 1!@#USER_ID 96!@#ACTIVITY_CODE 1
12/11/2022 03:12:36 PM script INFO: SUCCESS!@#KODE 1!@#USER_ID 96!@#ACTIVITY_CODE 3
12/11/2022 03:12:36 PM script INFO: SUCCESS!@#KODE 1!@#USER_ID 96!@#ACTIVITY_CODE 2
12/11/2022 03:12:36 PM script INFO: Duration: 34.99951648712158
12/11/2022 03:12:36 PM script INFO: mengakhiri-quiz
12/11/2022 03:12:46 PM script INFO: SUCCESS!@#KODE 1!@#USER_ID 96!@#ACTIVITY_CODE 5
12/11/2022 03:12:46 PM script INFO: berhasil-submit
