12/10/2022 09:03:33 AM script INFO: Prepared chrome options..
12/10/2022 09:03:34 AM script INFO: Initialized chrome browser..
12/10/2022 09:03:34 AM script INFO: mengakses-homepage
12/10/2022 09:04:00 AM script INFO: mengakses-login-page
12/10/2022 09:04:31 AM script INFO: mengakses-site-home
12/10/2022 09:04:34 AM script INFO: mengakses-site-course
12/10/2022 09:04:59 AM script INFO: mengakses-quiz
12/10/2022 09:05:03 AM script INFO: mengakses-start-quiz-page
12/10/2022 09:05:06 AM script INFO: memulai-quiz
12/10/2022 09:05:06 AM script INFO: SUCCESS!@#KODE 1!@#USER_ID 44!@#ACTIVITY_CODE 5
12/10/2022 09:05:18 AM script INFO: SUCCESS!@#KODE 1!@#USER_ID 44!@#ACTIVITY_CODE 2
12/10/2022 09:05:18 AM script INFO: SUCCESS!@#KODE 1!@#USER_ID 44!@#ACTIVITY_CODE 1
12/10/2022 09:05:18 AM script INFO: SUCCESS!@#KODE 1!@#USER_ID 44!@#ACTIVITY_CODE 4
12/10/2022 09:05:18 AM script INFO: SUCCESS!@#KODE 1!@#USER_ID 44!@#ACTIVITY_CODE 2
12/10/2022 09:05:18 AM script INFO: SUCCESS!@#KODE 1!@#USER_ID 44!@#ACTIVITY_CODE 1
12/10/2022 09:05:19 AM script INFO: SUCCESS!@#KODE 1!@#USER_ID 44!@#ACTIVITY_CODE 4
12/10/2022 09:05:19 AM script INFO: SUCCESS!@#KODE 1!@#USER_ID 44!@#ACTIVITY_CODE 5
12/10/2022 09:05:19 AM script INFO: SUCCESS!@#KODE 1!@#USER_ID 44!@#ACTIVITY_CODE 5
12/10/2022 09:05:21 AM script INFO: SUCCESS!@#KODE 1!@#USER_ID 44!@#ACTIVITY_CODE 1
12/10/2022 09:05:21 AM script INFO: SUCCESS!@#KODE 1!@#USER_ID 44!@#ACTIVITY_CODE 5
12/10/2022 09:05:21 AM script INFO: SUCCESS!@#KODE 1!@#USER_ID 44!@#ACTIVITY_CODE 5
12/10/2022 09:05:24 AM script INFO: SUCCESS!@#KODE 1!@#USER_ID 44!@#ACTIVITY_CODE 1
12/10/2022 09:05:24 AM script INFO: SUCCESS!@#KODE 1!@#USER_ID 44!@#ACTIVITY_CODE 3
12/10/2022 09:05:24 AM script INFO: SUCCESS!@#KODE 1!@#USER_ID 44!@#ACTIVITY_CODE 5
12/10/2022 09:05:24 AM script INFO: SUCCESS!@#KODE 1!@#USER_ID 44!@#ACTIVITY_CODE 5
12/10/2022 09:05:27 AM script INFO: SUCCESS!@#KODE 1!@#USER_ID 44!@#ACTIVITY_CODE 3
12/10/2022 09:05:27 AM script INFO: SUCCESS!@#KODE 1!@#USER_ID 44!@#ACTIVITY_CODE 5
12/10/2022 09:05:27 AM script INFO: SUCCESS!@#KODE 1!@#USER_ID 44!@#ACTIVITY_CODE 5
12/10/2022 09:05:29 AM script INFO: SUCCESS!@#KODE 1!@#USER_ID 44!@#ACTIVITY_CODE 1
12/10/2022 09:05:30 AM script INFO: SUCCESS!@#KODE 1!@#USER_ID 44!@#ACTIVITY_CODE 2
12/10/2022 09:05:30 AM script INFO: SUCCESS!@#KODE 1!@#USER_ID 44!@#ACTIVITY_CODE 1
12/10/2022 09:05:30 AM script INFO: SUCCESS!@#KODE 1!@#USER_ID 44!@#ACTIVITY_CODE 4
12/10/2022 09:05:31 AM script INFO: SUCCESS!@#KODE 1!@#USER_ID 44!@#ACTIVITY_CODE 3
12/10/2022 09:05:31 AM script INFO: SUCCESS!@#KODE 1!@#USER_ID 44!@#ACTIVITY_CODE 2
12/10/2022 09:05:31 AM script INFO: SUCCESS!@#KODE 1!@#USER_ID 44!@#ACTIVITY_CODE 5
12/10/2022 09:05:31 AM script INFO: SUCCESS!@#KODE 1!@#USER_ID 44!@#ACTIVITY_CODE 5
12/10/2022 09:05:34 AM script INFO: SUCCESS!@#KODE 1!@#USER_ID 44!@#ACTIVITY_CODE 2
12/10/2022 09:05:34 AM script INFO: SUCCESS!@#KODE 1!@#USER_ID 44!@#ACTIVITY_CODE 3
12/10/2022 09:05:34 AM script INFO: SUCCESS!@#KODE 1!@#USER_ID 44!@#ACTIVITY_CODE 5
12/10/2022 09:05:34 AM script INFO: SUCCESS!@#KODE 1!@#USER_ID 44!@#ACTIVITY_CODE 5
12/10/2022 09:05:37 AM script INFO: SUCCESS!@#KODE 1!@#USER_ID 44!@#ACTIVITY_CODE 3
12/10/2022 09:05:37 AM script INFO: SUCCESS!@#KODE 1!@#USER_ID 44!@#ACTIVITY_CODE 1
12/10/2022 09:05:37 AM script INFO: SUCCESS!@#KODE 1!@#USER_ID 44!@#ACTIVITY_CODE 3
12/10/2022 09:05:37 AM script INFO: SUCCESS!@#KODE 1!@#USER_ID 44!@#ACTIVITY_CODE 4
12/10/2022 09:05:37 AM script INFO: SUCCESS!@#KODE 1!@#USER_ID 44!@#ACTIVITY_CODE 3
12/10/2022 09:05:37 AM script INFO: SUCCESS!@#KODE 1!@#USER_ID 44!@#ACTIVITY_CODE 5
12/10/2022 09:05:37 AM script INFO: SUCCESS!@#KODE 1!@#USER_ID 44!@#ACTIVITY_CODE 5
12/10/2022 09:05:40 AM script INFO: SUCCESS!@#KODE 1!@#USER_ID 44!@#ACTIVITY_CODE 5
12/10/2022 09:05:40 AM script INFO: SUCCESS!@#KODE 1!@#USER_ID 44!@#ACTIVITY_CODE 5
12/10/2022 09:05:43 AM script INFO: SUCCESS!@#KODE 1!@#USER_ID 44!@#ACTIVITY_CODE 2
12/10/2022 09:05:43 AM script INFO: SUCCESS!@#KODE 1!@#USER_ID 44!@#ACTIVITY_CODE 3
12/10/2022 09:05:43 AM script INFO: SUCCESS!@#KODE 1!@#USER_ID 44!@#ACTIVITY_CODE 1
12/10/2022 09:05:43 AM script INFO: SUCCESS!@#KODE 1!@#USER_ID 44!@#ACTIVITY_CODE 3
12/10/2022 09:05:44 AM script INFO: SUCCESS!@#KODE 1!@#USER_ID 44!@#ACTIVITY_CODE 3
12/10/2022 09:05:44 AM script INFO: SUCCESS!@#KODE 1!@#USER_ID 44!@#ACTIVITY_CODE 2
12/10/2022 09:05:44 AM script INFO: SUCCESS!@#KODE 1!@#USER_ID 44!@#ACTIVITY_CODE 2
12/10/2022 09:05:45 AM script INFO: SUCCESS!@#KODE 1!@#USER_ID 44!@#ACTIVITY_CODE 2
12/10/2022 09:05:45 AM script INFO: SUCCESS!@#KODE 1!@#USER_ID 44!@#ACTIVITY_CODE 3
12/10/2022 09:05:45 AM script INFO: SUCCESS!@#KODE 1!@#USER_ID 44!@#ACTIVITY_CODE 3
12/10/2022 09:05:45 AM script INFO: SUCCESS!@#KODE 1!@#USER_ID 44!@#ACTIVITY_CODE 5
12/10/2022 09:05:45 AM script INFO: SUCCESS!@#KODE 1!@#USER_ID 44!@#ACTIVITY_CODE 5
12/10/2022 09:05:48 AM script INFO: SUCCESS!@#KODE 1!@#USER_ID 44!@#ACTIVITY_CODE 4
12/10/2022 09:05:48 AM script INFO: SUCCESS!@#KODE 1!@#USER_ID 44!@#ACTIVITY_CODE 2
12/10/2022 09:05:49 AM script INFO: SUCCESS!@#KODE 1!@#USER_ID 44!@#ACTIVITY_CODE 2
12/10/2022 09:05:49 AM script INFO: SUCCESS!@#KODE 1!@#USER_ID 44!@#ACTIVITY_CODE 5
12/10/2022 09:05:49 AM script INFO: SUCCESS!@#KODE 1!@#USER_ID 44!@#ACTIVITY_CODE 5
12/10/2022 09:05:51 AM script INFO: SUCCESS!@#KODE 1!@#USER_ID 44!@#ACTIVITY_CODE 5
12/10/2022 09:05:51 AM script INFO: SUCCESS!@#KODE 1!@#USER_ID 44!@#ACTIVITY_CODE 5
12/10/2022 09:05:54 AM script INFO: SUCCESS!@#KODE 1!@#USER_ID 44!@#ACTIVITY_CODE 3
12/10/2022 09:05:54 AM script INFO: SUCCESS!@#KODE 1!@#USER_ID 44!@#ACTIVITY_CODE 3
12/10/2022 09:05:54 AM script INFO: SUCCESS!@#KODE 1!@#USER_ID 44!@#ACTIVITY_CODE 3
12/10/2022 09:05:54 AM script INFO: SUCCESS!@#KODE 1!@#USER_ID 44!@#ACTIVITY_CODE 3
12/10/2022 09:05:55 AM script INFO: SUCCESS!@#KODE 1!@#USER_ID 44!@#ACTIVITY_CODE 3
12/10/2022 09:05:55 AM script INFO: SUCCESS!@#KODE 1!@#USER_ID 44!@#ACTIVITY_CODE 2
12/10/2022 09:05:55 AM script INFO: SUCCESS!@#KODE 1!@#USER_ID 44!@#ACTIVITY_CODE 3
12/10/2022 09:05:55 AM script INFO: SUCCESS!@#KODE 1!@#USER_ID 44!@#ACTIVITY_CODE 1
12/10/2022 09:05:56 AM script INFO: SUCCESS!@#KODE 1!@#USER_ID 44!@#ACTIVITY_CODE 3
12/10/2022 09:05:56 AM script INFO: SUCCESS!@#KODE 1!@#USER_ID 44!@#ACTIVITY_CODE 2
12/10/2022 09:05:57 AM script INFO: SUCCESS!@#KODE 1!@#USER_ID 44!@#ACTIVITY_CODE 2
12/10/2022 09:05:58 AM script INFO: SUCCESS!@#KODE 1!@#USER_ID 44!@#ACTIVITY_CODE 2
12/10/2022 09:05:58 AM script INFO: SUCCESS!@#KODE 1!@#USER_ID 44!@#ACTIVITY_CODE 3
12/10/2022 09:05:58 AM script INFO: SUCCESS!@#KODE 1!@#USER_ID 44!@#ACTIVITY_CODE 3
12/10/2022 09:05:58 AM script INFO: SUCCESS!@#KODE 1!@#USER_ID 44!@#ACTIVITY_CODE 3
12/10/2022 09:05:58 AM script INFO: SUCCESS!@#KODE 1!@#USER_ID 44!@#ACTIVITY_CODE 1
12/10/2022 09:05:59 AM script INFO: SUCCESS!@#KODE 1!@#USER_ID 44!@#ACTIVITY_CODE 1
12/10/2022 09:05:59 AM script INFO: SUCCESS!@#KODE 1!@#USER_ID 44!@#ACTIVITY_CODE 2
12/10/2022 09:05:59 AM script INFO: SUCCESS!@#KODE 1!@#USER_ID 44!@#ACTIVITY_CODE 2
12/10/2022 09:06:00 AM script INFO: SUCCESS!@#KODE 1!@#USER_ID 44!@#ACTIVITY_CODE 3
12/10/2022 09:06:00 AM script INFO: SUCCESS!@#KODE 1!@#USER_ID 44!@#ACTIVITY_CODE 3
12/10/2022 09:06:00 AM script INFO: SUCCESS!@#KODE 1!@#USER_ID 44!@#ACTIVITY_CODE 3
12/10/2022 09:06:00 AM script INFO: SUCCESS!@#KODE 1!@#USER_ID 44!@#ACTIVITY_CODE 1
12/10/2022 09:06:01 AM script INFO: SUCCESS!@#KODE 1!@#USER_ID 44!@#ACTIVITY_CODE 1
12/10/2022 09:06:01 AM script INFO: SUCCESS!@#KODE 1!@#USER_ID 44!@#ACTIVITY_CODE 3
12/10/2022 09:06:01 AM script INFO: SUCCESS!@#KODE 1!@#USER_ID 44!@#ACTIVITY_CODE 3
12/10/2022 09:06:01 AM script INFO: SUCCESS!@#KODE 1!@#USER_ID 44!@#ACTIVITY_CODE 3
12/10/2022 09:06:02 AM script INFO: SUCCESS!@#KODE 1!@#USER_ID 44!@#ACTIVITY_CODE 2
12/10/2022 09:06:02 AM script INFO: SUCCESS!@#KODE 1!@#USER_ID 44!@#ACTIVITY_CODE 1
12/10/2022 09:06:02 AM script INFO: SUCCESS!@#KODE 1!@#USER_ID 44!@#ACTIVITY_CODE 3
12/10/2022 09:06:02 AM script INFO: SUCCESS!@#KODE 1!@#USER_ID 44!@#ACTIVITY_CODE 1
12/10/2022 09:06:03 AM script INFO: SUCCESS!@#KODE 1!@#USER_ID 44!@#ACTIVITY_CODE 4
12/10/2022 09:06:03 AM script INFO: SUCCESS!@#KODE 1!@#USER_ID 44!@#ACTIVITY_CODE 1
12/10/2022 09:06:03 AM script INFO: SUCCESS!@#KODE 1!@#USER_ID 44!@#ACTIVITY_CODE 3
12/10/2022 09:06:04 AM script INFO: SUCCESS!@#KODE 1!@#USER_ID 44!@#ACTIVITY_CODE 4
12/10/2022 09:06:04 AM script INFO: SUCCESS!@#KODE 1!@#USER_ID 44!@#ACTIVITY_CODE 2
12/10/2022 09:06:05 AM script INFO: SUCCESS!@#KODE 1!@#USER_ID 44!@#ACTIVITY_CODE 2
12/10/2022 09:06:05 AM script INFO: SUCCESS!@#KODE 1!@#USER_ID 44!@#ACTIVITY_CODE 1
12/10/2022 09:06:05 AM script INFO: SUCCESS!@#KODE 1!@#USER_ID 44!@#ACTIVITY_CODE 4
12/10/2022 09:06:06 AM script INFO: SUCCESS!@#KODE 1!@#USER_ID 44!@#ACTIVITY_CODE 1
12/10/2022 09:06:06 AM script INFO: Duration: 48.374858140945435
12/10/2022 09:06:06 AM script INFO: mengakhiri-quiz
12/10/2022 09:06:28 AM script INFO: SUCCESS!@#KODE 1!@#USER_ID 44!@#ACTIVITY_CODE 5
12/10/2022 09:06:28 AM script INFO: berhasil-submit
