12/12/2022 01:44:27 AM script INFO: Prepared chrome options..
12/12/2022 01:44:29 AM script INFO: Initialized chrome browser..
12/12/2022 01:44:29 AM script INFO: mengakses-homepage
12/12/2022 01:44:52 AM script INFO: mengakses-login-page
12/12/2022 01:44:53 AM script INFO: mengakses-site-home
12/12/2022 01:44:54 AM script INFO: mengakses-site-course
12/12/2022 01:44:54 AM script INFO: mengakses-quiz
12/12/2022 01:44:55 AM script INFO: mengakses-start-quiz-page
12/12/2022 01:44:56 AM script INFO: memulai-quiz
12/12/2022 01:44:56 AM script INFO: SUCCESS!@#KODE 1!@#USER_ID 7!@#ACTIVITY_CODE 5
12/12/2022 01:45:07 AM script INFO: SUCCESS!@#KODE 1!@#USER_ID 7!@#ACTIVITY_CODE 1
12/12/2022 01:45:07 AM script INFO: SUCCESS!@#KODE 1!@#USER_ID 7!@#ACTIVITY_CODE 2
12/12/2022 01:45:07 AM script INFO: SUCCESS!@#KODE 1!@#USER_ID 7!@#ACTIVITY_CODE 3
12/12/2022 01:45:07 AM script INFO: SUCCESS!@#KODE 1!@#USER_ID 7!@#ACTIVITY_CODE 5
12/12/2022 01:45:07 AM script INFO: SUCCESS!@#KODE 1!@#USER_ID 7!@#ACTIVITY_CODE 5
12/12/2022 01:45:10 AM script INFO: SUCCESS!@#KODE 1!@#USER_ID 7!@#ACTIVITY_CODE 3
12/12/2022 01:45:10 AM script INFO: SUCCESS!@#KODE 1!@#USER_ID 7!@#ACTIVITY_CODE 3
12/12/2022 01:45:10 AM script INFO: SUCCESS!@#KODE 1!@#USER_ID 7!@#ACTIVITY_CODE 2
12/12/2022 01:45:10 AM script INFO: SUCCESS!@#KODE 1!@#USER_ID 7!@#ACTIVITY_CODE 5
12/12/2022 01:45:10 AM script INFO: SUCCESS!@#KODE 1!@#USER_ID 7!@#ACTIVITY_CODE 5
12/12/2022 01:45:12 AM script INFO: SUCCESS!@#KODE 1!@#USER_ID 7!@#ACTIVITY_CODE 5
12/12/2022 01:45:12 AM script INFO: SUCCESS!@#KODE 1!@#USER_ID 7!@#ACTIVITY_CODE 5
12/12/2022 01:45:15 AM script INFO: SUCCESS!@#KODE 1!@#USER_ID 7!@#ACTIVITY_CODE 1
12/12/2022 01:45:15 AM script INFO: SUCCESS!@#KODE 1!@#USER_ID 7!@#ACTIVITY_CODE 4
12/12/2022 01:45:15 AM script INFO: SUCCESS!@#KODE 1!@#USER_ID 7!@#ACTIVITY_CODE 2
12/12/2022 01:45:15 AM script INFO: SUCCESS!@#KODE 1!@#USER_ID 7!@#ACTIVITY_CODE 3
12/12/2022 01:45:15 AM script INFO: SUCCESS!@#KODE 1!@#USER_ID 7!@#ACTIVITY_CODE 1
12/12/2022 01:45:15 AM script INFO: SUCCESS!@#KODE 1!@#USER_ID 7!@#ACTIVITY_CODE 1
12/12/2022 01:45:16 AM script INFO: SUCCESS!@#KODE 1!@#USER_ID 7!@#ACTIVITY_CODE 4
12/12/2022 01:45:16 AM script INFO: SUCCESS!@#KODE 1!@#USER_ID 7!@#ACTIVITY_CODE 2
12/12/2022 01:45:16 AM script INFO: SUCCESS!@#KODE 1!@#USER_ID 7!@#ACTIVITY_CODE 2
12/12/2022 01:45:16 AM script INFO: SUCCESS!@#KODE 1!@#USER_ID 7!@#ACTIVITY_CODE 5
12/12/2022 01:45:16 AM script INFO: SUCCESS!@#KODE 1!@#USER_ID 7!@#ACTIVITY_CODE 5
12/12/2022 01:45:18 AM script INFO: SUCCESS!@#KODE 1!@#USER_ID 7!@#ACTIVITY_CODE 5
12/12/2022 01:45:18 AM script INFO: SUCCESS!@#KODE 1!@#USER_ID 7!@#ACTIVITY_CODE 5
12/12/2022 01:45:21 AM script INFO: SUCCESS!@#KODE 1!@#USER_ID 7!@#ACTIVITY_CODE 5
12/12/2022 01:45:21 AM script INFO: SUCCESS!@#KODE 1!@#USER_ID 7!@#ACTIVITY_CODE 5
12/12/2022 01:45:23 AM script INFO: SUCCESS!@#KODE 1!@#USER_ID 7!@#ACTIVITY_CODE 5
12/12/2022 01:45:23 AM script INFO: SUCCESS!@#KODE 1!@#USER_ID 7!@#ACTIVITY_CODE 5
12/12/2022 01:45:26 AM script INFO: SUCCESS!@#KODE 1!@#USER_ID 7!@#ACTIVITY_CODE 1
12/12/2022 01:45:26 AM script INFO: SUCCESS!@#KODE 1!@#USER_ID 7!@#ACTIVITY_CODE 1
12/12/2022 01:45:26 AM script INFO: SUCCESS!@#KODE 1!@#USER_ID 7!@#ACTIVITY_CODE 2
12/12/2022 01:45:26 AM script INFO: SUCCESS!@#KODE 1!@#USER_ID 7!@#ACTIVITY_CODE 5
12/12/2022 01:45:26 AM script INFO: SUCCESS!@#KODE 1!@#USER_ID 7!@#ACTIVITY_CODE 5
12/12/2022 01:45:29 AM script INFO: SUCCESS!@#KODE 1!@#USER_ID 7!@#ACTIVITY_CODE 3
12/12/2022 01:45:29 AM script INFO: SUCCESS!@#KODE 1!@#USER_ID 7!@#ACTIVITY_CODE 2
12/12/2022 01:45:29 AM script INFO: SUCCESS!@#KODE 1!@#USER_ID 7!@#ACTIVITY_CODE 5
12/12/2022 01:45:29 AM script INFO: SUCCESS!@#KODE 1!@#USER_ID 7!@#ACTIVITY_CODE 5
12/12/2022 01:45:31 AM script INFO: SUCCESS!@#KODE 1!@#USER_ID 7!@#ACTIVITY_CODE 5
12/12/2022 01:45:31 AM script INFO: SUCCESS!@#KODE 1!@#USER_ID 7!@#ACTIVITY_CODE 5
12/12/2022 01:45:34 AM script INFO: SUCCESS!@#KODE 1!@#USER_ID 7!@#ACTIVITY_CODE 1
12/12/2022 01:45:34 AM script INFO: SUCCESS!@#KODE 1!@#USER_ID 7!@#ACTIVITY_CODE 4
12/12/2022 01:45:34 AM script INFO: SUCCESS!@#KODE 1!@#USER_ID 7!@#ACTIVITY_CODE 3
12/12/2022 01:45:34 AM script INFO: SUCCESS!@#KODE 1!@#USER_ID 7!@#ACTIVITY_CODE 5
12/12/2022 01:45:34 AM script INFO: SUCCESS!@#KODE 1!@#USER_ID 7!@#ACTIVITY_CODE 5
12/12/2022 01:45:37 AM script INFO: SUCCESS!@#KODE 1!@#USER_ID 7!@#ACTIVITY_CODE 1
12/12/2022 01:45:37 AM script INFO: SUCCESS!@#KODE 1!@#USER_ID 7!@#ACTIVITY_CODE 3
12/12/2022 01:45:37 AM script INFO: SUCCESS!@#KODE 1!@#USER_ID 7!@#ACTIVITY_CODE 3
12/12/2022 01:45:37 AM script INFO: SUCCESS!@#KODE 1!@#USER_ID 7!@#ACTIVITY_CODE 3
12/12/2022 01:45:37 AM script INFO: SUCCESS!@#KODE 1!@#USER_ID 7!@#ACTIVITY_CODE 1
12/12/2022 01:45:37 AM script INFO: SUCCESS!@#KODE 1!@#USER_ID 7!@#ACTIVITY_CODE 3
12/12/2022 01:45:37 AM script INFO: SUCCESS!@#KODE 1!@#USER_ID 7!@#ACTIVITY_CODE 1
12/12/2022 01:45:37 AM script INFO: SUCCESS!@#KODE 1!@#USER_ID 7!@#ACTIVITY_CODE 4
12/12/2022 01:45:37 AM script INFO: SUCCESS!@#KODE 1!@#USER_ID 7!@#ACTIVITY_CODE 2
12/12/2022 01:45:38 AM script INFO: SUCCESS!@#KODE 1!@#USER_ID 7!@#ACTIVITY_CODE 2
12/12/2022 01:45:38 AM script INFO: SUCCESS!@#KODE 1!@#USER_ID 7!@#ACTIVITY_CODE 2
12/12/2022 01:45:38 AM script INFO: SUCCESS!@#KODE 1!@#USER_ID 7!@#ACTIVITY_CODE 2
12/12/2022 01:45:38 AM script INFO: SUCCESS!@#KODE 1!@#USER_ID 7!@#ACTIVITY_CODE 1
12/12/2022 01:45:38 AM script INFO: SUCCESS!@#KODE 1!@#USER_ID 7!@#ACTIVITY_CODE 4
12/12/2022 01:45:38 AM script INFO: SUCCESS!@#KODE 1!@#USER_ID 7!@#ACTIVITY_CODE 2
12/12/2022 01:45:38 AM script INFO: SUCCESS!@#KODE 1!@#USER_ID 7!@#ACTIVITY_CODE 3
12/12/2022 01:45:38 AM script INFO: SUCCESS!@#KODE 1!@#USER_ID 7!@#ACTIVITY_CODE 1
12/12/2022 01:45:38 AM script INFO: SUCCESS!@#KODE 1!@#USER_ID 7!@#ACTIVITY_CODE 1
12/12/2022 01:45:39 AM script INFO: SUCCESS!@#KODE 1!@#USER_ID 7!@#ACTIVITY_CODE 4
12/12/2022 01:45:39 AM script INFO: SUCCESS!@#KODE 1!@#USER_ID 7!@#ACTIVITY_CODE 3
12/12/2022 01:45:39 AM script INFO: SUCCESS!@#KODE 1!@#USER_ID 7!@#ACTIVITY_CODE 3
12/12/2022 01:45:39 AM script INFO: SUCCESS!@#KODE 1!@#USER_ID 7!@#ACTIVITY_CODE 3
12/12/2022 01:45:39 AM script INFO: SUCCESS!@#KODE 1!@#USER_ID 7!@#ACTIVITY_CODE 3
12/12/2022 01:45:39 AM script INFO: SUCCESS!@#KODE 1!@#USER_ID 7!@#ACTIVITY_CODE 3
12/12/2022 01:45:39 AM script INFO: SUCCESS!@#KODE 1!@#USER_ID 7!@#ACTIVITY_CODE 3
12/12/2022 01:45:39 AM script INFO: SUCCESS!@#KODE 1!@#USER_ID 7!@#ACTIVITY_CODE 3
12/12/2022 01:45:39 AM script INFO: SUCCESS!@#KODE 1!@#USER_ID 7!@#ACTIVITY_CODE 2
12/12/2022 01:45:39 AM script INFO: SUCCESS!@#KODE 1!@#USER_ID 7!@#ACTIVITY_CODE 2
12/12/2022 01:45:39 AM script INFO: SUCCESS!@#KODE 1!@#USER_ID 7!@#ACTIVITY_CODE 3
12/12/2022 01:45:39 AM script INFO: SUCCESS!@#KODE 1!@#USER_ID 7!@#ACTIVITY_CODE 1
12/12/2022 01:45:39 AM script INFO: SUCCESS!@#KODE 1!@#USER_ID 7!@#ACTIVITY_CODE 3
12/12/2022 01:45:40 AM script INFO: SUCCESS!@#KODE 1!@#USER_ID 7!@#ACTIVITY_CODE 1
12/12/2022 01:45:40 AM script INFO: SUCCESS!@#KODE 1!@#USER_ID 7!@#ACTIVITY_CODE 3
12/12/2022 01:45:40 AM script INFO: SUCCESS!@#KODE 1!@#USER_ID 7!@#ACTIVITY_CODE 4
12/12/2022 01:45:40 AM script INFO: SUCCESS!@#KODE 1!@#USER_ID 7!@#ACTIVITY_CODE 3
12/12/2022 01:45:40 AM script INFO: SUCCESS!@#KODE 1!@#USER_ID 7!@#ACTIVITY_CODE 1
12/12/2022 01:45:40 AM script INFO: SUCCESS!@#KODE 1!@#USER_ID 7!@#ACTIVITY_CODE 1
12/12/2022 01:45:40 AM script INFO: SUCCESS!@#KODE 1!@#USER_ID 7!@#ACTIVITY_CODE 3
12/12/2022 01:45:40 AM script INFO: SUCCESS!@#KODE 1!@#USER_ID 7!@#ACTIVITY_CODE 1
12/12/2022 01:45:40 AM script INFO: SUCCESS!@#KODE 1!@#USER_ID 7!@#ACTIVITY_CODE 4
12/12/2022 01:45:40 AM script INFO: SUCCESS!@#KODE 1!@#USER_ID 7!@#ACTIVITY_CODE 2
12/12/2022 01:45:40 AM script INFO: SUCCESS!@#KODE 1!@#USER_ID 7!@#ACTIVITY_CODE 3
12/12/2022 01:45:41 AM script INFO: SUCCESS!@#KODE 1!@#USER_ID 7!@#ACTIVITY_CODE 2
12/12/2022 01:45:41 AM script INFO: SUCCESS!@#KODE 1!@#USER_ID 7!@#ACTIVITY_CODE 3
12/12/2022 01:45:41 AM script INFO: SUCCESS!@#KODE 1!@#USER_ID 7!@#ACTIVITY_CODE 1
12/12/2022 01:45:41 AM script INFO: SUCCESS!@#KODE 1!@#USER_ID 7!@#ACTIVITY_CODE 4
12/12/2022 01:45:41 AM script INFO: SUCCESS!@#KODE 1!@#USER_ID 7!@#ACTIVITY_CODE 2
12/12/2022 01:45:41 AM script INFO: SUCCESS!@#KODE 1!@#USER_ID 7!@#ACTIVITY_CODE 3
12/12/2022 01:45:41 AM script INFO: SUCCESS!@#KODE 1!@#USER_ID 7!@#ACTIVITY_CODE 3
12/12/2022 01:45:41 AM script INFO: SUCCESS!@#KODE 1!@#USER_ID 7!@#ACTIVITY_CODE 2
12/12/2022 01:45:42 AM script INFO: SUCCESS!@#KODE 1!@#USER_ID 7!@#ACTIVITY_CODE 1
12/12/2022 01:45:42 AM script INFO: SUCCESS!@#KODE 1!@#USER_ID 7!@#ACTIVITY_CODE 3
12/12/2022 01:45:42 AM script INFO: SUCCESS!@#KODE 1!@#USER_ID 7!@#ACTIVITY_CODE 3
12/12/2022 01:45:42 AM script INFO: Duration: 34.945205211639404
12/12/2022 01:45:42 AM script INFO: mengakhiri-quiz
12/12/2022 01:45:42 AM script INFO: SUCCESS!@#KODE 1!@#USER_ID 7!@#ACTIVITY_CODE 5
12/12/2022 01:45:42 AM script INFO: berhasil-submit
12/12/2022 01:47:13 AM script ERROR: TIMEOUT EXCEPTION!@#KODE 0!@#LOCATION berhasil-submit
12/12/2022 01:47:13 AM main_worker ERROR: Message: None

