12/23/2022 07:21:05 AM script INFO: Prepared chrome options..
12/23/2022 07:21:06 AM script INFO: Initialized chrome browser..
12/23/2022 07:21:06 AM script INFO: mengakses-homepage
12/23/2022 07:21:12 AM script INFO: mengakses-login-page
12/23/2022 07:21:13 AM script INFO: mengakses-site-home
12/23/2022 07:21:14 AM script INFO: mengakses-site-course
12/23/2022 07:21:14 AM script INFO: mengakses-quiz
12/23/2022 07:21:15 AM script INFO: mengakses-start-quiz-page
12/23/2022 07:21:16 AM script INFO: memulai-quiz
12/23/2022 07:21:16 AM script INFO: SUCCESS!@#KODE 1!@#USER_ID 70!@#ACTIVITY_CODE 5
12/23/2022 07:21:26 AM script INFO: SUCCESS!@#KODE 1!@#USER_ID 70!@#ACTIVITY_CODE 3
12/23/2022 07:21:26 AM script INFO: SUCCESS!@#KODE 1!@#USER_ID 70!@#ACTIVITY_CODE 3
12/23/2022 07:21:27 AM script INFO: SUCCESS!@#KODE 1!@#USER_ID 70!@#ACTIVITY_CODE 2
12/23/2022 07:21:27 AM script INFO: SUCCESS!@#KODE 1!@#USER_ID 70!@#ACTIVITY_CODE 3
12/23/2022 07:21:27 AM script INFO: SUCCESS!@#KODE 1!@#USER_ID 70!@#ACTIVITY_CODE 1
12/23/2022 07:21:27 AM script INFO: SUCCESS!@#KODE 1!@#USER_ID 70!@#ACTIVITY_CODE 1
12/23/2022 07:21:27 AM script INFO: SUCCESS!@#KODE 1!@#USER_ID 70!@#ACTIVITY_CODE 1
12/23/2022 07:21:27 AM script INFO: SUCCESS!@#KODE 1!@#USER_ID 70!@#ACTIVITY_CODE 3
12/23/2022 07:21:27 AM script INFO: SUCCESS!@#KODE 1!@#USER_ID 70!@#ACTIVITY_CODE 1
12/23/2022 07:21:27 AM script INFO: SUCCESS!@#KODE 1!@#USER_ID 70!@#ACTIVITY_CODE 1
12/23/2022 07:21:27 AM script INFO: SUCCESS!@#KODE 1!@#USER_ID 70!@#ACTIVITY_CODE 2
12/23/2022 07:21:27 AM script INFO: SUCCESS!@#KODE 1!@#USER_ID 70!@#ACTIVITY_CODE 5
12/23/2022 07:21:27 AM script INFO: SUCCESS!@#KODE 1!@#USER_ID 70!@#ACTIVITY_CODE 5
12/23/2022 07:21:30 AM script INFO: SUCCESS!@#KODE 1!@#USER_ID 70!@#ACTIVITY_CODE 1
12/23/2022 07:21:30 AM script INFO: SUCCESS!@#KODE 1!@#USER_ID 70!@#ACTIVITY_CODE 4
12/23/2022 07:21:30 AM script INFO: SUCCESS!@#KODE 1!@#USER_ID 70!@#ACTIVITY_CODE 5
12/23/2022 07:21:30 AM script INFO: SUCCESS!@#KODE 1!@#USER_ID 70!@#ACTIVITY_CODE 5
12/23/2022 07:21:32 AM script INFO: SUCCESS!@#KODE 1!@#USER_ID 70!@#ACTIVITY_CODE 1
12/23/2022 07:21:32 AM script INFO: SUCCESS!@#KODE 1!@#USER_ID 70!@#ACTIVITY_CODE 1
12/23/2022 07:21:32 AM script INFO: SUCCESS!@#KODE 1!@#USER_ID 70!@#ACTIVITY_CODE 5
12/23/2022 07:21:32 AM script INFO: SUCCESS!@#KODE 1!@#USER_ID 70!@#ACTIVITY_CODE 5
12/23/2022 07:21:35 AM script INFO: SUCCESS!@#KODE 1!@#USER_ID 70!@#ACTIVITY_CODE 2
12/23/2022 07:21:35 AM script INFO: SUCCESS!@#KODE 1!@#USER_ID 70!@#ACTIVITY_CODE 5
12/23/2022 07:21:35 AM script INFO: SUCCESS!@#KODE 1!@#USER_ID 70!@#ACTIVITY_CODE 5
12/23/2022 07:21:37 AM script INFO: SUCCESS!@#KODE 1!@#USER_ID 70!@#ACTIVITY_CODE 1
12/23/2022 07:21:38 AM script INFO: SUCCESS!@#KODE 1!@#USER_ID 70!@#ACTIVITY_CODE 1
12/23/2022 07:21:38 AM script INFO: SUCCESS!@#KODE 1!@#USER_ID 70!@#ACTIVITY_CODE 5
12/23/2022 07:21:38 AM script INFO: SUCCESS!@#KODE 1!@#USER_ID 70!@#ACTIVITY_CODE 5
12/23/2022 07:21:40 AM script INFO: SUCCESS!@#KODE 1!@#USER_ID 70!@#ACTIVITY_CODE 3
12/23/2022 07:21:40 AM script INFO: SUCCESS!@#KODE 1!@#USER_ID 70!@#ACTIVITY_CODE 2
12/23/2022 07:21:40 AM script INFO: SUCCESS!@#KODE 1!@#USER_ID 70!@#ACTIVITY_CODE 3
12/23/2022 07:21:40 AM script INFO: SUCCESS!@#KODE 1!@#USER_ID 70!@#ACTIVITY_CODE 5
12/23/2022 07:21:40 AM script INFO: SUCCESS!@#KODE 1!@#USER_ID 70!@#ACTIVITY_CODE 5
12/23/2022 07:21:43 AM script INFO: SUCCESS!@#KODE 1!@#USER_ID 70!@#ACTIVITY_CODE 2
12/23/2022 07:21:43 AM script INFO: SUCCESS!@#KODE 1!@#USER_ID 70!@#ACTIVITY_CODE 5
12/23/2022 07:21:43 AM script INFO: SUCCESS!@#KODE 1!@#USER_ID 70!@#ACTIVITY_CODE 5
12/23/2022 07:21:46 AM script INFO: SUCCESS!@#KODE 1!@#USER_ID 70!@#ACTIVITY_CODE 3
12/23/2022 07:21:46 AM script INFO: SUCCESS!@#KODE 1!@#USER_ID 70!@#ACTIVITY_CODE 3
12/23/2022 07:21:46 AM script INFO: SUCCESS!@#KODE 1!@#USER_ID 70!@#ACTIVITY_CODE 3
12/23/2022 07:21:46 AM script INFO: SUCCESS!@#KODE 1!@#USER_ID 70!@#ACTIVITY_CODE 5
12/23/2022 07:21:46 AM script INFO: SUCCESS!@#KODE 1!@#USER_ID 70!@#ACTIVITY_CODE 5
12/23/2022 07:21:48 AM script INFO: SUCCESS!@#KODE 1!@#USER_ID 70!@#ACTIVITY_CODE 3
12/23/2022 07:21:48 AM script INFO: SUCCESS!@#KODE 1!@#USER_ID 70!@#ACTIVITY_CODE 2
12/23/2022 07:21:48 AM script INFO: SUCCESS!@#KODE 1!@#USER_ID 70!@#ACTIVITY_CODE 5
12/23/2022 07:21:48 AM script INFO: SUCCESS!@#KODE 1!@#USER_ID 70!@#ACTIVITY_CODE 5
12/23/2022 07:21:51 AM script INFO: SUCCESS!@#KODE 1!@#USER_ID 70!@#ACTIVITY_CODE 2
12/23/2022 07:21:51 AM script INFO: SUCCESS!@#KODE 1!@#USER_ID 70!@#ACTIVITY_CODE 2
12/23/2022 07:21:51 AM script INFO: SUCCESS!@#KODE 1!@#USER_ID 70!@#ACTIVITY_CODE 1
12/23/2022 07:21:51 AM script INFO: SUCCESS!@#KODE 1!@#USER_ID 70!@#ACTIVITY_CODE 5
12/23/2022 07:21:51 AM script INFO: SUCCESS!@#KODE 1!@#USER_ID 70!@#ACTIVITY_CODE 5
12/23/2022 07:21:54 AM script INFO: SUCCESS!@#KODE 1!@#USER_ID 70!@#ACTIVITY_CODE 1
12/23/2022 07:21:54 AM script INFO: SUCCESS!@#KODE 1!@#USER_ID 70!@#ACTIVITY_CODE 5
12/23/2022 07:21:54 AM script INFO: SUCCESS!@#KODE 1!@#USER_ID 70!@#ACTIVITY_CODE 5
12/23/2022 07:21:56 AM script INFO: SUCCESS!@#KODE 1!@#USER_ID 70!@#ACTIVITY_CODE 3
12/23/2022 07:21:56 AM script INFO: SUCCESS!@#KODE 1!@#USER_ID 70!@#ACTIVITY_CODE 5
12/23/2022 07:21:56 AM script INFO: SUCCESS!@#KODE 1!@#USER_ID 70!@#ACTIVITY_CODE 5
12/23/2022 07:21:59 AM script INFO: SUCCESS!@#KODE 1!@#USER_ID 70!@#ACTIVITY_CODE 5
12/23/2022 07:21:59 AM script INFO: SUCCESS!@#KODE 1!@#USER_ID 70!@#ACTIVITY_CODE 5
12/23/2022 07:22:02 AM script INFO: SUCCESS!@#KODE 1!@#USER_ID 70!@#ACTIVITY_CODE 1
12/23/2022 07:22:02 AM script INFO: SUCCESS!@#KODE 1!@#USER_ID 70!@#ACTIVITY_CODE 3
12/23/2022 07:22:02 AM script INFO: SUCCESS!@#KODE 1!@#USER_ID 70!@#ACTIVITY_CODE 3
12/23/2022 07:22:02 AM script INFO: SUCCESS!@#KODE 1!@#USER_ID 70!@#ACTIVITY_CODE 1
12/23/2022 07:22:02 AM script INFO: SUCCESS!@#KODE 1!@#USER_ID 70!@#ACTIVITY_CODE 5
12/23/2022 07:22:02 AM script INFO: SUCCESS!@#KODE 1!@#USER_ID 70!@#ACTIVITY_CODE 5
12/23/2022 07:22:04 AM script INFO: SUCCESS!@#KODE 1!@#USER_ID 70!@#ACTIVITY_CODE 1
12/23/2022 07:22:04 AM script INFO: SUCCESS!@#KODE 1!@#USER_ID 70!@#ACTIVITY_CODE 1
12/23/2022 07:22:04 AM script INFO: SUCCESS!@#KODE 1!@#USER_ID 70!@#ACTIVITY_CODE 3
12/23/2022 07:22:05 AM script INFO: SUCCESS!@#KODE 1!@#USER_ID 70!@#ACTIVITY_CODE 3
12/23/2022 07:22:05 AM script INFO: SUCCESS!@#KODE 1!@#USER_ID 70!@#ACTIVITY_CODE 1
12/23/2022 07:22:05 AM script INFO: SUCCESS!@#KODE 1!@#USER_ID 70!@#ACTIVITY_CODE 2
12/23/2022 07:22:05 AM script INFO: SUCCESS!@#KODE 1!@#USER_ID 70!@#ACTIVITY_CODE 3
12/23/2022 07:22:05 AM script INFO: SUCCESS!@#KODE 1!@#USER_ID 70!@#ACTIVITY_CODE 1
12/23/2022 07:22:05 AM script INFO: SUCCESS!@#KODE 1!@#USER_ID 70!@#ACTIVITY_CODE 3
12/23/2022 07:22:05 AM script INFO: SUCCESS!@#KODE 1!@#USER_ID 70!@#ACTIVITY_CODE 3
12/23/2022 07:22:05 AM script INFO: SUCCESS!@#KODE 1!@#USER_ID 70!@#ACTIVITY_CODE 3
12/23/2022 07:22:05 AM script INFO: SUCCESS!@#KODE 1!@#USER_ID 70!@#ACTIVITY_CODE 3
12/23/2022 07:22:05 AM script INFO: SUCCESS!@#KODE 1!@#USER_ID 70!@#ACTIVITY_CODE 3
12/23/2022 07:22:05 AM script INFO: SUCCESS!@#KODE 1!@#USER_ID 70!@#ACTIVITY_CODE 4
12/23/2022 07:22:05 AM script INFO: SUCCESS!@#KODE 1!@#USER_ID 70!@#ACTIVITY_CODE 5
12/23/2022 07:22:05 AM script INFO: SUCCESS!@#KODE 1!@#USER_ID 70!@#ACTIVITY_CODE 5
12/23/2022 07:22:08 AM script INFO: SUCCESS!@#KODE 1!@#USER_ID 70!@#ACTIVITY_CODE 2
12/23/2022 07:22:08 AM script INFO: SUCCESS!@#KODE 1!@#USER_ID 70!@#ACTIVITY_CODE 1
12/23/2022 07:22:08 AM script INFO: SUCCESS!@#KODE 1!@#USER_ID 70!@#ACTIVITY_CODE 5
12/23/2022 07:22:08 AM script INFO: SUCCESS!@#KODE 1!@#USER_ID 70!@#ACTIVITY_CODE 5
12/23/2022 07:22:11 AM script INFO: SUCCESS!@#KODE 1!@#USER_ID 70!@#ACTIVITY_CODE 4
12/23/2022 07:22:11 AM script INFO: SUCCESS!@#KODE 1!@#USER_ID 70!@#ACTIVITY_CODE 3
12/23/2022 07:22:11 AM script INFO: SUCCESS!@#KODE 1!@#USER_ID 70!@#ACTIVITY_CODE 3
12/23/2022 07:22:11 AM script INFO: SUCCESS!@#KODE 1!@#USER_ID 70!@#ACTIVITY_CODE 1
12/23/2022 07:22:11 AM script INFO: SUCCESS!@#KODE 1!@#USER_ID 70!@#ACTIVITY_CODE 1
12/23/2022 07:22:11 AM script INFO: SUCCESS!@#KODE 1!@#USER_ID 70!@#ACTIVITY_CODE 2
12/23/2022 07:22:11 AM script INFO: SUCCESS!@#KODE 1!@#USER_ID 70!@#ACTIVITY_CODE 2
12/23/2022 07:22:11 AM script INFO: SUCCESS!@#KODE 1!@#USER_ID 70!@#ACTIVITY_CODE 2
12/23/2022 07:22:12 AM script INFO: SUCCESS!@#KODE 1!@#USER_ID 70!@#ACTIVITY_CODE 2
12/23/2022 07:22:12 AM script INFO: SUCCESS!@#KODE 1!@#USER_ID 70!@#ACTIVITY_CODE 1
12/23/2022 07:22:12 AM script INFO: SUCCESS!@#KODE 1!@#USER_ID 70!@#ACTIVITY_CODE 2
12/23/2022 07:22:12 AM script INFO: SUCCESS!@#KODE 1!@#USER_ID 70!@#ACTIVITY_CODE 2
12/23/2022 07:22:12 AM script INFO: SUCCESS!@#KODE 1!@#USER_ID 70!@#ACTIVITY_CODE 1
12/23/2022 07:22:12 AM script INFO: SUCCESS!@#KODE 1!@#USER_ID 70!@#ACTIVITY_CODE 1
12/23/2022 07:22:12 AM script INFO: SUCCESS!@#KODE 1!@#USER_ID 70!@#ACTIVITY_CODE 2
12/23/2022 07:22:12 AM script INFO: SUCCESS!@#KODE 1!@#USER_ID 70!@#ACTIVITY_CODE 2
12/23/2022 07:22:12 AM script INFO: SUCCESS!@#KODE 1!@#USER_ID 70!@#ACTIVITY_CODE 4
12/23/2022 07:22:13 AM script INFO: SUCCESS!@#KODE 1!@#USER_ID 70!@#ACTIVITY_CODE 2
12/23/2022 07:22:13 AM script INFO: SUCCESS!@#KODE 1!@#USER_ID 70!@#ACTIVITY_CODE 3
12/23/2022 07:22:13 AM script INFO: SUCCESS!@#KODE 1!@#USER_ID 70!@#ACTIVITY_CODE 3
12/23/2022 07:22:13 AM script INFO: SUCCESS!@#KODE 1!@#USER_ID 70!@#ACTIVITY_CODE 3
12/23/2022 07:22:13 AM script INFO: SUCCESS!@#KODE 1!@#USER_ID 70!@#ACTIVITY_CODE 2
12/23/2022 07:22:13 AM script INFO: SUCCESS!@#KODE 1!@#USER_ID 70!@#ACTIVITY_CODE 3
12/23/2022 07:22:13 AM script INFO: SUCCESS!@#KODE 1!@#USER_ID 70!@#ACTIVITY_CODE 2
12/23/2022 07:22:13 AM script INFO: SUCCESS!@#KODE 1!@#USER_ID 70!@#ACTIVITY_CODE 3
12/23/2022 07:22:13 AM script INFO: SUCCESS!@#KODE 1!@#USER_ID 70!@#ACTIVITY_CODE 3
12/23/2022 07:22:13 AM script INFO: SUCCESS!@#KODE 1!@#USER_ID 70!@#ACTIVITY_CODE 3
12/23/2022 07:22:14 AM script INFO: SUCCESS!@#KODE 1!@#USER_ID 70!@#ACTIVITY_CODE 2
12/23/2022 07:22:14 AM script INFO: SUCCESS!@#KODE 1!@#USER_ID 70!@#ACTIVITY_CODE 1
12/23/2022 07:22:14 AM script INFO: SUCCESS!@#KODE 1!@#USER_ID 70!@#ACTIVITY_CODE 3
12/23/2022 07:22:14 AM script INFO: SUCCESS!@#KODE 1!@#USER_ID 70!@#ACTIVITY_CODE 4
12/23/2022 07:22:14 AM script INFO: SUCCESS!@#KODE 1!@#USER_ID 70!@#ACTIVITY_CODE 3
12/23/2022 07:22:14 AM script INFO: SUCCESS!@#KODE 1!@#USER_ID 70!@#ACTIVITY_CODE 2
12/23/2022 07:22:14 AM script INFO: SUCCESS!@#KODE 1!@#USER_ID 70!@#ACTIVITY_CODE 2
12/23/2022 07:22:14 AM script INFO: SUCCESS!@#KODE 1!@#USER_ID 70!@#ACTIVITY_CODE 2
12/23/2022 07:22:15 AM script INFO: SUCCESS!@#KODE 1!@#USER_ID 70!@#ACTIVITY_CODE 1
12/23/2022 07:22:15 AM script INFO: SUCCESS!@#KODE 1!@#USER_ID 70!@#ACTIVITY_CODE 1
12/23/2022 07:22:15 AM script INFO: SUCCESS!@#KODE 1!@#USER_ID 70!@#ACTIVITY_CODE 3
12/23/2022 07:22:15 AM script INFO: SUCCESS!@#KODE 1!@#USER_ID 70!@#ACTIVITY_CODE 1
12/23/2022 07:22:15 AM script INFO: SUCCESS!@#KODE 1!@#USER_ID 70!@#ACTIVITY_CODE 1
12/23/2022 07:22:15 AM script INFO: SUCCESS!@#KODE 1!@#USER_ID 70!@#ACTIVITY_CODE 2
12/23/2022 07:22:15 AM script INFO: SUCCESS!@#KODE 1!@#USER_ID 70!@#ACTIVITY_CODE 1
12/23/2022 07:22:15 AM script INFO: SUCCESS!@#KODE 1!@#USER_ID 70!@#ACTIVITY_CODE 3
12/23/2022 07:22:15 AM script INFO: SUCCESS!@#KODE 1!@#USER_ID 70!@#ACTIVITY_CODE 3
12/23/2022 07:22:15 AM script INFO: SUCCESS!@#KODE 1!@#USER_ID 70!@#ACTIVITY_CODE 3
12/23/2022 07:22:15 AM script INFO: SUCCESS!@#KODE 1!@#USER_ID 70!@#ACTIVITY_CODE 2
12/23/2022 07:22:16 AM script INFO: SUCCESS!@#KODE 1!@#USER_ID 70!@#ACTIVITY_CODE 1
12/23/2022 07:22:16 AM script INFO: SUCCESS!@#KODE 1!@#USER_ID 70!@#ACTIVITY_CODE 2
12/23/2022 07:22:16 AM script INFO: SUCCESS!@#KODE 1!@#USER_ID 70!@#ACTIVITY_CODE 1
12/23/2022 07:22:16 AM script INFO: SUCCESS!@#KODE 1!@#USER_ID 70!@#ACTIVITY_CODE 4
12/23/2022 07:22:16 AM script INFO: SUCCESS!@#KODE 1!@#USER_ID 70!@#ACTIVITY_CODE 1
12/23/2022 07:22:16 AM script INFO: SUCCESS!@#KODE 1!@#USER_ID 70!@#ACTIVITY_CODE 3
12/23/2022 07:22:16 AM script INFO: SUCCESS!@#KODE 1!@#USER_ID 70!@#ACTIVITY_CODE 2
12/23/2022 07:22:16 AM script INFO: SUCCESS!@#KODE 1!@#USER_ID 70!@#ACTIVITY_CODE 1
12/23/2022 07:22:16 AM script INFO: SUCCESS!@#KODE 1!@#USER_ID 70!@#ACTIVITY_CODE 3
12/23/2022 07:22:16 AM script INFO: SUCCESS!@#KODE 1!@#USER_ID 70!@#ACTIVITY_CODE 4
12/23/2022 07:22:17 AM script INFO: SUCCESS!@#KODE 1!@#USER_ID 70!@#ACTIVITY_CODE 1
12/23/2022 07:22:17 AM script INFO: SUCCESS!@#KODE 1!@#USER_ID 70!@#ACTIVITY_CODE 2
12/23/2022 07:22:17 AM script INFO: SUCCESS!@#KODE 1!@#USER_ID 70!@#ACTIVITY_CODE 1
12/23/2022 07:22:17 AM script INFO: SUCCESS!@#KODE 1!@#USER_ID 70!@#ACTIVITY_CODE 2
12/23/2022 07:22:17 AM script INFO: SUCCESS!@#KODE 1!@#USER_ID 70!@#ACTIVITY_CODE 2
12/23/2022 07:22:17 AM script INFO: SUCCESS!@#KODE 1!@#USER_ID 70!@#ACTIVITY_CODE 3
12/23/2022 07:22:17 AM script INFO: SUCCESS!@#KODE 1!@#USER_ID 70!@#ACTIVITY_CODE 1
12/23/2022 07:22:17 AM script INFO: SUCCESS!@#KODE 1!@#USER_ID 70!@#ACTIVITY_CODE 4
12/23/2022 07:22:17 AM script INFO: SUCCESS!@#KODE 1!@#USER_ID 70!@#ACTIVITY_CODE 1
12/23/2022 07:22:18 AM script INFO: SUCCESS!@#KODE 1!@#USER_ID 70!@#ACTIVITY_CODE 3
12/23/2022 07:22:18 AM script INFO: SUCCESS!@#KODE 1!@#USER_ID 70!@#ACTIVITY_CODE 2
12/23/2022 07:22:18 AM script INFO: SUCCESS!@#KODE 1!@#USER_ID 70!@#ACTIVITY_CODE 1
12/23/2022 07:22:18 AM script INFO: SUCCESS!@#KODE 1!@#USER_ID 70!@#ACTIVITY_CODE 3
12/23/2022 07:22:18 AM script INFO: SUCCESS!@#KODE 1!@#USER_ID 70!@#ACTIVITY_CODE 2
12/23/2022 07:22:18 AM script INFO: SUCCESS!@#KODE 1!@#USER_ID 70!@#ACTIVITY_CODE 2
12/23/2022 07:22:18 AM script INFO: SUCCESS!@#KODE 1!@#USER_ID 70!@#ACTIVITY_CODE 3
12/23/2022 07:22:19 AM script INFO: SUCCESS!@#KODE 1!@#USER_ID 70!@#ACTIVITY_CODE 4
12/23/2022 07:22:19 AM script INFO: SUCCESS!@#KODE 1!@#USER_ID 70!@#ACTIVITY_CODE 2
12/23/2022 07:22:19 AM script INFO: SUCCESS!@#KODE 1!@#USER_ID 70!@#ACTIVITY_CODE 4
12/23/2022 07:22:19 AM script INFO: SUCCESS!@#KODE 1!@#USER_ID 70!@#ACTIVITY_CODE 3
12/23/2022 07:22:19 AM script INFO: SUCCESS!@#KODE 1!@#USER_ID 70!@#ACTIVITY_CODE 1
12/23/2022 07:22:19 AM script INFO: SUCCESS!@#KODE 1!@#USER_ID 70!@#ACTIVITY_CODE 3
12/23/2022 07:22:19 AM script INFO: SUCCESS!@#KODE 1!@#USER_ID 70!@#ACTIVITY_CODE 4
12/23/2022 07:22:19 AM script INFO: SUCCESS!@#KODE 1!@#USER_ID 70!@#ACTIVITY_CODE 1
12/23/2022 07:22:19 AM script INFO: SUCCESS!@#KODE 1!@#USER_ID 70!@#ACTIVITY_CODE 3
12/23/2022 07:22:19 AM script INFO: SUCCESS!@#KODE 1!@#USER_ID 70!@#ACTIVITY_CODE 1
12/23/2022 07:22:19 AM script INFO: SUCCESS!@#KODE 1!@#USER_ID 70!@#ACTIVITY_CODE 1
12/23/2022 07:22:19 AM script INFO: SUCCESS!@#KODE 1!@#USER_ID 70!@#ACTIVITY_CODE 1
12/23/2022 07:22:20 AM script INFO: SUCCESS!@#KODE 1!@#USER_ID 70!@#ACTIVITY_CODE 2
12/23/2022 07:22:20 AM script INFO: SUCCESS!@#KODE 1!@#USER_ID 70!@#ACTIVITY_CODE 2
12/23/2022 07:22:20 AM script INFO: SUCCESS!@#KODE 1!@#USER_ID 70!@#ACTIVITY_CODE 2
12/23/2022 07:22:20 AM script INFO: SUCCESS!@#KODE 1!@#USER_ID 70!@#ACTIVITY_CODE 3
12/23/2022 07:22:20 AM script INFO: SUCCESS!@#KODE 1!@#USER_ID 70!@#ACTIVITY_CODE 4
12/23/2022 07:22:20 AM script INFO: SUCCESS!@#KODE 1!@#USER_ID 70!@#ACTIVITY_CODE 3
12/23/2022 07:22:20 AM script INFO: SUCCESS!@#KODE 1!@#USER_ID 70!@#ACTIVITY_CODE 2
12/23/2022 07:22:21 AM script INFO: SUCCESS!@#KODE 1!@#USER_ID 70!@#ACTIVITY_CODE 1
12/23/2022 07:22:21 AM script INFO: SUCCESS!@#KODE 1!@#USER_ID 70!@#ACTIVITY_CODE 4
12/23/2022 07:22:21 AM script INFO: SUCCESS!@#KODE 1!@#USER_ID 70!@#ACTIVITY_CODE 3
12/23/2022 07:22:21 AM script INFO: SUCCESS!@#KODE 1!@#USER_ID 70!@#ACTIVITY_CODE 2
12/23/2022 07:22:21 AM script INFO: SUCCESS!@#KODE 1!@#USER_ID 70!@#ACTIVITY_CODE 2
12/23/2022 07:22:21 AM script INFO: SUCCESS!@#KODE 1!@#USER_ID 70!@#ACTIVITY_CODE 1
12/23/2022 07:22:21 AM script INFO: SUCCESS!@#KODE 1!@#USER_ID 70!@#ACTIVITY_CODE 4
12/23/2022 07:22:22 AM script INFO: SUCCESS!@#KODE 1!@#USER_ID 70!@#ACTIVITY_CODE 3
12/23/2022 07:22:22 AM script INFO: SUCCESS!@#KODE 1!@#USER_ID 70!@#ACTIVITY_CODE 2
12/23/2022 07:22:22 AM script INFO: SUCCESS!@#KODE 1!@#USER_ID 70!@#ACTIVITY_CODE 3
12/23/2022 07:22:22 AM script INFO: SUCCESS!@#KODE 1!@#USER_ID 70!@#ACTIVITY_CODE 1
12/23/2022 07:22:22 AM script INFO: SUCCESS!@#KODE 1!@#USER_ID 70!@#ACTIVITY_CODE 2
12/23/2022 07:22:22 AM script INFO: SUCCESS!@#KODE 1!@#USER_ID 70!@#ACTIVITY_CODE 3
12/23/2022 07:22:22 AM script INFO: SUCCESS!@#KODE 1!@#USER_ID 70!@#ACTIVITY_CODE 2
12/23/2022 07:22:23 AM script INFO: SUCCESS!@#KODE 1!@#USER_ID 70!@#ACTIVITY_CODE 2
12/23/2022 07:22:23 AM script INFO: SUCCESS!@#KODE 1!@#USER_ID 70!@#ACTIVITY_CODE 2
12/23/2022 07:22:23 AM script INFO: SUCCESS!@#KODE 1!@#USER_ID 70!@#ACTIVITY_CODE 2
12/23/2022 07:22:23 AM script INFO: SUCCESS!@#KODE 1!@#USER_ID 70!@#ACTIVITY_CODE 2
12/23/2022 07:22:23 AM script INFO: SUCCESS!@#KODE 1!@#USER_ID 70!@#ACTIVITY_CODE 1
12/23/2022 07:22:23 AM script INFO: SUCCESS!@#KODE 1!@#USER_ID 70!@#ACTIVITY_CODE 1
12/23/2022 07:22:23 AM script INFO: SUCCESS!@#KODE 1!@#USER_ID 70!@#ACTIVITY_CODE 1
12/23/2022 07:22:23 AM script INFO: SUCCESS!@#KODE 1!@#USER_ID 70!@#ACTIVITY_CODE 3
12/23/2022 07:22:24 AM script INFO: SUCCESS!@#KODE 1!@#USER_ID 70!@#ACTIVITY_CODE 3
12/23/2022 07:22:24 AM script INFO: SUCCESS!@#KODE 1!@#USER_ID 70!@#ACTIVITY_CODE 2
12/23/2022 07:22:24 AM script INFO: SUCCESS!@#KODE 1!@#USER_ID 70!@#ACTIVITY_CODE 1
12/23/2022 07:22:24 AM script INFO: SUCCESS!@#KODE 1!@#USER_ID 70!@#ACTIVITY_CODE 4
12/23/2022 07:22:24 AM script INFO: SUCCESS!@#KODE 1!@#USER_ID 70!@#ACTIVITY_CODE 3
12/23/2022 07:22:24 AM script INFO: SUCCESS!@#KODE 1!@#USER_ID 70!@#ACTIVITY_CODE 3
12/23/2022 07:22:24 AM script INFO: SUCCESS!@#KODE 1!@#USER_ID 70!@#ACTIVITY_CODE 3
12/23/2022 07:22:24 AM script INFO: SUCCESS!@#KODE 1!@#USER_ID 70!@#ACTIVITY_CODE 2
12/23/2022 07:22:25 AM script INFO: SUCCESS!@#KODE 1!@#USER_ID 70!@#ACTIVITY_CODE 1
12/23/2022 07:22:25 AM script INFO: SUCCESS!@#KODE 1!@#USER_ID 70!@#ACTIVITY_CODE 2
12/23/2022 07:22:25 AM script INFO: SUCCESS!@#KODE 1!@#USER_ID 70!@#ACTIVITY_CODE 3
12/23/2022 07:22:25 AM script INFO: SUCCESS!@#KODE 1!@#USER_ID 70!@#ACTIVITY_CODE 2
12/23/2022 07:22:25 AM script INFO: SUCCESS!@#KODE 1!@#USER_ID 70!@#ACTIVITY_CODE 4
12/23/2022 07:22:25 AM script INFO: SUCCESS!@#KODE 1!@#USER_ID 70!@#ACTIVITY_CODE 1
12/23/2022 07:22:25 AM script INFO: SUCCESS!@#KODE 1!@#USER_ID 70!@#ACTIVITY_CODE 3
12/23/2022 07:22:25 AM script INFO: SUCCESS!@#KODE 1!@#USER_ID 70!@#ACTIVITY_CODE 3
12/23/2022 07:22:26 AM script INFO: SUCCESS!@#KODE 1!@#USER_ID 70!@#ACTIVITY_CODE 2
12/23/2022 07:22:26 AM script INFO: SUCCESS!@#KODE 1!@#USER_ID 70!@#ACTIVITY_CODE 2
12/23/2022 07:22:26 AM script INFO: SUCCESS!@#KODE 1!@#USER_ID 70!@#ACTIVITY_CODE 4
12/23/2022 07:22:26 AM script INFO: SUCCESS!@#KODE 1!@#USER_ID 70!@#ACTIVITY_CODE 3
12/23/2022 07:22:26 AM script INFO: SUCCESS!@#KODE 1!@#USER_ID 70!@#ACTIVITY_CODE 1
12/23/2022 07:22:26 AM script INFO: SUCCESS!@#KODE 1!@#USER_ID 70!@#ACTIVITY_CODE 3
12/23/2022 07:22:26 AM script INFO: SUCCESS!@#KODE 1!@#USER_ID 70!@#ACTIVITY_CODE 4
12/23/2022 07:22:26 AM script INFO: SUCCESS!@#KODE 1!@#USER_ID 70!@#ACTIVITY_CODE 2
12/23/2022 07:22:27 AM script INFO: SUCCESS!@#KODE 1!@#USER_ID 70!@#ACTIVITY_CODE 2
12/23/2022 07:22:27 AM script INFO: SUCCESS!@#KODE 1!@#USER_ID 70!@#ACTIVITY_CODE 1
12/23/2022 07:22:27 AM script INFO: SUCCESS!@#KODE 1!@#USER_ID 70!@#ACTIVITY_CODE 2
12/23/2022 07:22:27 AM script INFO: SUCCESS!@#KODE 1!@#USER_ID 70!@#ACTIVITY_CODE 1
12/23/2022 07:22:27 AM script INFO: SUCCESS!@#KODE 1!@#USER_ID 70!@#ACTIVITY_CODE 1
12/23/2022 07:22:27 AM script INFO: SUCCESS!@#KODE 1!@#USER_ID 70!@#ACTIVITY_CODE 3
12/23/2022 07:22:27 AM script INFO: SUCCESS!@#KODE 1!@#USER_ID 70!@#ACTIVITY_CODE 4
12/23/2022 07:22:27 AM script INFO: SUCCESS!@#KODE 1!@#USER_ID 70!@#ACTIVITY_CODE 3
12/23/2022 07:22:28 AM script INFO: SUCCESS!@#KODE 1!@#USER_ID 70!@#ACTIVITY_CODE 1
12/23/2022 07:22:28 AM script INFO: SUCCESS!@#KODE 1!@#USER_ID 70!@#ACTIVITY_CODE 4
12/23/2022 07:22:28 AM script INFO: SUCCESS!@#KODE 1!@#USER_ID 70!@#ACTIVITY_CODE 2
12/23/2022 07:22:28 AM script INFO: SUCCESS!@#KODE 1!@#USER_ID 70!@#ACTIVITY_CODE 2
12/23/2022 07:22:28 AM script INFO: SUCCESS!@#KODE 1!@#USER_ID 70!@#ACTIVITY_CODE 1
12/23/2022 07:22:28 AM script INFO: SUCCESS!@#KODE 1!@#USER_ID 70!@#ACTIVITY_CODE 3
12/23/2022 07:22:28 AM script INFO: SUCCESS!@#KODE 1!@#USER_ID 70!@#ACTIVITY_CODE 4
12/23/2022 07:22:29 AM script INFO: SUCCESS!@#KODE 1!@#USER_ID 70!@#ACTIVITY_CODE 3
12/23/2022 07:22:29 AM script INFO: SUCCESS!@#KODE 1!@#USER_ID 70!@#ACTIVITY_CODE 2
12/23/2022 07:22:29 AM script INFO: SUCCESS!@#KODE 1!@#USER_ID 70!@#ACTIVITY_CODE 3
12/23/2022 07:22:29 AM script INFO: SUCCESS!@#KODE 1!@#USER_ID 70!@#ACTIVITY_CODE 1
12/23/2022 07:22:29 AM script INFO: SUCCESS!@#KODE 1!@#USER_ID 70!@#ACTIVITY_CODE 4
12/23/2022 07:22:29 AM script INFO: SUCCESS!@#KODE 1!@#USER_ID 70!@#ACTIVITY_CODE 3
12/23/2022 07:22:29 AM script INFO: SUCCESS!@#KODE 1!@#USER_ID 70!@#ACTIVITY_CODE 2
12/23/2022 07:22:29 AM script INFO: SUCCESS!@#KODE 1!@#USER_ID 70!@#ACTIVITY_CODE 1
12/23/2022 07:22:30 AM script INFO: SUCCESS!@#KODE 1!@#USER_ID 70!@#ACTIVITY_CODE 3
12/23/2022 07:22:30 AM script INFO: SUCCESS!@#KODE 1!@#USER_ID 70!@#ACTIVITY_CODE 4
12/23/2022 07:22:30 AM script INFO: SUCCESS!@#KODE 1!@#USER_ID 70!@#ACTIVITY_CODE 3
12/23/2022 07:22:30 AM script INFO: SUCCESS!@#KODE 1!@#USER_ID 70!@#ACTIVITY_CODE 2
12/23/2022 07:22:30 AM script INFO: Duration: 63.716660261154175
12/23/2022 07:22:30 AM script INFO: mengakhiri-quiz
12/23/2022 07:22:32 AM script INFO: SUCCESS!@#KODE 1!@#USER_ID 70!@#ACTIVITY_CODE 5
12/23/2022 07:22:32 AM script INFO: berhasil-submit
