12/23/2022 07:11:47 AM script INFO: Prepared chrome options..
12/23/2022 07:11:47 AM script INFO: Initialized chrome browser..
12/23/2022 07:11:47 AM script INFO: mengakses-homepage
12/23/2022 07:11:52 AM script INFO: mengakses-login-page
12/23/2022 07:11:53 AM script INFO: mengakses-site-home
12/23/2022 07:11:53 AM script INFO: mengakses-site-course
12/23/2022 07:11:54 AM script INFO: mengakses-quiz
12/23/2022 07:11:54 AM script INFO: mengakses-start-quiz-page
12/23/2022 07:11:55 AM script INFO: memulai-quiz
12/23/2022 07:11:55 AM script INFO: SUCCESS!@#KODE 1!@#USER_ID 68!@#ACTIVITY_CODE 5
12/23/2022 07:12:06 AM script INFO: SUCCESS!@#KODE 1!@#USER_ID 68!@#ACTIVITY_CODE 5
12/23/2022 07:12:06 AM script INFO: SUCCESS!@#KODE 1!@#USER_ID 68!@#ACTIVITY_CODE 5
12/23/2022 07:12:08 AM script INFO: SUCCESS!@#KODE 1!@#USER_ID 68!@#ACTIVITY_CODE 3
12/23/2022 07:12:08 AM script INFO: SUCCESS!@#KODE 1!@#USER_ID 68!@#ACTIVITY_CODE 5
12/23/2022 07:12:08 AM script INFO: SUCCESS!@#KODE 1!@#USER_ID 68!@#ACTIVITY_CODE 5
12/23/2022 07:12:11 AM script INFO: SUCCESS!@#KODE 1!@#USER_ID 68!@#ACTIVITY_CODE 5
12/23/2022 07:12:11 AM script INFO: SUCCESS!@#KODE 1!@#USER_ID 68!@#ACTIVITY_CODE 5
12/23/2022 07:12:13 AM script INFO: SUCCESS!@#KODE 1!@#USER_ID 68!@#ACTIVITY_CODE 5
12/23/2022 07:12:13 AM script INFO: SUCCESS!@#KODE 1!@#USER_ID 68!@#ACTIVITY_CODE 5
12/23/2022 07:12:16 AM script INFO: SUCCESS!@#KODE 1!@#USER_ID 68!@#ACTIVITY_CODE 1
12/23/2022 07:12:16 AM script INFO: SUCCESS!@#KODE 1!@#USER_ID 68!@#ACTIVITY_CODE 2
12/23/2022 07:12:16 AM script INFO: SUCCESS!@#KODE 1!@#USER_ID 68!@#ACTIVITY_CODE 5
12/23/2022 07:12:16 AM script INFO: SUCCESS!@#KODE 1!@#USER_ID 68!@#ACTIVITY_CODE 5
12/23/2022 07:12:19 AM script INFO: SUCCESS!@#KODE 1!@#USER_ID 68!@#ACTIVITY_CODE 2
12/23/2022 07:12:19 AM script INFO: SUCCESS!@#KODE 1!@#USER_ID 68!@#ACTIVITY_CODE 5
12/23/2022 07:12:19 AM script INFO: SUCCESS!@#KODE 1!@#USER_ID 68!@#ACTIVITY_CODE 5
12/23/2022 07:12:21 AM script INFO: SUCCESS!@#KODE 1!@#USER_ID 68!@#ACTIVITY_CODE 3
12/23/2022 07:12:21 AM script INFO: SUCCESS!@#KODE 1!@#USER_ID 68!@#ACTIVITY_CODE 3
12/23/2022 07:12:21 AM script INFO: SUCCESS!@#KODE 1!@#USER_ID 68!@#ACTIVITY_CODE 3
12/23/2022 07:12:21 AM script INFO: SUCCESS!@#KODE 1!@#USER_ID 68!@#ACTIVITY_CODE 5
12/23/2022 07:12:21 AM script INFO: SUCCESS!@#KODE 1!@#USER_ID 68!@#ACTIVITY_CODE 5
12/23/2022 07:12:24 AM script INFO: SUCCESS!@#KODE 1!@#USER_ID 68!@#ACTIVITY_CODE 3
12/23/2022 07:12:24 AM script INFO: SUCCESS!@#KODE 1!@#USER_ID 68!@#ACTIVITY_CODE 1
12/23/2022 07:12:24 AM script INFO: SUCCESS!@#KODE 1!@#USER_ID 68!@#ACTIVITY_CODE 2
12/23/2022 07:12:24 AM script INFO: SUCCESS!@#KODE 1!@#USER_ID 68!@#ACTIVITY_CODE 1
12/23/2022 07:12:24 AM script INFO: SUCCESS!@#KODE 1!@#USER_ID 68!@#ACTIVITY_CODE 2
12/23/2022 07:12:25 AM script INFO: SUCCESS!@#KODE 1!@#USER_ID 68!@#ACTIVITY_CODE 2
12/23/2022 07:12:25 AM script INFO: SUCCESS!@#KODE 1!@#USER_ID 68!@#ACTIVITY_CODE 3
12/23/2022 07:12:25 AM script INFO: SUCCESS!@#KODE 1!@#USER_ID 68!@#ACTIVITY_CODE 3
12/23/2022 07:12:25 AM script INFO: SUCCESS!@#KODE 1!@#USER_ID 68!@#ACTIVITY_CODE 5
12/23/2022 07:12:25 AM script INFO: SUCCESS!@#KODE 1!@#USER_ID 68!@#ACTIVITY_CODE 5
12/23/2022 07:12:27 AM script INFO: SUCCESS!@#KODE 1!@#USER_ID 68!@#ACTIVITY_CODE 2
12/23/2022 07:12:27 AM script INFO: SUCCESS!@#KODE 1!@#USER_ID 68!@#ACTIVITY_CODE 1
12/23/2022 07:12:28 AM script INFO: SUCCESS!@#KODE 1!@#USER_ID 68!@#ACTIVITY_CODE 2
12/23/2022 07:12:28 AM script INFO: SUCCESS!@#KODE 1!@#USER_ID 68!@#ACTIVITY_CODE 3
12/23/2022 07:12:28 AM script INFO: SUCCESS!@#KODE 1!@#USER_ID 68!@#ACTIVITY_CODE 3
12/23/2022 07:12:28 AM script INFO: SUCCESS!@#KODE 1!@#USER_ID 68!@#ACTIVITY_CODE 1
12/23/2022 07:12:28 AM script INFO: SUCCESS!@#KODE 1!@#USER_ID 68!@#ACTIVITY_CODE 3
12/23/2022 07:12:28 AM script INFO: SUCCESS!@#KODE 1!@#USER_ID 68!@#ACTIVITY_CODE 5
12/23/2022 07:12:28 AM script INFO: SUCCESS!@#KODE 1!@#USER_ID 68!@#ACTIVITY_CODE 5
12/23/2022 07:12:30 AM script INFO: SUCCESS!@#KODE 1!@#USER_ID 68!@#ACTIVITY_CODE 3
12/23/2022 07:12:30 AM script INFO: SUCCESS!@#KODE 1!@#USER_ID 68!@#ACTIVITY_CODE 1
12/23/2022 07:12:31 AM script INFO: SUCCESS!@#KODE 1!@#USER_ID 68!@#ACTIVITY_CODE 4
12/23/2022 07:12:31 AM script INFO: SUCCESS!@#KODE 1!@#USER_ID 68!@#ACTIVITY_CODE 3
12/23/2022 07:12:31 AM script INFO: SUCCESS!@#KODE 1!@#USER_ID 68!@#ACTIVITY_CODE 2
12/23/2022 07:12:31 AM script INFO: SUCCESS!@#KODE 1!@#USER_ID 68!@#ACTIVITY_CODE 2
12/23/2022 07:12:31 AM script INFO: SUCCESS!@#KODE 1!@#USER_ID 68!@#ACTIVITY_CODE 1
12/23/2022 07:12:31 AM script INFO: SUCCESS!@#KODE 1!@#USER_ID 68!@#ACTIVITY_CODE 1
12/23/2022 07:12:31 AM script INFO: SUCCESS!@#KODE 1!@#USER_ID 68!@#ACTIVITY_CODE 4
12/23/2022 07:12:31 AM script INFO: SUCCESS!@#KODE 1!@#USER_ID 68!@#ACTIVITY_CODE 3
12/23/2022 07:12:31 AM script INFO: SUCCESS!@#KODE 1!@#USER_ID 68!@#ACTIVITY_CODE 3
12/23/2022 07:12:31 AM script INFO: SUCCESS!@#KODE 1!@#USER_ID 68!@#ACTIVITY_CODE 2
12/23/2022 07:12:31 AM script INFO: SUCCESS!@#KODE 1!@#USER_ID 68!@#ACTIVITY_CODE 3
12/23/2022 07:12:32 AM script INFO: SUCCESS!@#KODE 1!@#USER_ID 68!@#ACTIVITY_CODE 3
12/23/2022 07:12:32 AM script INFO: SUCCESS!@#KODE 1!@#USER_ID 68!@#ACTIVITY_CODE 3
12/23/2022 07:12:32 AM script INFO: SUCCESS!@#KODE 1!@#USER_ID 68!@#ACTIVITY_CODE 3
12/23/2022 07:12:32 AM script INFO: SUCCESS!@#KODE 1!@#USER_ID 68!@#ACTIVITY_CODE 1
12/23/2022 07:12:32 AM script INFO: SUCCESS!@#KODE 1!@#USER_ID 68!@#ACTIVITY_CODE 5
12/23/2022 07:12:32 AM script INFO: SUCCESS!@#KODE 1!@#USER_ID 68!@#ACTIVITY_CODE 5
12/23/2022 07:12:34 AM script INFO: SUCCESS!@#KODE 1!@#USER_ID 68!@#ACTIVITY_CODE 2
12/23/2022 07:12:34 AM script INFO: SUCCESS!@#KODE 1!@#USER_ID 68!@#ACTIVITY_CODE 5
12/23/2022 07:12:34 AM script INFO: SUCCESS!@#KODE 1!@#USER_ID 68!@#ACTIVITY_CODE 5
12/23/2022 07:12:37 AM script INFO: SUCCESS!@#KODE 1!@#USER_ID 68!@#ACTIVITY_CODE 3
12/23/2022 07:12:37 AM script INFO: SUCCESS!@#KODE 1!@#USER_ID 68!@#ACTIVITY_CODE 3
12/23/2022 07:12:37 AM script INFO: SUCCESS!@#KODE 1!@#USER_ID 68!@#ACTIVITY_CODE 3
12/23/2022 07:12:37 AM script INFO: SUCCESS!@#KODE 1!@#USER_ID 68!@#ACTIVITY_CODE 4
12/23/2022 07:12:37 AM script INFO: SUCCESS!@#KODE 1!@#USER_ID 68!@#ACTIVITY_CODE 2
12/23/2022 07:12:37 AM script INFO: SUCCESS!@#KODE 1!@#USER_ID 68!@#ACTIVITY_CODE 3
12/23/2022 07:12:37 AM script INFO: SUCCESS!@#KODE 1!@#USER_ID 68!@#ACTIVITY_CODE 2
12/23/2022 07:12:38 AM script INFO: SUCCESS!@#KODE 1!@#USER_ID 68!@#ACTIVITY_CODE 1
12/23/2022 07:12:38 AM script INFO: SUCCESS!@#KODE 1!@#USER_ID 68!@#ACTIVITY_CODE 2
12/23/2022 07:12:38 AM script INFO: SUCCESS!@#KODE 1!@#USER_ID 68!@#ACTIVITY_CODE 4
12/23/2022 07:12:38 AM script INFO: SUCCESS!@#KODE 1!@#USER_ID 68!@#ACTIVITY_CODE 3
12/23/2022 07:12:38 AM script INFO: SUCCESS!@#KODE 1!@#USER_ID 68!@#ACTIVITY_CODE 1
12/23/2022 07:12:38 AM script INFO: SUCCESS!@#KODE 1!@#USER_ID 68!@#ACTIVITY_CODE 3
12/23/2022 07:12:38 AM script INFO: SUCCESS!@#KODE 1!@#USER_ID 68!@#ACTIVITY_CODE 2
12/23/2022 07:12:38 AM script INFO: SUCCESS!@#KODE 1!@#USER_ID 68!@#ACTIVITY_CODE 2
12/23/2022 07:12:38 AM script INFO: SUCCESS!@#KODE 1!@#USER_ID 68!@#ACTIVITY_CODE 1
12/23/2022 07:12:38 AM script INFO: SUCCESS!@#KODE 1!@#USER_ID 68!@#ACTIVITY_CODE 4
12/23/2022 07:12:39 AM script INFO: SUCCESS!@#KODE 1!@#USER_ID 68!@#ACTIVITY_CODE 2
12/23/2022 07:12:39 AM script INFO: SUCCESS!@#KODE 1!@#USER_ID 68!@#ACTIVITY_CODE 2
12/23/2022 07:12:39 AM script INFO: SUCCESS!@#KODE 1!@#USER_ID 68!@#ACTIVITY_CODE 3
12/23/2022 07:12:39 AM script INFO: SUCCESS!@#KODE 1!@#USER_ID 68!@#ACTIVITY_CODE 1
12/23/2022 07:12:39 AM script INFO: SUCCESS!@#KODE 1!@#USER_ID 68!@#ACTIVITY_CODE 1
12/23/2022 07:12:39 AM script INFO: SUCCESS!@#KODE 1!@#USER_ID 68!@#ACTIVITY_CODE 4
12/23/2022 07:12:39 AM script INFO: SUCCESS!@#KODE 1!@#USER_ID 68!@#ACTIVITY_CODE 2
12/23/2022 07:12:39 AM script INFO: SUCCESS!@#KODE 1!@#USER_ID 68!@#ACTIVITY_CODE 2
12/23/2022 07:12:40 AM script INFO: SUCCESS!@#KODE 1!@#USER_ID 68!@#ACTIVITY_CODE 2
12/23/2022 07:12:40 AM script INFO: SUCCESS!@#KODE 1!@#USER_ID 68!@#ACTIVITY_CODE 1
12/23/2022 07:12:40 AM script INFO: SUCCESS!@#KODE 1!@#USER_ID 68!@#ACTIVITY_CODE 2
12/23/2022 07:12:40 AM script INFO: SUCCESS!@#KODE 1!@#USER_ID 68!@#ACTIVITY_CODE 3
12/23/2022 07:12:40 AM script INFO: SUCCESS!@#KODE 1!@#USER_ID 68!@#ACTIVITY_CODE 1
12/23/2022 07:12:40 AM script INFO: SUCCESS!@#KODE 1!@#USER_ID 68!@#ACTIVITY_CODE 2
12/23/2022 07:12:40 AM script INFO: SUCCESS!@#KODE 1!@#USER_ID 68!@#ACTIVITY_CODE 3
12/23/2022 07:12:40 AM script INFO: SUCCESS!@#KODE 1!@#USER_ID 68!@#ACTIVITY_CODE 2
12/23/2022 07:12:40 AM script INFO: SUCCESS!@#KODE 1!@#USER_ID 68!@#ACTIVITY_CODE 3
12/23/2022 07:12:40 AM script INFO: SUCCESS!@#KODE 1!@#USER_ID 68!@#ACTIVITY_CODE 1
12/23/2022 07:12:41 AM script INFO: SUCCESS!@#KODE 1!@#USER_ID 68!@#ACTIVITY_CODE 2
12/23/2022 07:12:41 AM script INFO: Duration: 34.78722143173218
12/23/2022 07:12:41 AM script INFO: mengakhiri-quiz
12/23/2022 07:12:41 AM script INFO: SUCCESS!@#KODE 1!@#USER_ID 68!@#ACTIVITY_CODE 5
12/23/2022 07:12:41 AM script INFO: berhasil-submit
