12/11/2022 03:11:15 PM script INFO: Prepared chrome options..
12/11/2022 03:11:16 PM script INFO: Initialized chrome browser..
12/11/2022 03:11:16 PM script INFO: mengakses-homepage
12/11/2022 03:11:29 PM script INFO: mengakses-login-page
12/11/2022 03:11:31 PM script INFO: mengakses-site-home
12/11/2022 03:11:32 PM script INFO: mengakses-site-course
12/11/2022 03:11:56 PM script INFO: mengakses-quiz
12/11/2022 03:12:13 PM script INFO: mengakses-start-quiz-page
12/11/2022 03:12:34 PM script INFO: memulai-quiz
12/11/2022 03:12:34 PM script INFO: SUCCESS!@#KODE 1!@#USER_ID 31!@#ACTIVITY_CODE 5
12/11/2022 03:12:45 PM script INFO: SUCCESS!@#KODE 1!@#USER_ID 31!@#ACTIVITY_CODE 2
12/11/2022 03:12:45 PM script INFO: SUCCESS!@#KODE 1!@#USER_ID 31!@#ACTIVITY_CODE 5
12/11/2022 03:12:45 PM script INFO: SUCCESS!@#KODE 1!@#USER_ID 31!@#ACTIVITY_CODE 5
12/11/2022 03:12:47 PM script INFO: SUCCESS!@#KODE 1!@#USER_ID 31!@#ACTIVITY_CODE 3
12/11/2022 03:12:47 PM script INFO: SUCCESS!@#KODE 1!@#USER_ID 31!@#ACTIVITY_CODE 1
12/11/2022 03:12:48 PM script INFO: SUCCESS!@#KODE 1!@#USER_ID 31!@#ACTIVITY_CODE 4
12/11/2022 03:12:48 PM script INFO: SUCCESS!@#KODE 1!@#USER_ID 31!@#ACTIVITY_CODE 2
12/11/2022 03:12:48 PM script INFO: SUCCESS!@#KODE 1!@#USER_ID 31!@#ACTIVITY_CODE 3
12/11/2022 03:12:48 PM script INFO: SUCCESS!@#KODE 1!@#USER_ID 31!@#ACTIVITY_CODE 3
12/11/2022 03:12:48 PM script INFO: SUCCESS!@#KODE 1!@#USER_ID 31!@#ACTIVITY_CODE 5
12/11/2022 03:12:48 PM script INFO: SUCCESS!@#KODE 1!@#USER_ID 31!@#ACTIVITY_CODE 5
12/11/2022 03:12:50 PM script INFO: SUCCESS!@#KODE 1!@#USER_ID 31!@#ACTIVITY_CODE 3
12/11/2022 03:12:51 PM script INFO: SUCCESS!@#KODE 1!@#USER_ID 31!@#ACTIVITY_CODE 2
12/11/2022 03:12:51 PM script INFO: SUCCESS!@#KODE 1!@#USER_ID 31!@#ACTIVITY_CODE 2
12/11/2022 03:12:51 PM script INFO: SUCCESS!@#KODE 1!@#USER_ID 31!@#ACTIVITY_CODE 3
12/11/2022 03:12:51 PM script INFO: SUCCESS!@#KODE 1!@#USER_ID 31!@#ACTIVITY_CODE 1
12/11/2022 03:12:51 PM script INFO: SUCCESS!@#KODE 1!@#USER_ID 31!@#ACTIVITY_CODE 5
12/11/2022 03:12:51 PM script INFO: SUCCESS!@#KODE 1!@#USER_ID 31!@#ACTIVITY_CODE 5
12/11/2022 03:12:53 PM script INFO: SUCCESS!@#KODE 1!@#USER_ID 31!@#ACTIVITY_CODE 3
12/11/2022 03:12:53 PM script INFO: SUCCESS!@#KODE 1!@#USER_ID 31!@#ACTIVITY_CODE 2
12/11/2022 03:12:53 PM script INFO: SUCCESS!@#KODE 1!@#USER_ID 31!@#ACTIVITY_CODE 5
12/11/2022 03:12:53 PM script INFO: SUCCESS!@#KODE 1!@#USER_ID 31!@#ACTIVITY_CODE 5
12/11/2022 03:12:56 PM script INFO: SUCCESS!@#KODE 1!@#USER_ID 31!@#ACTIVITY_CODE 2
12/11/2022 03:12:56 PM script INFO: SUCCESS!@#KODE 1!@#USER_ID 31!@#ACTIVITY_CODE 5
12/11/2022 03:12:56 PM script INFO: SUCCESS!@#KODE 1!@#USER_ID 31!@#ACTIVITY_CODE 5
12/11/2022 03:12:59 PM script INFO: SUCCESS!@#KODE 1!@#USER_ID 31!@#ACTIVITY_CODE 3
12/11/2022 03:12:59 PM script INFO: SUCCESS!@#KODE 1!@#USER_ID 31!@#ACTIVITY_CODE 2
12/11/2022 03:12:59 PM script INFO: SUCCESS!@#KODE 1!@#USER_ID 31!@#ACTIVITY_CODE 1
12/11/2022 03:12:59 PM script INFO: SUCCESS!@#KODE 1!@#USER_ID 31!@#ACTIVITY_CODE 2
12/11/2022 03:12:59 PM script INFO: SUCCESS!@#KODE 1!@#USER_ID 31!@#ACTIVITY_CODE 1
12/11/2022 03:12:59 PM script INFO: SUCCESS!@#KODE 1!@#USER_ID 31!@#ACTIVITY_CODE 5
12/11/2022 03:12:59 PM script INFO: SUCCESS!@#KODE 1!@#USER_ID 31!@#ACTIVITY_CODE 5
12/11/2022 03:13:01 PM script INFO: SUCCESS!@#KODE 1!@#USER_ID 31!@#ACTIVITY_CODE 3
12/11/2022 03:13:01 PM script INFO: SUCCESS!@#KODE 1!@#USER_ID 31!@#ACTIVITY_CODE 5
12/11/2022 03:13:01 PM script INFO: SUCCESS!@#KODE 1!@#USER_ID 31!@#ACTIVITY_CODE 5
12/11/2022 03:13:04 PM script INFO: SUCCESS!@#KODE 1!@#USER_ID 31!@#ACTIVITY_CODE 3
12/11/2022 03:13:04 PM script INFO: SUCCESS!@#KODE 1!@#USER_ID 31!@#ACTIVITY_CODE 1
12/11/2022 03:13:04 PM script INFO: SUCCESS!@#KODE 1!@#USER_ID 31!@#ACTIVITY_CODE 4
12/11/2022 03:13:04 PM script INFO: SUCCESS!@#KODE 1!@#USER_ID 31!@#ACTIVITY_CODE 1
12/11/2022 03:13:04 PM script INFO: SUCCESS!@#KODE 1!@#USER_ID 31!@#ACTIVITY_CODE 2
12/11/2022 03:13:04 PM script INFO: SUCCESS!@#KODE 1!@#USER_ID 31!@#ACTIVITY_CODE 1
12/11/2022 03:13:04 PM script INFO: SUCCESS!@#KODE 1!@#USER_ID 31!@#ACTIVITY_CODE 2
12/11/2022 03:13:04 PM script INFO: SUCCESS!@#KODE 1!@#USER_ID 31!@#ACTIVITY_CODE 5
12/11/2022 03:13:04 PM script INFO: SUCCESS!@#KODE 1!@#USER_ID 31!@#ACTIVITY_CODE 5
12/11/2022 03:13:07 PM script INFO: SUCCESS!@#KODE 1!@#USER_ID 31!@#ACTIVITY_CODE 3
12/11/2022 03:13:07 PM script INFO: SUCCESS!@#KODE 1!@#USER_ID 31!@#ACTIVITY_CODE 3
12/11/2022 03:13:07 PM script INFO: SUCCESS!@#KODE 1!@#USER_ID 31!@#ACTIVITY_CODE 3
12/11/2022 03:13:07 PM script INFO: SUCCESS!@#KODE 1!@#USER_ID 31!@#ACTIVITY_CODE 1
12/11/2022 03:13:07 PM script INFO: SUCCESS!@#KODE 1!@#USER_ID 31!@#ACTIVITY_CODE 3
12/11/2022 03:13:07 PM script INFO: SUCCESS!@#KODE 1!@#USER_ID 31!@#ACTIVITY_CODE 2
12/11/2022 03:13:07 PM script INFO: SUCCESS!@#KODE 1!@#USER_ID 31!@#ACTIVITY_CODE 3
12/11/2022 03:13:08 PM script INFO: SUCCESS!@#KODE 1!@#USER_ID 31!@#ACTIVITY_CODE 2
12/11/2022 03:13:08 PM script INFO: SUCCESS!@#KODE 1!@#USER_ID 31!@#ACTIVITY_CODE 4
12/11/2022 03:13:08 PM script INFO: SUCCESS!@#KODE 1!@#USER_ID 31!@#ACTIVITY_CODE 3
12/11/2022 03:13:08 PM script INFO: SUCCESS!@#KODE 1!@#USER_ID 31!@#ACTIVITY_CODE 3
12/11/2022 03:13:08 PM script INFO: SUCCESS!@#KODE 1!@#USER_ID 31!@#ACTIVITY_CODE 1
12/11/2022 03:13:08 PM script INFO: SUCCESS!@#KODE 1!@#USER_ID 31!@#ACTIVITY_CODE 4
12/11/2022 03:13:08 PM script INFO: SUCCESS!@#KODE 1!@#USER_ID 31!@#ACTIVITY_CODE 5
12/11/2022 03:13:08 PM script INFO: SUCCESS!@#KODE 1!@#USER_ID 31!@#ACTIVITY_CODE 5
12/11/2022 03:13:10 PM script INFO: SUCCESS!@#KODE 1!@#USER_ID 31!@#ACTIVITY_CODE 1
12/11/2022 03:13:10 PM script INFO: SUCCESS!@#KODE 1!@#USER_ID 31!@#ACTIVITY_CODE 5
12/11/2022 03:13:10 PM script INFO: SUCCESS!@#KODE 1!@#USER_ID 31!@#ACTIVITY_CODE 5
12/11/2022 03:13:13 PM script INFO: SUCCESS!@#KODE 1!@#USER_ID 31!@#ACTIVITY_CODE 5
12/11/2022 03:13:13 PM script INFO: SUCCESS!@#KODE 1!@#USER_ID 31!@#ACTIVITY_CODE 5
12/11/2022 03:13:15 PM script INFO: SUCCESS!@#KODE 1!@#USER_ID 31!@#ACTIVITY_CODE 1
12/11/2022 03:13:16 PM script INFO: SUCCESS!@#KODE 1!@#USER_ID 31!@#ACTIVITY_CODE 2
12/11/2022 03:13:16 PM script INFO: SUCCESS!@#KODE 1!@#USER_ID 31!@#ACTIVITY_CODE 2
12/11/2022 03:13:16 PM script INFO: SUCCESS!@#KODE 1!@#USER_ID 31!@#ACTIVITY_CODE 3
12/11/2022 03:13:16 PM script INFO: SUCCESS!@#KODE 1!@#USER_ID 31!@#ACTIVITY_CODE 2
12/11/2022 03:13:16 PM script INFO: SUCCESS!@#KODE 1!@#USER_ID 31!@#ACTIVITY_CODE 2
12/11/2022 03:13:16 PM script INFO: SUCCESS!@#KODE 1!@#USER_ID 31!@#ACTIVITY_CODE 3
12/11/2022 03:13:16 PM script INFO: SUCCESS!@#KODE 1!@#USER_ID 31!@#ACTIVITY_CODE 4
12/11/2022 03:13:16 PM script INFO: SUCCESS!@#KODE 1!@#USER_ID 31!@#ACTIVITY_CODE 1
12/11/2022 03:13:16 PM script INFO: SUCCESS!@#KODE 1!@#USER_ID 31!@#ACTIVITY_CODE 2
12/11/2022 03:13:16 PM script INFO: SUCCESS!@#KODE 1!@#USER_ID 31!@#ACTIVITY_CODE 2
12/11/2022 03:13:17 PM script INFO: SUCCESS!@#KODE 1!@#USER_ID 31!@#ACTIVITY_CODE 2
12/11/2022 03:13:17 PM script INFO: SUCCESS!@#KODE 1!@#USER_ID 31!@#ACTIVITY_CODE 4
12/11/2022 03:13:17 PM script INFO: SUCCESS!@#KODE 1!@#USER_ID 31!@#ACTIVITY_CODE 2
12/11/2022 03:13:17 PM script INFO: SUCCESS!@#KODE 1!@#USER_ID 31!@#ACTIVITY_CODE 1
12/11/2022 03:13:17 PM script INFO: SUCCESS!@#KODE 1!@#USER_ID 31!@#ACTIVITY_CODE 3
12/11/2022 03:13:17 PM script INFO: SUCCESS!@#KODE 1!@#USER_ID 31!@#ACTIVITY_CODE 2
12/11/2022 03:13:17 PM script INFO: SUCCESS!@#KODE 1!@#USER_ID 31!@#ACTIVITY_CODE 4
12/11/2022 03:13:17 PM script INFO: SUCCESS!@#KODE 1!@#USER_ID 31!@#ACTIVITY_CODE 1
12/11/2022 03:13:17 PM script INFO: SUCCESS!@#KODE 1!@#USER_ID 31!@#ACTIVITY_CODE 1
12/11/2022 03:13:17 PM script INFO: SUCCESS!@#KODE 1!@#USER_ID 31!@#ACTIVITY_CODE 1
12/11/2022 03:13:17 PM script INFO: SUCCESS!@#KODE 1!@#USER_ID 31!@#ACTIVITY_CODE 3
12/11/2022 03:13:17 PM script INFO: SUCCESS!@#KODE 1!@#USER_ID 31!@#ACTIVITY_CODE 2
12/11/2022 03:13:18 PM script INFO: SUCCESS!@#KODE 1!@#USER_ID 31!@#ACTIVITY_CODE 2
12/11/2022 03:13:18 PM script INFO: SUCCESS!@#KODE 1!@#USER_ID 31!@#ACTIVITY_CODE 3
12/11/2022 03:13:18 PM script INFO: SUCCESS!@#KODE 1!@#USER_ID 31!@#ACTIVITY_CODE 1
12/11/2022 03:13:18 PM script INFO: SUCCESS!@#KODE 1!@#USER_ID 31!@#ACTIVITY_CODE 2
12/11/2022 03:13:18 PM script INFO: SUCCESS!@#KODE 1!@#USER_ID 31!@#ACTIVITY_CODE 1
12/11/2022 03:13:18 PM script INFO: SUCCESS!@#KODE 1!@#USER_ID 31!@#ACTIVITY_CODE 1
12/11/2022 03:13:18 PM script INFO: SUCCESS!@#KODE 1!@#USER_ID 31!@#ACTIVITY_CODE 2
12/11/2022 03:13:18 PM script INFO: SUCCESS!@#KODE 1!@#USER_ID 31!@#ACTIVITY_CODE 2
12/11/2022 03:13:18 PM script INFO: SUCCESS!@#KODE 1!@#USER_ID 31!@#ACTIVITY_CODE 2
12/11/2022 03:13:18 PM script INFO: SUCCESS!@#KODE 1!@#USER_ID 31!@#ACTIVITY_CODE 1
12/11/2022 03:13:18 PM script INFO: SUCCESS!@#KODE 1!@#USER_ID 31!@#ACTIVITY_CODE 3
12/11/2022 03:13:18 PM script INFO: Duration: 33.53130006790161
12/11/2022 03:13:18 PM script INFO: mengakhiri-quiz
12/11/2022 03:13:22 PM script INFO: SUCCESS!@#KODE 1!@#USER_ID 31!@#ACTIVITY_CODE 5
12/11/2022 03:13:22 PM script INFO: berhasil-submit
