12/23/2022 03:16:01 AM script INFO: Prepared chrome options..
12/23/2022 03:16:03 AM script INFO: Initialized chrome browser..
12/23/2022 03:16:03 AM script INFO: mengakses-homepage
12/23/2022 03:16:46 AM script INFO: mengakses-login-page
12/23/2022 03:16:47 AM script INFO: mengakses-site-home
12/23/2022 03:16:57 AM script INFO: mengakses-site-course
12/23/2022 03:17:04 AM script INFO: mengakses-quiz
12/23/2022 03:17:08 AM script INFO: mengakses-start-quiz-page
12/23/2022 03:17:09 AM script INFO: memulai-quiz
12/23/2022 03:17:09 AM script INFO: SUCCESS!@#KODE 1!@#USER_ID 40!@#ACTIVITY_CODE 5
12/23/2022 03:17:20 AM script INFO: SUCCESS!@#KODE 1!@#USER_ID 40!@#ACTIVITY_CODE 5
12/23/2022 03:17:20 AM script INFO: SUCCESS!@#KODE 1!@#USER_ID 40!@#ACTIVITY_CODE 5
12/23/2022 03:17:22 AM script INFO: SUCCESS!@#KODE 1!@#USER_ID 40!@#ACTIVITY_CODE 3
12/23/2022 03:17:22 AM script INFO: SUCCESS!@#KODE 1!@#USER_ID 40!@#ACTIVITY_CODE 1
12/23/2022 03:17:22 AM script INFO: SUCCESS!@#KODE 1!@#USER_ID 40!@#ACTIVITY_CODE 1
12/23/2022 03:17:22 AM script INFO: SUCCESS!@#KODE 1!@#USER_ID 40!@#ACTIVITY_CODE 5
12/23/2022 03:17:22 AM script INFO: SUCCESS!@#KODE 1!@#USER_ID 40!@#ACTIVITY_CODE 5
12/23/2022 03:17:25 AM script INFO: SUCCESS!@#KODE 1!@#USER_ID 40!@#ACTIVITY_CODE 1
12/23/2022 03:17:25 AM script INFO: SUCCESS!@#KODE 1!@#USER_ID 40!@#ACTIVITY_CODE 1
12/23/2022 03:17:25 AM script INFO: SUCCESS!@#KODE 1!@#USER_ID 40!@#ACTIVITY_CODE 4
12/23/2022 03:17:25 AM script INFO: SUCCESS!@#KODE 1!@#USER_ID 40!@#ACTIVITY_CODE 2
12/23/2022 03:17:25 AM script INFO: SUCCESS!@#KODE 1!@#USER_ID 40!@#ACTIVITY_CODE 5
12/23/2022 03:17:25 AM script INFO: SUCCESS!@#KODE 1!@#USER_ID 40!@#ACTIVITY_CODE 5
12/23/2022 03:17:28 AM script INFO: SUCCESS!@#KODE 1!@#USER_ID 40!@#ACTIVITY_CODE 5
12/23/2022 03:17:28 AM script INFO: SUCCESS!@#KODE 1!@#USER_ID 40!@#ACTIVITY_CODE 5
12/23/2022 03:17:30 AM script INFO: SUCCESS!@#KODE 1!@#USER_ID 40!@#ACTIVITY_CODE 5
12/23/2022 03:17:30 AM script INFO: SUCCESS!@#KODE 1!@#USER_ID 40!@#ACTIVITY_CODE 5
12/23/2022 03:17:33 AM script INFO: SUCCESS!@#KODE 1!@#USER_ID 40!@#ACTIVITY_CODE 2
12/23/2022 03:17:33 AM script INFO: SUCCESS!@#KODE 1!@#USER_ID 40!@#ACTIVITY_CODE 1
12/23/2022 03:17:33 AM script INFO: SUCCESS!@#KODE 1!@#USER_ID 40!@#ACTIVITY_CODE 5
12/23/2022 03:17:33 AM script INFO: SUCCESS!@#KODE 1!@#USER_ID 40!@#ACTIVITY_CODE 5
12/23/2022 03:17:36 AM script INFO: SUCCESS!@#KODE 1!@#USER_ID 40!@#ACTIVITY_CODE 2
12/23/2022 03:17:36 AM script INFO: SUCCESS!@#KODE 1!@#USER_ID 40!@#ACTIVITY_CODE 1
12/23/2022 03:17:36 AM script INFO: SUCCESS!@#KODE 1!@#USER_ID 40!@#ACTIVITY_CODE 4
12/23/2022 03:17:36 AM script INFO: SUCCESS!@#KODE 1!@#USER_ID 40!@#ACTIVITY_CODE 1
12/23/2022 03:17:36 AM script INFO: SUCCESS!@#KODE 1!@#USER_ID 40!@#ACTIVITY_CODE 3
12/23/2022 03:17:36 AM script INFO: SUCCESS!@#KODE 1!@#USER_ID 40!@#ACTIVITY_CODE 2
12/23/2022 03:17:36 AM script INFO: SUCCESS!@#KODE 1!@#USER_ID 40!@#ACTIVITY_CODE 2
12/23/2022 03:17:36 AM script INFO: SUCCESS!@#KODE 1!@#USER_ID 40!@#ACTIVITY_CODE 2
12/23/2022 03:17:36 AM script INFO: SUCCESS!@#KODE 1!@#USER_ID 40!@#ACTIVITY_CODE 4
12/23/2022 03:17:37 AM script INFO: SUCCESS!@#KODE 1!@#USER_ID 40!@#ACTIVITY_CODE 2
12/23/2022 03:17:37 AM script INFO: SUCCESS!@#KODE 1!@#USER_ID 40!@#ACTIVITY_CODE 4
12/23/2022 03:17:37 AM script INFO: SUCCESS!@#KODE 1!@#USER_ID 40!@#ACTIVITY_CODE 2
12/23/2022 03:17:37 AM script INFO: SUCCESS!@#KODE 1!@#USER_ID 40!@#ACTIVITY_CODE 1
12/23/2022 03:17:37 AM script INFO: SUCCESS!@#KODE 1!@#USER_ID 40!@#ACTIVITY_CODE 3
12/23/2022 03:17:37 AM script INFO: SUCCESS!@#KODE 1!@#USER_ID 40!@#ACTIVITY_CODE 3
12/23/2022 03:17:37 AM script INFO: SUCCESS!@#KODE 1!@#USER_ID 40!@#ACTIVITY_CODE 1
12/23/2022 03:17:37 AM script INFO: SUCCESS!@#KODE 1!@#USER_ID 40!@#ACTIVITY_CODE 2
12/23/2022 03:17:37 AM script INFO: SUCCESS!@#KODE 1!@#USER_ID 40!@#ACTIVITY_CODE 3
12/23/2022 03:17:37 AM script INFO: SUCCESS!@#KODE 1!@#USER_ID 40!@#ACTIVITY_CODE 3
12/23/2022 03:17:37 AM script INFO: SUCCESS!@#KODE 1!@#USER_ID 40!@#ACTIVITY_CODE 1
12/23/2022 03:17:37 AM script INFO: SUCCESS!@#KODE 1!@#USER_ID 40!@#ACTIVITY_CODE 4
12/23/2022 03:17:38 AM script INFO: SUCCESS!@#KODE 1!@#USER_ID 40!@#ACTIVITY_CODE 2
12/23/2022 03:17:38 AM script INFO: SUCCESS!@#KODE 1!@#USER_ID 40!@#ACTIVITY_CODE 2
12/23/2022 03:17:38 AM script INFO: SUCCESS!@#KODE 1!@#USER_ID 40!@#ACTIVITY_CODE 1
12/23/2022 03:17:38 AM script INFO: SUCCESS!@#KODE 1!@#USER_ID 40!@#ACTIVITY_CODE 4
12/23/2022 03:17:38 AM script INFO: SUCCESS!@#KODE 1!@#USER_ID 40!@#ACTIVITY_CODE 2
12/23/2022 03:17:38 AM script INFO: SUCCESS!@#KODE 1!@#USER_ID 40!@#ACTIVITY_CODE 2
12/23/2022 03:17:38 AM script INFO: Duration: 18.2633216381073
12/23/2022 03:17:38 AM script INFO: mengakhiri-quiz
12/23/2022 03:17:39 AM script INFO: SUCCESS!@#KODE 1!@#USER_ID 40!@#ACTIVITY_CODE 5
12/23/2022 03:17:39 AM script INFO: berhasil-submit
