12/10/2022 08:53:26 AM script INFO: Prepared chrome options..
12/10/2022 08:53:28 AM script INFO: Initialized chrome browser..
12/10/2022 08:53:28 AM script INFO: mengakses-homepage
12/10/2022 08:53:38 AM script INFO: mengakses-login-page
12/10/2022 08:53:41 AM script INFO: mengakses-site-home
12/10/2022 08:53:43 AM script INFO: mengakses-site-course
12/10/2022 08:54:10 AM script INFO: mengakses-quiz
12/10/2022 08:54:29 AM script INFO: mengakses-start-quiz-page
12/10/2022 08:54:54 AM script INFO: memulai-quiz
12/10/2022 08:54:54 AM script INFO: SUCCESS!@#KODE 1!@#USER_ID 22!@#ACTIVITY_CODE 5
12/10/2022 08:55:05 AM script INFO: SUCCESS!@#KODE 1!@#USER_ID 22!@#ACTIVITY_CODE 1
12/10/2022 08:55:05 AM script INFO: SUCCESS!@#KODE 1!@#USER_ID 22!@#ACTIVITY_CODE 2
12/10/2022 08:55:05 AM script INFO: SUCCESS!@#KODE 1!@#USER_ID 22!@#ACTIVITY_CODE 5
12/10/2022 08:55:05 AM script INFO: SUCCESS!@#KODE 1!@#USER_ID 22!@#ACTIVITY_CODE 5
12/10/2022 08:55:08 AM script INFO: SUCCESS!@#KODE 1!@#USER_ID 22!@#ACTIVITY_CODE 1
12/10/2022 08:55:08 AM script INFO: SUCCESS!@#KODE 1!@#USER_ID 22!@#ACTIVITY_CODE 2
12/10/2022 08:55:08 AM script INFO: SUCCESS!@#KODE 1!@#USER_ID 22!@#ACTIVITY_CODE 3
12/10/2022 08:55:08 AM script INFO: SUCCESS!@#KODE 1!@#USER_ID 22!@#ACTIVITY_CODE 2
12/10/2022 08:55:08 AM script INFO: SUCCESS!@#KODE 1!@#USER_ID 22!@#ACTIVITY_CODE 5
12/10/2022 08:55:08 AM script INFO: SUCCESS!@#KODE 1!@#USER_ID 22!@#ACTIVITY_CODE 5
12/10/2022 08:55:11 AM script INFO: SUCCESS!@#KODE 1!@#USER_ID 22!@#ACTIVITY_CODE 5
12/10/2022 08:55:11 AM script INFO: SUCCESS!@#KODE 1!@#USER_ID 22!@#ACTIVITY_CODE 5
12/10/2022 08:55:13 AM script INFO: SUCCESS!@#KODE 1!@#USER_ID 22!@#ACTIVITY_CODE 5
12/10/2022 08:55:13 AM script INFO: SUCCESS!@#KODE 1!@#USER_ID 22!@#ACTIVITY_CODE 5
12/10/2022 08:55:16 AM script INFO: SUCCESS!@#KODE 1!@#USER_ID 22!@#ACTIVITY_CODE 1
12/10/2022 08:55:16 AM script INFO: SUCCESS!@#KODE 1!@#USER_ID 22!@#ACTIVITY_CODE 5
12/10/2022 08:55:16 AM script INFO: SUCCESS!@#KODE 1!@#USER_ID 22!@#ACTIVITY_CODE 5
12/10/2022 08:55:18 AM script INFO: SUCCESS!@#KODE 1!@#USER_ID 22!@#ACTIVITY_CODE 3
12/10/2022 08:55:19 AM script INFO: SUCCESS!@#KODE 1!@#USER_ID 22!@#ACTIVITY_CODE 3
12/10/2022 08:55:19 AM script INFO: SUCCESS!@#KODE 1!@#USER_ID 22!@#ACTIVITY_CODE 5
12/10/2022 08:55:19 AM script INFO: SUCCESS!@#KODE 1!@#USER_ID 22!@#ACTIVITY_CODE 5
12/10/2022 08:55:21 AM script INFO: SUCCESS!@#KODE 1!@#USER_ID 22!@#ACTIVITY_CODE 3
12/10/2022 08:55:22 AM script INFO: SUCCESS!@#KODE 1!@#USER_ID 22!@#ACTIVITY_CODE 2
12/10/2022 08:55:22 AM script INFO: SUCCESS!@#KODE 1!@#USER_ID 22!@#ACTIVITY_CODE 1
12/10/2022 08:55:22 AM script INFO: SUCCESS!@#KODE 1!@#USER_ID 22!@#ACTIVITY_CODE 3
12/10/2022 08:55:22 AM script INFO: SUCCESS!@#KODE 1!@#USER_ID 22!@#ACTIVITY_CODE 3
12/10/2022 08:55:22 AM script INFO: SUCCESS!@#KODE 1!@#USER_ID 22!@#ACTIVITY_CODE 2
12/10/2022 08:55:22 AM script INFO: SUCCESS!@#KODE 1!@#USER_ID 22!@#ACTIVITY_CODE 1
12/10/2022 08:55:22 AM script INFO: SUCCESS!@#KODE 1!@#USER_ID 22!@#ACTIVITY_CODE 4
12/10/2022 08:55:22 AM script INFO: SUCCESS!@#KODE 1!@#USER_ID 22!@#ACTIVITY_CODE 1
12/10/2022 08:55:23 AM script INFO: SUCCESS!@#KODE 1!@#USER_ID 22!@#ACTIVITY_CODE 1
12/10/2022 08:55:23 AM script INFO: SUCCESS!@#KODE 1!@#USER_ID 22!@#ACTIVITY_CODE 4
12/10/2022 08:55:23 AM script INFO: SUCCESS!@#KODE 1!@#USER_ID 22!@#ACTIVITY_CODE 3
12/10/2022 08:55:23 AM script INFO: SUCCESS!@#KODE 1!@#USER_ID 22!@#ACTIVITY_CODE 1
12/10/2022 08:55:23 AM script INFO: SUCCESS!@#KODE 1!@#USER_ID 22!@#ACTIVITY_CODE 1
12/10/2022 08:55:23 AM script INFO: SUCCESS!@#KODE 1!@#USER_ID 22!@#ACTIVITY_CODE 3
12/10/2022 08:55:23 AM script INFO: SUCCESS!@#KODE 1!@#USER_ID 22!@#ACTIVITY_CODE 1
12/10/2022 08:55:23 AM script INFO: SUCCESS!@#KODE 1!@#USER_ID 22!@#ACTIVITY_CODE 3
12/10/2022 08:55:23 AM script INFO: SUCCESS!@#KODE 1!@#USER_ID 22!@#ACTIVITY_CODE 3
12/10/2022 08:55:24 AM script INFO: SUCCESS!@#KODE 1!@#USER_ID 22!@#ACTIVITY_CODE 4
12/10/2022 08:55:24 AM script INFO: SUCCESS!@#KODE 1!@#USER_ID 22!@#ACTIVITY_CODE 3
12/10/2022 08:55:24 AM script INFO: SUCCESS!@#KODE 1!@#USER_ID 22!@#ACTIVITY_CODE 3
12/10/2022 08:55:24 AM script INFO: SUCCESS!@#KODE 1!@#USER_ID 22!@#ACTIVITY_CODE 3
12/10/2022 08:55:24 AM script INFO: SUCCESS!@#KODE 1!@#USER_ID 22!@#ACTIVITY_CODE 1
12/10/2022 08:55:24 AM script INFO: SUCCESS!@#KODE 1!@#USER_ID 22!@#ACTIVITY_CODE 3
12/10/2022 08:55:24 AM script INFO: SUCCESS!@#KODE 1!@#USER_ID 22!@#ACTIVITY_CODE 1
12/10/2022 08:55:24 AM script INFO: SUCCESS!@#KODE 1!@#USER_ID 22!@#ACTIVITY_CODE 3
12/10/2022 08:55:25 AM script INFO: SUCCESS!@#KODE 1!@#USER_ID 22!@#ACTIVITY_CODE 2
12/10/2022 08:55:25 AM script INFO: Duration: 19.688798904418945
12/10/2022 08:55:25 AM script INFO: mengakhiri-quiz
12/10/2022 08:55:29 AM script INFO: SUCCESS!@#KODE 1!@#USER_ID 22!@#ACTIVITY_CODE 5
12/10/2022 08:55:29 AM script INFO: berhasil-submit
