12/12/2022 01:53:33 AM script INFO: Prepared chrome options..
12/12/2022 01:53:35 AM script INFO: Initialized chrome browser..
12/12/2022 01:53:35 AM script INFO: mengakses-homepage
12/12/2022 01:54:24 AM script INFO: mengakses-login-page
12/12/2022 01:54:38 AM script INFO: mengakses-site-home
12/12/2022 01:54:39 AM script INFO: mengakses-site-course
12/12/2022 01:54:58 AM script INFO: mengakses-quiz
12/12/2022 01:54:59 AM script INFO: mengakses-start-quiz-page
12/12/2022 01:55:00 AM script INFO: memulai-quiz
12/12/2022 01:55:00 AM script INFO: SUCCESS!@#KODE 1!@#USER_ID 12!@#ACTIVITY_CODE 5
12/12/2022 01:55:12 AM script INFO: SUCCESS!@#KODE 1!@#USER_ID 12!@#ACTIVITY_CODE 2
12/12/2022 01:55:12 AM script INFO: SUCCESS!@#KODE 1!@#USER_ID 12!@#ACTIVITY_CODE 5
12/12/2022 01:55:12 AM script INFO: SUCCESS!@#KODE 1!@#USER_ID 12!@#ACTIVITY_CODE 5
12/12/2022 01:55:14 AM script INFO: SUCCESS!@#KODE 1!@#USER_ID 12!@#ACTIVITY_CODE 2
12/12/2022 01:55:14 AM script INFO: SUCCESS!@#KODE 1!@#USER_ID 12!@#ACTIVITY_CODE 3
12/12/2022 01:55:15 AM script INFO: SUCCESS!@#KODE 1!@#USER_ID 12!@#ACTIVITY_CODE 1
12/12/2022 01:55:15 AM script INFO: SUCCESS!@#KODE 1!@#USER_ID 12!@#ACTIVITY_CODE 5
12/12/2022 01:55:15 AM script INFO: SUCCESS!@#KODE 1!@#USER_ID 12!@#ACTIVITY_CODE 5
12/12/2022 01:55:17 AM script INFO: SUCCESS!@#KODE 1!@#USER_ID 12!@#ACTIVITY_CODE 4
12/12/2022 01:55:17 AM script INFO: SUCCESS!@#KODE 1!@#USER_ID 12!@#ACTIVITY_CODE 5
12/12/2022 01:55:17 AM script INFO: SUCCESS!@#KODE 1!@#USER_ID 12!@#ACTIVITY_CODE 5
12/12/2022 01:55:20 AM script INFO: SUCCESS!@#KODE 1!@#USER_ID 12!@#ACTIVITY_CODE 5
12/12/2022 01:55:20 AM script INFO: SUCCESS!@#KODE 1!@#USER_ID 12!@#ACTIVITY_CODE 5
12/12/2022 01:55:23 AM script INFO: SUCCESS!@#KODE 1!@#USER_ID 12!@#ACTIVITY_CODE 3
12/12/2022 01:55:23 AM script INFO: SUCCESS!@#KODE 1!@#USER_ID 12!@#ACTIVITY_CODE 5
12/12/2022 01:55:23 AM script INFO: SUCCESS!@#KODE 1!@#USER_ID 12!@#ACTIVITY_CODE 5
12/12/2022 01:55:25 AM script INFO: SUCCESS!@#KODE 1!@#USER_ID 12!@#ACTIVITY_CODE 3
12/12/2022 01:55:25 AM script INFO: SUCCESS!@#KODE 1!@#USER_ID 12!@#ACTIVITY_CODE 5
12/12/2022 01:55:25 AM script INFO: SUCCESS!@#KODE 1!@#USER_ID 12!@#ACTIVITY_CODE 5
12/12/2022 01:55:28 AM script INFO: SUCCESS!@#KODE 1!@#USER_ID 12!@#ACTIVITY_CODE 1
12/12/2022 01:55:28 AM script INFO: SUCCESS!@#KODE 1!@#USER_ID 12!@#ACTIVITY_CODE 1
12/12/2022 01:55:28 AM script INFO: SUCCESS!@#KODE 1!@#USER_ID 12!@#ACTIVITY_CODE 5
12/12/2022 01:55:28 AM script INFO: SUCCESS!@#KODE 1!@#USER_ID 12!@#ACTIVITY_CODE 5
12/12/2022 01:55:31 AM script INFO: SUCCESS!@#KODE 1!@#USER_ID 12!@#ACTIVITY_CODE 5
12/12/2022 01:55:31 AM script INFO: SUCCESS!@#KODE 1!@#USER_ID 12!@#ACTIVITY_CODE 5
12/12/2022 01:55:33 AM script INFO: SUCCESS!@#KODE 1!@#USER_ID 12!@#ACTIVITY_CODE 1
12/12/2022 01:55:34 AM script INFO: SUCCESS!@#KODE 1!@#USER_ID 12!@#ACTIVITY_CODE 4
12/12/2022 01:55:34 AM script INFO: SUCCESS!@#KODE 1!@#USER_ID 12!@#ACTIVITY_CODE 2
12/12/2022 01:55:35 AM script INFO: SUCCESS!@#KODE 1!@#USER_ID 12!@#ACTIVITY_CODE 2
12/12/2022 01:55:35 AM script INFO: SUCCESS!@#KODE 1!@#USER_ID 12!@#ACTIVITY_CODE 2
12/12/2022 01:55:35 AM script INFO: SUCCESS!@#KODE 1!@#USER_ID 12!@#ACTIVITY_CODE 5
12/12/2022 01:55:35 AM script INFO: SUCCESS!@#KODE 1!@#USER_ID 12!@#ACTIVITY_CODE 5
12/12/2022 01:55:38 AM script INFO: SUCCESS!@#KODE 1!@#USER_ID 12!@#ACTIVITY_CODE 5
12/12/2022 01:55:38 AM script INFO: SUCCESS!@#KODE 1!@#USER_ID 12!@#ACTIVITY_CODE 5
12/12/2022 01:55:41 AM script INFO: SUCCESS!@#KODE 1!@#USER_ID 12!@#ACTIVITY_CODE 3
12/12/2022 01:55:41 AM script INFO: SUCCESS!@#KODE 1!@#USER_ID 12!@#ACTIVITY_CODE 1
12/12/2022 01:55:41 AM script INFO: SUCCESS!@#KODE 1!@#USER_ID 12!@#ACTIVITY_CODE 1
12/12/2022 01:55:41 AM script INFO: SUCCESS!@#KODE 1!@#USER_ID 12!@#ACTIVITY_CODE 4
12/12/2022 01:55:42 AM script INFO: SUCCESS!@#KODE 1!@#USER_ID 12!@#ACTIVITY_CODE 3
12/12/2022 01:55:42 AM script INFO: SUCCESS!@#KODE 1!@#USER_ID 12!@#ACTIVITY_CODE 5
12/12/2022 01:55:42 AM script INFO: SUCCESS!@#KODE 1!@#USER_ID 12!@#ACTIVITY_CODE 5
12/12/2022 01:55:44 AM script INFO: SUCCESS!@#KODE 1!@#USER_ID 12!@#ACTIVITY_CODE 3
12/12/2022 01:55:45 AM script INFO: SUCCESS!@#KODE 1!@#USER_ID 12!@#ACTIVITY_CODE 1
12/12/2022 01:55:45 AM script INFO: SUCCESS!@#KODE 1!@#USER_ID 12!@#ACTIVITY_CODE 2
12/12/2022 01:55:45 AM script INFO: SUCCESS!@#KODE 1!@#USER_ID 12!@#ACTIVITY_CODE 1
12/12/2022 01:55:45 AM script INFO: SUCCESS!@#KODE 1!@#USER_ID 12!@#ACTIVITY_CODE 3
12/12/2022 01:55:46 AM script INFO: SUCCESS!@#KODE 1!@#USER_ID 12!@#ACTIVITY_CODE 4
12/12/2022 01:55:47 AM script INFO: SUCCESS!@#KODE 1!@#USER_ID 12!@#ACTIVITY_CODE 2
12/12/2022 01:55:47 AM script INFO: SUCCESS!@#KODE 1!@#USER_ID 12!@#ACTIVITY_CODE 3
12/12/2022 01:55:47 AM script INFO: SUCCESS!@#KODE 1!@#USER_ID 12!@#ACTIVITY_CODE 1
12/12/2022 01:55:47 AM script INFO: SUCCESS!@#KODE 1!@#USER_ID 12!@#ACTIVITY_CODE 5
12/12/2022 01:55:47 AM script INFO: SUCCESS!@#KODE 1!@#USER_ID 12!@#ACTIVITY_CODE 5
12/12/2022 01:55:50 AM script INFO: SUCCESS!@#KODE 1!@#USER_ID 12!@#ACTIVITY_CODE 3
12/12/2022 01:55:50 AM script INFO: SUCCESS!@#KODE 1!@#USER_ID 12!@#ACTIVITY_CODE 3
12/12/2022 01:55:50 AM script INFO: SUCCESS!@#KODE 1!@#USER_ID 12!@#ACTIVITY_CODE 5
12/12/2022 01:55:50 AM script INFO: SUCCESS!@#KODE 1!@#USER_ID 12!@#ACTIVITY_CODE 5
12/12/2022 01:55:53 AM script INFO: SUCCESS!@#KODE 1!@#USER_ID 12!@#ACTIVITY_CODE 5
12/12/2022 01:55:53 AM script INFO: SUCCESS!@#KODE 1!@#USER_ID 12!@#ACTIVITY_CODE 5
12/12/2022 01:55:56 AM script INFO: SUCCESS!@#KODE 1!@#USER_ID 12!@#ACTIVITY_CODE 5
12/12/2022 01:55:56 AM script INFO: SUCCESS!@#KODE 1!@#USER_ID 12!@#ACTIVITY_CODE 5
12/12/2022 01:55:59 AM script INFO: SUCCESS!@#KODE 1!@#USER_ID 12!@#ACTIVITY_CODE 2
12/12/2022 01:55:59 AM script INFO: SUCCESS!@#KODE 1!@#USER_ID 12!@#ACTIVITY_CODE 5
12/12/2022 01:55:59 AM script INFO: SUCCESS!@#KODE 1!@#USER_ID 12!@#ACTIVITY_CODE 5
12/12/2022 01:56:02 AM script INFO: SUCCESS!@#KODE 1!@#USER_ID 12!@#ACTIVITY_CODE 2
12/12/2022 01:56:03 AM script INFO: SUCCESS!@#KODE 1!@#USER_ID 12!@#ACTIVITY_CODE 2
12/12/2022 01:56:03 AM script INFO: SUCCESS!@#KODE 1!@#USER_ID 12!@#ACTIVITY_CODE 4
12/12/2022 01:56:03 AM script INFO: SUCCESS!@#KODE 1!@#USER_ID 12!@#ACTIVITY_CODE 3
12/12/2022 01:56:03 AM script INFO: SUCCESS!@#KODE 1!@#USER_ID 12!@#ACTIVITY_CODE 5
12/12/2022 01:56:03 AM script INFO: SUCCESS!@#KODE 1!@#USER_ID 12!@#ACTIVITY_CODE 5
12/12/2022 01:56:06 AM script INFO: SUCCESS!@#KODE 1!@#USER_ID 12!@#ACTIVITY_CODE 1
12/12/2022 01:56:07 AM script INFO: SUCCESS!@#KODE 1!@#USER_ID 12!@#ACTIVITY_CODE 2
12/12/2022 01:56:07 AM script INFO: SUCCESS!@#KODE 1!@#USER_ID 12!@#ACTIVITY_CODE 1
12/12/2022 01:56:07 AM script INFO: SUCCESS!@#KODE 1!@#USER_ID 12!@#ACTIVITY_CODE 1
12/12/2022 01:56:07 AM script INFO: SUCCESS!@#KODE 1!@#USER_ID 12!@#ACTIVITY_CODE 5
12/12/2022 01:56:07 AM script INFO: SUCCESS!@#KODE 1!@#USER_ID 12!@#ACTIVITY_CODE 5
12/12/2022 01:56:10 AM script INFO: SUCCESS!@#KODE 1!@#USER_ID 12!@#ACTIVITY_CODE 1
12/12/2022 01:56:11 AM script INFO: SUCCESS!@#KODE 1!@#USER_ID 12!@#ACTIVITY_CODE 4
12/12/2022 01:56:11 AM script INFO: SUCCESS!@#KODE 1!@#USER_ID 12!@#ACTIVITY_CODE 2
12/12/2022 01:56:11 AM script INFO: SUCCESS!@#KODE 1!@#USER_ID 12!@#ACTIVITY_CODE 2
12/12/2022 01:56:11 AM script INFO: SUCCESS!@#KODE 1!@#USER_ID 12!@#ACTIVITY_CODE 5
12/12/2022 01:56:11 AM script INFO: SUCCESS!@#KODE 1!@#USER_ID 12!@#ACTIVITY_CODE 5
12/12/2022 01:56:15 AM script INFO: SUCCESS!@#KODE 1!@#USER_ID 12!@#ACTIVITY_CODE 3
12/12/2022 01:56:15 AM script INFO: SUCCESS!@#KODE 1!@#USER_ID 12!@#ACTIVITY_CODE 1
12/12/2022 01:56:15 AM script INFO: SUCCESS!@#KODE 1!@#USER_ID 12!@#ACTIVITY_CODE 1
12/12/2022 01:56:15 AM script INFO: SUCCESS!@#KODE 1!@#USER_ID 12!@#ACTIVITY_CODE 5
12/12/2022 01:56:15 AM script INFO: SUCCESS!@#KODE 1!@#USER_ID 12!@#ACTIVITY_CODE 5
12/12/2022 01:56:18 AM script INFO: SUCCESS!@#KODE 1!@#USER_ID 12!@#ACTIVITY_CODE 2
12/12/2022 01:56:19 AM script INFO: SUCCESS!@#KODE 1!@#USER_ID 12!@#ACTIVITY_CODE 2
12/12/2022 01:56:19 AM script INFO: SUCCESS!@#KODE 1!@#USER_ID 12!@#ACTIVITY_CODE 2
12/12/2022 01:56:19 AM script INFO: SUCCESS!@#KODE 1!@#USER_ID 12!@#ACTIVITY_CODE 1
12/12/2022 01:56:20 AM script INFO: SUCCESS!@#KODE 1!@#USER_ID 12!@#ACTIVITY_CODE 4
12/12/2022 01:56:20 AM script INFO: SUCCESS!@#KODE 1!@#USER_ID 12!@#ACTIVITY_CODE 3
12/12/2022 01:56:20 AM script INFO: SUCCESS!@#KODE 1!@#USER_ID 12!@#ACTIVITY_CODE 3
12/12/2022 01:56:21 AM script INFO: SUCCESS!@#KODE 1!@#USER_ID 12!@#ACTIVITY_CODE 2
12/12/2022 01:56:21 AM script INFO: SUCCESS!@#KODE 1!@#USER_ID 12!@#ACTIVITY_CODE 1
12/12/2022 01:56:22 AM script INFO: SUCCESS!@#KODE 1!@#USER_ID 12!@#ACTIVITY_CODE 2
12/12/2022 01:56:22 AM script INFO: SUCCESS!@#KODE 1!@#USER_ID 12!@#ACTIVITY_CODE 1
12/12/2022 01:56:23 AM script INFO: SUCCESS!@#KODE 1!@#USER_ID 12!@#ACTIVITY_CODE 4
12/12/2022 01:56:23 AM script INFO: SUCCESS!@#KODE 1!@#USER_ID 12!@#ACTIVITY_CODE 2
12/12/2022 01:56:24 AM script INFO: SUCCESS!@#KODE 1!@#USER_ID 12!@#ACTIVITY_CODE 2
12/12/2022 01:56:24 AM script INFO: SUCCESS!@#KODE 1!@#USER_ID 12!@#ACTIVITY_CODE 2
12/12/2022 01:56:24 AM script INFO: SUCCESS!@#KODE 1!@#USER_ID 12!@#ACTIVITY_CODE 5
12/12/2022 01:56:24 AM script INFO: SUCCESS!@#KODE 1!@#USER_ID 12!@#ACTIVITY_CODE 5
12/12/2022 01:56:27 AM script INFO: SUCCESS!@#KODE 1!@#USER_ID 12!@#ACTIVITY_CODE 2
12/12/2022 01:56:28 AM script INFO: SUCCESS!@#KODE 1!@#USER_ID 12!@#ACTIVITY_CODE 2
12/12/2022 01:56:28 AM script INFO: SUCCESS!@#KODE 1!@#USER_ID 12!@#ACTIVITY_CODE 3
12/12/2022 01:56:28 AM script INFO: SUCCESS!@#KODE 1!@#USER_ID 12!@#ACTIVITY_CODE 1
12/12/2022 01:56:28 AM script INFO: SUCCESS!@#KODE 1!@#USER_ID 12!@#ACTIVITY_CODE 1
12/12/2022 01:56:29 AM script INFO: SUCCESS!@#KODE 1!@#USER_ID 12!@#ACTIVITY_CODE 2
12/12/2022 01:56:29 AM script INFO: SUCCESS!@#KODE 1!@#USER_ID 12!@#ACTIVITY_CODE 3
12/12/2022 01:56:29 AM script INFO: SUCCESS!@#KODE 1!@#USER_ID 12!@#ACTIVITY_CODE 2
12/12/2022 01:56:29 AM script INFO: SUCCESS!@#KODE 1!@#USER_ID 12!@#ACTIVITY_CODE 3
12/12/2022 01:56:30 AM script INFO: SUCCESS!@#KODE 1!@#USER_ID 12!@#ACTIVITY_CODE 1
12/12/2022 01:56:30 AM script INFO: SUCCESS!@#KODE 1!@#USER_ID 12!@#ACTIVITY_CODE 2
12/12/2022 01:56:30 AM script INFO: SUCCESS!@#KODE 1!@#USER_ID 12!@#ACTIVITY_CODE 2
12/12/2022 01:56:31 AM script INFO: SUCCESS!@#KODE 1!@#USER_ID 12!@#ACTIVITY_CODE 2
12/12/2022 01:56:32 AM script INFO: SUCCESS!@#KODE 1!@#USER_ID 12!@#ACTIVITY_CODE 2
12/12/2022 01:56:32 AM script INFO: SUCCESS!@#KODE 1!@#USER_ID 12!@#ACTIVITY_CODE 3
12/12/2022 01:56:32 AM script INFO: SUCCESS!@#KODE 1!@#USER_ID 12!@#ACTIVITY_CODE 1
12/12/2022 01:56:33 AM script INFO: SUCCESS!@#KODE 1!@#USER_ID 12!@#ACTIVITY_CODE 1
12/12/2022 01:56:34 AM script INFO: SUCCESS!@#KODE 1!@#USER_ID 12!@#ACTIVITY_CODE 3
12/12/2022 01:56:34 AM script INFO: SUCCESS!@#KODE 1!@#USER_ID 12!@#ACTIVITY_CODE 3
12/12/2022 01:56:34 AM script INFO: SUCCESS!@#KODE 1!@#USER_ID 12!@#ACTIVITY_CODE 4
12/12/2022 01:56:34 AM script INFO: SUCCESS!@#KODE 1!@#USER_ID 12!@#ACTIVITY_CODE 1
12/12/2022 01:56:35 AM script INFO: SUCCESS!@#KODE 1!@#USER_ID 12!@#ACTIVITY_CODE 4
12/12/2022 01:56:35 AM script INFO: SUCCESS!@#KODE 1!@#USER_ID 12!@#ACTIVITY_CODE 2
12/12/2022 01:56:36 AM script INFO: SUCCESS!@#KODE 1!@#USER_ID 12!@#ACTIVITY_CODE 1
12/12/2022 01:56:36 AM script INFO: SUCCESS!@#KODE 1!@#USER_ID 12!@#ACTIVITY_CODE 3
12/12/2022 01:56:36 AM script INFO: SUCCESS!@#KODE 1!@#USER_ID 12!@#ACTIVITY_CODE 3
12/12/2022 01:56:37 AM script INFO: SUCCESS!@#KODE 1!@#USER_ID 12!@#ACTIVITY_CODE 2
12/12/2022 01:56:37 AM script INFO: SUCCESS!@#KODE 1!@#USER_ID 12!@#ACTIVITY_CODE 1
12/12/2022 01:56:37 AM script INFO: SUCCESS!@#KODE 1!@#USER_ID 12!@#ACTIVITY_CODE 3
12/12/2022 01:56:37 AM script INFO: SUCCESS!@#KODE 1!@#USER_ID 12!@#ACTIVITY_CODE 1
12/12/2022 01:56:38 AM script INFO: SUCCESS!@#KODE 1!@#USER_ID 12!@#ACTIVITY_CODE 4
12/12/2022 01:56:38 AM script INFO: SUCCESS!@#KODE 1!@#USER_ID 12!@#ACTIVITY_CODE 2
12/12/2022 01:56:39 AM script INFO: SUCCESS!@#KODE 1!@#USER_ID 12!@#ACTIVITY_CODE 2
12/12/2022 01:56:39 AM script INFO: SUCCESS!@#KODE 1!@#USER_ID 12!@#ACTIVITY_CODE 1
12/12/2022 01:56:39 AM script INFO: SUCCESS!@#KODE 1!@#USER_ID 12!@#ACTIVITY_CODE 1
12/12/2022 01:56:40 AM script INFO: SUCCESS!@#KODE 1!@#USER_ID 12!@#ACTIVITY_CODE 2
12/12/2022 01:56:40 AM script INFO: SUCCESS!@#KODE 1!@#USER_ID 12!@#ACTIVITY_CODE 2
12/12/2022 01:56:41 AM script INFO: SUCCESS!@#KODE 1!@#USER_ID 12!@#ACTIVITY_CODE 3
12/12/2022 01:56:41 AM script INFO: SUCCESS!@#KODE 1!@#USER_ID 12!@#ACTIVITY_CODE 2
12/12/2022 01:56:42 AM script INFO: SUCCESS!@#KODE 1!@#USER_ID 12!@#ACTIVITY_CODE 2
12/12/2022 01:56:42 AM script INFO: SUCCESS!@#KODE 1!@#USER_ID 12!@#ACTIVITY_CODE 2
12/12/2022 01:56:43 AM script INFO: SUCCESS!@#KODE 1!@#USER_ID 12!@#ACTIVITY_CODE 1
12/12/2022 01:56:43 AM script INFO: SUCCESS!@#KODE 1!@#USER_ID 12!@#ACTIVITY_CODE 1
12/12/2022 01:56:43 AM script INFO: SUCCESS!@#KODE 1!@#USER_ID 12!@#ACTIVITY_CODE 1
12/12/2022 01:56:44 AM script INFO: SUCCESS!@#KODE 1!@#USER_ID 12!@#ACTIVITY_CODE 2
12/12/2022 01:56:44 AM script INFO: SUCCESS!@#KODE 1!@#USER_ID 12!@#ACTIVITY_CODE 2
12/12/2022 01:56:46 AM script INFO: SUCCESS!@#KODE 1!@#USER_ID 12!@#ACTIVITY_CODE 2
12/12/2022 01:56:46 AM script INFO: SUCCESS!@#KODE 1!@#USER_ID 12!@#ACTIVITY_CODE 2
12/12/2022 01:56:46 AM script INFO: SUCCESS!@#KODE 1!@#USER_ID 12!@#ACTIVITY_CODE 3
12/12/2022 01:56:46 AM script INFO: SUCCESS!@#KODE 1!@#USER_ID 12!@#ACTIVITY_CODE 1
12/12/2022 01:56:47 AM script INFO: SUCCESS!@#KODE 1!@#USER_ID 12!@#ACTIVITY_CODE 2
12/12/2022 01:56:47 AM script INFO: SUCCESS!@#KODE 1!@#USER_ID 12!@#ACTIVITY_CODE 3
12/12/2022 01:56:48 AM script INFO: SUCCESS!@#KODE 1!@#USER_ID 12!@#ACTIVITY_CODE 1
12/12/2022 01:56:48 AM script INFO: SUCCESS!@#KODE 1!@#USER_ID 12!@#ACTIVITY_CODE 2
12/12/2022 01:56:48 AM script INFO: SUCCESS!@#KODE 1!@#USER_ID 12!@#ACTIVITY_CODE 1
12/12/2022 01:56:49 AM script INFO: SUCCESS!@#KODE 1!@#USER_ID 12!@#ACTIVITY_CODE 2
12/12/2022 01:56:50 AM script INFO: SUCCESS!@#KODE 1!@#USER_ID 12!@#ACTIVITY_CODE 2
12/12/2022 01:56:50 AM script INFO: SUCCESS!@#KODE 1!@#USER_ID 12!@#ACTIVITY_CODE 2
12/12/2022 01:56:50 AM script INFO: SUCCESS!@#KODE 1!@#USER_ID 12!@#ACTIVITY_CODE 4
12/12/2022 01:56:51 AM script INFO: SUCCESS!@#KODE 1!@#USER_ID 12!@#ACTIVITY_CODE 2
12/12/2022 01:56:51 AM script INFO: SUCCESS!@#KODE 1!@#USER_ID 12!@#ACTIVITY_CODE 4
12/12/2022 01:56:51 AM script INFO: SUCCESS!@#KODE 1!@#USER_ID 12!@#ACTIVITY_CODE 2
12/12/2022 01:56:52 AM script INFO: SUCCESS!@#KODE 1!@#USER_ID 12!@#ACTIVITY_CODE 3
12/12/2022 01:56:52 AM script INFO: SUCCESS!@#KODE 1!@#USER_ID 12!@#ACTIVITY_CODE 4
12/12/2022 01:56:52 AM script INFO: SUCCESS!@#KODE 1!@#USER_ID 12!@#ACTIVITY_CODE 1
12/12/2022 01:56:52 AM script INFO: SUCCESS!@#KODE 1!@#USER_ID 12!@#ACTIVITY_CODE 1
12/12/2022 01:56:52 AM script INFO: SUCCESS!@#KODE 1!@#USER_ID 12!@#ACTIVITY_CODE 1
12/12/2022 01:56:52 AM script INFO: SUCCESS!@#KODE 1!@#USER_ID 12!@#ACTIVITY_CODE 3
12/12/2022 01:56:53 AM script INFO: SUCCESS!@#KODE 1!@#USER_ID 12!@#ACTIVITY_CODE 3
12/12/2022 01:56:53 AM script INFO: SUCCESS!@#KODE 1!@#USER_ID 12!@#ACTIVITY_CODE 2
12/12/2022 01:56:54 AM script INFO: SUCCESS!@#KODE 1!@#USER_ID 12!@#ACTIVITY_CODE 2
12/12/2022 01:56:55 AM script INFO: SUCCESS!@#KODE 1!@#USER_ID 12!@#ACTIVITY_CODE 3
12/12/2022 01:56:55 AM script INFO: SUCCESS!@#KODE 1!@#USER_ID 12!@#ACTIVITY_CODE 4
12/12/2022 01:56:55 AM script INFO: SUCCESS!@#KODE 1!@#USER_ID 12!@#ACTIVITY_CODE 3
12/12/2022 01:56:55 AM script INFO: SUCCESS!@#KODE 1!@#USER_ID 12!@#ACTIVITY_CODE 3
12/12/2022 01:56:55 AM script INFO: SUCCESS!@#KODE 1!@#USER_ID 12!@#ACTIVITY_CODE 3
12/12/2022 01:56:56 AM script INFO: SUCCESS!@#KODE 1!@#USER_ID 12!@#ACTIVITY_CODE 1
12/12/2022 01:56:56 AM script INFO: SUCCESS!@#KODE 1!@#USER_ID 12!@#ACTIVITY_CODE 4
12/12/2022 01:56:56 AM script INFO: SUCCESS!@#KODE 1!@#USER_ID 12!@#ACTIVITY_CODE 2
12/12/2022 01:56:57 AM script INFO: SUCCESS!@#KODE 1!@#USER_ID 12!@#ACTIVITY_CODE 4
12/12/2022 01:56:58 AM script INFO: SUCCESS!@#KODE 1!@#USER_ID 12!@#ACTIVITY_CODE 2
12/12/2022 01:56:58 AM script INFO: SUCCESS!@#KODE 1!@#USER_ID 12!@#ACTIVITY_CODE 2
12/12/2022 01:56:59 AM script INFO: SUCCESS!@#KODE 1!@#USER_ID 12!@#ACTIVITY_CODE 2
12/12/2022 01:56:59 AM script INFO: SUCCESS!@#KODE 1!@#USER_ID 12!@#ACTIVITY_CODE 2
12/12/2022 01:56:59 AM script INFO: SUCCESS!@#KODE 1!@#USER_ID 12!@#ACTIVITY_CODE 2
12/12/2022 01:57:00 AM script INFO: SUCCESS!@#KODE 1!@#USER_ID 12!@#ACTIVITY_CODE 1
12/12/2022 01:57:00 AM script INFO: SUCCESS!@#KODE 1!@#USER_ID 12!@#ACTIVITY_CODE 1
12/12/2022 01:57:00 AM script INFO: SUCCESS!@#KODE 1!@#USER_ID 12!@#ACTIVITY_CODE 2
12/12/2022 01:57:00 AM script INFO: SUCCESS!@#KODE 1!@#USER_ID 12!@#ACTIVITY_CODE 1
12/12/2022 01:57:01 AM script INFO: SUCCESS!@#KODE 1!@#USER_ID 12!@#ACTIVITY_CODE 4
12/12/2022 01:57:01 AM script INFO: SUCCESS!@#KODE 1!@#USER_ID 12!@#ACTIVITY_CODE 1
12/12/2022 01:57:01 AM script INFO: SUCCESS!@#KODE 1!@#USER_ID 12!@#ACTIVITY_CODE 2
12/12/2022 01:57:02 AM script INFO: SUCCESS!@#KODE 1!@#USER_ID 12!@#ACTIVITY_CODE 3
12/12/2022 01:57:02 AM script INFO: SUCCESS!@#KODE 1!@#USER_ID 12!@#ACTIVITY_CODE 2
12/12/2022 01:57:02 AM script INFO: SUCCESS!@#KODE 1!@#USER_ID 12!@#ACTIVITY_CODE 3
12/12/2022 01:57:03 AM script INFO: SUCCESS!@#KODE 1!@#USER_ID 12!@#ACTIVITY_CODE 1
12/12/2022 01:57:03 AM script INFO: SUCCESS!@#KODE 1!@#USER_ID 12!@#ACTIVITY_CODE 2
12/12/2022 01:57:04 AM script INFO: SUCCESS!@#KODE 1!@#USER_ID 12!@#ACTIVITY_CODE 2
12/12/2022 01:57:04 AM script INFO: SUCCESS!@#KODE 1!@#USER_ID 12!@#ACTIVITY_CODE 1
12/12/2022 01:57:04 AM script INFO: SUCCESS!@#KODE 1!@#USER_ID 12!@#ACTIVITY_CODE 2
12/12/2022 01:57:05 AM script INFO: SUCCESS!@#KODE 1!@#USER_ID 12!@#ACTIVITY_CODE 3
12/12/2022 01:57:05 AM script INFO: SUCCESS!@#KODE 1!@#USER_ID 12!@#ACTIVITY_CODE 3
12/12/2022 01:57:05 AM script INFO: SUCCESS!@#KODE 1!@#USER_ID 12!@#ACTIVITY_CODE 3
12/12/2022 01:57:05 AM script INFO: SUCCESS!@#KODE 1!@#USER_ID 12!@#ACTIVITY_CODE 3
12/12/2022 01:57:06 AM script INFO: SUCCESS!@#KODE 1!@#USER_ID 12!@#ACTIVITY_CODE 2
12/12/2022 01:57:06 AM script INFO: SUCCESS!@#KODE 1!@#USER_ID 12!@#ACTIVITY_CODE 1
12/12/2022 01:57:06 AM script INFO: SUCCESS!@#KODE 1!@#USER_ID 12!@#ACTIVITY_CODE 2
12/12/2022 01:57:06 AM script INFO: SUCCESS!@#KODE 1!@#USER_ID 12!@#ACTIVITY_CODE 1
12/12/2022 01:57:07 AM script INFO: SUCCESS!@#KODE 1!@#USER_ID 12!@#ACTIVITY_CODE 2
12/12/2022 01:57:07 AM script INFO: SUCCESS!@#KODE 1!@#USER_ID 12!@#ACTIVITY_CODE 4
12/12/2022 01:57:07 AM script INFO: SUCCESS!@#KODE 1!@#USER_ID 12!@#ACTIVITY_CODE 2
12/12/2022 01:57:08 AM script INFO: SUCCESS!@#KODE 1!@#USER_ID 12!@#ACTIVITY_CODE 1
12/12/2022 01:57:08 AM script INFO: SUCCESS!@#KODE 1!@#USER_ID 12!@#ACTIVITY_CODE 2
12/12/2022 01:57:08 AM script INFO: SUCCESS!@#KODE 1!@#USER_ID 12!@#ACTIVITY_CODE 3
12/12/2022 01:57:09 AM script INFO: SUCCESS!@#KODE 1!@#USER_ID 12!@#ACTIVITY_CODE 3
12/12/2022 01:57:09 AM script INFO: SUCCESS!@#KODE 1!@#USER_ID 12!@#ACTIVITY_CODE 1
12/12/2022 01:57:09 AM script INFO: SUCCESS!@#KODE 1!@#USER_ID 12!@#ACTIVITY_CODE 3
12/12/2022 01:57:09 AM script INFO: SUCCESS!@#KODE 1!@#USER_ID 12!@#ACTIVITY_CODE 3
12/12/2022 01:57:09 AM script INFO: SUCCESS!@#KODE 1!@#USER_ID 12!@#ACTIVITY_CODE 1
12/12/2022 01:57:09 AM script INFO: SUCCESS!@#KODE 1!@#USER_ID 12!@#ACTIVITY_CODE 1
12/12/2022 01:57:10 AM script INFO: SUCCESS!@#KODE 1!@#USER_ID 12!@#ACTIVITY_CODE 3
12/12/2022 01:57:10 AM script INFO: SUCCESS!@#KODE 1!@#USER_ID 12!@#ACTIVITY_CODE 2
12/12/2022 01:57:11 AM script INFO: SUCCESS!@#KODE 1!@#USER_ID 12!@#ACTIVITY_CODE 1
12/12/2022 01:57:11 AM script INFO: SUCCESS!@#KODE 1!@#USER_ID 12!@#ACTIVITY_CODE 1
12/12/2022 01:57:11 AM script INFO: SUCCESS!@#KODE 1!@#USER_ID 12!@#ACTIVITY_CODE 3
12/12/2022 01:57:11 AM script INFO: SUCCESS!@#KODE 1!@#USER_ID 12!@#ACTIVITY_CODE 1
12/12/2022 01:57:11 AM script INFO: SUCCESS!@#KODE 1!@#USER_ID 12!@#ACTIVITY_CODE 3
12/12/2022 01:57:12 AM script INFO: SUCCESS!@#KODE 1!@#USER_ID 12!@#ACTIVITY_CODE 4
12/12/2022 01:57:12 AM script INFO: SUCCESS!@#KODE 1!@#USER_ID 12!@#ACTIVITY_CODE 3
12/12/2022 01:57:12 AM script INFO: SUCCESS!@#KODE 1!@#USER_ID 12!@#ACTIVITY_CODE 1
12/12/2022 01:57:13 AM script INFO: SUCCESS!@#KODE 1!@#USER_ID 12!@#ACTIVITY_CODE 2
12/12/2022 01:57:13 AM script INFO: SUCCESS!@#KODE 1!@#USER_ID 12!@#ACTIVITY_CODE 3
12/12/2022 01:57:13 AM script INFO: SUCCESS!@#KODE 1!@#USER_ID 12!@#ACTIVITY_CODE 1
12/12/2022 01:57:13 AM script INFO: SUCCESS!@#KODE 1!@#USER_ID 12!@#ACTIVITY_CODE 1
12/12/2022 01:57:13 AM script INFO: SUCCESS!@#KODE 1!@#USER_ID 12!@#ACTIVITY_CODE 1
12/12/2022 01:57:14 AM script INFO: SUCCESS!@#KODE 1!@#USER_ID 12!@#ACTIVITY_CODE 1
12/12/2022 01:57:14 AM script INFO: SUCCESS!@#KODE 1!@#USER_ID 12!@#ACTIVITY_CODE 1
12/12/2022 01:57:14 AM script INFO: SUCCESS!@#KODE 1!@#USER_ID 12!@#ACTIVITY_CODE 2
12/12/2022 01:57:14 AM script INFO: SUCCESS!@#KODE 1!@#USER_ID 12!@#ACTIVITY_CODE 3
12/12/2022 01:57:15 AM script INFO: SUCCESS!@#KODE 1!@#USER_ID 12!@#ACTIVITY_CODE 2
12/12/2022 01:57:15 AM script INFO: SUCCESS!@#KODE 1!@#USER_ID 12!@#ACTIVITY_CODE 1
12/12/2022 01:57:15 AM script INFO: SUCCESS!@#KODE 1!@#USER_ID 12!@#ACTIVITY_CODE 3
12/12/2022 01:57:15 AM script INFO: SUCCESS!@#KODE 1!@#USER_ID 12!@#ACTIVITY_CODE 1
12/12/2022 01:57:16 AM script INFO: SUCCESS!@#KODE 1!@#USER_ID 12!@#ACTIVITY_CODE 3
12/12/2022 01:57:16 AM script INFO: SUCCESS!@#KODE 1!@#USER_ID 12!@#ACTIVITY_CODE 3
12/12/2022 01:57:16 AM script INFO: SUCCESS!@#KODE 1!@#USER_ID 12!@#ACTIVITY_CODE 1
12/12/2022 01:57:16 AM script INFO: SUCCESS!@#KODE 1!@#USER_ID 12!@#ACTIVITY_CODE 2
12/12/2022 01:57:17 AM script INFO: SUCCESS!@#KODE 1!@#USER_ID 12!@#ACTIVITY_CODE 2
12/12/2022 01:57:17 AM script INFO: SUCCESS!@#KODE 1!@#USER_ID 12!@#ACTIVITY_CODE 3
12/12/2022 01:57:17 AM script INFO: SUCCESS!@#KODE 1!@#USER_ID 12!@#ACTIVITY_CODE 3
12/12/2022 01:57:17 AM script INFO: SUCCESS!@#KODE 1!@#USER_ID 12!@#ACTIVITY_CODE 1
12/12/2022 01:57:17 AM script INFO: SUCCESS!@#KODE 1!@#USER_ID 12!@#ACTIVITY_CODE 3
12/12/2022 01:57:17 AM script INFO: SUCCESS!@#KODE 1!@#USER_ID 12!@#ACTIVITY_CODE 1
12/12/2022 01:57:18 AM script INFO: SUCCESS!@#KODE 1!@#USER_ID 12!@#ACTIVITY_CODE 3
12/12/2022 01:57:18 AM script INFO: SUCCESS!@#KODE 1!@#USER_ID 12!@#ACTIVITY_CODE 2
12/12/2022 01:57:18 AM script INFO: SUCCESS!@#KODE 1!@#USER_ID 12!@#ACTIVITY_CODE 1
12/12/2022 01:57:19 AM script INFO: SUCCESS!@#KODE 1!@#USER_ID 12!@#ACTIVITY_CODE 2
12/12/2022 01:57:19 AM script INFO: SUCCESS!@#KODE 1!@#USER_ID 12!@#ACTIVITY_CODE 2
12/12/2022 01:57:19 AM script INFO: SUCCESS!@#KODE 1!@#USER_ID 12!@#ACTIVITY_CODE 3
12/12/2022 01:57:19 AM script INFO: SUCCESS!@#KODE 1!@#USER_ID 12!@#ACTIVITY_CODE 2
12/12/2022 01:57:20 AM script INFO: SUCCESS!@#KODE 1!@#USER_ID 12!@#ACTIVITY_CODE 3
12/12/2022 01:57:20 AM script INFO: SUCCESS!@#KODE 1!@#USER_ID 12!@#ACTIVITY_CODE 1
12/12/2022 01:57:20 AM script INFO: SUCCESS!@#KODE 1!@#USER_ID 12!@#ACTIVITY_CODE 4
12/12/2022 01:57:20 AM script INFO: SUCCESS!@#KODE 1!@#USER_ID 12!@#ACTIVITY_CODE 2
12/12/2022 01:57:20 AM script INFO: SUCCESS!@#KODE 1!@#USER_ID 12!@#ACTIVITY_CODE 1
12/12/2022 01:57:20 AM script INFO: SUCCESS!@#KODE 1!@#USER_ID 12!@#ACTIVITY_CODE 1
12/12/2022 01:57:21 AM script INFO: SUCCESS!@#KODE 1!@#USER_ID 12!@#ACTIVITY_CODE 2
12/12/2022 01:57:21 AM script INFO: SUCCESS!@#KODE 1!@#USER_ID 12!@#ACTIVITY_CODE 1
12/12/2022 01:57:21 AM script INFO: SUCCESS!@#KODE 1!@#USER_ID 12!@#ACTIVITY_CODE 3
12/12/2022 01:57:21 AM script INFO: SUCCESS!@#KODE 1!@#USER_ID 12!@#ACTIVITY_CODE 2
12/12/2022 01:57:21 AM script INFO: SUCCESS!@#KODE 1!@#USER_ID 12!@#ACTIVITY_CODE 1
12/12/2022 01:57:22 AM script INFO: SUCCESS!@#KODE 1!@#USER_ID 12!@#ACTIVITY_CODE 2
12/12/2022 01:57:22 AM script INFO: SUCCESS!@#KODE 1!@#USER_ID 12!@#ACTIVITY_CODE 4
12/12/2022 01:57:22 AM script INFO: SUCCESS!@#KODE 1!@#USER_ID 12!@#ACTIVITY_CODE 1
12/12/2022 01:57:22 AM script INFO: SUCCESS!@#KODE 1!@#USER_ID 12!@#ACTIVITY_CODE 1
12/12/2022 01:57:22 AM script INFO: SUCCESS!@#KODE 1!@#USER_ID 12!@#ACTIVITY_CODE 3
12/12/2022 01:57:22 AM script INFO: SUCCESS!@#KODE 1!@#USER_ID 12!@#ACTIVITY_CODE 3
12/12/2022 01:57:22 AM script INFO: SUCCESS!@#KODE 1!@#USER_ID 12!@#ACTIVITY_CODE 1
12/12/2022 01:57:23 AM script INFO: SUCCESS!@#KODE 1!@#USER_ID 12!@#ACTIVITY_CODE 3
12/12/2022 01:57:23 AM script INFO: SUCCESS!@#KODE 1!@#USER_ID 12!@#ACTIVITY_CODE 4
12/12/2022 01:57:23 AM script INFO: SUCCESS!@#KODE 1!@#USER_ID 12!@#ACTIVITY_CODE 3
12/12/2022 01:57:23 AM script INFO: SUCCESS!@#KODE 1!@#USER_ID 12!@#ACTIVITY_CODE 1
12/12/2022 01:57:23 AM script INFO: SUCCESS!@#KODE 1!@#USER_ID 12!@#ACTIVITY_CODE 3
12/12/2022 01:57:23 AM script INFO: SUCCESS!@#KODE 1!@#USER_ID 12!@#ACTIVITY_CODE 4
12/12/2022 01:57:23 AM script INFO: SUCCESS!@#KODE 1!@#USER_ID 12!@#ACTIVITY_CODE 1
12/12/2022 01:57:24 AM script INFO: SUCCESS!@#KODE 1!@#USER_ID 12!@#ACTIVITY_CODE 4
12/12/2022 01:57:24 AM script INFO: SUCCESS!@#KODE 1!@#USER_ID 12!@#ACTIVITY_CODE 1
12/12/2022 01:57:24 AM script INFO: SUCCESS!@#KODE 1!@#USER_ID 12!@#ACTIVITY_CODE 2
12/12/2022 01:57:24 AM script INFO: SUCCESS!@#KODE 1!@#USER_ID 12!@#ACTIVITY_CODE 1
12/12/2022 01:57:24 AM script INFO: SUCCESS!@#KODE 1!@#USER_ID 12!@#ACTIVITY_CODE 1
12/12/2022 01:57:24 AM script INFO: SUCCESS!@#KODE 1!@#USER_ID 12!@#ACTIVITY_CODE 1
12/12/2022 01:57:24 AM script INFO: SUCCESS!@#KODE 1!@#USER_ID 12!@#ACTIVITY_CODE 3
12/12/2022 01:57:24 AM script INFO: SUCCESS!@#KODE 1!@#USER_ID 12!@#ACTIVITY_CODE 1
12/12/2022 01:57:24 AM script INFO: SUCCESS!@#KODE 1!@#USER_ID 12!@#ACTIVITY_CODE 3
12/12/2022 01:57:25 AM script INFO: SUCCESS!@#KODE 1!@#USER_ID 12!@#ACTIVITY_CODE 2
12/12/2022 01:57:25 AM script INFO: SUCCESS!@#KODE 1!@#USER_ID 12!@#ACTIVITY_CODE 3
12/12/2022 01:57:25 AM script INFO: SUCCESS!@#KODE 1!@#USER_ID 12!@#ACTIVITY_CODE 1
12/12/2022 01:57:25 AM script INFO: SUCCESS!@#KODE 1!@#USER_ID 12!@#ACTIVITY_CODE 2
12/12/2022 01:57:25 AM script INFO: SUCCESS!@#KODE 1!@#USER_ID 12!@#ACTIVITY_CODE 3
12/12/2022 01:57:26 AM script INFO: SUCCESS!@#KODE 1!@#USER_ID 12!@#ACTIVITY_CODE 2
12/12/2022 01:57:26 AM script INFO: SUCCESS!@#KODE 1!@#USER_ID 12!@#ACTIVITY_CODE 2
12/12/2022 01:57:26 AM script INFO: SUCCESS!@#KODE 1!@#USER_ID 12!@#ACTIVITY_CODE 4
12/12/2022 01:57:26 AM script INFO: SUCCESS!@#KODE 1!@#USER_ID 12!@#ACTIVITY_CODE 3
12/12/2022 01:57:26 AM script INFO: SUCCESS!@#KODE 1!@#USER_ID 12!@#ACTIVITY_CODE 3
12/12/2022 01:57:26 AM script INFO: SUCCESS!@#KODE 1!@#USER_ID 12!@#ACTIVITY_CODE 3
12/12/2022 01:57:26 AM script INFO: SUCCESS!@#KODE 1!@#USER_ID 12!@#ACTIVITY_CODE 3
12/12/2022 01:57:26 AM script INFO: SUCCESS!@#KODE 1!@#USER_ID 12!@#ACTIVITY_CODE 3
12/12/2022 01:57:26 AM script INFO: SUCCESS!@#KODE 1!@#USER_ID 12!@#ACTIVITY_CODE 1
12/12/2022 01:57:27 AM script INFO: SUCCESS!@#KODE 1!@#USER_ID 12!@#ACTIVITY_CODE 2
12/12/2022 01:57:27 AM script INFO: SUCCESS!@#KODE 1!@#USER_ID 12!@#ACTIVITY_CODE 2
12/12/2022 01:57:27 AM script INFO: SUCCESS!@#KODE 1!@#USER_ID 12!@#ACTIVITY_CODE 4
12/12/2022 01:57:27 AM script INFO: SUCCESS!@#KODE 1!@#USER_ID 12!@#ACTIVITY_CODE 2
12/12/2022 01:57:27 AM script INFO: SUCCESS!@#KODE 1!@#USER_ID 12!@#ACTIVITY_CODE 1
12/12/2022 01:57:27 AM script INFO: SUCCESS!@#KODE 1!@#USER_ID 12!@#ACTIVITY_CODE 1
12/12/2022 01:57:27 AM script INFO: SUCCESS!@#KODE 1!@#USER_ID 12!@#ACTIVITY_CODE 1
12/12/2022 01:57:27 AM script INFO: SUCCESS!@#KODE 1!@#USER_ID 12!@#ACTIVITY_CODE 2
12/12/2022 01:57:28 AM script INFO: SUCCESS!@#KODE 1!@#USER_ID 12!@#ACTIVITY_CODE 3
12/12/2022 01:57:28 AM script INFO: SUCCESS!@#KODE 1!@#USER_ID 12!@#ACTIVITY_CODE 2
12/12/2022 01:57:28 AM script INFO: SUCCESS!@#KODE 1!@#USER_ID 12!@#ACTIVITY_CODE 1
12/12/2022 01:57:28 AM script INFO: SUCCESS!@#KODE 1!@#USER_ID 12!@#ACTIVITY_CODE 1
12/12/2022 01:57:28 AM script INFO: SUCCESS!@#KODE 1!@#USER_ID 12!@#ACTIVITY_CODE 2
12/12/2022 01:57:28 AM script INFO: SUCCESS!@#KODE 1!@#USER_ID 12!@#ACTIVITY_CODE 4
12/12/2022 01:57:28 AM script INFO: SUCCESS!@#KODE 1!@#USER_ID 12!@#ACTIVITY_CODE 1
12/12/2022 01:57:28 AM script INFO: SUCCESS!@#KODE 1!@#USER_ID 12!@#ACTIVITY_CODE 4
12/12/2022 01:57:28 AM script INFO: SUCCESS!@#KODE 1!@#USER_ID 12!@#ACTIVITY_CODE 3
12/12/2022 01:57:28 AM script INFO: SUCCESS!@#KODE 1!@#USER_ID 12!@#ACTIVITY_CODE 1
12/12/2022 01:57:28 AM script INFO: SUCCESS!@#KODE 1!@#USER_ID 12!@#ACTIVITY_CODE 3
12/12/2022 01:57:29 AM script INFO: SUCCESS!@#KODE 1!@#USER_ID 12!@#ACTIVITY_CODE 4
12/12/2022 01:57:29 AM script INFO: SUCCESS!@#KODE 1!@#USER_ID 12!@#ACTIVITY_CODE 3
12/12/2022 01:57:29 AM script INFO: SUCCESS!@#KODE 1!@#USER_ID 12!@#ACTIVITY_CODE 2
12/12/2022 01:57:29 AM script INFO: SUCCESS!@#KODE 1!@#USER_ID 12!@#ACTIVITY_CODE 4
12/12/2022 01:57:29 AM script INFO: SUCCESS!@#KODE 1!@#USER_ID 12!@#ACTIVITY_CODE 3
12/12/2022 01:57:29 AM script INFO: SUCCESS!@#KODE 1!@#USER_ID 12!@#ACTIVITY_CODE 3
12/12/2022 01:57:29 AM script INFO: SUCCESS!@#KODE 1!@#USER_ID 12!@#ACTIVITY_CODE 3
12/12/2022 01:57:29 AM script INFO: SUCCESS!@#KODE 1!@#USER_ID 12!@#ACTIVITY_CODE 2
12/12/2022 01:57:29 AM script INFO: SUCCESS!@#KODE 1!@#USER_ID 12!@#ACTIVITY_CODE 1
12/12/2022 01:57:30 AM script INFO: SUCCESS!@#KODE 1!@#USER_ID 12!@#ACTIVITY_CODE 3
12/12/2022 01:57:30 AM script INFO: SUCCESS!@#KODE 1!@#USER_ID 12!@#ACTIVITY_CODE 1
12/12/2022 01:57:30 AM script INFO: SUCCESS!@#KODE 1!@#USER_ID 12!@#ACTIVITY_CODE 1
12/12/2022 01:57:30 AM script INFO: SUCCESS!@#KODE 1!@#USER_ID 12!@#ACTIVITY_CODE 3
12/12/2022 01:57:30 AM script INFO: SUCCESS!@#KODE 1!@#USER_ID 12!@#ACTIVITY_CODE 3
12/12/2022 01:57:30 AM script INFO: SUCCESS!@#KODE 1!@#USER_ID 12!@#ACTIVITY_CODE 1
12/12/2022 01:57:30 AM script INFO: SUCCESS!@#KODE 1!@#USER_ID 12!@#ACTIVITY_CODE 3
12/12/2022 01:57:30 AM script INFO: SUCCESS!@#KODE 1!@#USER_ID 12!@#ACTIVITY_CODE 1
12/12/2022 01:57:30 AM script INFO: SUCCESS!@#KODE 1!@#USER_ID 12!@#ACTIVITY_CODE 1
12/12/2022 01:57:30 AM script INFO: SUCCESS!@#KODE 1!@#USER_ID 12!@#ACTIVITY_CODE 2
12/12/2022 01:57:30 AM script INFO: SUCCESS!@#KODE 1!@#USER_ID 12!@#ACTIVITY_CODE 2
12/12/2022 01:57:31 AM script INFO: SUCCESS!@#KODE 1!@#USER_ID 12!@#ACTIVITY_CODE 2
12/12/2022 01:57:31 AM script INFO: SUCCESS!@#KODE 1!@#USER_ID 12!@#ACTIVITY_CODE 1
12/12/2022 01:57:31 AM script INFO: SUCCESS!@#KODE 1!@#USER_ID 12!@#ACTIVITY_CODE 1
12/12/2022 01:57:31 AM script INFO: SUCCESS!@#KODE 1!@#USER_ID 12!@#ACTIVITY_CODE 1
12/12/2022 01:57:31 AM script INFO: SUCCESS!@#KODE 1!@#USER_ID 12!@#ACTIVITY_CODE 3
12/12/2022 01:57:31 AM script INFO: SUCCESS!@#KODE 1!@#USER_ID 12!@#ACTIVITY_CODE 1
12/12/2022 01:57:31 AM script INFO: SUCCESS!@#KODE 1!@#USER_ID 12!@#ACTIVITY_CODE 3
12/12/2022 01:57:31 AM script INFO: SUCCESS!@#KODE 1!@#USER_ID 12!@#ACTIVITY_CODE 4
12/12/2022 01:57:31 AM script INFO: SUCCESS!@#KODE 1!@#USER_ID 12!@#ACTIVITY_CODE 1
12/12/2022 01:57:31 AM script INFO: SUCCESS!@#KODE 1!@#USER_ID 12!@#ACTIVITY_CODE 4
12/12/2022 01:57:32 AM script INFO: SUCCESS!@#KODE 1!@#USER_ID 12!@#ACTIVITY_CODE 2
12/12/2022 01:57:32 AM script INFO: SUCCESS!@#KODE 1!@#USER_ID 12!@#ACTIVITY_CODE 3
12/12/2022 01:57:32 AM script INFO: SUCCESS!@#KODE 1!@#USER_ID 12!@#ACTIVITY_CODE 1
12/12/2022 01:57:32 AM script INFO: SUCCESS!@#KODE 1!@#USER_ID 12!@#ACTIVITY_CODE 2
12/12/2022 01:57:32 AM script INFO: SUCCESS!@#KODE 1!@#USER_ID 12!@#ACTIVITY_CODE 2
12/12/2022 01:57:32 AM script INFO: SUCCESS!@#KODE 1!@#USER_ID 12!@#ACTIVITY_CODE 3
12/12/2022 01:57:32 AM script INFO: SUCCESS!@#KODE 1!@#USER_ID 12!@#ACTIVITY_CODE 2
12/12/2022 01:57:33 AM script INFO: SUCCESS!@#KODE 1!@#USER_ID 12!@#ACTIVITY_CODE 4
12/12/2022 01:57:33 AM script INFO: SUCCESS!@#KODE 1!@#USER_ID 12!@#ACTIVITY_CODE 3
12/12/2022 01:57:33 AM script INFO: SUCCESS!@#KODE 1!@#USER_ID 12!@#ACTIVITY_CODE 1
12/12/2022 01:57:33 AM script INFO: SUCCESS!@#KODE 1!@#USER_ID 12!@#ACTIVITY_CODE 1
12/12/2022 01:57:33 AM script INFO: SUCCESS!@#KODE 1!@#USER_ID 12!@#ACTIVITY_CODE 3
12/12/2022 01:57:33 AM script INFO: SUCCESS!@#KODE 1!@#USER_ID 12!@#ACTIVITY_CODE 2
12/12/2022 01:57:33 AM script INFO: SUCCESS!@#KODE 1!@#USER_ID 12!@#ACTIVITY_CODE 3
12/12/2022 01:57:33 AM script INFO: SUCCESS!@#KODE 1!@#USER_ID 12!@#ACTIVITY_CODE 3
12/12/2022 01:57:33 AM script INFO: SUCCESS!@#KODE 1!@#USER_ID 12!@#ACTIVITY_CODE 2
12/12/2022 01:57:33 AM script INFO: SUCCESS!@#KODE 1!@#USER_ID 12!@#ACTIVITY_CODE 2
12/12/2022 01:57:34 AM script INFO: SUCCESS!@#KODE 1!@#USER_ID 12!@#ACTIVITY_CODE 1
12/12/2022 01:57:34 AM script INFO: SUCCESS!@#KODE 1!@#USER_ID 12!@#ACTIVITY_CODE 2
12/12/2022 01:57:34 AM script INFO: SUCCESS!@#KODE 1!@#USER_ID 12!@#ACTIVITY_CODE 4
12/12/2022 01:57:34 AM script INFO: SUCCESS!@#KODE 1!@#USER_ID 12!@#ACTIVITY_CODE 2
12/12/2022 01:57:34 AM script INFO: SUCCESS!@#KODE 1!@#USER_ID 12!@#ACTIVITY_CODE 2
12/12/2022 01:57:34 AM script INFO: SUCCESS!@#KODE 1!@#USER_ID 12!@#ACTIVITY_CODE 1
12/12/2022 01:57:34 AM script INFO: SUCCESS!@#KODE 1!@#USER_ID 12!@#ACTIVITY_CODE 1
12/12/2022 01:57:34 AM script INFO: SUCCESS!@#KODE 1!@#USER_ID 12!@#ACTIVITY_CODE 1
12/12/2022 01:57:34 AM script INFO: SUCCESS!@#KODE 1!@#USER_ID 12!@#ACTIVITY_CODE 3
12/12/2022 01:57:35 AM script INFO: SUCCESS!@#KODE 1!@#USER_ID 12!@#ACTIVITY_CODE 3
12/12/2022 01:57:35 AM script INFO: SUCCESS!@#KODE 1!@#USER_ID 12!@#ACTIVITY_CODE 3
12/12/2022 01:57:35 AM script INFO: SUCCESS!@#KODE 1!@#USER_ID 12!@#ACTIVITY_CODE 2
12/12/2022 01:57:35 AM script INFO: SUCCESS!@#KODE 1!@#USER_ID 12!@#ACTIVITY_CODE 3
12/12/2022 01:57:35 AM script INFO: SUCCESS!@#KODE 1!@#USER_ID 12!@#ACTIVITY_CODE 3
12/12/2022 01:57:35 AM script INFO: SUCCESS!@#KODE 1!@#USER_ID 12!@#ACTIVITY_CODE 2
12/12/2022 01:57:35 AM script INFO: SUCCESS!@#KODE 1!@#USER_ID 12!@#ACTIVITY_CODE 3
12/12/2022 01:57:35 AM script INFO: SUCCESS!@#KODE 1!@#USER_ID 12!@#ACTIVITY_CODE 1
12/12/2022 01:57:35 AM script INFO: SUCCESS!@#KODE 1!@#USER_ID 12!@#ACTIVITY_CODE 2
12/12/2022 01:57:35 AM script INFO: SUCCESS!@#KODE 1!@#USER_ID 12!@#ACTIVITY_CODE 1
12/12/2022 01:57:36 AM script INFO: SUCCESS!@#KODE 1!@#USER_ID 12!@#ACTIVITY_CODE 2
12/12/2022 01:57:36 AM script INFO: SUCCESS!@#KODE 1!@#USER_ID 12!@#ACTIVITY_CODE 4
12/12/2022 01:57:36 AM script INFO: SUCCESS!@#KODE 1!@#USER_ID 12!@#ACTIVITY_CODE 1
12/12/2022 01:57:36 AM script INFO: SUCCESS!@#KODE 1!@#USER_ID 12!@#ACTIVITY_CODE 2
12/12/2022 01:57:36 AM script INFO: SUCCESS!@#KODE 1!@#USER_ID 12!@#ACTIVITY_CODE 1
12/12/2022 01:57:36 AM script INFO: SUCCESS!@#KODE 1!@#USER_ID 12!@#ACTIVITY_CODE 3
12/12/2022 01:57:36 AM script INFO: SUCCESS!@#KODE 1!@#USER_ID 12!@#ACTIVITY_CODE 3
12/12/2022 01:57:36 AM script INFO: SUCCESS!@#KODE 1!@#USER_ID 12!@#ACTIVITY_CODE 3
12/12/2022 01:57:36 AM script INFO: SUCCESS!@#KODE 1!@#USER_ID 12!@#ACTIVITY_CODE 1
12/12/2022 01:57:36 AM script INFO: SUCCESS!@#KODE 1!@#USER_ID 12!@#ACTIVITY_CODE 2
12/12/2022 01:57:36 AM script INFO: SUCCESS!@#KODE 1!@#USER_ID 12!@#ACTIVITY_CODE 3
12/12/2022 01:57:36 AM script INFO: SUCCESS!@#KODE 1!@#USER_ID 12!@#ACTIVITY_CODE 3
12/12/2022 01:57:36 AM script INFO: SUCCESS!@#KODE 1!@#USER_ID 12!@#ACTIVITY_CODE 1
12/12/2022 01:57:37 AM script INFO: SUCCESS!@#KODE 1!@#USER_ID 12!@#ACTIVITY_CODE 1
12/12/2022 01:57:37 AM script INFO: SUCCESS!@#KODE 1!@#USER_ID 12!@#ACTIVITY_CODE 3
12/12/2022 01:57:37 AM script INFO: SUCCESS!@#KODE 1!@#USER_ID 12!@#ACTIVITY_CODE 3
12/12/2022 01:57:37 AM script INFO: SUCCESS!@#KODE 1!@#USER_ID 12!@#ACTIVITY_CODE 1
12/12/2022 01:57:37 AM script INFO: SUCCESS!@#KODE 1!@#USER_ID 12!@#ACTIVITY_CODE 2
12/12/2022 01:57:37 AM script INFO: SUCCESS!@#KODE 1!@#USER_ID 12!@#ACTIVITY_CODE 3
12/12/2022 01:57:37 AM script INFO: SUCCESS!@#KODE 1!@#USER_ID 12!@#ACTIVITY_CODE 2
12/12/2022 01:57:37 AM script INFO: SUCCESS!@#KODE 1!@#USER_ID 12!@#ACTIVITY_CODE 1
12/12/2022 01:57:37 AM script INFO: SUCCESS!@#KODE 1!@#USER_ID 12!@#ACTIVITY_CODE 1
12/12/2022 01:57:37 AM script INFO: SUCCESS!@#KODE 1!@#USER_ID 12!@#ACTIVITY_CODE 2
12/12/2022 01:57:37 AM script INFO: SUCCESS!@#KODE 1!@#USER_ID 12!@#ACTIVITY_CODE 3
12/12/2022 01:57:37 AM script INFO: SUCCESS!@#KODE 1!@#USER_ID 12!@#ACTIVITY_CODE 2
12/12/2022 01:57:38 AM script INFO: SUCCESS!@#KODE 1!@#USER_ID 12!@#ACTIVITY_CODE 4
12/12/2022 01:57:38 AM script INFO: SUCCESS!@#KODE 1!@#USER_ID 12!@#ACTIVITY_CODE 3
12/12/2022 01:57:38 AM script INFO: SUCCESS!@#KODE 1!@#USER_ID 12!@#ACTIVITY_CODE 1
12/12/2022 01:57:38 AM script INFO: SUCCESS!@#KODE 1!@#USER_ID 12!@#ACTIVITY_CODE 2
12/12/2022 01:57:38 AM script INFO: SUCCESS!@#KODE 1!@#USER_ID 12!@#ACTIVITY_CODE 4
12/12/2022 01:57:38 AM script INFO: SUCCESS!@#KODE 1!@#USER_ID 12!@#ACTIVITY_CODE 2
12/12/2022 01:57:38 AM script INFO: SUCCESS!@#KODE 1!@#USER_ID 12!@#ACTIVITY_CODE 2
12/12/2022 01:57:38 AM script INFO: SUCCESS!@#KODE 1!@#USER_ID 12!@#ACTIVITY_CODE 3
12/12/2022 01:57:38 AM script INFO: SUCCESS!@#KODE 1!@#USER_ID 12!@#ACTIVITY_CODE 2
12/12/2022 01:57:38 AM script INFO: SUCCESS!@#KODE 1!@#USER_ID 12!@#ACTIVITY_CODE 1
12/12/2022 01:57:39 AM script INFO: SUCCESS!@#KODE 1!@#USER_ID 12!@#ACTIVITY_CODE 3
12/12/2022 01:57:39 AM script INFO: SUCCESS!@#KODE 1!@#USER_ID 12!@#ACTIVITY_CODE 3
12/12/2022 01:57:39 AM script INFO: SUCCESS!@#KODE 1!@#USER_ID 12!@#ACTIVITY_CODE 2
12/12/2022 01:57:39 AM script INFO: SUCCESS!@#KODE 1!@#USER_ID 12!@#ACTIVITY_CODE 1
12/12/2022 01:57:39 AM script INFO: SUCCESS!@#KODE 1!@#USER_ID 12!@#ACTIVITY_CODE 2
12/12/2022 01:57:39 AM script INFO: SUCCESS!@#KODE 1!@#USER_ID 12!@#ACTIVITY_CODE 2
12/12/2022 01:57:39 AM script INFO: SUCCESS!@#KODE 1!@#USER_ID 12!@#ACTIVITY_CODE 4
12/12/2022 01:57:39 AM script INFO: SUCCESS!@#KODE 1!@#USER_ID 12!@#ACTIVITY_CODE 2
12/12/2022 01:57:39 AM script INFO: SUCCESS!@#KODE 1!@#USER_ID 12!@#ACTIVITY_CODE 2
12/12/2022 01:57:40 AM script INFO: SUCCESS!@#KODE 1!@#USER_ID 12!@#ACTIVITY_CODE 2
12/12/2022 01:57:40 AM script INFO: SUCCESS!@#KODE 1!@#USER_ID 12!@#ACTIVITY_CODE 4
12/12/2022 01:57:40 AM script INFO: SUCCESS!@#KODE 1!@#USER_ID 12!@#ACTIVITY_CODE 2
12/12/2022 01:57:40 AM script INFO: SUCCESS!@#KODE 1!@#USER_ID 12!@#ACTIVITY_CODE 1
12/12/2022 01:57:40 AM script INFO: SUCCESS!@#KODE 1!@#USER_ID 12!@#ACTIVITY_CODE 3
12/12/2022 01:57:40 AM script INFO: SUCCESS!@#KODE 1!@#USER_ID 12!@#ACTIVITY_CODE 1
12/12/2022 01:57:40 AM script INFO: SUCCESS!@#KODE 1!@#USER_ID 12!@#ACTIVITY_CODE 1
12/12/2022 01:57:40 AM script INFO: SUCCESS!@#KODE 1!@#USER_ID 12!@#ACTIVITY_CODE 1
12/12/2022 01:57:40 AM script INFO: SUCCESS!@#KODE 1!@#USER_ID 12!@#ACTIVITY_CODE 4
12/12/2022 01:57:40 AM script INFO: SUCCESS!@#KODE 1!@#USER_ID 12!@#ACTIVITY_CODE 2
12/12/2022 01:57:40 AM script INFO: SUCCESS!@#KODE 1!@#USER_ID 12!@#ACTIVITY_CODE 2
12/12/2022 01:57:40 AM script INFO: SUCCESS!@#KODE 1!@#USER_ID 12!@#ACTIVITY_CODE 3
12/12/2022 01:57:40 AM script INFO: SUCCESS!@#KODE 1!@#USER_ID 12!@#ACTIVITY_CODE 3
12/12/2022 01:57:40 AM script INFO: SUCCESS!@#KODE 1!@#USER_ID 12!@#ACTIVITY_CODE 3
12/12/2022 01:57:41 AM script INFO: SUCCESS!@#KODE 1!@#USER_ID 12!@#ACTIVITY_CODE 2
12/12/2022 01:57:41 AM script INFO: SUCCESS!@#KODE 1!@#USER_ID 12!@#ACTIVITY_CODE 2
12/12/2022 01:57:41 AM script INFO: SUCCESS!@#KODE 1!@#USER_ID 12!@#ACTIVITY_CODE 2
12/12/2022 01:57:41 AM script INFO: SUCCESS!@#KODE 1!@#USER_ID 12!@#ACTIVITY_CODE 2
12/12/2022 01:57:41 AM script INFO: SUCCESS!@#KODE 1!@#USER_ID 12!@#ACTIVITY_CODE 1
12/12/2022 01:57:41 AM script INFO: SUCCESS!@#KODE 1!@#USER_ID 12!@#ACTIVITY_CODE 3
12/12/2022 01:57:41 AM script INFO: SUCCESS!@#KODE 1!@#USER_ID 12!@#ACTIVITY_CODE 2
12/12/2022 01:57:41 AM script INFO: SUCCESS!@#KODE 1!@#USER_ID 12!@#ACTIVITY_CODE 3
12/12/2022 01:57:41 AM script INFO: SUCCESS!@#KODE 1!@#USER_ID 12!@#ACTIVITY_CODE 2
12/12/2022 01:57:42 AM script INFO: SUCCESS!@#KODE 1!@#USER_ID 12!@#ACTIVITY_CODE 3
12/12/2022 01:57:42 AM script INFO: SUCCESS!@#KODE 1!@#USER_ID 12!@#ACTIVITY_CODE 1
12/12/2022 01:57:42 AM script INFO: SUCCESS!@#KODE 1!@#USER_ID 12!@#ACTIVITY_CODE 1
12/12/2022 01:57:42 AM script INFO: SUCCESS!@#KODE 1!@#USER_ID 12!@#ACTIVITY_CODE 3
12/12/2022 01:57:42 AM script INFO: SUCCESS!@#KODE 1!@#USER_ID 12!@#ACTIVITY_CODE 1
12/12/2022 01:57:42 AM script INFO: SUCCESS!@#KODE 1!@#USER_ID 12!@#ACTIVITY_CODE 2
12/12/2022 01:57:42 AM script INFO: SUCCESS!@#KODE 1!@#USER_ID 12!@#ACTIVITY_CODE 3
12/12/2022 01:57:42 AM script INFO: SUCCESS!@#KODE 1!@#USER_ID 12!@#ACTIVITY_CODE 3
12/12/2022 01:57:42 AM script INFO: SUCCESS!@#KODE 1!@#USER_ID 12!@#ACTIVITY_CODE 2
12/12/2022 01:57:42 AM script INFO: SUCCESS!@#KODE 1!@#USER_ID 12!@#ACTIVITY_CODE 2
12/12/2022 01:57:42 AM script INFO: SUCCESS!@#KODE 1!@#USER_ID 12!@#ACTIVITY_CODE 3
12/12/2022 01:57:42 AM script INFO: SUCCESS!@#KODE 1!@#USER_ID 12!@#ACTIVITY_CODE 2
12/12/2022 01:57:42 AM script INFO: SUCCESS!@#KODE 1!@#USER_ID 12!@#ACTIVITY_CODE 3
12/12/2022 01:57:42 AM script INFO: SUCCESS!@#KODE 1!@#USER_ID 12!@#ACTIVITY_CODE 1
12/12/2022 01:57:42 AM script INFO: SUCCESS!@#KODE 1!@#USER_ID 12!@#ACTIVITY_CODE 3
12/12/2022 01:57:43 AM script INFO: SUCCESS!@#KODE 1!@#USER_ID 12!@#ACTIVITY_CODE 3
12/12/2022 01:57:43 AM script INFO: SUCCESS!@#KODE 1!@#USER_ID 12!@#ACTIVITY_CODE 3
12/12/2022 01:57:43 AM script INFO: SUCCESS!@#KODE 1!@#USER_ID 12!@#ACTIVITY_CODE 2
12/12/2022 01:57:43 AM script INFO: SUCCESS!@#KODE 1!@#USER_ID 12!@#ACTIVITY_CODE 3
12/12/2022 01:57:43 AM script INFO: SUCCESS!@#KODE 1!@#USER_ID 12!@#ACTIVITY_CODE 3
12/12/2022 01:57:43 AM script INFO: SUCCESS!@#KODE 1!@#USER_ID 12!@#ACTIVITY_CODE 2
12/12/2022 01:57:43 AM script INFO: SUCCESS!@#KODE 1!@#USER_ID 12!@#ACTIVITY_CODE 4
12/12/2022 01:57:43 AM script INFO: SUCCESS!@#KODE 1!@#USER_ID 12!@#ACTIVITY_CODE 1
12/12/2022 01:57:43 AM script INFO: SUCCESS!@#KODE 1!@#USER_ID 12!@#ACTIVITY_CODE 3
12/12/2022 01:57:43 AM script INFO: SUCCESS!@#KODE 1!@#USER_ID 12!@#ACTIVITY_CODE 1
12/12/2022 01:57:43 AM script INFO: SUCCESS!@#KODE 1!@#USER_ID 12!@#ACTIVITY_CODE 1
12/12/2022 01:57:43 AM script INFO: SUCCESS!@#KODE 1!@#USER_ID 12!@#ACTIVITY_CODE 3
12/12/2022 01:57:43 AM script INFO: SUCCESS!@#KODE 1!@#USER_ID 12!@#ACTIVITY_CODE 1
12/12/2022 01:57:43 AM script INFO: SUCCESS!@#KODE 1!@#USER_ID 12!@#ACTIVITY_CODE 2
12/12/2022 01:57:43 AM script INFO: SUCCESS!@#KODE 1!@#USER_ID 12!@#ACTIVITY_CODE 4
12/12/2022 01:57:43 AM script INFO: SUCCESS!@#KODE 1!@#USER_ID 12!@#ACTIVITY_CODE 2
12/12/2022 01:57:44 AM script INFO: SUCCESS!@#KODE 1!@#USER_ID 12!@#ACTIVITY_CODE 3
12/12/2022 01:57:44 AM script INFO: SUCCESS!@#KODE 1!@#USER_ID 12!@#ACTIVITY_CODE 2
12/12/2022 01:57:44 AM script INFO: SUCCESS!@#KODE 1!@#USER_ID 12!@#ACTIVITY_CODE 2
12/12/2022 01:57:44 AM script INFO: SUCCESS!@#KODE 1!@#USER_ID 12!@#ACTIVITY_CODE 3
12/12/2022 01:57:44 AM script INFO: Duration: 152.5232298374176
12/12/2022 01:57:44 AM script INFO: mengakhiri-quiz
12/12/2022 01:57:44 AM script INFO: SUCCESS!@#KODE 1!@#USER_ID 12!@#ACTIVITY_CODE 5
12/12/2022 01:57:44 AM script INFO: berhasil-submit
12/12/2022 01:59:14 AM script ERROR: TIMEOUT EXCEPTION!@#KODE 0!@#LOCATION berhasil-submit
12/12/2022 01:59:14 AM main_worker ERROR: Message: None

