12/21/2022 02:41:06 PM script INFO: Prepared chrome options..
12/21/2022 02:41:07 PM script INFO: Initialized chrome browser..
12/21/2022 02:41:07 PM script INFO: mengakses-homepage
12/21/2022 02:41:39 PM script INFO: mengakses-login-page
12/21/2022 02:41:40 PM script INFO: mengakses-site-home
12/21/2022 02:41:41 PM script INFO: mengakses-site-course
12/21/2022 02:41:41 PM script INFO: mengakses-quiz
12/21/2022 02:41:42 PM script INFO: mengakses-start-quiz-page
12/21/2022 02:41:43 PM script INFO: memulai-quiz
12/21/2022 02:41:43 PM script INFO: SUCCESS!@#KODE 1!@#USER_ID 101!@#ACTIVITY_CODE 5
12/21/2022 02:41:54 PM script INFO: SUCCESS!@#KODE 1!@#USER_ID 101!@#ACTIVITY_CODE 2
12/21/2022 02:41:54 PM script INFO: SUCCESS!@#KODE 1!@#USER_ID 101!@#ACTIVITY_CODE 3
12/21/2022 02:41:54 PM script INFO: SUCCESS!@#KODE 1!@#USER_ID 101!@#ACTIVITY_CODE 3
12/21/2022 02:41:54 PM script INFO: SUCCESS!@#KODE 1!@#USER_ID 101!@#ACTIVITY_CODE 3
12/21/2022 02:41:54 PM script INFO: SUCCESS!@#KODE 1!@#USER_ID 101!@#ACTIVITY_CODE 3
12/21/2022 02:41:54 PM script INFO: SUCCESS!@#KODE 1!@#USER_ID 101!@#ACTIVITY_CODE 5
12/21/2022 02:41:54 PM script INFO: SUCCESS!@#KODE 1!@#USER_ID 101!@#ACTIVITY_CODE 5
12/21/2022 02:41:57 PM script INFO: SUCCESS!@#KODE 1!@#USER_ID 101!@#ACTIVITY_CODE 3
12/21/2022 02:41:57 PM script INFO: SUCCESS!@#KODE 1!@#USER_ID 101!@#ACTIVITY_CODE 2
12/21/2022 02:41:57 PM script INFO: SUCCESS!@#KODE 1!@#USER_ID 101!@#ACTIVITY_CODE 1
12/21/2022 02:41:57 PM script INFO: SUCCESS!@#KODE 1!@#USER_ID 101!@#ACTIVITY_CODE 3
12/21/2022 02:41:57 PM script INFO: SUCCESS!@#KODE 1!@#USER_ID 101!@#ACTIVITY_CODE 1
12/21/2022 02:41:57 PM script INFO: SUCCESS!@#KODE 1!@#USER_ID 101!@#ACTIVITY_CODE 3
12/21/2022 02:41:57 PM script INFO: SUCCESS!@#KODE 1!@#USER_ID 101!@#ACTIVITY_CODE 3
12/21/2022 02:41:58 PM script INFO: SUCCESS!@#KODE 1!@#USER_ID 101!@#ACTIVITY_CODE 2
12/21/2022 02:41:58 PM script INFO: SUCCESS!@#KODE 1!@#USER_ID 101!@#ACTIVITY_CODE 5
12/21/2022 02:41:58 PM script INFO: SUCCESS!@#KODE 1!@#USER_ID 101!@#ACTIVITY_CODE 5
12/21/2022 02:42:00 PM script INFO: SUCCESS!@#KODE 1!@#USER_ID 101!@#ACTIVITY_CODE 3
12/21/2022 02:42:00 PM script INFO: SUCCESS!@#KODE 1!@#USER_ID 101!@#ACTIVITY_CODE 2
12/21/2022 02:42:00 PM script INFO: SUCCESS!@#KODE 1!@#USER_ID 101!@#ACTIVITY_CODE 1
12/21/2022 02:42:00 PM script INFO: SUCCESS!@#KODE 1!@#USER_ID 101!@#ACTIVITY_CODE 5
12/21/2022 02:42:00 PM script INFO: SUCCESS!@#KODE 1!@#USER_ID 101!@#ACTIVITY_CODE 5
12/21/2022 02:42:03 PM script INFO: SUCCESS!@#KODE 1!@#USER_ID 101!@#ACTIVITY_CODE 2
12/21/2022 02:42:03 PM script INFO: SUCCESS!@#KODE 1!@#USER_ID 101!@#ACTIVITY_CODE 2
12/21/2022 02:42:03 PM script INFO: SUCCESS!@#KODE 1!@#USER_ID 101!@#ACTIVITY_CODE 3
12/21/2022 02:42:03 PM script INFO: SUCCESS!@#KODE 1!@#USER_ID 101!@#ACTIVITY_CODE 3
12/21/2022 02:42:03 PM script INFO: SUCCESS!@#KODE 1!@#USER_ID 101!@#ACTIVITY_CODE 1
12/21/2022 02:42:03 PM script INFO: SUCCESS!@#KODE 1!@#USER_ID 101!@#ACTIVITY_CODE 3
12/21/2022 02:42:03 PM script INFO: SUCCESS!@#KODE 1!@#USER_ID 101!@#ACTIVITY_CODE 5
12/21/2022 02:42:03 PM script INFO: SUCCESS!@#KODE 1!@#USER_ID 101!@#ACTIVITY_CODE 5
12/21/2022 02:42:06 PM script INFO: SUCCESS!@#KODE 1!@#USER_ID 101!@#ACTIVITY_CODE 2
12/21/2022 02:42:06 PM script INFO: SUCCESS!@#KODE 1!@#USER_ID 101!@#ACTIVITY_CODE 5
12/21/2022 02:42:06 PM script INFO: SUCCESS!@#KODE 1!@#USER_ID 101!@#ACTIVITY_CODE 5
12/21/2022 02:42:09 PM script INFO: SUCCESS!@#KODE 1!@#USER_ID 101!@#ACTIVITY_CODE 2
12/21/2022 02:42:09 PM script INFO: SUCCESS!@#KODE 1!@#USER_ID 101!@#ACTIVITY_CODE 2
12/21/2022 02:42:09 PM script INFO: SUCCESS!@#KODE 1!@#USER_ID 101!@#ACTIVITY_CODE 3
12/21/2022 02:42:09 PM script INFO: SUCCESS!@#KODE 1!@#USER_ID 101!@#ACTIVITY_CODE 1
12/21/2022 02:42:09 PM script INFO: SUCCESS!@#KODE 1!@#USER_ID 101!@#ACTIVITY_CODE 4
12/21/2022 02:42:09 PM script INFO: SUCCESS!@#KODE 1!@#USER_ID 101!@#ACTIVITY_CODE 5
12/21/2022 02:42:09 PM script INFO: SUCCESS!@#KODE 1!@#USER_ID 101!@#ACTIVITY_CODE 5
12/21/2022 02:42:11 PM script INFO: SUCCESS!@#KODE 1!@#USER_ID 101!@#ACTIVITY_CODE 5
12/21/2022 02:42:11 PM script INFO: SUCCESS!@#KODE 1!@#USER_ID 101!@#ACTIVITY_CODE 5
12/21/2022 02:42:14 PM script INFO: SUCCESS!@#KODE 1!@#USER_ID 101!@#ACTIVITY_CODE 1
12/21/2022 02:42:14 PM script INFO: SUCCESS!@#KODE 1!@#USER_ID 101!@#ACTIVITY_CODE 4
12/21/2022 02:42:14 PM script INFO: SUCCESS!@#KODE 1!@#USER_ID 101!@#ACTIVITY_CODE 3
12/21/2022 02:42:14 PM script INFO: SUCCESS!@#KODE 1!@#USER_ID 101!@#ACTIVITY_CODE 1
12/21/2022 02:42:14 PM script INFO: SUCCESS!@#KODE 1!@#USER_ID 101!@#ACTIVITY_CODE 4
12/21/2022 02:42:14 PM script INFO: SUCCESS!@#KODE 1!@#USER_ID 101!@#ACTIVITY_CODE 2
12/21/2022 02:42:14 PM script INFO: SUCCESS!@#KODE 1!@#USER_ID 101!@#ACTIVITY_CODE 1
12/21/2022 02:42:14 PM script INFO: SUCCESS!@#KODE 1!@#USER_ID 101!@#ACTIVITY_CODE 5
12/21/2022 02:42:14 PM script INFO: SUCCESS!@#KODE 1!@#USER_ID 101!@#ACTIVITY_CODE 5
12/21/2022 02:42:17 PM script INFO: SUCCESS!@#KODE 1!@#USER_ID 101!@#ACTIVITY_CODE 2
12/21/2022 02:42:17 PM script INFO: SUCCESS!@#KODE 1!@#USER_ID 101!@#ACTIVITY_CODE 3
12/21/2022 02:42:17 PM script INFO: SUCCESS!@#KODE 1!@#USER_ID 101!@#ACTIVITY_CODE 5
12/21/2022 02:42:17 PM script INFO: SUCCESS!@#KODE 1!@#USER_ID 101!@#ACTIVITY_CODE 5
12/21/2022 02:42:20 PM script INFO: SUCCESS!@#KODE 1!@#USER_ID 101!@#ACTIVITY_CODE 5
12/21/2022 02:42:20 PM script INFO: SUCCESS!@#KODE 1!@#USER_ID 101!@#ACTIVITY_CODE 5
12/21/2022 02:42:22 PM script INFO: SUCCESS!@#KODE 1!@#USER_ID 101!@#ACTIVITY_CODE 5
12/21/2022 02:42:22 PM script INFO: SUCCESS!@#KODE 1!@#USER_ID 101!@#ACTIVITY_CODE 5
12/21/2022 02:42:25 PM script INFO: SUCCESS!@#KODE 1!@#USER_ID 101!@#ACTIVITY_CODE 3
12/21/2022 02:42:25 PM script INFO: SUCCESS!@#KODE 1!@#USER_ID 101!@#ACTIVITY_CODE 2
12/21/2022 02:42:25 PM script INFO: SUCCESS!@#KODE 1!@#USER_ID 101!@#ACTIVITY_CODE 2
12/21/2022 02:42:25 PM script INFO: SUCCESS!@#KODE 1!@#USER_ID 101!@#ACTIVITY_CODE 2
12/21/2022 02:42:25 PM script INFO: SUCCESS!@#KODE 1!@#USER_ID 101!@#ACTIVITY_CODE 2
12/21/2022 02:42:25 PM script INFO: SUCCESS!@#KODE 1!@#USER_ID 101!@#ACTIVITY_CODE 3
12/21/2022 02:42:25 PM script INFO: SUCCESS!@#KODE 1!@#USER_ID 101!@#ACTIVITY_CODE 3
12/21/2022 02:42:25 PM script INFO: SUCCESS!@#KODE 1!@#USER_ID 101!@#ACTIVITY_CODE 5
12/21/2022 02:42:25 PM script INFO: SUCCESS!@#KODE 1!@#USER_ID 101!@#ACTIVITY_CODE 5
12/21/2022 02:42:28 PM script INFO: SUCCESS!@#KODE 1!@#USER_ID 101!@#ACTIVITY_CODE 3
12/21/2022 02:42:28 PM script INFO: SUCCESS!@#KODE 1!@#USER_ID 101!@#ACTIVITY_CODE 3
12/21/2022 02:42:28 PM script INFO: SUCCESS!@#KODE 1!@#USER_ID 101!@#ACTIVITY_CODE 3
12/21/2022 02:42:28 PM script INFO: SUCCESS!@#KODE 1!@#USER_ID 101!@#ACTIVITY_CODE 3
12/21/2022 02:42:28 PM script INFO: SUCCESS!@#KODE 1!@#USER_ID 101!@#ACTIVITY_CODE 3
12/21/2022 02:42:28 PM script INFO: SUCCESS!@#KODE 1!@#USER_ID 101!@#ACTIVITY_CODE 2
12/21/2022 02:42:28 PM script INFO: SUCCESS!@#KODE 1!@#USER_ID 101!@#ACTIVITY_CODE 1
12/21/2022 02:42:28 PM script INFO: SUCCESS!@#KODE 1!@#USER_ID 101!@#ACTIVITY_CODE 2
12/21/2022 02:42:29 PM script INFO: SUCCESS!@#KODE 1!@#USER_ID 101!@#ACTIVITY_CODE 3
12/21/2022 02:42:29 PM script INFO: SUCCESS!@#KODE 1!@#USER_ID 101!@#ACTIVITY_CODE 3
12/21/2022 02:42:29 PM script INFO: SUCCESS!@#KODE 1!@#USER_ID 101!@#ACTIVITY_CODE 5
12/21/2022 02:42:29 PM script INFO: SUCCESS!@#KODE 1!@#USER_ID 101!@#ACTIVITY_CODE 5
12/21/2022 02:42:31 PM script INFO: SUCCESS!@#KODE 1!@#USER_ID 101!@#ACTIVITY_CODE 1
12/21/2022 02:42:31 PM script INFO: SUCCESS!@#KODE 1!@#USER_ID 101!@#ACTIVITY_CODE 3
12/21/2022 02:42:31 PM script INFO: SUCCESS!@#KODE 1!@#USER_ID 101!@#ACTIVITY_CODE 2
12/21/2022 02:42:32 PM script INFO: SUCCESS!@#KODE 1!@#USER_ID 101!@#ACTIVITY_CODE 4
12/21/2022 02:42:32 PM script INFO: SUCCESS!@#KODE 1!@#USER_ID 101!@#ACTIVITY_CODE 2
12/21/2022 02:42:32 PM script INFO: SUCCESS!@#KODE 1!@#USER_ID 101!@#ACTIVITY_CODE 2
12/21/2022 02:42:32 PM script INFO: SUCCESS!@#KODE 1!@#USER_ID 101!@#ACTIVITY_CODE 5
12/21/2022 02:42:32 PM script INFO: SUCCESS!@#KODE 1!@#USER_ID 101!@#ACTIVITY_CODE 5
12/21/2022 02:42:34 PM script INFO: SUCCESS!@#KODE 1!@#USER_ID 101!@#ACTIVITY_CODE 3
12/21/2022 02:42:35 PM script INFO: SUCCESS!@#KODE 1!@#USER_ID 101!@#ACTIVITY_CODE 1
12/21/2022 02:42:35 PM script INFO: SUCCESS!@#KODE 1!@#USER_ID 101!@#ACTIVITY_CODE 5
12/21/2022 02:42:35 PM script INFO: SUCCESS!@#KODE 1!@#USER_ID 101!@#ACTIVITY_CODE 5
12/21/2022 02:42:37 PM script INFO: SUCCESS!@#KODE 1!@#USER_ID 101!@#ACTIVITY_CODE 1
12/21/2022 02:42:37 PM script INFO: SUCCESS!@#KODE 1!@#USER_ID 101!@#ACTIVITY_CODE 2
12/21/2022 02:42:37 PM script INFO: SUCCESS!@#KODE 1!@#USER_ID 101!@#ACTIVITY_CODE 1
12/21/2022 02:42:37 PM script INFO: SUCCESS!@#KODE 1!@#USER_ID 101!@#ACTIVITY_CODE 1
12/21/2022 02:42:38 PM script INFO: SUCCESS!@#KODE 1!@#USER_ID 101!@#ACTIVITY_CODE 3
12/21/2022 02:42:38 PM script INFO: SUCCESS!@#KODE 1!@#USER_ID 101!@#ACTIVITY_CODE 4
12/21/2022 02:42:38 PM script INFO: SUCCESS!@#KODE 1!@#USER_ID 101!@#ACTIVITY_CODE 2
12/21/2022 02:42:38 PM script INFO: SUCCESS!@#KODE 1!@#USER_ID 101!@#ACTIVITY_CODE 1
12/21/2022 02:42:38 PM script INFO: SUCCESS!@#KODE 1!@#USER_ID 101!@#ACTIVITY_CODE 4
12/21/2022 02:42:38 PM script INFO: SUCCESS!@#KODE 1!@#USER_ID 101!@#ACTIVITY_CODE 3
12/21/2022 02:42:38 PM script INFO: SUCCESS!@#KODE 1!@#USER_ID 101!@#ACTIVITY_CODE 3
12/21/2022 02:42:38 PM script INFO: SUCCESS!@#KODE 1!@#USER_ID 101!@#ACTIVITY_CODE 5
12/21/2022 02:42:38 PM script INFO: SUCCESS!@#KODE 1!@#USER_ID 101!@#ACTIVITY_CODE 5
12/21/2022 02:42:41 PM script INFO: SUCCESS!@#KODE 1!@#USER_ID 101!@#ACTIVITY_CODE 1
12/21/2022 02:42:41 PM script INFO: SUCCESS!@#KODE 1!@#USER_ID 101!@#ACTIVITY_CODE 4
12/21/2022 02:42:41 PM script INFO: SUCCESS!@#KODE 1!@#USER_ID 101!@#ACTIVITY_CODE 3
12/21/2022 02:42:41 PM script INFO: SUCCESS!@#KODE 1!@#USER_ID 101!@#ACTIVITY_CODE 3
12/21/2022 02:42:41 PM script INFO: SUCCESS!@#KODE 1!@#USER_ID 101!@#ACTIVITY_CODE 2
12/21/2022 02:42:42 PM script INFO: SUCCESS!@#KODE 1!@#USER_ID 101!@#ACTIVITY_CODE 1
12/21/2022 02:42:42 PM script INFO: SUCCESS!@#KODE 1!@#USER_ID 101!@#ACTIVITY_CODE 2
12/21/2022 02:42:42 PM script INFO: SUCCESS!@#KODE 1!@#USER_ID 101!@#ACTIVITY_CODE 4
12/21/2022 02:42:42 PM script INFO: SUCCESS!@#KODE 1!@#USER_ID 101!@#ACTIVITY_CODE 3
12/21/2022 02:42:42 PM script INFO: SUCCESS!@#KODE 1!@#USER_ID 101!@#ACTIVITY_CODE 1
12/21/2022 02:42:42 PM script INFO: SUCCESS!@#KODE 1!@#USER_ID 101!@#ACTIVITY_CODE 4
12/21/2022 02:42:43 PM script INFO: SUCCESS!@#KODE 1!@#USER_ID 101!@#ACTIVITY_CODE 2
12/21/2022 02:42:43 PM script INFO: SUCCESS!@#KODE 1!@#USER_ID 101!@#ACTIVITY_CODE 1
12/21/2022 02:42:43 PM script INFO: SUCCESS!@#KODE 1!@#USER_ID 101!@#ACTIVITY_CODE 2
12/21/2022 02:42:43 PM script INFO: SUCCESS!@#KODE 1!@#USER_ID 101!@#ACTIVITY_CODE 1
12/21/2022 02:42:43 PM script INFO: SUCCESS!@#KODE 1!@#USER_ID 101!@#ACTIVITY_CODE 1
12/21/2022 02:42:43 PM script INFO: SUCCESS!@#KODE 1!@#USER_ID 101!@#ACTIVITY_CODE 2
12/21/2022 02:42:44 PM script INFO: SUCCESS!@#KODE 1!@#USER_ID 101!@#ACTIVITY_CODE 2
12/21/2022 02:42:44 PM script INFO: SUCCESS!@#KODE 1!@#USER_ID 101!@#ACTIVITY_CODE 3
12/21/2022 02:42:44 PM script INFO: SUCCESS!@#KODE 1!@#USER_ID 101!@#ACTIVITY_CODE 1
12/21/2022 02:42:44 PM script INFO: SUCCESS!@#KODE 1!@#USER_ID 101!@#ACTIVITY_CODE 1
12/21/2022 02:42:44 PM script INFO: SUCCESS!@#KODE 1!@#USER_ID 101!@#ACTIVITY_CODE 3
12/21/2022 02:42:44 PM script INFO: SUCCESS!@#KODE 1!@#USER_ID 101!@#ACTIVITY_CODE 2
12/21/2022 02:42:44 PM script INFO: SUCCESS!@#KODE 1!@#USER_ID 101!@#ACTIVITY_CODE 2
12/21/2022 02:42:45 PM script INFO: SUCCESS!@#KODE 1!@#USER_ID 101!@#ACTIVITY_CODE 1
12/21/2022 02:42:45 PM script INFO: SUCCESS!@#KODE 1!@#USER_ID 101!@#ACTIVITY_CODE 1
12/21/2022 02:42:45 PM script INFO: SUCCESS!@#KODE 1!@#USER_ID 101!@#ACTIVITY_CODE 4
12/21/2022 02:42:45 PM script INFO: SUCCESS!@#KODE 1!@#USER_ID 101!@#ACTIVITY_CODE 1
12/21/2022 02:42:45 PM script INFO: SUCCESS!@#KODE 1!@#USER_ID 101!@#ACTIVITY_CODE 1
12/21/2022 02:42:45 PM script INFO: SUCCESS!@#KODE 1!@#USER_ID 101!@#ACTIVITY_CODE 3
12/21/2022 02:42:45 PM script INFO: SUCCESS!@#KODE 1!@#USER_ID 101!@#ACTIVITY_CODE 4
12/21/2022 02:42:45 PM script INFO: SUCCESS!@#KODE 1!@#USER_ID 101!@#ACTIVITY_CODE 1
12/21/2022 02:42:46 PM script INFO: SUCCESS!@#KODE 1!@#USER_ID 101!@#ACTIVITY_CODE 4
12/21/2022 02:42:46 PM script INFO: SUCCESS!@#KODE 1!@#USER_ID 101!@#ACTIVITY_CODE 3
12/21/2022 02:42:46 PM script INFO: SUCCESS!@#KODE 1!@#USER_ID 101!@#ACTIVITY_CODE 3
12/21/2022 02:42:46 PM script INFO: SUCCESS!@#KODE 1!@#USER_ID 101!@#ACTIVITY_CODE 1
12/21/2022 02:42:46 PM script INFO: SUCCESS!@#KODE 1!@#USER_ID 101!@#ACTIVITY_CODE 2
12/21/2022 02:42:46 PM script INFO: SUCCESS!@#KODE 1!@#USER_ID 101!@#ACTIVITY_CODE 3
12/21/2022 02:42:47 PM script INFO: SUCCESS!@#KODE 1!@#USER_ID 101!@#ACTIVITY_CODE 2
12/21/2022 02:42:47 PM script INFO: SUCCESS!@#KODE 1!@#USER_ID 101!@#ACTIVITY_CODE 4
12/21/2022 02:42:47 PM script INFO: SUCCESS!@#KODE 1!@#USER_ID 101!@#ACTIVITY_CODE 3
12/21/2022 02:42:47 PM script INFO: SUCCESS!@#KODE 1!@#USER_ID 101!@#ACTIVITY_CODE 2
12/21/2022 02:42:47 PM script INFO: SUCCESS!@#KODE 1!@#USER_ID 101!@#ACTIVITY_CODE 3
12/21/2022 02:42:47 PM script INFO: SUCCESS!@#KODE 1!@#USER_ID 101!@#ACTIVITY_CODE 4
12/21/2022 02:42:47 PM script INFO: SUCCESS!@#KODE 1!@#USER_ID 101!@#ACTIVITY_CODE 3
12/21/2022 02:42:48 PM script INFO: SUCCESS!@#KODE 1!@#USER_ID 101!@#ACTIVITY_CODE 2
12/21/2022 02:42:48 PM script INFO: SUCCESS!@#KODE 1!@#USER_ID 101!@#ACTIVITY_CODE 3
12/21/2022 02:42:48 PM script INFO: SUCCESS!@#KODE 1!@#USER_ID 101!@#ACTIVITY_CODE 1
12/21/2022 02:42:48 PM script INFO: SUCCESS!@#KODE 1!@#USER_ID 101!@#ACTIVITY_CODE 2
12/21/2022 02:42:48 PM script INFO: SUCCESS!@#KODE 1!@#USER_ID 101!@#ACTIVITY_CODE 2
12/21/2022 02:42:49 PM script INFO: SUCCESS!@#KODE 1!@#USER_ID 101!@#ACTIVITY_CODE 2
12/21/2022 02:42:49 PM script INFO: SUCCESS!@#KODE 1!@#USER_ID 101!@#ACTIVITY_CODE 1
12/21/2022 02:42:49 PM script INFO: SUCCESS!@#KODE 1!@#USER_ID 101!@#ACTIVITY_CODE 4
12/21/2022 02:42:49 PM script INFO: SUCCESS!@#KODE 1!@#USER_ID 101!@#ACTIVITY_CODE 3
12/21/2022 02:42:49 PM script INFO: SUCCESS!@#KODE 1!@#USER_ID 101!@#ACTIVITY_CODE 2
12/21/2022 02:42:49 PM script INFO: SUCCESS!@#KODE 1!@#USER_ID 101!@#ACTIVITY_CODE 3
12/21/2022 02:42:50 PM script INFO: SUCCESS!@#KODE 1!@#USER_ID 101!@#ACTIVITY_CODE 2
12/21/2022 02:42:50 PM script INFO: SUCCESS!@#KODE 1!@#USER_ID 101!@#ACTIVITY_CODE 1
12/21/2022 02:42:50 PM script INFO: SUCCESS!@#KODE 1!@#USER_ID 101!@#ACTIVITY_CODE 4
12/21/2022 02:42:50 PM script INFO: SUCCESS!@#KODE 1!@#USER_ID 101!@#ACTIVITY_CODE 2
12/21/2022 02:42:50 PM script INFO: SUCCESS!@#KODE 1!@#USER_ID 101!@#ACTIVITY_CODE 2
12/21/2022 02:42:50 PM script INFO: SUCCESS!@#KODE 1!@#USER_ID 101!@#ACTIVITY_CODE 1
12/21/2022 02:42:51 PM script INFO: SUCCESS!@#KODE 1!@#USER_ID 101!@#ACTIVITY_CODE 2
12/21/2022 02:42:51 PM script INFO: SUCCESS!@#KODE 1!@#USER_ID 101!@#ACTIVITY_CODE 1
12/21/2022 02:42:51 PM script INFO: SUCCESS!@#KODE 1!@#USER_ID 101!@#ACTIVITY_CODE 1
12/21/2022 02:42:51 PM script INFO: SUCCESS!@#KODE 1!@#USER_ID 101!@#ACTIVITY_CODE 3
12/21/2022 02:42:51 PM script INFO: SUCCESS!@#KODE 1!@#USER_ID 101!@#ACTIVITY_CODE 2
12/21/2022 02:42:51 PM script INFO: SUCCESS!@#KODE 1!@#USER_ID 101!@#ACTIVITY_CODE 2
12/21/2022 02:42:51 PM script INFO: SUCCESS!@#KODE 1!@#USER_ID 101!@#ACTIVITY_CODE 1
12/21/2022 02:42:51 PM script INFO: SUCCESS!@#KODE 1!@#USER_ID 101!@#ACTIVITY_CODE 1
12/21/2022 02:42:52 PM script INFO: SUCCESS!@#KODE 1!@#USER_ID 101!@#ACTIVITY_CODE 3
12/21/2022 02:42:52 PM script INFO: SUCCESS!@#KODE 1!@#USER_ID 101!@#ACTIVITY_CODE 1
12/21/2022 02:42:52 PM script INFO: SUCCESS!@#KODE 1!@#USER_ID 101!@#ACTIVITY_CODE 4
12/21/2022 02:42:52 PM script INFO: SUCCESS!@#KODE 1!@#USER_ID 101!@#ACTIVITY_CODE 3
12/21/2022 02:42:52 PM script INFO: SUCCESS!@#KODE 1!@#USER_ID 101!@#ACTIVITY_CODE 1
12/21/2022 02:42:52 PM script INFO: SUCCESS!@#KODE 1!@#USER_ID 101!@#ACTIVITY_CODE 2
12/21/2022 02:42:52 PM script INFO: SUCCESS!@#KODE 1!@#USER_ID 101!@#ACTIVITY_CODE 3
12/21/2022 02:42:52 PM script INFO: SUCCESS!@#KODE 1!@#USER_ID 101!@#ACTIVITY_CODE 3
12/21/2022 02:42:53 PM script INFO: SUCCESS!@#KODE 1!@#USER_ID 101!@#ACTIVITY_CODE 2
12/21/2022 02:42:53 PM script INFO: SUCCESS!@#KODE 1!@#USER_ID 101!@#ACTIVITY_CODE 1
12/21/2022 02:42:53 PM script INFO: SUCCESS!@#KODE 1!@#USER_ID 101!@#ACTIVITY_CODE 2
12/21/2022 02:42:53 PM script INFO: SUCCESS!@#KODE 1!@#USER_ID 101!@#ACTIVITY_CODE 1
12/21/2022 02:42:53 PM script INFO: SUCCESS!@#KODE 1!@#USER_ID 101!@#ACTIVITY_CODE 1
12/21/2022 02:42:53 PM script INFO: SUCCESS!@#KODE 1!@#USER_ID 101!@#ACTIVITY_CODE 3
12/21/2022 02:42:53 PM script INFO: SUCCESS!@#KODE 1!@#USER_ID 101!@#ACTIVITY_CODE 3
12/21/2022 02:42:54 PM script INFO: SUCCESS!@#KODE 1!@#USER_ID 101!@#ACTIVITY_CODE 2
12/21/2022 02:42:54 PM script INFO: SUCCESS!@#KODE 1!@#USER_ID 101!@#ACTIVITY_CODE 1
12/21/2022 02:42:54 PM script INFO: SUCCESS!@#KODE 1!@#USER_ID 101!@#ACTIVITY_CODE 1
12/21/2022 02:42:54 PM script INFO: SUCCESS!@#KODE 1!@#USER_ID 101!@#ACTIVITY_CODE 2
12/21/2022 02:42:54 PM script INFO: SUCCESS!@#KODE 1!@#USER_ID 101!@#ACTIVITY_CODE 2
12/21/2022 02:42:54 PM script INFO: SUCCESS!@#KODE 1!@#USER_ID 101!@#ACTIVITY_CODE 3
12/21/2022 02:42:54 PM script INFO: SUCCESS!@#KODE 1!@#USER_ID 101!@#ACTIVITY_CODE 4
12/21/2022 02:42:55 PM script INFO: SUCCESS!@#KODE 1!@#USER_ID 101!@#ACTIVITY_CODE 3
12/21/2022 02:42:55 PM script INFO: SUCCESS!@#KODE 1!@#USER_ID 101!@#ACTIVITY_CODE 3
12/21/2022 02:42:55 PM script INFO: SUCCESS!@#KODE 1!@#USER_ID 101!@#ACTIVITY_CODE 1
12/21/2022 02:42:55 PM script INFO: SUCCESS!@#KODE 1!@#USER_ID 101!@#ACTIVITY_CODE 4
12/21/2022 02:42:55 PM script INFO: SUCCESS!@#KODE 1!@#USER_ID 101!@#ACTIVITY_CODE 2
12/21/2022 02:42:55 PM script INFO: SUCCESS!@#KODE 1!@#USER_ID 101!@#ACTIVITY_CODE 2
12/21/2022 02:42:55 PM script INFO: SUCCESS!@#KODE 1!@#USER_ID 101!@#ACTIVITY_CODE 3
12/21/2022 02:42:55 PM script INFO: SUCCESS!@#KODE 1!@#USER_ID 101!@#ACTIVITY_CODE 1
12/21/2022 02:42:56 PM script INFO: SUCCESS!@#KODE 1!@#USER_ID 101!@#ACTIVITY_CODE 3
12/21/2022 02:42:56 PM script INFO: SUCCESS!@#KODE 1!@#USER_ID 101!@#ACTIVITY_CODE 2
12/21/2022 02:42:56 PM script INFO: SUCCESS!@#KODE 1!@#USER_ID 101!@#ACTIVITY_CODE 1
12/21/2022 02:42:56 PM script INFO: SUCCESS!@#KODE 1!@#USER_ID 101!@#ACTIVITY_CODE 3
12/21/2022 02:42:56 PM script INFO: SUCCESS!@#KODE 1!@#USER_ID 101!@#ACTIVITY_CODE 1
12/21/2022 02:42:56 PM script INFO: SUCCESS!@#KODE 1!@#USER_ID 101!@#ACTIVITY_CODE 3
12/21/2022 02:42:56 PM script INFO: SUCCESS!@#KODE 1!@#USER_ID 101!@#ACTIVITY_CODE 2
12/21/2022 02:42:56 PM script INFO: SUCCESS!@#KODE 1!@#USER_ID 101!@#ACTIVITY_CODE 2
12/21/2022 02:42:57 PM script INFO: SUCCESS!@#KODE 1!@#USER_ID 101!@#ACTIVITY_CODE 2
12/21/2022 02:42:57 PM script INFO: SUCCESS!@#KODE 1!@#USER_ID 101!@#ACTIVITY_CODE 3
12/21/2022 02:42:57 PM script INFO: SUCCESS!@#KODE 1!@#USER_ID 101!@#ACTIVITY_CODE 2
12/21/2022 02:42:57 PM script INFO: SUCCESS!@#KODE 1!@#USER_ID 101!@#ACTIVITY_CODE 1
12/21/2022 02:42:57 PM script INFO: SUCCESS!@#KODE 1!@#USER_ID 101!@#ACTIVITY_CODE 3
12/21/2022 02:42:57 PM script INFO: SUCCESS!@#KODE 1!@#USER_ID 101!@#ACTIVITY_CODE 1
12/21/2022 02:42:57 PM script INFO: SUCCESS!@#KODE 1!@#USER_ID 101!@#ACTIVITY_CODE 4
12/21/2022 02:42:57 PM script INFO: SUCCESS!@#KODE 1!@#USER_ID 101!@#ACTIVITY_CODE 3
12/21/2022 02:42:57 PM script INFO: SUCCESS!@#KODE 1!@#USER_ID 101!@#ACTIVITY_CODE 3
12/21/2022 02:42:58 PM script INFO: SUCCESS!@#KODE 1!@#USER_ID 101!@#ACTIVITY_CODE 2
12/21/2022 02:42:58 PM script INFO: SUCCESS!@#KODE 1!@#USER_ID 101!@#ACTIVITY_CODE 2
12/21/2022 02:42:58 PM script INFO: SUCCESS!@#KODE 1!@#USER_ID 101!@#ACTIVITY_CODE 4
12/21/2022 02:42:58 PM script INFO: SUCCESS!@#KODE 1!@#USER_ID 101!@#ACTIVITY_CODE 2
12/21/2022 02:42:58 PM script INFO: SUCCESS!@#KODE 1!@#USER_ID 101!@#ACTIVITY_CODE 3
12/21/2022 02:42:59 PM script INFO: SUCCESS!@#KODE 1!@#USER_ID 101!@#ACTIVITY_CODE 2
12/21/2022 02:42:59 PM script INFO: SUCCESS!@#KODE 1!@#USER_ID 101!@#ACTIVITY_CODE 4
12/21/2022 02:42:59 PM script INFO: SUCCESS!@#KODE 1!@#USER_ID 101!@#ACTIVITY_CODE 2
12/21/2022 02:42:59 PM script INFO: SUCCESS!@#KODE 1!@#USER_ID 101!@#ACTIVITY_CODE 3
12/21/2022 02:42:59 PM script INFO: SUCCESS!@#KODE 1!@#USER_ID 101!@#ACTIVITY_CODE 4
12/21/2022 02:42:59 PM script INFO: SUCCESS!@#KODE 1!@#USER_ID 101!@#ACTIVITY_CODE 2
12/21/2022 02:42:59 PM script INFO: SUCCESS!@#KODE 1!@#USER_ID 101!@#ACTIVITY_CODE 2
12/21/2022 02:42:59 PM script INFO: SUCCESS!@#KODE 1!@#USER_ID 101!@#ACTIVITY_CODE 3
12/21/2022 02:43:00 PM script INFO: SUCCESS!@#KODE 1!@#USER_ID 101!@#ACTIVITY_CODE 1
12/21/2022 02:43:00 PM script INFO: SUCCESS!@#KODE 1!@#USER_ID 101!@#ACTIVITY_CODE 4
12/21/2022 02:43:00 PM script INFO: SUCCESS!@#KODE 1!@#USER_ID 101!@#ACTIVITY_CODE 2
12/21/2022 02:43:00 PM script INFO: SUCCESS!@#KODE 1!@#USER_ID 101!@#ACTIVITY_CODE 2
12/21/2022 02:43:00 PM script INFO: SUCCESS!@#KODE 1!@#USER_ID 101!@#ACTIVITY_CODE 2
12/21/2022 02:43:00 PM script INFO: SUCCESS!@#KODE 1!@#USER_ID 101!@#ACTIVITY_CODE 2
12/21/2022 02:43:00 PM script INFO: SUCCESS!@#KODE 1!@#USER_ID 101!@#ACTIVITY_CODE 1
12/21/2022 02:43:00 PM script INFO: SUCCESS!@#KODE 1!@#USER_ID 101!@#ACTIVITY_CODE 4
12/21/2022 02:43:01 PM script INFO: SUCCESS!@#KODE 1!@#USER_ID 101!@#ACTIVITY_CODE 3
12/21/2022 02:43:01 PM script INFO: SUCCESS!@#KODE 1!@#USER_ID 101!@#ACTIVITY_CODE 2
12/21/2022 02:43:01 PM script INFO: SUCCESS!@#KODE 1!@#USER_ID 101!@#ACTIVITY_CODE 2
12/21/2022 02:43:01 PM script INFO: SUCCESS!@#KODE 1!@#USER_ID 101!@#ACTIVITY_CODE 2
12/21/2022 02:43:01 PM script INFO: SUCCESS!@#KODE 1!@#USER_ID 101!@#ACTIVITY_CODE 3
12/21/2022 02:43:01 PM script INFO: Duration: 67.13675165176392
12/21/2022 02:43:01 PM script INFO: mengakhiri-quiz
12/21/2022 02:43:13 PM script INFO: SUCCESS!@#KODE 1!@#USER_ID 101!@#ACTIVITY_CODE 5
12/21/2022 02:43:13 PM script INFO: berhasil-submit
