12/23/2022 03:27:17 AM script INFO: Prepared chrome options..
12/23/2022 03:27:18 AM script INFO: Initialized chrome browser..
12/23/2022 03:27:18 AM script INFO: mengakses-homepage
12/23/2022 03:28:11 AM script INFO: mengakses-login-page
12/23/2022 03:28:27 AM script INFO: mengakses-site-home
12/23/2022 03:28:27 AM script INFO: mengakses-site-course
12/23/2022 03:28:48 AM script INFO: mengakses-quiz
12/23/2022 03:29:11 AM script INFO: mengakses-start-quiz-page
12/23/2022 03:29:15 AM script INFO: memulai-quiz
12/23/2022 03:29:15 AM script INFO: SUCCESS!@#KODE 1!@#USER_ID 100!@#ACTIVITY_CODE 5
12/23/2022 03:29:26 AM script INFO: SUCCESS!@#KODE 1!@#USER_ID 100!@#ACTIVITY_CODE 3
12/23/2022 03:29:26 AM script INFO: SUCCESS!@#KODE 1!@#USER_ID 100!@#ACTIVITY_CODE 5
12/23/2022 03:29:26 AM script INFO: SUCCESS!@#KODE 1!@#USER_ID 100!@#ACTIVITY_CODE 5
12/23/2022 03:29:29 AM script INFO: SUCCESS!@#KODE 1!@#USER_ID 100!@#ACTIVITY_CODE 5
12/23/2022 03:29:29 AM script INFO: SUCCESS!@#KODE 1!@#USER_ID 100!@#ACTIVITY_CODE 5
12/23/2022 03:29:31 AM script INFO: SUCCESS!@#KODE 1!@#USER_ID 100!@#ACTIVITY_CODE 5
12/23/2022 03:29:31 AM script INFO: SUCCESS!@#KODE 1!@#USER_ID 100!@#ACTIVITY_CODE 5
12/23/2022 03:29:34 AM script INFO: SUCCESS!@#KODE 1!@#USER_ID 100!@#ACTIVITY_CODE 2
12/23/2022 03:29:34 AM script INFO: SUCCESS!@#KODE 1!@#USER_ID 100!@#ACTIVITY_CODE 5
12/23/2022 03:29:34 AM script INFO: SUCCESS!@#KODE 1!@#USER_ID 100!@#ACTIVITY_CODE 5
12/23/2022 03:29:36 AM script INFO: SUCCESS!@#KODE 1!@#USER_ID 100!@#ACTIVITY_CODE 1
12/23/2022 03:29:36 AM script INFO: SUCCESS!@#KODE 1!@#USER_ID 100!@#ACTIVITY_CODE 5
12/23/2022 03:29:36 AM script INFO: SUCCESS!@#KODE 1!@#USER_ID 100!@#ACTIVITY_CODE 5
12/23/2022 03:29:39 AM script INFO: SUCCESS!@#KODE 1!@#USER_ID 100!@#ACTIVITY_CODE 3
12/23/2022 03:29:39 AM script INFO: SUCCESS!@#KODE 1!@#USER_ID 100!@#ACTIVITY_CODE 1
12/23/2022 03:29:39 AM script INFO: SUCCESS!@#KODE 1!@#USER_ID 100!@#ACTIVITY_CODE 5
12/23/2022 03:29:39 AM script INFO: SUCCESS!@#KODE 1!@#USER_ID 100!@#ACTIVITY_CODE 5
12/23/2022 03:29:42 AM script INFO: SUCCESS!@#KODE 1!@#USER_ID 100!@#ACTIVITY_CODE 1
12/23/2022 03:29:42 AM script INFO: SUCCESS!@#KODE 1!@#USER_ID 100!@#ACTIVITY_CODE 5
12/23/2022 03:29:42 AM script INFO: SUCCESS!@#KODE 1!@#USER_ID 100!@#ACTIVITY_CODE 5
12/23/2022 03:29:44 AM script INFO: SUCCESS!@#KODE 1!@#USER_ID 100!@#ACTIVITY_CODE 3
12/23/2022 03:29:44 AM script INFO: SUCCESS!@#KODE 1!@#USER_ID 100!@#ACTIVITY_CODE 5
12/23/2022 03:29:44 AM script INFO: SUCCESS!@#KODE 1!@#USER_ID 100!@#ACTIVITY_CODE 5
12/23/2022 03:29:47 AM script INFO: SUCCESS!@#KODE 1!@#USER_ID 100!@#ACTIVITY_CODE 5
12/23/2022 03:29:47 AM script INFO: SUCCESS!@#KODE 1!@#USER_ID 100!@#ACTIVITY_CODE 5
12/23/2022 03:29:49 AM script INFO: SUCCESS!@#KODE 1!@#USER_ID 100!@#ACTIVITY_CODE 1
12/23/2022 03:29:49 AM script INFO: SUCCESS!@#KODE 1!@#USER_ID 100!@#ACTIVITY_CODE 3
12/23/2022 03:29:49 AM script INFO: SUCCESS!@#KODE 1!@#USER_ID 100!@#ACTIVITY_CODE 2
12/23/2022 03:29:49 AM script INFO: SUCCESS!@#KODE 1!@#USER_ID 100!@#ACTIVITY_CODE 5
12/23/2022 03:29:49 AM script INFO: SUCCESS!@#KODE 1!@#USER_ID 100!@#ACTIVITY_CODE 5
12/23/2022 03:29:52 AM script INFO: SUCCESS!@#KODE 1!@#USER_ID 100!@#ACTIVITY_CODE 2
12/23/2022 03:29:52 AM script INFO: SUCCESS!@#KODE 1!@#USER_ID 100!@#ACTIVITY_CODE 2
12/23/2022 03:29:52 AM script INFO: SUCCESS!@#KODE 1!@#USER_ID 100!@#ACTIVITY_CODE 3
12/23/2022 03:29:52 AM script INFO: SUCCESS!@#KODE 1!@#USER_ID 100!@#ACTIVITY_CODE 1
12/23/2022 03:29:52 AM script INFO: SUCCESS!@#KODE 1!@#USER_ID 100!@#ACTIVITY_CODE 4
12/23/2022 03:29:52 AM script INFO: SUCCESS!@#KODE 1!@#USER_ID 100!@#ACTIVITY_CODE 1
12/23/2022 03:29:52 AM script INFO: SUCCESS!@#KODE 1!@#USER_ID 100!@#ACTIVITY_CODE 5
12/23/2022 03:29:52 AM script INFO: SUCCESS!@#KODE 1!@#USER_ID 100!@#ACTIVITY_CODE 5
12/23/2022 03:29:55 AM script INFO: SUCCESS!@#KODE 1!@#USER_ID 100!@#ACTIVITY_CODE 5
12/23/2022 03:29:55 AM script INFO: SUCCESS!@#KODE 1!@#USER_ID 100!@#ACTIVITY_CODE 5
12/23/2022 03:29:57 AM script INFO: SUCCESS!@#KODE 1!@#USER_ID 100!@#ACTIVITY_CODE 3
12/23/2022 03:29:57 AM script INFO: SUCCESS!@#KODE 1!@#USER_ID 100!@#ACTIVITY_CODE 4
12/23/2022 03:29:57 AM script INFO: SUCCESS!@#KODE 1!@#USER_ID 100!@#ACTIVITY_CODE 1
12/23/2022 03:29:57 AM script INFO: SUCCESS!@#KODE 1!@#USER_ID 100!@#ACTIVITY_CODE 1
12/23/2022 03:29:57 AM script INFO: SUCCESS!@#KODE 1!@#USER_ID 100!@#ACTIVITY_CODE 3
12/23/2022 03:29:58 AM script INFO: SUCCESS!@#KODE 1!@#USER_ID 100!@#ACTIVITY_CODE 2
12/23/2022 03:29:58 AM script INFO: SUCCESS!@#KODE 1!@#USER_ID 100!@#ACTIVITY_CODE 2
12/23/2022 03:29:58 AM script INFO: SUCCESS!@#KODE 1!@#USER_ID 100!@#ACTIVITY_CODE 3
12/23/2022 03:29:58 AM script INFO: SUCCESS!@#KODE 1!@#USER_ID 100!@#ACTIVITY_CODE 5
12/23/2022 03:29:58 AM script INFO: SUCCESS!@#KODE 1!@#USER_ID 100!@#ACTIVITY_CODE 5
12/23/2022 03:30:00 AM script INFO: SUCCESS!@#KODE 1!@#USER_ID 100!@#ACTIVITY_CODE 5
12/23/2022 03:30:00 AM script INFO: SUCCESS!@#KODE 1!@#USER_ID 100!@#ACTIVITY_CODE 5
12/23/2022 03:30:03 AM script INFO: SUCCESS!@#KODE 1!@#USER_ID 100!@#ACTIVITY_CODE 5
12/23/2022 03:30:03 AM script INFO: SUCCESS!@#KODE 1!@#USER_ID 100!@#ACTIVITY_CODE 5
12/23/2022 03:30:05 AM script INFO: SUCCESS!@#KODE 1!@#USER_ID 100!@#ACTIVITY_CODE 1
12/23/2022 03:30:05 AM script INFO: SUCCESS!@#KODE 1!@#USER_ID 100!@#ACTIVITY_CODE 2
12/23/2022 03:30:05 AM script INFO: SUCCESS!@#KODE 1!@#USER_ID 100!@#ACTIVITY_CODE 5
12/23/2022 03:30:05 AM script INFO: SUCCESS!@#KODE 1!@#USER_ID 100!@#ACTIVITY_CODE 5
12/23/2022 03:30:08 AM script INFO: SUCCESS!@#KODE 1!@#USER_ID 100!@#ACTIVITY_CODE 3
12/23/2022 03:30:08 AM script INFO: SUCCESS!@#KODE 1!@#USER_ID 100!@#ACTIVITY_CODE 3
12/23/2022 03:30:08 AM script INFO: SUCCESS!@#KODE 1!@#USER_ID 100!@#ACTIVITY_CODE 1
12/23/2022 03:30:08 AM script INFO: SUCCESS!@#KODE 1!@#USER_ID 100!@#ACTIVITY_CODE 1
12/23/2022 03:30:08 AM script INFO: SUCCESS!@#KODE 1!@#USER_ID 100!@#ACTIVITY_CODE 1
12/23/2022 03:30:08 AM script INFO: SUCCESS!@#KODE 1!@#USER_ID 100!@#ACTIVITY_CODE 2
12/23/2022 03:30:08 AM script INFO: SUCCESS!@#KODE 1!@#USER_ID 100!@#ACTIVITY_CODE 4
12/23/2022 03:30:08 AM script INFO: SUCCESS!@#KODE 1!@#USER_ID 100!@#ACTIVITY_CODE 2
12/23/2022 03:30:08 AM script INFO: SUCCESS!@#KODE 1!@#USER_ID 100!@#ACTIVITY_CODE 3
12/23/2022 03:30:09 AM script INFO: SUCCESS!@#KODE 1!@#USER_ID 100!@#ACTIVITY_CODE 1
12/23/2022 03:30:09 AM script INFO: SUCCESS!@#KODE 1!@#USER_ID 100!@#ACTIVITY_CODE 1
12/23/2022 03:30:09 AM script INFO: SUCCESS!@#KODE 1!@#USER_ID 100!@#ACTIVITY_CODE 4
12/23/2022 03:30:09 AM script INFO: SUCCESS!@#KODE 1!@#USER_ID 100!@#ACTIVITY_CODE 2
12/23/2022 03:30:09 AM script INFO: SUCCESS!@#KODE 1!@#USER_ID 100!@#ACTIVITY_CODE 4
12/23/2022 03:30:09 AM script INFO: SUCCESS!@#KODE 1!@#USER_ID 100!@#ACTIVITY_CODE 1
12/23/2022 03:30:09 AM script INFO: SUCCESS!@#KODE 1!@#USER_ID 100!@#ACTIVITY_CODE 3
12/23/2022 03:30:09 AM script INFO: SUCCESS!@#KODE 1!@#USER_ID 100!@#ACTIVITY_CODE 2
12/23/2022 03:30:09 AM script INFO: SUCCESS!@#KODE 1!@#USER_ID 100!@#ACTIVITY_CODE 1
12/23/2022 03:30:09 AM script INFO: SUCCESS!@#KODE 1!@#USER_ID 100!@#ACTIVITY_CODE 4
12/23/2022 03:30:09 AM script INFO: SUCCESS!@#KODE 1!@#USER_ID 100!@#ACTIVITY_CODE 3
12/23/2022 03:30:09 AM script INFO: SUCCESS!@#KODE 1!@#USER_ID 100!@#ACTIVITY_CODE 3
12/23/2022 03:30:09 AM script INFO: SUCCESS!@#KODE 1!@#USER_ID 100!@#ACTIVITY_CODE 3
12/23/2022 03:30:09 AM script INFO: SUCCESS!@#KODE 1!@#USER_ID 100!@#ACTIVITY_CODE 3
12/23/2022 03:30:09 AM script INFO: SUCCESS!@#KODE 1!@#USER_ID 100!@#ACTIVITY_CODE 2
12/23/2022 03:30:09 AM script INFO: SUCCESS!@#KODE 1!@#USER_ID 100!@#ACTIVITY_CODE 3
12/23/2022 03:30:10 AM script INFO: SUCCESS!@#KODE 1!@#USER_ID 100!@#ACTIVITY_CODE 4
12/23/2022 03:30:10 AM script INFO: SUCCESS!@#KODE 1!@#USER_ID 100!@#ACTIVITY_CODE 1
12/23/2022 03:30:10 AM script INFO: SUCCESS!@#KODE 1!@#USER_ID 100!@#ACTIVITY_CODE 3
12/23/2022 03:30:10 AM script INFO: SUCCESS!@#KODE 1!@#USER_ID 100!@#ACTIVITY_CODE 4
12/23/2022 03:30:10 AM script INFO: SUCCESS!@#KODE 1!@#USER_ID 100!@#ACTIVITY_CODE 3
12/23/2022 03:30:10 AM script INFO: SUCCESS!@#KODE 1!@#USER_ID 100!@#ACTIVITY_CODE 3
12/23/2022 03:30:10 AM script INFO: SUCCESS!@#KODE 1!@#USER_ID 100!@#ACTIVITY_CODE 3
12/23/2022 03:30:10 AM script INFO: SUCCESS!@#KODE 1!@#USER_ID 100!@#ACTIVITY_CODE 2
12/23/2022 03:30:10 AM script INFO: SUCCESS!@#KODE 1!@#USER_ID 100!@#ACTIVITY_CODE 1
12/23/2022 03:30:10 AM script INFO: SUCCESS!@#KODE 1!@#USER_ID 100!@#ACTIVITY_CODE 3
12/23/2022 03:30:10 AM script INFO: SUCCESS!@#KODE 1!@#USER_ID 100!@#ACTIVITY_CODE 1
12/23/2022 03:30:10 AM script INFO: SUCCESS!@#KODE 1!@#USER_ID 100!@#ACTIVITY_CODE 3
12/23/2022 03:30:10 AM script INFO: SUCCESS!@#KODE 1!@#USER_ID 100!@#ACTIVITY_CODE 3
12/23/2022 03:30:10 AM script INFO: SUCCESS!@#KODE 1!@#USER_ID 100!@#ACTIVITY_CODE 3
12/23/2022 03:30:10 AM script INFO: SUCCESS!@#KODE 1!@#USER_ID 100!@#ACTIVITY_CODE 3
12/23/2022 03:30:10 AM script INFO: SUCCESS!@#KODE 1!@#USER_ID 100!@#ACTIVITY_CODE 2
12/23/2022 03:30:10 AM script INFO: SUCCESS!@#KODE 1!@#USER_ID 100!@#ACTIVITY_CODE 2
12/23/2022 03:30:10 AM script INFO: SUCCESS!@#KODE 1!@#USER_ID 100!@#ACTIVITY_CODE 1
12/23/2022 03:30:10 AM script INFO: SUCCESS!@#KODE 1!@#USER_ID 100!@#ACTIVITY_CODE 3
12/23/2022 03:30:10 AM script INFO: SUCCESS!@#KODE 1!@#USER_ID 100!@#ACTIVITY_CODE 1
12/23/2022 03:30:11 AM script INFO: SUCCESS!@#KODE 1!@#USER_ID 100!@#ACTIVITY_CODE 1
12/23/2022 03:30:11 AM script INFO: SUCCESS!@#KODE 1!@#USER_ID 100!@#ACTIVITY_CODE 3
12/23/2022 03:30:11 AM script INFO: SUCCESS!@#KODE 1!@#USER_ID 100!@#ACTIVITY_CODE 1
12/23/2022 03:30:11 AM script INFO: SUCCESS!@#KODE 1!@#USER_ID 100!@#ACTIVITY_CODE 2
12/23/2022 03:30:11 AM script INFO: SUCCESS!@#KODE 1!@#USER_ID 100!@#ACTIVITY_CODE 1
12/23/2022 03:30:11 AM script INFO: SUCCESS!@#KODE 1!@#USER_ID 100!@#ACTIVITY_CODE 3
12/23/2022 03:30:11 AM script INFO: SUCCESS!@#KODE 1!@#USER_ID 100!@#ACTIVITY_CODE 4
12/23/2022 03:30:11 AM script INFO: SUCCESS!@#KODE 1!@#USER_ID 100!@#ACTIVITY_CODE 3
12/23/2022 03:30:11 AM script INFO: SUCCESS!@#KODE 1!@#USER_ID 100!@#ACTIVITY_CODE 1
12/23/2022 03:30:11 AM script INFO: SUCCESS!@#KODE 1!@#USER_ID 100!@#ACTIVITY_CODE 3
12/23/2022 03:30:11 AM script INFO: SUCCESS!@#KODE 1!@#USER_ID 100!@#ACTIVITY_CODE 1
12/23/2022 03:30:11 AM script INFO: SUCCESS!@#KODE 1!@#USER_ID 100!@#ACTIVITY_CODE 3
12/23/2022 03:30:11 AM script INFO: SUCCESS!@#KODE 1!@#USER_ID 100!@#ACTIVITY_CODE 4
12/23/2022 03:30:11 AM script INFO: SUCCESS!@#KODE 1!@#USER_ID 100!@#ACTIVITY_CODE 2
12/23/2022 03:30:11 AM script INFO: SUCCESS!@#KODE 1!@#USER_ID 100!@#ACTIVITY_CODE 3
12/23/2022 03:30:11 AM script INFO: SUCCESS!@#KODE 1!@#USER_ID 100!@#ACTIVITY_CODE 3
12/23/2022 03:30:11 AM script INFO: SUCCESS!@#KODE 1!@#USER_ID 100!@#ACTIVITY_CODE 2
12/23/2022 03:30:12 AM script INFO: SUCCESS!@#KODE 1!@#USER_ID 100!@#ACTIVITY_CODE 1
12/23/2022 03:30:12 AM script INFO: SUCCESS!@#KODE 1!@#USER_ID 100!@#ACTIVITY_CODE 4
12/23/2022 03:30:12 AM script INFO: SUCCESS!@#KODE 1!@#USER_ID 100!@#ACTIVITY_CODE 3
12/23/2022 03:30:12 AM script INFO: SUCCESS!@#KODE 1!@#USER_ID 100!@#ACTIVITY_CODE 3
12/23/2022 03:30:12 AM script INFO: SUCCESS!@#KODE 1!@#USER_ID 100!@#ACTIVITY_CODE 1
12/23/2022 03:30:12 AM script INFO: SUCCESS!@#KODE 1!@#USER_ID 100!@#ACTIVITY_CODE 1
12/23/2022 03:30:12 AM script INFO: SUCCESS!@#KODE 1!@#USER_ID 100!@#ACTIVITY_CODE 3
12/23/2022 03:30:12 AM script INFO: SUCCESS!@#KODE 1!@#USER_ID 100!@#ACTIVITY_CODE 2
12/23/2022 03:30:12 AM script INFO: SUCCESS!@#KODE 1!@#USER_ID 100!@#ACTIVITY_CODE 2
12/23/2022 03:30:12 AM script INFO: SUCCESS!@#KODE 1!@#USER_ID 100!@#ACTIVITY_CODE 1
12/23/2022 03:30:12 AM script INFO: SUCCESS!@#KODE 1!@#USER_ID 100!@#ACTIVITY_CODE 4
12/23/2022 03:30:12 AM script INFO: SUCCESS!@#KODE 1!@#USER_ID 100!@#ACTIVITY_CODE 1
12/23/2022 03:30:12 AM script INFO: SUCCESS!@#KODE 1!@#USER_ID 100!@#ACTIVITY_CODE 1
12/23/2022 03:30:12 AM script INFO: SUCCESS!@#KODE 1!@#USER_ID 100!@#ACTIVITY_CODE 3
12/23/2022 03:30:12 AM script INFO: SUCCESS!@#KODE 1!@#USER_ID 100!@#ACTIVITY_CODE 3
12/23/2022 03:30:12 AM script INFO: SUCCESS!@#KODE 1!@#USER_ID 100!@#ACTIVITY_CODE 4
12/23/2022 03:30:12 AM script INFO: SUCCESS!@#KODE 1!@#USER_ID 100!@#ACTIVITY_CODE 3
12/23/2022 03:30:12 AM script INFO: SUCCESS!@#KODE 1!@#USER_ID 100!@#ACTIVITY_CODE 2
12/23/2022 03:30:12 AM script INFO: SUCCESS!@#KODE 1!@#USER_ID 100!@#ACTIVITY_CODE 1
12/23/2022 03:30:13 AM script INFO: SUCCESS!@#KODE 1!@#USER_ID 100!@#ACTIVITY_CODE 1
12/23/2022 03:30:13 AM script INFO: SUCCESS!@#KODE 1!@#USER_ID 100!@#ACTIVITY_CODE 2
12/23/2022 03:30:13 AM script INFO: SUCCESS!@#KODE 1!@#USER_ID 100!@#ACTIVITY_CODE 1
12/23/2022 03:30:13 AM script INFO: SUCCESS!@#KODE 1!@#USER_ID 100!@#ACTIVITY_CODE 3
12/23/2022 03:30:13 AM script INFO: SUCCESS!@#KODE 1!@#USER_ID 100!@#ACTIVITY_CODE 2
12/23/2022 03:30:13 AM script INFO: SUCCESS!@#KODE 1!@#USER_ID 100!@#ACTIVITY_CODE 1
12/23/2022 03:30:13 AM script INFO: SUCCESS!@#KODE 1!@#USER_ID 100!@#ACTIVITY_CODE 2
12/23/2022 03:30:13 AM script INFO: SUCCESS!@#KODE 1!@#USER_ID 100!@#ACTIVITY_CODE 2
12/23/2022 03:30:13 AM script INFO: SUCCESS!@#KODE 1!@#USER_ID 100!@#ACTIVITY_CODE 2
12/23/2022 03:30:13 AM script INFO: SUCCESS!@#KODE 1!@#USER_ID 100!@#ACTIVITY_CODE 2
12/23/2022 03:30:13 AM script INFO: SUCCESS!@#KODE 1!@#USER_ID 100!@#ACTIVITY_CODE 2
12/23/2022 03:30:13 AM script INFO: SUCCESS!@#KODE 1!@#USER_ID 100!@#ACTIVITY_CODE 1
12/23/2022 03:30:13 AM script INFO: SUCCESS!@#KODE 1!@#USER_ID 100!@#ACTIVITY_CODE 1
12/23/2022 03:30:14 AM script INFO: SUCCESS!@#KODE 1!@#USER_ID 100!@#ACTIVITY_CODE 3
12/23/2022 03:30:14 AM script INFO: SUCCESS!@#KODE 1!@#USER_ID 100!@#ACTIVITY_CODE 2
12/23/2022 03:30:14 AM script INFO: SUCCESS!@#KODE 1!@#USER_ID 100!@#ACTIVITY_CODE 2
12/23/2022 03:30:14 AM script INFO: SUCCESS!@#KODE 1!@#USER_ID 100!@#ACTIVITY_CODE 1
12/23/2022 03:30:14 AM script INFO: SUCCESS!@#KODE 1!@#USER_ID 100!@#ACTIVITY_CODE 3
12/23/2022 03:30:14 AM script INFO: SUCCESS!@#KODE 1!@#USER_ID 100!@#ACTIVITY_CODE 1
12/23/2022 03:30:14 AM script INFO: SUCCESS!@#KODE 1!@#USER_ID 100!@#ACTIVITY_CODE 1
12/23/2022 03:30:14 AM script INFO: SUCCESS!@#KODE 1!@#USER_ID 100!@#ACTIVITY_CODE 3
12/23/2022 03:30:14 AM script INFO: SUCCESS!@#KODE 1!@#USER_ID 100!@#ACTIVITY_CODE 2
12/23/2022 03:30:14 AM script INFO: SUCCESS!@#KODE 1!@#USER_ID 100!@#ACTIVITY_CODE 2
12/23/2022 03:30:14 AM script INFO: SUCCESS!@#KODE 1!@#USER_ID 100!@#ACTIVITY_CODE 1
12/23/2022 03:30:14 AM script INFO: SUCCESS!@#KODE 1!@#USER_ID 100!@#ACTIVITY_CODE 1
12/23/2022 03:30:14 AM script INFO: SUCCESS!@#KODE 1!@#USER_ID 100!@#ACTIVITY_CODE 3
12/23/2022 03:30:14 AM script INFO: SUCCESS!@#KODE 1!@#USER_ID 100!@#ACTIVITY_CODE 3
12/23/2022 03:30:14 AM script INFO: SUCCESS!@#KODE 1!@#USER_ID 100!@#ACTIVITY_CODE 1
12/23/2022 03:30:14 AM script INFO: SUCCESS!@#KODE 1!@#USER_ID 100!@#ACTIVITY_CODE 2
12/23/2022 03:30:15 AM script INFO: SUCCESS!@#KODE 1!@#USER_ID 100!@#ACTIVITY_CODE 2
12/23/2022 03:30:15 AM script INFO: SUCCESS!@#KODE 1!@#USER_ID 100!@#ACTIVITY_CODE 3
12/23/2022 03:30:15 AM script INFO: SUCCESS!@#KODE 1!@#USER_ID 100!@#ACTIVITY_CODE 2
12/23/2022 03:30:15 AM script INFO: SUCCESS!@#KODE 1!@#USER_ID 100!@#ACTIVITY_CODE 3
12/23/2022 03:30:15 AM script INFO: SUCCESS!@#KODE 1!@#USER_ID 100!@#ACTIVITY_CODE 4
12/23/2022 03:30:15 AM script INFO: SUCCESS!@#KODE 1!@#USER_ID 100!@#ACTIVITY_CODE 2
12/23/2022 03:30:15 AM script INFO: SUCCESS!@#KODE 1!@#USER_ID 100!@#ACTIVITY_CODE 1
12/23/2022 03:30:15 AM script INFO: SUCCESS!@#KODE 1!@#USER_ID 100!@#ACTIVITY_CODE 4
12/23/2022 03:30:15 AM script INFO: SUCCESS!@#KODE 1!@#USER_ID 100!@#ACTIVITY_CODE 1
12/23/2022 03:30:15 AM script INFO: SUCCESS!@#KODE 1!@#USER_ID 100!@#ACTIVITY_CODE 4
12/23/2022 03:30:15 AM script INFO: SUCCESS!@#KODE 1!@#USER_ID 100!@#ACTIVITY_CODE 1
12/23/2022 03:30:15 AM script INFO: SUCCESS!@#KODE 1!@#USER_ID 100!@#ACTIVITY_CODE 4
12/23/2022 03:30:15 AM script INFO: SUCCESS!@#KODE 1!@#USER_ID 100!@#ACTIVITY_CODE 1
12/23/2022 03:30:15 AM script INFO: SUCCESS!@#KODE 1!@#USER_ID 100!@#ACTIVITY_CODE 1
12/23/2022 03:30:15 AM script INFO: SUCCESS!@#KODE 1!@#USER_ID 100!@#ACTIVITY_CODE 1
12/23/2022 03:30:15 AM script INFO: SUCCESS!@#KODE 1!@#USER_ID 100!@#ACTIVITY_CODE 2
12/23/2022 03:30:15 AM script INFO: SUCCESS!@#KODE 1!@#USER_ID 100!@#ACTIVITY_CODE 2
12/23/2022 03:30:16 AM script INFO: SUCCESS!@#KODE 1!@#USER_ID 100!@#ACTIVITY_CODE 3
12/23/2022 03:30:16 AM script INFO: SUCCESS!@#KODE 1!@#USER_ID 100!@#ACTIVITY_CODE 1
12/23/2022 03:30:16 AM script INFO: SUCCESS!@#KODE 1!@#USER_ID 100!@#ACTIVITY_CODE 1
12/23/2022 03:30:16 AM script INFO: SUCCESS!@#KODE 1!@#USER_ID 100!@#ACTIVITY_CODE 1
12/23/2022 03:30:16 AM script INFO: SUCCESS!@#KODE 1!@#USER_ID 100!@#ACTIVITY_CODE 1
12/23/2022 03:30:16 AM script INFO: SUCCESS!@#KODE 1!@#USER_ID 100!@#ACTIVITY_CODE 4
12/23/2022 03:30:16 AM script INFO: SUCCESS!@#KODE 1!@#USER_ID 100!@#ACTIVITY_CODE 2
12/23/2022 03:30:16 AM script INFO: SUCCESS!@#KODE 1!@#USER_ID 100!@#ACTIVITY_CODE 1
12/23/2022 03:30:16 AM script INFO: SUCCESS!@#KODE 1!@#USER_ID 100!@#ACTIVITY_CODE 1
12/23/2022 03:30:16 AM script INFO: SUCCESS!@#KODE 1!@#USER_ID 100!@#ACTIVITY_CODE 3
12/23/2022 03:30:16 AM script INFO: SUCCESS!@#KODE 1!@#USER_ID 100!@#ACTIVITY_CODE 3
12/23/2022 03:30:16 AM script INFO: SUCCESS!@#KODE 1!@#USER_ID 100!@#ACTIVITY_CODE 1
12/23/2022 03:30:16 AM script INFO: SUCCESS!@#KODE 1!@#USER_ID 100!@#ACTIVITY_CODE 3
12/23/2022 03:30:16 AM script INFO: SUCCESS!@#KODE 1!@#USER_ID 100!@#ACTIVITY_CODE 2
12/23/2022 03:30:16 AM script INFO: SUCCESS!@#KODE 1!@#USER_ID 100!@#ACTIVITY_CODE 4
12/23/2022 03:30:16 AM script INFO: SUCCESS!@#KODE 1!@#USER_ID 100!@#ACTIVITY_CODE 3
12/23/2022 03:30:16 AM script INFO: SUCCESS!@#KODE 1!@#USER_ID 100!@#ACTIVITY_CODE 3
12/23/2022 03:30:16 AM script INFO: SUCCESS!@#KODE 1!@#USER_ID 100!@#ACTIVITY_CODE 3
12/23/2022 03:30:16 AM script INFO: SUCCESS!@#KODE 1!@#USER_ID 100!@#ACTIVITY_CODE 3
12/23/2022 03:30:17 AM script INFO: SUCCESS!@#KODE 1!@#USER_ID 100!@#ACTIVITY_CODE 2
12/23/2022 03:30:17 AM script INFO: SUCCESS!@#KODE 1!@#USER_ID 100!@#ACTIVITY_CODE 3
12/23/2022 03:30:17 AM script INFO: SUCCESS!@#KODE 1!@#USER_ID 100!@#ACTIVITY_CODE 3
12/23/2022 03:30:17 AM script INFO: SUCCESS!@#KODE 1!@#USER_ID 100!@#ACTIVITY_CODE 2
12/23/2022 03:30:17 AM script INFO: SUCCESS!@#KODE 1!@#USER_ID 100!@#ACTIVITY_CODE 1
12/23/2022 03:30:17 AM script INFO: SUCCESS!@#KODE 1!@#USER_ID 100!@#ACTIVITY_CODE 2
12/23/2022 03:30:17 AM script INFO: SUCCESS!@#KODE 1!@#USER_ID 100!@#ACTIVITY_CODE 3
12/23/2022 03:30:17 AM script INFO: SUCCESS!@#KODE 1!@#USER_ID 100!@#ACTIVITY_CODE 1
12/23/2022 03:30:17 AM script INFO: SUCCESS!@#KODE 1!@#USER_ID 100!@#ACTIVITY_CODE 4
12/23/2022 03:30:17 AM script INFO: SUCCESS!@#KODE 1!@#USER_ID 100!@#ACTIVITY_CODE 1
12/23/2022 03:30:17 AM script INFO: SUCCESS!@#KODE 1!@#USER_ID 100!@#ACTIVITY_CODE 1
12/23/2022 03:30:17 AM script INFO: SUCCESS!@#KODE 1!@#USER_ID 100!@#ACTIVITY_CODE 2
12/23/2022 03:30:17 AM script INFO: SUCCESS!@#KODE 1!@#USER_ID 100!@#ACTIVITY_CODE 2
12/23/2022 03:30:17 AM script INFO: SUCCESS!@#KODE 1!@#USER_ID 100!@#ACTIVITY_CODE 3
12/23/2022 03:30:17 AM script INFO: SUCCESS!@#KODE 1!@#USER_ID 100!@#ACTIVITY_CODE 3
12/23/2022 03:30:17 AM script INFO: SUCCESS!@#KODE 1!@#USER_ID 100!@#ACTIVITY_CODE 1
12/23/2022 03:30:17 AM script INFO: SUCCESS!@#KODE 1!@#USER_ID 100!@#ACTIVITY_CODE 1
12/23/2022 03:30:17 AM script INFO: SUCCESS!@#KODE 1!@#USER_ID 100!@#ACTIVITY_CODE 1
12/23/2022 03:30:18 AM script INFO: SUCCESS!@#KODE 1!@#USER_ID 100!@#ACTIVITY_CODE 2
12/23/2022 03:30:18 AM script INFO: SUCCESS!@#KODE 1!@#USER_ID 100!@#ACTIVITY_CODE 2
12/23/2022 03:30:18 AM script INFO: SUCCESS!@#KODE 1!@#USER_ID 100!@#ACTIVITY_CODE 3
12/23/2022 03:30:18 AM script INFO: SUCCESS!@#KODE 1!@#USER_ID 100!@#ACTIVITY_CODE 3
12/23/2022 03:30:18 AM script INFO: SUCCESS!@#KODE 1!@#USER_ID 100!@#ACTIVITY_CODE 2
12/23/2022 03:30:18 AM script INFO: SUCCESS!@#KODE 1!@#USER_ID 100!@#ACTIVITY_CODE 1
12/23/2022 03:30:18 AM script INFO: SUCCESS!@#KODE 1!@#USER_ID 100!@#ACTIVITY_CODE 2
12/23/2022 03:30:18 AM script INFO: SUCCESS!@#KODE 1!@#USER_ID 100!@#ACTIVITY_CODE 2
12/23/2022 03:30:18 AM script INFO: SUCCESS!@#KODE 1!@#USER_ID 100!@#ACTIVITY_CODE 2
12/23/2022 03:30:18 AM script INFO: SUCCESS!@#KODE 1!@#USER_ID 100!@#ACTIVITY_CODE 3
12/23/2022 03:30:18 AM script INFO: SUCCESS!@#KODE 1!@#USER_ID 100!@#ACTIVITY_CODE 2
12/23/2022 03:30:19 AM script INFO: SUCCESS!@#KODE 1!@#USER_ID 100!@#ACTIVITY_CODE 2
12/23/2022 03:30:19 AM script INFO: SUCCESS!@#KODE 1!@#USER_ID 100!@#ACTIVITY_CODE 3
12/23/2022 03:30:19 AM script INFO: SUCCESS!@#KODE 1!@#USER_ID 100!@#ACTIVITY_CODE 1
12/23/2022 03:30:19 AM script INFO: SUCCESS!@#KODE 1!@#USER_ID 100!@#ACTIVITY_CODE 1
12/23/2022 03:30:19 AM script INFO: SUCCESS!@#KODE 1!@#USER_ID 100!@#ACTIVITY_CODE 2
12/23/2022 03:30:19 AM script INFO: SUCCESS!@#KODE 1!@#USER_ID 100!@#ACTIVITY_CODE 2
12/23/2022 03:30:19 AM script INFO: SUCCESS!@#KODE 1!@#USER_ID 100!@#ACTIVITY_CODE 3
12/23/2022 03:30:19 AM script INFO: SUCCESS!@#KODE 1!@#USER_ID 100!@#ACTIVITY_CODE 1
12/23/2022 03:30:19 AM script INFO: SUCCESS!@#KODE 1!@#USER_ID 100!@#ACTIVITY_CODE 3
12/23/2022 03:30:19 AM script INFO: SUCCESS!@#KODE 1!@#USER_ID 100!@#ACTIVITY_CODE 3
12/23/2022 03:30:19 AM script INFO: SUCCESS!@#KODE 1!@#USER_ID 100!@#ACTIVITY_CODE 3
12/23/2022 03:30:19 AM script INFO: SUCCESS!@#KODE 1!@#USER_ID 100!@#ACTIVITY_CODE 3
12/23/2022 03:30:19 AM script INFO: SUCCESS!@#KODE 1!@#USER_ID 100!@#ACTIVITY_CODE 1
12/23/2022 03:30:19 AM script INFO: SUCCESS!@#KODE 1!@#USER_ID 100!@#ACTIVITY_CODE 1
12/23/2022 03:30:19 AM script INFO: SUCCESS!@#KODE 1!@#USER_ID 100!@#ACTIVITY_CODE 2
12/23/2022 03:30:19 AM script INFO: Duration: 53.23244833946228
12/23/2022 03:30:19 AM script INFO: mengakhiri-quiz
12/23/2022 03:30:20 AM script INFO: SUCCESS!@#KODE 1!@#USER_ID 100!@#ACTIVITY_CODE 5
12/23/2022 03:30:20 AM script INFO: berhasil-submit
