12/23/2022 03:27:17 AM script INFO: Prepared chrome options..
12/23/2022 03:27:18 AM script INFO: Initialized chrome browser..
12/23/2022 03:27:18 AM script INFO: mengakses-homepage
12/23/2022 03:28:01 AM script INFO: mengakses-login-page
12/23/2022 03:28:16 AM script INFO: mengakses-site-home
12/23/2022 03:28:17 AM script INFO: mengakses-site-course
12/23/2022 03:28:18 AM script INFO: mengakses-quiz
12/23/2022 03:28:18 AM script INFO: mengakses-start-quiz-page
12/23/2022 03:28:19 AM script INFO: memulai-quiz
12/23/2022 03:28:19 AM script INFO: SUCCESS!@#KODE 1!@#USER_ID 75!@#ACTIVITY_CODE 5
12/23/2022 03:28:30 AM script INFO: SUCCESS!@#KODE 1!@#USER_ID 75!@#ACTIVITY_CODE 1
12/23/2022 03:28:30 AM script INFO: SUCCESS!@#KODE 1!@#USER_ID 75!@#ACTIVITY_CODE 2
12/23/2022 03:28:31 AM script INFO: SUCCESS!@#KODE 1!@#USER_ID 75!@#ACTIVITY_CODE 1
12/23/2022 03:28:31 AM script INFO: SUCCESS!@#KODE 1!@#USER_ID 75!@#ACTIVITY_CODE 1
12/23/2022 03:28:31 AM script INFO: SUCCESS!@#KODE 1!@#USER_ID 75!@#ACTIVITY_CODE 2
12/23/2022 03:28:31 AM script INFO: SUCCESS!@#KODE 1!@#USER_ID 75!@#ACTIVITY_CODE 1
12/23/2022 03:28:31 AM script INFO: SUCCESS!@#KODE 1!@#USER_ID 75!@#ACTIVITY_CODE 5
12/23/2022 03:28:31 AM script INFO: SUCCESS!@#KODE 1!@#USER_ID 75!@#ACTIVITY_CODE 5
12/23/2022 03:28:33 AM script INFO: SUCCESS!@#KODE 1!@#USER_ID 75!@#ACTIVITY_CODE 5
12/23/2022 03:28:33 AM script INFO: SUCCESS!@#KODE 1!@#USER_ID 75!@#ACTIVITY_CODE 5
12/23/2022 03:28:36 AM script INFO: SUCCESS!@#KODE 1!@#USER_ID 75!@#ACTIVITY_CODE 3
12/23/2022 03:28:36 AM script INFO: SUCCESS!@#KODE 1!@#USER_ID 75!@#ACTIVITY_CODE 4
12/23/2022 03:28:36 AM script INFO: SUCCESS!@#KODE 1!@#USER_ID 75!@#ACTIVITY_CODE 2
12/23/2022 03:28:36 AM script INFO: SUCCESS!@#KODE 1!@#USER_ID 75!@#ACTIVITY_CODE 1
12/23/2022 03:28:36 AM script INFO: SUCCESS!@#KODE 1!@#USER_ID 75!@#ACTIVITY_CODE 5
12/23/2022 03:28:36 AM script INFO: SUCCESS!@#KODE 1!@#USER_ID 75!@#ACTIVITY_CODE 5
12/23/2022 03:28:39 AM script INFO: SUCCESS!@#KODE 1!@#USER_ID 75!@#ACTIVITY_CODE 2
12/23/2022 03:28:39 AM script INFO: SUCCESS!@#KODE 1!@#USER_ID 75!@#ACTIVITY_CODE 3
12/23/2022 03:28:39 AM script INFO: SUCCESS!@#KODE 1!@#USER_ID 75!@#ACTIVITY_CODE 2
12/23/2022 03:28:40 AM script INFO: SUCCESS!@#KODE 1!@#USER_ID 75!@#ACTIVITY_CODE 3
12/23/2022 03:28:40 AM script INFO: SUCCESS!@#KODE 1!@#USER_ID 75!@#ACTIVITY_CODE 1
12/23/2022 03:28:40 AM script INFO: SUCCESS!@#KODE 1!@#USER_ID 75!@#ACTIVITY_CODE 5
12/23/2022 03:28:40 AM script INFO: SUCCESS!@#KODE 1!@#USER_ID 75!@#ACTIVITY_CODE 5
12/23/2022 03:28:42 AM script INFO: SUCCESS!@#KODE 1!@#USER_ID 75!@#ACTIVITY_CODE 5
12/23/2022 03:28:42 AM script INFO: SUCCESS!@#KODE 1!@#USER_ID 75!@#ACTIVITY_CODE 5
12/23/2022 03:28:45 AM script INFO: SUCCESS!@#KODE 1!@#USER_ID 75!@#ACTIVITY_CODE 5
12/23/2022 03:28:45 AM script INFO: SUCCESS!@#KODE 1!@#USER_ID 75!@#ACTIVITY_CODE 5
12/23/2022 03:28:47 AM script INFO: SUCCESS!@#KODE 1!@#USER_ID 75!@#ACTIVITY_CODE 5
12/23/2022 03:28:47 AM script INFO: SUCCESS!@#KODE 1!@#USER_ID 75!@#ACTIVITY_CODE 5
12/23/2022 03:28:50 AM script INFO: SUCCESS!@#KODE 1!@#USER_ID 75!@#ACTIVITY_CODE 5
12/23/2022 03:28:50 AM script INFO: SUCCESS!@#KODE 1!@#USER_ID 75!@#ACTIVITY_CODE 5
12/23/2022 03:28:53 AM script INFO: SUCCESS!@#KODE 1!@#USER_ID 75!@#ACTIVITY_CODE 2
12/23/2022 03:28:53 AM script INFO: SUCCESS!@#KODE 1!@#USER_ID 75!@#ACTIVITY_CODE 2
12/23/2022 03:28:53 AM script INFO: SUCCESS!@#KODE 1!@#USER_ID 75!@#ACTIVITY_CODE 5
12/23/2022 03:28:53 AM script INFO: SUCCESS!@#KODE 1!@#USER_ID 75!@#ACTIVITY_CODE 5
12/23/2022 03:28:56 AM script INFO: SUCCESS!@#KODE 1!@#USER_ID 75!@#ACTIVITY_CODE 2
12/23/2022 03:28:56 AM script INFO: SUCCESS!@#KODE 1!@#USER_ID 75!@#ACTIVITY_CODE 3
12/23/2022 03:28:56 AM script INFO: SUCCESS!@#KODE 1!@#USER_ID 75!@#ACTIVITY_CODE 2
12/23/2022 03:28:57 AM script INFO: SUCCESS!@#KODE 1!@#USER_ID 75!@#ACTIVITY_CODE 2
12/23/2022 03:28:57 AM script INFO: SUCCESS!@#KODE 1!@#USER_ID 75!@#ACTIVITY_CODE 5
12/23/2022 03:28:57 AM script INFO: SUCCESS!@#KODE 1!@#USER_ID 75!@#ACTIVITY_CODE 5
12/23/2022 03:28:59 AM script INFO: SUCCESS!@#KODE 1!@#USER_ID 75!@#ACTIVITY_CODE 5
12/23/2022 03:28:59 AM script INFO: SUCCESS!@#KODE 1!@#USER_ID 75!@#ACTIVITY_CODE 5
12/23/2022 03:29:02 AM script INFO: SUCCESS!@#KODE 1!@#USER_ID 75!@#ACTIVITY_CODE 2
12/23/2022 03:29:02 AM script INFO: SUCCESS!@#KODE 1!@#USER_ID 75!@#ACTIVITY_CODE 1
12/23/2022 03:29:02 AM script INFO: SUCCESS!@#KODE 1!@#USER_ID 75!@#ACTIVITY_CODE 4
12/23/2022 03:29:02 AM script INFO: SUCCESS!@#KODE 1!@#USER_ID 75!@#ACTIVITY_CODE 2
12/23/2022 03:29:02 AM script INFO: SUCCESS!@#KODE 1!@#USER_ID 75!@#ACTIVITY_CODE 1
12/23/2022 03:29:03 AM script INFO: SUCCESS!@#KODE 1!@#USER_ID 75!@#ACTIVITY_CODE 1
12/23/2022 03:29:03 AM script INFO: SUCCESS!@#KODE 1!@#USER_ID 75!@#ACTIVITY_CODE 2
12/23/2022 03:29:03 AM script INFO: SUCCESS!@#KODE 1!@#USER_ID 75!@#ACTIVITY_CODE 1
12/23/2022 03:29:03 AM script INFO: SUCCESS!@#KODE 1!@#USER_ID 75!@#ACTIVITY_CODE 4
12/23/2022 03:29:03 AM script INFO: SUCCESS!@#KODE 1!@#USER_ID 75!@#ACTIVITY_CODE 2
12/23/2022 03:29:04 AM script INFO: SUCCESS!@#KODE 1!@#USER_ID 75!@#ACTIVITY_CODE 2
12/23/2022 03:29:04 AM script INFO: SUCCESS!@#KODE 1!@#USER_ID 75!@#ACTIVITY_CODE 5
12/23/2022 03:29:04 AM script INFO: SUCCESS!@#KODE 1!@#USER_ID 75!@#ACTIVITY_CODE 5
12/23/2022 03:29:06 AM script INFO: SUCCESS!@#KODE 1!@#USER_ID 75!@#ACTIVITY_CODE 3
12/23/2022 03:29:06 AM script INFO: SUCCESS!@#KODE 1!@#USER_ID 75!@#ACTIVITY_CODE 3
12/23/2022 03:29:06 AM script INFO: SUCCESS!@#KODE 1!@#USER_ID 75!@#ACTIVITY_CODE 1
12/23/2022 03:29:06 AM script INFO: SUCCESS!@#KODE 1!@#USER_ID 75!@#ACTIVITY_CODE 1
12/23/2022 03:29:06 AM script INFO: SUCCESS!@#KODE 1!@#USER_ID 75!@#ACTIVITY_CODE 1
12/23/2022 03:29:06 AM script INFO: SUCCESS!@#KODE 1!@#USER_ID 75!@#ACTIVITY_CODE 5
12/23/2022 03:29:06 AM script INFO: SUCCESS!@#KODE 1!@#USER_ID 75!@#ACTIVITY_CODE 5
12/23/2022 03:29:09 AM script INFO: SUCCESS!@#KODE 1!@#USER_ID 75!@#ACTIVITY_CODE 2
12/23/2022 03:29:09 AM script INFO: SUCCESS!@#KODE 1!@#USER_ID 75!@#ACTIVITY_CODE 5
12/23/2022 03:29:09 AM script INFO: SUCCESS!@#KODE 1!@#USER_ID 75!@#ACTIVITY_CODE 5
12/23/2022 03:29:12 AM script INFO: SUCCESS!@#KODE 1!@#USER_ID 75!@#ACTIVITY_CODE 5
12/23/2022 03:29:12 AM script INFO: SUCCESS!@#KODE 1!@#USER_ID 75!@#ACTIVITY_CODE 5
12/23/2022 03:29:14 AM script INFO: SUCCESS!@#KODE 1!@#USER_ID 75!@#ACTIVITY_CODE 2
12/23/2022 03:29:14 AM script INFO: SUCCESS!@#KODE 1!@#USER_ID 75!@#ACTIVITY_CODE 1
12/23/2022 03:29:14 AM script INFO: SUCCESS!@#KODE 1!@#USER_ID 75!@#ACTIVITY_CODE 3
12/23/2022 03:29:14 AM script INFO: SUCCESS!@#KODE 1!@#USER_ID 75!@#ACTIVITY_CODE 1
12/23/2022 03:29:14 AM script INFO: SUCCESS!@#KODE 1!@#USER_ID 75!@#ACTIVITY_CODE 5
12/23/2022 03:29:14 AM script INFO: SUCCESS!@#KODE 1!@#USER_ID 75!@#ACTIVITY_CODE 5
12/23/2022 03:29:17 AM script INFO: SUCCESS!@#KODE 1!@#USER_ID 75!@#ACTIVITY_CODE 1
12/23/2022 03:29:17 AM script INFO: SUCCESS!@#KODE 1!@#USER_ID 75!@#ACTIVITY_CODE 2
12/23/2022 03:29:17 AM script INFO: SUCCESS!@#KODE 1!@#USER_ID 75!@#ACTIVITY_CODE 1
12/23/2022 03:29:17 AM script INFO: SUCCESS!@#KODE 1!@#USER_ID 75!@#ACTIVITY_CODE 3
12/23/2022 03:29:17 AM script INFO: SUCCESS!@#KODE 1!@#USER_ID 75!@#ACTIVITY_CODE 3
12/23/2022 03:29:17 AM script INFO: SUCCESS!@#KODE 1!@#USER_ID 75!@#ACTIVITY_CODE 1
12/23/2022 03:29:17 AM script INFO: SUCCESS!@#KODE 1!@#USER_ID 75!@#ACTIVITY_CODE 2
12/23/2022 03:29:17 AM script INFO: SUCCESS!@#KODE 1!@#USER_ID 75!@#ACTIVITY_CODE 4
12/23/2022 03:29:18 AM script INFO: SUCCESS!@#KODE 1!@#USER_ID 75!@#ACTIVITY_CODE 3
12/23/2022 03:29:18 AM script INFO: SUCCESS!@#KODE 1!@#USER_ID 75!@#ACTIVITY_CODE 2
12/23/2022 03:29:18 AM script INFO: SUCCESS!@#KODE 1!@#USER_ID 75!@#ACTIVITY_CODE 4
12/23/2022 03:29:18 AM script INFO: SUCCESS!@#KODE 1!@#USER_ID 75!@#ACTIVITY_CODE 3
12/23/2022 03:29:18 AM script INFO: SUCCESS!@#KODE 1!@#USER_ID 75!@#ACTIVITY_CODE 3
12/23/2022 03:29:18 AM script INFO: SUCCESS!@#KODE 1!@#USER_ID 75!@#ACTIVITY_CODE 3
12/23/2022 03:29:18 AM script INFO: SUCCESS!@#KODE 1!@#USER_ID 75!@#ACTIVITY_CODE 1
12/23/2022 03:29:18 AM script INFO: SUCCESS!@#KODE 1!@#USER_ID 75!@#ACTIVITY_CODE 3
12/23/2022 03:29:18 AM script INFO: SUCCESS!@#KODE 1!@#USER_ID 75!@#ACTIVITY_CODE 3
12/23/2022 03:29:18 AM script INFO: SUCCESS!@#KODE 1!@#USER_ID 75!@#ACTIVITY_CODE 4
12/23/2022 03:29:18 AM script INFO: SUCCESS!@#KODE 1!@#USER_ID 75!@#ACTIVITY_CODE 2
12/23/2022 03:29:18 AM script INFO: SUCCESS!@#KODE 1!@#USER_ID 75!@#ACTIVITY_CODE 1
12/23/2022 03:29:18 AM script INFO: SUCCESS!@#KODE 1!@#USER_ID 75!@#ACTIVITY_CODE 1
12/23/2022 03:29:18 AM script INFO: SUCCESS!@#KODE 1!@#USER_ID 75!@#ACTIVITY_CODE 1
12/23/2022 03:29:18 AM script INFO: SUCCESS!@#KODE 1!@#USER_ID 75!@#ACTIVITY_CODE 1
12/23/2022 03:29:19 AM script INFO: SUCCESS!@#KODE 1!@#USER_ID 75!@#ACTIVITY_CODE 2
12/23/2022 03:29:19 AM script INFO: SUCCESS!@#KODE 1!@#USER_ID 75!@#ACTIVITY_CODE 3
12/23/2022 03:29:19 AM script INFO: SUCCESS!@#KODE 1!@#USER_ID 75!@#ACTIVITY_CODE 1
12/23/2022 03:29:19 AM script INFO: SUCCESS!@#KODE 1!@#USER_ID 75!@#ACTIVITY_CODE 1
12/23/2022 03:29:19 AM script INFO: SUCCESS!@#KODE 1!@#USER_ID 75!@#ACTIVITY_CODE 2
12/23/2022 03:29:19 AM script INFO: SUCCESS!@#KODE 1!@#USER_ID 75!@#ACTIVITY_CODE 2
12/23/2022 03:29:19 AM script INFO: SUCCESS!@#KODE 1!@#USER_ID 75!@#ACTIVITY_CODE 1
12/23/2022 03:29:19 AM script INFO: SUCCESS!@#KODE 1!@#USER_ID 75!@#ACTIVITY_CODE 1
12/23/2022 03:29:19 AM script INFO: SUCCESS!@#KODE 1!@#USER_ID 75!@#ACTIVITY_CODE 3
12/23/2022 03:29:19 AM script INFO: SUCCESS!@#KODE 1!@#USER_ID 75!@#ACTIVITY_CODE 4
12/23/2022 03:29:19 AM script INFO: SUCCESS!@#KODE 1!@#USER_ID 75!@#ACTIVITY_CODE 1
12/23/2022 03:29:19 AM script INFO: SUCCESS!@#KODE 1!@#USER_ID 75!@#ACTIVITY_CODE 3
12/23/2022 03:29:19 AM script INFO: SUCCESS!@#KODE 1!@#USER_ID 75!@#ACTIVITY_CODE 4
12/23/2022 03:29:19 AM script INFO: SUCCESS!@#KODE 1!@#USER_ID 75!@#ACTIVITY_CODE 1
12/23/2022 03:29:19 AM script INFO: SUCCESS!@#KODE 1!@#USER_ID 75!@#ACTIVITY_CODE 3
12/23/2022 03:29:19 AM script INFO: SUCCESS!@#KODE 1!@#USER_ID 75!@#ACTIVITY_CODE 3
12/23/2022 03:29:20 AM script INFO: SUCCESS!@#KODE 1!@#USER_ID 75!@#ACTIVITY_CODE 1
12/23/2022 03:29:20 AM script INFO: SUCCESS!@#KODE 1!@#USER_ID 75!@#ACTIVITY_CODE 1
12/23/2022 03:29:20 AM script INFO: SUCCESS!@#KODE 1!@#USER_ID 75!@#ACTIVITY_CODE 3
12/23/2022 03:29:20 AM script INFO: SUCCESS!@#KODE 1!@#USER_ID 75!@#ACTIVITY_CODE 4
12/23/2022 03:29:20 AM script INFO: SUCCESS!@#KODE 1!@#USER_ID 75!@#ACTIVITY_CODE 2
12/23/2022 03:29:20 AM script INFO: SUCCESS!@#KODE 1!@#USER_ID 75!@#ACTIVITY_CODE 1
12/23/2022 03:29:20 AM script INFO: SUCCESS!@#KODE 1!@#USER_ID 75!@#ACTIVITY_CODE 4
12/23/2022 03:29:20 AM script INFO: SUCCESS!@#KODE 1!@#USER_ID 75!@#ACTIVITY_CODE 1
12/23/2022 03:29:20 AM script INFO: SUCCESS!@#KODE 1!@#USER_ID 75!@#ACTIVITY_CODE 1
12/23/2022 03:29:20 AM script INFO: SUCCESS!@#KODE 1!@#USER_ID 75!@#ACTIVITY_CODE 2
12/23/2022 03:29:20 AM script INFO: SUCCESS!@#KODE 1!@#USER_ID 75!@#ACTIVITY_CODE 1
12/23/2022 03:29:20 AM script INFO: SUCCESS!@#KODE 1!@#USER_ID 75!@#ACTIVITY_CODE 2
12/23/2022 03:29:20 AM script INFO: SUCCESS!@#KODE 1!@#USER_ID 75!@#ACTIVITY_CODE 3
12/23/2022 03:29:20 AM script INFO: SUCCESS!@#KODE 1!@#USER_ID 75!@#ACTIVITY_CODE 3
12/23/2022 03:29:20 AM script INFO: SUCCESS!@#KODE 1!@#USER_ID 75!@#ACTIVITY_CODE 3
12/23/2022 03:29:20 AM script INFO: SUCCESS!@#KODE 1!@#USER_ID 75!@#ACTIVITY_CODE 2
12/23/2022 03:29:21 AM script INFO: SUCCESS!@#KODE 1!@#USER_ID 75!@#ACTIVITY_CODE 2
12/23/2022 03:29:21 AM script INFO: SUCCESS!@#KODE 1!@#USER_ID 75!@#ACTIVITY_CODE 3
12/23/2022 03:29:21 AM script INFO: SUCCESS!@#KODE 1!@#USER_ID 75!@#ACTIVITY_CODE 3
12/23/2022 03:29:21 AM script INFO: SUCCESS!@#KODE 1!@#USER_ID 75!@#ACTIVITY_CODE 3
12/23/2022 03:29:21 AM script INFO: SUCCESS!@#KODE 1!@#USER_ID 75!@#ACTIVITY_CODE 1
12/23/2022 03:29:21 AM script INFO: SUCCESS!@#KODE 1!@#USER_ID 75!@#ACTIVITY_CODE 3
12/23/2022 03:29:21 AM script INFO: SUCCESS!@#KODE 1!@#USER_ID 75!@#ACTIVITY_CODE 3
12/23/2022 03:29:21 AM script INFO: SUCCESS!@#KODE 1!@#USER_ID 75!@#ACTIVITY_CODE 2
12/23/2022 03:29:21 AM script INFO: SUCCESS!@#KODE 1!@#USER_ID 75!@#ACTIVITY_CODE 3
12/23/2022 03:29:21 AM script INFO: SUCCESS!@#KODE 1!@#USER_ID 75!@#ACTIVITY_CODE 2
12/23/2022 03:29:21 AM script INFO: SUCCESS!@#KODE 1!@#USER_ID 75!@#ACTIVITY_CODE 4
12/23/2022 03:29:21 AM script INFO: SUCCESS!@#KODE 1!@#USER_ID 75!@#ACTIVITY_CODE 3
12/23/2022 03:29:21 AM script INFO: SUCCESS!@#KODE 1!@#USER_ID 75!@#ACTIVITY_CODE 3
12/23/2022 03:29:21 AM script INFO: SUCCESS!@#KODE 1!@#USER_ID 75!@#ACTIVITY_CODE 2
12/23/2022 03:29:21 AM script INFO: SUCCESS!@#KODE 1!@#USER_ID 75!@#ACTIVITY_CODE 1
12/23/2022 03:29:22 AM script INFO: SUCCESS!@#KODE 1!@#USER_ID 75!@#ACTIVITY_CODE 2
12/23/2022 03:29:22 AM script INFO: SUCCESS!@#KODE 1!@#USER_ID 75!@#ACTIVITY_CODE 1
12/23/2022 03:29:22 AM script INFO: SUCCESS!@#KODE 1!@#USER_ID 75!@#ACTIVITY_CODE 1
12/23/2022 03:29:22 AM script INFO: SUCCESS!@#KODE 1!@#USER_ID 75!@#ACTIVITY_CODE 4
12/23/2022 03:29:22 AM script INFO: SUCCESS!@#KODE 1!@#USER_ID 75!@#ACTIVITY_CODE 2
12/23/2022 03:29:22 AM script INFO: SUCCESS!@#KODE 1!@#USER_ID 75!@#ACTIVITY_CODE 3
12/23/2022 03:29:22 AM script INFO: SUCCESS!@#KODE 1!@#USER_ID 75!@#ACTIVITY_CODE 2
12/23/2022 03:29:22 AM script INFO: SUCCESS!@#KODE 1!@#USER_ID 75!@#ACTIVITY_CODE 1
12/23/2022 03:29:22 AM script INFO: SUCCESS!@#KODE 1!@#USER_ID 75!@#ACTIVITY_CODE 2
12/23/2022 03:29:22 AM script INFO: SUCCESS!@#KODE 1!@#USER_ID 75!@#ACTIVITY_CODE 2
12/23/2022 03:29:22 AM script INFO: SUCCESS!@#KODE 1!@#USER_ID 75!@#ACTIVITY_CODE 3
12/23/2022 03:29:23 AM script INFO: SUCCESS!@#KODE 1!@#USER_ID 75!@#ACTIVITY_CODE 2
12/23/2022 03:29:23 AM script INFO: SUCCESS!@#KODE 1!@#USER_ID 75!@#ACTIVITY_CODE 3
12/23/2022 03:29:23 AM script INFO: SUCCESS!@#KODE 1!@#USER_ID 75!@#ACTIVITY_CODE 2
12/23/2022 03:29:23 AM script INFO: SUCCESS!@#KODE 1!@#USER_ID 75!@#ACTIVITY_CODE 1
12/23/2022 03:29:23 AM script INFO: SUCCESS!@#KODE 1!@#USER_ID 75!@#ACTIVITY_CODE 2
12/23/2022 03:29:23 AM script INFO: SUCCESS!@#KODE 1!@#USER_ID 75!@#ACTIVITY_CODE 1
12/23/2022 03:29:23 AM script INFO: SUCCESS!@#KODE 1!@#USER_ID 75!@#ACTIVITY_CODE 1
12/23/2022 03:29:23 AM script INFO: SUCCESS!@#KODE 1!@#USER_ID 75!@#ACTIVITY_CODE 2
12/23/2022 03:29:23 AM script INFO: SUCCESS!@#KODE 1!@#USER_ID 75!@#ACTIVITY_CODE 1
12/23/2022 03:29:23 AM script INFO: SUCCESS!@#KODE 1!@#USER_ID 75!@#ACTIVITY_CODE 4
12/23/2022 03:29:23 AM script INFO: SUCCESS!@#KODE 1!@#USER_ID 75!@#ACTIVITY_CODE 1
12/23/2022 03:29:23 AM script INFO: SUCCESS!@#KODE 1!@#USER_ID 75!@#ACTIVITY_CODE 2
12/23/2022 03:29:23 AM script INFO: SUCCESS!@#KODE 1!@#USER_ID 75!@#ACTIVITY_CODE 1
12/23/2022 03:29:23 AM script INFO: SUCCESS!@#KODE 1!@#USER_ID 75!@#ACTIVITY_CODE 1
12/23/2022 03:29:23 AM script INFO: SUCCESS!@#KODE 1!@#USER_ID 75!@#ACTIVITY_CODE 3
12/23/2022 03:29:24 AM script INFO: SUCCESS!@#KODE 1!@#USER_ID 75!@#ACTIVITY_CODE 4
12/23/2022 03:29:24 AM script INFO: SUCCESS!@#KODE 1!@#USER_ID 75!@#ACTIVITY_CODE 3
12/23/2022 03:29:24 AM script INFO: SUCCESS!@#KODE 1!@#USER_ID 75!@#ACTIVITY_CODE 2
12/23/2022 03:29:24 AM script INFO: SUCCESS!@#KODE 1!@#USER_ID 75!@#ACTIVITY_CODE 2
12/23/2022 03:29:24 AM script INFO: SUCCESS!@#KODE 1!@#USER_ID 75!@#ACTIVITY_CODE 3
12/23/2022 03:29:24 AM script INFO: SUCCESS!@#KODE 1!@#USER_ID 75!@#ACTIVITY_CODE 2
12/23/2022 03:29:24 AM script INFO: SUCCESS!@#KODE 1!@#USER_ID 75!@#ACTIVITY_CODE 4
12/23/2022 03:29:24 AM script INFO: SUCCESS!@#KODE 1!@#USER_ID 75!@#ACTIVITY_CODE 2
12/23/2022 03:29:24 AM script INFO: SUCCESS!@#KODE 1!@#USER_ID 75!@#ACTIVITY_CODE 2
12/23/2022 03:29:24 AM script INFO: SUCCESS!@#KODE 1!@#USER_ID 75!@#ACTIVITY_CODE 1
12/23/2022 03:29:24 AM script INFO: SUCCESS!@#KODE 1!@#USER_ID 75!@#ACTIVITY_CODE 4
12/23/2022 03:29:24 AM script INFO: SUCCESS!@#KODE 1!@#USER_ID 75!@#ACTIVITY_CODE 3
12/23/2022 03:29:24 AM script INFO: SUCCESS!@#KODE 1!@#USER_ID 75!@#ACTIVITY_CODE 1
12/23/2022 03:29:24 AM script INFO: SUCCESS!@#KODE 1!@#USER_ID 75!@#ACTIVITY_CODE 1
12/23/2022 03:29:25 AM script INFO: SUCCESS!@#KODE 1!@#USER_ID 75!@#ACTIVITY_CODE 1
12/23/2022 03:29:25 AM script INFO: SUCCESS!@#KODE 1!@#USER_ID 75!@#ACTIVITY_CODE 4
12/23/2022 03:29:25 AM script INFO: SUCCESS!@#KODE 1!@#USER_ID 75!@#ACTIVITY_CODE 1
12/23/2022 03:29:25 AM script INFO: SUCCESS!@#KODE 1!@#USER_ID 75!@#ACTIVITY_CODE 4
12/23/2022 03:29:25 AM script INFO: SUCCESS!@#KODE 1!@#USER_ID 75!@#ACTIVITY_CODE 3
12/23/2022 03:29:25 AM script INFO: SUCCESS!@#KODE 1!@#USER_ID 75!@#ACTIVITY_CODE 1
12/23/2022 03:29:25 AM script INFO: SUCCESS!@#KODE 1!@#USER_ID 75!@#ACTIVITY_CODE 2
12/23/2022 03:29:25 AM script INFO: SUCCESS!@#KODE 1!@#USER_ID 75!@#ACTIVITY_CODE 3
12/23/2022 03:29:25 AM script INFO: SUCCESS!@#KODE 1!@#USER_ID 75!@#ACTIVITY_CODE 3
12/23/2022 03:29:25 AM script INFO: SUCCESS!@#KODE 1!@#USER_ID 75!@#ACTIVITY_CODE 3
12/23/2022 03:29:25 AM script INFO: SUCCESS!@#KODE 1!@#USER_ID 75!@#ACTIVITY_CODE 3
12/23/2022 03:29:25 AM script INFO: SUCCESS!@#KODE 1!@#USER_ID 75!@#ACTIVITY_CODE 3
12/23/2022 03:29:25 AM script INFO: SUCCESS!@#KODE 1!@#USER_ID 75!@#ACTIVITY_CODE 2
12/23/2022 03:29:25 AM script INFO: SUCCESS!@#KODE 1!@#USER_ID 75!@#ACTIVITY_CODE 1
12/23/2022 03:29:25 AM script INFO: SUCCESS!@#KODE 1!@#USER_ID 75!@#ACTIVITY_CODE 1
12/23/2022 03:29:26 AM script INFO: SUCCESS!@#KODE 1!@#USER_ID 75!@#ACTIVITY_CODE 2
12/23/2022 03:29:26 AM script INFO: SUCCESS!@#KODE 1!@#USER_ID 75!@#ACTIVITY_CODE 2
12/23/2022 03:29:26 AM script INFO: SUCCESS!@#KODE 1!@#USER_ID 75!@#ACTIVITY_CODE 4
12/23/2022 03:29:26 AM script INFO: SUCCESS!@#KODE 1!@#USER_ID 75!@#ACTIVITY_CODE 2
12/23/2022 03:29:26 AM script INFO: SUCCESS!@#KODE 1!@#USER_ID 75!@#ACTIVITY_CODE 1
12/23/2022 03:29:26 AM script INFO: SUCCESS!@#KODE 1!@#USER_ID 75!@#ACTIVITY_CODE 2
12/23/2022 03:29:26 AM script INFO: SUCCESS!@#KODE 1!@#USER_ID 75!@#ACTIVITY_CODE 3
12/23/2022 03:29:26 AM script INFO: SUCCESS!@#KODE 1!@#USER_ID 75!@#ACTIVITY_CODE 1
12/23/2022 03:29:26 AM script INFO: SUCCESS!@#KODE 1!@#USER_ID 75!@#ACTIVITY_CODE 3
12/23/2022 03:29:26 AM script INFO: SUCCESS!@#KODE 1!@#USER_ID 75!@#ACTIVITY_CODE 4
12/23/2022 03:29:26 AM script INFO: SUCCESS!@#KODE 1!@#USER_ID 75!@#ACTIVITY_CODE 1
12/23/2022 03:29:26 AM script INFO: SUCCESS!@#KODE 1!@#USER_ID 75!@#ACTIVITY_CODE 2
12/23/2022 03:29:26 AM script INFO: SUCCESS!@#KODE 1!@#USER_ID 75!@#ACTIVITY_CODE 2
12/23/2022 03:29:27 AM script INFO: SUCCESS!@#KODE 1!@#USER_ID 75!@#ACTIVITY_CODE 3
12/23/2022 03:29:27 AM script INFO: SUCCESS!@#KODE 1!@#USER_ID 75!@#ACTIVITY_CODE 3
12/23/2022 03:29:27 AM script INFO: SUCCESS!@#KODE 1!@#USER_ID 75!@#ACTIVITY_CODE 1
12/23/2022 03:29:27 AM script INFO: SUCCESS!@#KODE 1!@#USER_ID 75!@#ACTIVITY_CODE 2
12/23/2022 03:29:27 AM script INFO: SUCCESS!@#KODE 1!@#USER_ID 75!@#ACTIVITY_CODE 2
12/23/2022 03:29:27 AM script INFO: SUCCESS!@#KODE 1!@#USER_ID 75!@#ACTIVITY_CODE 1
12/23/2022 03:29:27 AM script INFO: SUCCESS!@#KODE 1!@#USER_ID 75!@#ACTIVITY_CODE 4
12/23/2022 03:29:27 AM script INFO: SUCCESS!@#KODE 1!@#USER_ID 75!@#ACTIVITY_CODE 3
12/23/2022 03:29:27 AM script INFO: SUCCESS!@#KODE 1!@#USER_ID 75!@#ACTIVITY_CODE 2
12/23/2022 03:29:27 AM script INFO: SUCCESS!@#KODE 1!@#USER_ID 75!@#ACTIVITY_CODE 2
12/23/2022 03:29:27 AM script INFO: SUCCESS!@#KODE 1!@#USER_ID 75!@#ACTIVITY_CODE 2
12/23/2022 03:29:28 AM script INFO: SUCCESS!@#KODE 1!@#USER_ID 75!@#ACTIVITY_CODE 2
12/23/2022 03:29:28 AM script INFO: SUCCESS!@#KODE 1!@#USER_ID 75!@#ACTIVITY_CODE 2
12/23/2022 03:29:28 AM script INFO: SUCCESS!@#KODE 1!@#USER_ID 75!@#ACTIVITY_CODE 4
12/23/2022 03:29:28 AM script INFO: SUCCESS!@#KODE 1!@#USER_ID 75!@#ACTIVITY_CODE 1
12/23/2022 03:29:28 AM script INFO: SUCCESS!@#KODE 1!@#USER_ID 75!@#ACTIVITY_CODE 4
12/23/2022 03:29:28 AM script INFO: SUCCESS!@#KODE 1!@#USER_ID 75!@#ACTIVITY_CODE 1
12/23/2022 03:29:28 AM script INFO: SUCCESS!@#KODE 1!@#USER_ID 75!@#ACTIVITY_CODE 1
12/23/2022 03:29:28 AM script INFO: SUCCESS!@#KODE 1!@#USER_ID 75!@#ACTIVITY_CODE 3
12/23/2022 03:29:28 AM script INFO: SUCCESS!@#KODE 1!@#USER_ID 75!@#ACTIVITY_CODE 3
12/23/2022 03:29:28 AM script INFO: SUCCESS!@#KODE 1!@#USER_ID 75!@#ACTIVITY_CODE 2
12/23/2022 03:29:28 AM script INFO: SUCCESS!@#KODE 1!@#USER_ID 75!@#ACTIVITY_CODE 1
12/23/2022 03:29:28 AM script INFO: SUCCESS!@#KODE 1!@#USER_ID 75!@#ACTIVITY_CODE 2
12/23/2022 03:29:28 AM script INFO: SUCCESS!@#KODE 1!@#USER_ID 75!@#ACTIVITY_CODE 3
12/23/2022 03:29:28 AM script INFO: SUCCESS!@#KODE 1!@#USER_ID 75!@#ACTIVITY_CODE 3
12/23/2022 03:29:29 AM script INFO: SUCCESS!@#KODE 1!@#USER_ID 75!@#ACTIVITY_CODE 2
12/23/2022 03:29:29 AM script INFO: SUCCESS!@#KODE 1!@#USER_ID 75!@#ACTIVITY_CODE 4
12/23/2022 03:29:29 AM script INFO: SUCCESS!@#KODE 1!@#USER_ID 75!@#ACTIVITY_CODE 2
12/23/2022 03:29:29 AM script INFO: SUCCESS!@#KODE 1!@#USER_ID 75!@#ACTIVITY_CODE 2
12/23/2022 03:29:29 AM script INFO: SUCCESS!@#KODE 1!@#USER_ID 75!@#ACTIVITY_CODE 4
12/23/2022 03:29:29 AM script INFO: SUCCESS!@#KODE 1!@#USER_ID 75!@#ACTIVITY_CODE 2
12/23/2022 03:29:29 AM script INFO: SUCCESS!@#KODE 1!@#USER_ID 75!@#ACTIVITY_CODE 2
12/23/2022 03:29:29 AM script INFO: SUCCESS!@#KODE 1!@#USER_ID 75!@#ACTIVITY_CODE 1
12/23/2022 03:29:29 AM script INFO: SUCCESS!@#KODE 1!@#USER_ID 75!@#ACTIVITY_CODE 1
12/23/2022 03:29:29 AM script INFO: SUCCESS!@#KODE 1!@#USER_ID 75!@#ACTIVITY_CODE 4
12/23/2022 03:29:29 AM script INFO: SUCCESS!@#KODE 1!@#USER_ID 75!@#ACTIVITY_CODE 1
12/23/2022 03:29:29 AM script INFO: Duration: 59.14727187156677
12/23/2022 03:29:29 AM script INFO: mengakhiri-quiz
12/23/2022 03:29:30 AM script INFO: SUCCESS!@#KODE 1!@#USER_ID 75!@#ACTIVITY_CODE 5
12/23/2022 03:29:30 AM script INFO: berhasil-submit
