12/23/2022 01:40:09 AM script INFO: Prepared chrome options..
12/23/2022 01:40:11 AM script INFO: Initialized chrome browser..
12/23/2022 01:40:11 AM script INFO: mengakses-homepage
12/23/2022 01:41:17 AM script INFO: mengakses-login-page
12/23/2022 01:41:57 AM script INFO: mengakses-site-home
12/23/2022 01:41:58 AM main_worker ERROR: Message: element click intercepted: Element <a class="list-group-item list-group-item-action  " href="http://35.238.154.97/?redirect=0" data-key="home" data-isexpandable="0" data-indent="0" data-showdivider="0" data-type="70" data-nodetype="0" data-collapse="0" data-forceopen="0" data-isactive="0" data-hidden="0" data-preceedwithhr="0" data-parent-key="myhome">...</a> is not clickable at point (142, 141). Other element would receive the click: <div class="yui3-widget-mask" style="position: fixed; width: 100%; height: 100%; top: 0px; left: 0px; z-index: 1041;"></div>
  (Session info: headless chrome=107.0.5304.87)
Stacktrace:
#0 0x5641747b1463 <unknown>
#1 0x5641745758d8 <unknown>
#2 0x5641745bb23b <unknown>
#3 0x5641745b8a79 <unknown>
#4 0x5641745b5fe4 <unknown>
#5 0x5641745b4b21 <unknown>
#6 0x5641745a7421 <unknown>
#7 0x5641745d4622 <unknown>
#8 0x5641745a6ba7 <unknown>
#9 0x5641745d478e <unknown>
#10 0x5641745ed30f <unknown>
#11 0x5641745d4443 <unknown>
#12 0x5641745a53c5 <unknown>
#13 0x5641745a6531 <unknown>
#14 0x564174803dce <unknown>
#15 0x564174807192 <unknown>
#16 0x5641747e893e <unknown>
#17 0x564174808103 <unknown>
#18 0x5641747dbd85 <unknown>
#19 0x5641748290a8 <unknown>
#20 0x564174829239 <unknown>
#21 0x564174844492 <unknown>
#22 0x7f67c592d609 start_thread

