12/11/2022 03:52:31 PM script INFO: Prepared chrome options..
12/11/2022 03:52:33 PM script INFO: Initialized chrome browser..
12/11/2022 03:52:33 PM script INFO: mengakses-homepage
12/11/2022 03:53:02 PM script INFO: mengakses-login-page
12/11/2022 03:53:03 PM script INFO: mengakses-site-home
12/11/2022 03:53:04 PM script INFO: mengakses-site-course
12/11/2022 03:53:20 PM script INFO: mengakses-quiz
12/11/2022 03:53:34 PM script INFO: mengakses-start-quiz-page
12/11/2022 03:54:13 PM script INFO: memulai-quiz
12/11/2022 03:54:13 PM script INFO: SUCCESS!@#KODE 1!@#USER_ID 76!@#ACTIVITY_CODE 5
12/11/2022 03:54:23 PM script INFO: SUCCESS!@#KODE 1!@#USER_ID 76!@#ACTIVITY_CODE 2
12/11/2022 03:54:23 PM script INFO: SUCCESS!@#KODE 1!@#USER_ID 76!@#ACTIVITY_CODE 5
12/11/2022 03:54:23 PM script INFO: SUCCESS!@#KODE 1!@#USER_ID 76!@#ACTIVITY_CODE 5
12/11/2022 03:54:26 PM script INFO: SUCCESS!@#KODE 1!@#USER_ID 76!@#ACTIVITY_CODE 2
12/11/2022 03:54:26 PM script INFO: SUCCESS!@#KODE 1!@#USER_ID 76!@#ACTIVITY_CODE 5
12/11/2022 03:54:26 PM script INFO: SUCCESS!@#KODE 1!@#USER_ID 76!@#ACTIVITY_CODE 5
12/11/2022 03:54:29 PM script INFO: SUCCESS!@#KODE 1!@#USER_ID 76!@#ACTIVITY_CODE 5
12/11/2022 03:54:29 PM script INFO: SUCCESS!@#KODE 1!@#USER_ID 76!@#ACTIVITY_CODE 5
12/11/2022 03:54:31 PM script INFO: SUCCESS!@#KODE 1!@#USER_ID 76!@#ACTIVITY_CODE 1
12/11/2022 03:54:31 PM script INFO: SUCCESS!@#KODE 1!@#USER_ID 76!@#ACTIVITY_CODE 5
12/11/2022 03:54:31 PM script INFO: SUCCESS!@#KODE 1!@#USER_ID 76!@#ACTIVITY_CODE 5
12/11/2022 03:54:34 PM script INFO: SUCCESS!@#KODE 1!@#USER_ID 76!@#ACTIVITY_CODE 1
12/11/2022 03:54:34 PM script INFO: SUCCESS!@#KODE 1!@#USER_ID 76!@#ACTIVITY_CODE 4
12/11/2022 03:54:34 PM script INFO: SUCCESS!@#KODE 1!@#USER_ID 76!@#ACTIVITY_CODE 5
12/11/2022 03:54:34 PM script INFO: SUCCESS!@#KODE 1!@#USER_ID 76!@#ACTIVITY_CODE 5
12/11/2022 03:54:36 PM script INFO: SUCCESS!@#KODE 1!@#USER_ID 76!@#ACTIVITY_CODE 2
12/11/2022 03:54:37 PM script INFO: SUCCESS!@#KODE 1!@#USER_ID 76!@#ACTIVITY_CODE 1
12/11/2022 03:54:37 PM script INFO: SUCCESS!@#KODE 1!@#USER_ID 76!@#ACTIVITY_CODE 3
12/11/2022 03:54:37 PM script INFO: SUCCESS!@#KODE 1!@#USER_ID 76!@#ACTIVITY_CODE 2
12/11/2022 03:54:37 PM script INFO: SUCCESS!@#KODE 1!@#USER_ID 76!@#ACTIVITY_CODE 2
12/11/2022 03:54:37 PM script INFO: SUCCESS!@#KODE 1!@#USER_ID 76!@#ACTIVITY_CODE 3
12/11/2022 03:54:37 PM script INFO: SUCCESS!@#KODE 1!@#USER_ID 76!@#ACTIVITY_CODE 2
12/11/2022 03:54:37 PM script INFO: SUCCESS!@#KODE 1!@#USER_ID 76!@#ACTIVITY_CODE 1
12/11/2022 03:54:37 PM script INFO: SUCCESS!@#KODE 1!@#USER_ID 76!@#ACTIVITY_CODE 3
12/11/2022 03:54:37 PM script INFO: SUCCESS!@#KODE 1!@#USER_ID 76!@#ACTIVITY_CODE 1
12/11/2022 03:54:37 PM script INFO: SUCCESS!@#KODE 1!@#USER_ID 76!@#ACTIVITY_CODE 4
12/11/2022 03:54:37 PM script INFO: SUCCESS!@#KODE 1!@#USER_ID 76!@#ACTIVITY_CODE 2
12/11/2022 03:54:37 PM script INFO: SUCCESS!@#KODE 1!@#USER_ID 76!@#ACTIVITY_CODE 1
12/11/2022 03:54:38 PM script INFO: SUCCESS!@#KODE 1!@#USER_ID 76!@#ACTIVITY_CODE 2
12/11/2022 03:54:38 PM script INFO: SUCCESS!@#KODE 1!@#USER_ID 76!@#ACTIVITY_CODE 3
12/11/2022 03:54:38 PM script INFO: SUCCESS!@#KODE 1!@#USER_ID 76!@#ACTIVITY_CODE 3
12/11/2022 03:54:38 PM script INFO: SUCCESS!@#KODE 1!@#USER_ID 76!@#ACTIVITY_CODE 3
12/11/2022 03:54:38 PM script INFO: SUCCESS!@#KODE 1!@#USER_ID 76!@#ACTIVITY_CODE 1
12/11/2022 03:54:38 PM script INFO: SUCCESS!@#KODE 1!@#USER_ID 76!@#ACTIVITY_CODE 3
12/11/2022 03:54:38 PM script INFO: SUCCESS!@#KODE 1!@#USER_ID 76!@#ACTIVITY_CODE 1
12/11/2022 03:54:38 PM script INFO: SUCCESS!@#KODE 1!@#USER_ID 76!@#ACTIVITY_CODE 1
12/11/2022 03:54:38 PM script INFO: SUCCESS!@#KODE 1!@#USER_ID 76!@#ACTIVITY_CODE 3
12/11/2022 03:54:38 PM script INFO: SUCCESS!@#KODE 1!@#USER_ID 76!@#ACTIVITY_CODE 1
12/11/2022 03:54:38 PM script INFO: SUCCESS!@#KODE 1!@#USER_ID 76!@#ACTIVITY_CODE 4
12/11/2022 03:54:38 PM script INFO: SUCCESS!@#KODE 1!@#USER_ID 76!@#ACTIVITY_CODE 5
12/11/2022 03:54:38 PM script INFO: SUCCESS!@#KODE 1!@#USER_ID 76!@#ACTIVITY_CODE 5
12/11/2022 03:54:41 PM script INFO: SUCCESS!@#KODE 1!@#USER_ID 76!@#ACTIVITY_CODE 1
12/11/2022 03:54:41 PM script INFO: SUCCESS!@#KODE 1!@#USER_ID 76!@#ACTIVITY_CODE 5
12/11/2022 03:54:41 PM script INFO: SUCCESS!@#KODE 1!@#USER_ID 76!@#ACTIVITY_CODE 5
12/11/2022 03:54:43 PM script INFO: SUCCESS!@#KODE 1!@#USER_ID 76!@#ACTIVITY_CODE 2
12/11/2022 03:54:43 PM script INFO: SUCCESS!@#KODE 1!@#USER_ID 76!@#ACTIVITY_CODE 1
12/11/2022 03:54:43 PM script INFO: SUCCESS!@#KODE 1!@#USER_ID 76!@#ACTIVITY_CODE 5
12/11/2022 03:54:43 PM script INFO: SUCCESS!@#KODE 1!@#USER_ID 76!@#ACTIVITY_CODE 5
12/11/2022 03:54:46 PM script INFO: SUCCESS!@#KODE 1!@#USER_ID 76!@#ACTIVITY_CODE 2
12/11/2022 03:54:46 PM script INFO: SUCCESS!@#KODE 1!@#USER_ID 76!@#ACTIVITY_CODE 5
12/11/2022 03:54:46 PM script INFO: SUCCESS!@#KODE 1!@#USER_ID 76!@#ACTIVITY_CODE 5
12/11/2022 03:54:49 PM script INFO: SUCCESS!@#KODE 1!@#USER_ID 76!@#ACTIVITY_CODE 1
12/11/2022 03:54:49 PM script INFO: SUCCESS!@#KODE 1!@#USER_ID 76!@#ACTIVITY_CODE 2
12/11/2022 03:54:49 PM script INFO: SUCCESS!@#KODE 1!@#USER_ID 76!@#ACTIVITY_CODE 1
12/11/2022 03:54:49 PM script INFO: SUCCESS!@#KODE 1!@#USER_ID 76!@#ACTIVITY_CODE 1
12/11/2022 03:54:49 PM script INFO: SUCCESS!@#KODE 1!@#USER_ID 76!@#ACTIVITY_CODE 1
12/11/2022 03:54:49 PM script INFO: SUCCESS!@#KODE 1!@#USER_ID 76!@#ACTIVITY_CODE 1
12/11/2022 03:54:49 PM script INFO: SUCCESS!@#KODE 1!@#USER_ID 76!@#ACTIVITY_CODE 5
12/11/2022 03:54:49 PM script INFO: SUCCESS!@#KODE 1!@#USER_ID 76!@#ACTIVITY_CODE 5
12/11/2022 03:54:51 PM script INFO: SUCCESS!@#KODE 1!@#USER_ID 76!@#ACTIVITY_CODE 1
12/11/2022 03:54:51 PM script INFO: SUCCESS!@#KODE 1!@#USER_ID 76!@#ACTIVITY_CODE 3
12/11/2022 03:54:52 PM script INFO: SUCCESS!@#KODE 1!@#USER_ID 76!@#ACTIVITY_CODE 2
12/11/2022 03:54:52 PM script INFO: SUCCESS!@#KODE 1!@#USER_ID 76!@#ACTIVITY_CODE 4
12/11/2022 03:54:52 PM script INFO: SUCCESS!@#KODE 1!@#USER_ID 76!@#ACTIVITY_CODE 2
12/11/2022 03:54:52 PM script INFO: SUCCESS!@#KODE 1!@#USER_ID 76!@#ACTIVITY_CODE 5
12/11/2022 03:54:52 PM script INFO: SUCCESS!@#KODE 1!@#USER_ID 76!@#ACTIVITY_CODE 5
12/11/2022 03:54:54 PM script INFO: SUCCESS!@#KODE 1!@#USER_ID 76!@#ACTIVITY_CODE 3
12/11/2022 03:54:54 PM script INFO: SUCCESS!@#KODE 1!@#USER_ID 76!@#ACTIVITY_CODE 5
12/11/2022 03:54:54 PM script INFO: SUCCESS!@#KODE 1!@#USER_ID 76!@#ACTIVITY_CODE 5
12/11/2022 03:54:57 PM script INFO: SUCCESS!@#KODE 1!@#USER_ID 76!@#ACTIVITY_CODE 2
12/11/2022 03:54:57 PM script INFO: SUCCESS!@#KODE 1!@#USER_ID 76!@#ACTIVITY_CODE 2
12/11/2022 03:54:57 PM script INFO: SUCCESS!@#KODE 1!@#USER_ID 76!@#ACTIVITY_CODE 1
12/11/2022 03:54:57 PM script INFO: SUCCESS!@#KODE 1!@#USER_ID 76!@#ACTIVITY_CODE 1
12/11/2022 03:54:57 PM script INFO: SUCCESS!@#KODE 1!@#USER_ID 76!@#ACTIVITY_CODE 5
12/11/2022 03:54:57 PM script INFO: SUCCESS!@#KODE 1!@#USER_ID 76!@#ACTIVITY_CODE 5
12/11/2022 03:55:00 PM script INFO: SUCCESS!@#KODE 1!@#USER_ID 76!@#ACTIVITY_CODE 4
12/11/2022 03:55:00 PM script INFO: SUCCESS!@#KODE 1!@#USER_ID 76!@#ACTIVITY_CODE 1
12/11/2022 03:55:00 PM script INFO: SUCCESS!@#KODE 1!@#USER_ID 76!@#ACTIVITY_CODE 3
12/11/2022 03:55:00 PM script INFO: SUCCESS!@#KODE 1!@#USER_ID 76!@#ACTIVITY_CODE 2
12/11/2022 03:55:00 PM script INFO: SUCCESS!@#KODE 1!@#USER_ID 76!@#ACTIVITY_CODE 2
12/11/2022 03:55:01 PM script INFO: SUCCESS!@#KODE 1!@#USER_ID 76!@#ACTIVITY_CODE 2
12/11/2022 03:55:01 PM script INFO: SUCCESS!@#KODE 1!@#USER_ID 76!@#ACTIVITY_CODE 2
12/11/2022 03:55:01 PM script INFO: SUCCESS!@#KODE 1!@#USER_ID 76!@#ACTIVITY_CODE 3
12/11/2022 03:55:01 PM script INFO: SUCCESS!@#KODE 1!@#USER_ID 76!@#ACTIVITY_CODE 1
12/11/2022 03:55:01 PM script INFO: SUCCESS!@#KODE 1!@#USER_ID 76!@#ACTIVITY_CODE 5
12/11/2022 03:55:01 PM script INFO: SUCCESS!@#KODE 1!@#USER_ID 76!@#ACTIVITY_CODE 5
12/11/2022 03:55:03 PM script INFO: SUCCESS!@#KODE 1!@#USER_ID 76!@#ACTIVITY_CODE 3
12/11/2022 03:55:03 PM script INFO: SUCCESS!@#KODE 1!@#USER_ID 76!@#ACTIVITY_CODE 3
12/11/2022 03:55:04 PM script INFO: SUCCESS!@#KODE 1!@#USER_ID 76!@#ACTIVITY_CODE 4
12/11/2022 03:55:04 PM script INFO: SUCCESS!@#KODE 1!@#USER_ID 76!@#ACTIVITY_CODE 5
12/11/2022 03:55:04 PM script INFO: SUCCESS!@#KODE 1!@#USER_ID 76!@#ACTIVITY_CODE 5
12/11/2022 03:55:06 PM script INFO: SUCCESS!@#KODE 1!@#USER_ID 76!@#ACTIVITY_CODE 3
12/11/2022 03:55:06 PM script INFO: SUCCESS!@#KODE 1!@#USER_ID 76!@#ACTIVITY_CODE 1
12/11/2022 03:55:06 PM script INFO: SUCCESS!@#KODE 1!@#USER_ID 76!@#ACTIVITY_CODE 1
12/11/2022 03:55:06 PM script INFO: SUCCESS!@#KODE 1!@#USER_ID 76!@#ACTIVITY_CODE 5
12/11/2022 03:55:06 PM script INFO: SUCCESS!@#KODE 1!@#USER_ID 76!@#ACTIVITY_CODE 5
12/11/2022 03:55:09 PM script INFO: SUCCESS!@#KODE 1!@#USER_ID 76!@#ACTIVITY_CODE 1
12/11/2022 03:55:09 PM script INFO: SUCCESS!@#KODE 1!@#USER_ID 76!@#ACTIVITY_CODE 4
12/11/2022 03:55:09 PM script INFO: SUCCESS!@#KODE 1!@#USER_ID 76!@#ACTIVITY_CODE 1
12/11/2022 03:55:09 PM script INFO: SUCCESS!@#KODE 1!@#USER_ID 76!@#ACTIVITY_CODE 1
12/11/2022 03:55:09 PM script INFO: SUCCESS!@#KODE 1!@#USER_ID 76!@#ACTIVITY_CODE 1
12/11/2022 03:55:09 PM script INFO: SUCCESS!@#KODE 1!@#USER_ID 76!@#ACTIVITY_CODE 4
12/11/2022 03:55:09 PM script INFO: SUCCESS!@#KODE 1!@#USER_ID 76!@#ACTIVITY_CODE 2
12/11/2022 03:55:09 PM script INFO: SUCCESS!@#KODE 1!@#USER_ID 76!@#ACTIVITY_CODE 2
12/11/2022 03:55:09 PM script INFO: SUCCESS!@#KODE 1!@#USER_ID 76!@#ACTIVITY_CODE 3
12/11/2022 03:55:09 PM script INFO: SUCCESS!@#KODE 1!@#USER_ID 76!@#ACTIVITY_CODE 1
12/11/2022 03:55:10 PM script INFO: SUCCESS!@#KODE 1!@#USER_ID 76!@#ACTIVITY_CODE 2
12/11/2022 03:55:10 PM script INFO: SUCCESS!@#KODE 1!@#USER_ID 76!@#ACTIVITY_CODE 3
12/11/2022 03:55:10 PM script INFO: SUCCESS!@#KODE 1!@#USER_ID 76!@#ACTIVITY_CODE 4
12/11/2022 03:55:10 PM script INFO: SUCCESS!@#KODE 1!@#USER_ID 76!@#ACTIVITY_CODE 1
12/11/2022 03:55:10 PM script INFO: SUCCESS!@#KODE 1!@#USER_ID 76!@#ACTIVITY_CODE 3
12/11/2022 03:55:10 PM script INFO: SUCCESS!@#KODE 1!@#USER_ID 76!@#ACTIVITY_CODE 1
12/11/2022 03:55:10 PM script INFO: SUCCESS!@#KODE 1!@#USER_ID 76!@#ACTIVITY_CODE 4
12/11/2022 03:55:10 PM script INFO: SUCCESS!@#KODE 1!@#USER_ID 76!@#ACTIVITY_CODE 2
12/11/2022 03:55:10 PM script INFO: SUCCESS!@#KODE 1!@#USER_ID 76!@#ACTIVITY_CODE 3
12/11/2022 03:55:10 PM script INFO: SUCCESS!@#KODE 1!@#USER_ID 76!@#ACTIVITY_CODE 2
12/11/2022 03:55:10 PM script INFO: SUCCESS!@#KODE 1!@#USER_ID 76!@#ACTIVITY_CODE 2
12/11/2022 03:55:10 PM script INFO: SUCCESS!@#KODE 1!@#USER_ID 76!@#ACTIVITY_CODE 3
12/11/2022 03:55:10 PM script INFO: SUCCESS!@#KODE 1!@#USER_ID 76!@#ACTIVITY_CODE 4
12/11/2022 03:55:11 PM script INFO: SUCCESS!@#KODE 1!@#USER_ID 76!@#ACTIVITY_CODE 3
12/11/2022 03:55:11 PM script INFO: SUCCESS!@#KODE 1!@#USER_ID 76!@#ACTIVITY_CODE 3
12/11/2022 03:55:11 PM script INFO: SUCCESS!@#KODE 1!@#USER_ID 76!@#ACTIVITY_CODE 1
12/11/2022 03:55:11 PM script INFO: SUCCESS!@#KODE 1!@#USER_ID 76!@#ACTIVITY_CODE 2
12/11/2022 03:55:11 PM script INFO: SUCCESS!@#KODE 1!@#USER_ID 76!@#ACTIVITY_CODE 1
12/11/2022 03:55:11 PM script INFO: SUCCESS!@#KODE 1!@#USER_ID 76!@#ACTIVITY_CODE 4
12/11/2022 03:55:11 PM script INFO: SUCCESS!@#KODE 1!@#USER_ID 76!@#ACTIVITY_CODE 3
12/11/2022 03:55:11 PM script INFO: SUCCESS!@#KODE 1!@#USER_ID 76!@#ACTIVITY_CODE 2
12/11/2022 03:55:11 PM script INFO: SUCCESS!@#KODE 1!@#USER_ID 76!@#ACTIVITY_CODE 1
12/11/2022 03:55:11 PM script INFO: SUCCESS!@#KODE 1!@#USER_ID 76!@#ACTIVITY_CODE 3
12/11/2022 03:55:11 PM script INFO: SUCCESS!@#KODE 1!@#USER_ID 76!@#ACTIVITY_CODE 3
12/11/2022 03:55:11 PM script INFO: SUCCESS!@#KODE 1!@#USER_ID 76!@#ACTIVITY_CODE 3
12/11/2022 03:55:11 PM script INFO: SUCCESS!@#KODE 1!@#USER_ID 76!@#ACTIVITY_CODE 4
12/11/2022 03:55:11 PM script INFO: SUCCESS!@#KODE 1!@#USER_ID 76!@#ACTIVITY_CODE 3
12/11/2022 03:55:12 PM script INFO: SUCCESS!@#KODE 1!@#USER_ID 76!@#ACTIVITY_CODE 3
12/11/2022 03:55:12 PM script INFO: SUCCESS!@#KODE 1!@#USER_ID 76!@#ACTIVITY_CODE 1
12/11/2022 03:55:12 PM script INFO: SUCCESS!@#KODE 1!@#USER_ID 76!@#ACTIVITY_CODE 3
12/11/2022 03:55:12 PM script INFO: SUCCESS!@#KODE 1!@#USER_ID 76!@#ACTIVITY_CODE 4
12/11/2022 03:55:12 PM script INFO: SUCCESS!@#KODE 1!@#USER_ID 76!@#ACTIVITY_CODE 3
12/11/2022 03:55:12 PM script INFO: SUCCESS!@#KODE 1!@#USER_ID 76!@#ACTIVITY_CODE 3
12/11/2022 03:55:12 PM script INFO: SUCCESS!@#KODE 1!@#USER_ID 76!@#ACTIVITY_CODE 3
12/11/2022 03:55:12 PM script INFO: SUCCESS!@#KODE 1!@#USER_ID 76!@#ACTIVITY_CODE 3
12/11/2022 03:55:12 PM script INFO: SUCCESS!@#KODE 1!@#USER_ID 76!@#ACTIVITY_CODE 2
12/11/2022 03:55:12 PM script INFO: SUCCESS!@#KODE 1!@#USER_ID 76!@#ACTIVITY_CODE 1
12/11/2022 03:55:12 PM script INFO: SUCCESS!@#KODE 1!@#USER_ID 76!@#ACTIVITY_CODE 1
12/11/2022 03:55:12 PM script INFO: SUCCESS!@#KODE 1!@#USER_ID 76!@#ACTIVITY_CODE 1
12/11/2022 03:55:12 PM script INFO: SUCCESS!@#KODE 1!@#USER_ID 76!@#ACTIVITY_CODE 4
12/11/2022 03:55:12 PM script INFO: SUCCESS!@#KODE 1!@#USER_ID 76!@#ACTIVITY_CODE 3
12/11/2022 03:55:12 PM script INFO: SUCCESS!@#KODE 1!@#USER_ID 76!@#ACTIVITY_CODE 1
12/11/2022 03:55:12 PM script INFO: SUCCESS!@#KODE 1!@#USER_ID 76!@#ACTIVITY_CODE 3
12/11/2022 03:55:12 PM script INFO: SUCCESS!@#KODE 1!@#USER_ID 76!@#ACTIVITY_CODE 3
12/11/2022 03:55:12 PM script INFO: SUCCESS!@#KODE 1!@#USER_ID 76!@#ACTIVITY_CODE 3
12/11/2022 03:55:13 PM script INFO: SUCCESS!@#KODE 1!@#USER_ID 76!@#ACTIVITY_CODE 1
12/11/2022 03:55:13 PM script INFO: SUCCESS!@#KODE 1!@#USER_ID 76!@#ACTIVITY_CODE 4
12/11/2022 03:55:13 PM script INFO: SUCCESS!@#KODE 1!@#USER_ID 76!@#ACTIVITY_CODE 2
12/11/2022 03:55:13 PM script INFO: SUCCESS!@#KODE 1!@#USER_ID 76!@#ACTIVITY_CODE 3
12/11/2022 03:55:13 PM script INFO: SUCCESS!@#KODE 1!@#USER_ID 76!@#ACTIVITY_CODE 2
12/11/2022 03:55:13 PM script INFO: SUCCESS!@#KODE 1!@#USER_ID 76!@#ACTIVITY_CODE 3
12/11/2022 03:55:13 PM script INFO: SUCCESS!@#KODE 1!@#USER_ID 76!@#ACTIVITY_CODE 2
12/11/2022 03:55:13 PM script INFO: SUCCESS!@#KODE 1!@#USER_ID 76!@#ACTIVITY_CODE 1
12/11/2022 03:55:13 PM script INFO: SUCCESS!@#KODE 1!@#USER_ID 76!@#ACTIVITY_CODE 2
12/11/2022 03:55:13 PM script INFO: SUCCESS!@#KODE 1!@#USER_ID 76!@#ACTIVITY_CODE 1
12/11/2022 03:55:13 PM script INFO: SUCCESS!@#KODE 1!@#USER_ID 76!@#ACTIVITY_CODE 3
12/11/2022 03:55:13 PM script INFO: SUCCESS!@#KODE 1!@#USER_ID 76!@#ACTIVITY_CODE 1
12/11/2022 03:55:14 PM script INFO: SUCCESS!@#KODE 1!@#USER_ID 76!@#ACTIVITY_CODE 4
12/11/2022 03:55:14 PM script INFO: SUCCESS!@#KODE 1!@#USER_ID 76!@#ACTIVITY_CODE 2
12/11/2022 03:55:14 PM script INFO: SUCCESS!@#KODE 1!@#USER_ID 76!@#ACTIVITY_CODE 1
12/11/2022 03:55:14 PM script INFO: SUCCESS!@#KODE 1!@#USER_ID 76!@#ACTIVITY_CODE 3
12/11/2022 03:55:14 PM script INFO: SUCCESS!@#KODE 1!@#USER_ID 76!@#ACTIVITY_CODE 1
12/11/2022 03:55:14 PM script INFO: SUCCESS!@#KODE 1!@#USER_ID 76!@#ACTIVITY_CODE 3
12/11/2022 03:55:14 PM script INFO: SUCCESS!@#KODE 1!@#USER_ID 76!@#ACTIVITY_CODE 3
12/11/2022 03:55:14 PM script INFO: SUCCESS!@#KODE 1!@#USER_ID 76!@#ACTIVITY_CODE 4
12/11/2022 03:55:14 PM script INFO: SUCCESS!@#KODE 1!@#USER_ID 76!@#ACTIVITY_CODE 2
12/11/2022 03:55:14 PM script INFO: SUCCESS!@#KODE 1!@#USER_ID 76!@#ACTIVITY_CODE 2
12/11/2022 03:55:14 PM script INFO: SUCCESS!@#KODE 1!@#USER_ID 76!@#ACTIVITY_CODE 4
12/11/2022 03:55:14 PM script INFO: SUCCESS!@#KODE 1!@#USER_ID 76!@#ACTIVITY_CODE 1
12/11/2022 03:55:14 PM script INFO: SUCCESS!@#KODE 1!@#USER_ID 76!@#ACTIVITY_CODE 4
12/11/2022 03:55:15 PM script INFO: SUCCESS!@#KODE 1!@#USER_ID 76!@#ACTIVITY_CODE 2
12/11/2022 03:55:15 PM script INFO: SUCCESS!@#KODE 1!@#USER_ID 76!@#ACTIVITY_CODE 1
12/11/2022 03:55:15 PM script INFO: SUCCESS!@#KODE 1!@#USER_ID 76!@#ACTIVITY_CODE 1
12/11/2022 03:55:15 PM script INFO: SUCCESS!@#KODE 1!@#USER_ID 76!@#ACTIVITY_CODE 2
12/11/2022 03:55:15 PM script INFO: SUCCESS!@#KODE 1!@#USER_ID 76!@#ACTIVITY_CODE 3
12/11/2022 03:55:15 PM script INFO: SUCCESS!@#KODE 1!@#USER_ID 76!@#ACTIVITY_CODE 2
12/11/2022 03:55:15 PM script INFO: SUCCESS!@#KODE 1!@#USER_ID 76!@#ACTIVITY_CODE 1
12/11/2022 03:55:15 PM script INFO: SUCCESS!@#KODE 1!@#USER_ID 76!@#ACTIVITY_CODE 4
12/11/2022 03:55:15 PM script INFO: SUCCESS!@#KODE 1!@#USER_ID 76!@#ACTIVITY_CODE 2
12/11/2022 03:55:15 PM script INFO: SUCCESS!@#KODE 1!@#USER_ID 76!@#ACTIVITY_CODE 2
12/11/2022 03:55:15 PM script INFO: SUCCESS!@#KODE 1!@#USER_ID 76!@#ACTIVITY_CODE 1
12/11/2022 03:55:15 PM script INFO: SUCCESS!@#KODE 1!@#USER_ID 76!@#ACTIVITY_CODE 1
12/11/2022 03:55:16 PM script INFO: SUCCESS!@#KODE 1!@#USER_ID 76!@#ACTIVITY_CODE 2
12/11/2022 03:55:16 PM script INFO: SUCCESS!@#KODE 1!@#USER_ID 76!@#ACTIVITY_CODE 2
12/11/2022 03:55:16 PM script INFO: SUCCESS!@#KODE 1!@#USER_ID 76!@#ACTIVITY_CODE 1
12/11/2022 03:55:16 PM script INFO: SUCCESS!@#KODE 1!@#USER_ID 76!@#ACTIVITY_CODE 1
12/11/2022 03:55:16 PM script INFO: SUCCESS!@#KODE 1!@#USER_ID 76!@#ACTIVITY_CODE 1
12/11/2022 03:55:16 PM script INFO: SUCCESS!@#KODE 1!@#USER_ID 76!@#ACTIVITY_CODE 1
12/11/2022 03:55:16 PM script INFO: SUCCESS!@#KODE 1!@#USER_ID 76!@#ACTIVITY_CODE 2
12/11/2022 03:55:16 PM script INFO: SUCCESS!@#KODE 1!@#USER_ID 76!@#ACTIVITY_CODE 2
12/11/2022 03:55:16 PM script INFO: SUCCESS!@#KODE 1!@#USER_ID 76!@#ACTIVITY_CODE 1
12/11/2022 03:55:16 PM script INFO: SUCCESS!@#KODE 1!@#USER_ID 76!@#ACTIVITY_CODE 1
12/11/2022 03:55:16 PM script INFO: SUCCESS!@#KODE 1!@#USER_ID 76!@#ACTIVITY_CODE 2
12/11/2022 03:55:17 PM script INFO: SUCCESS!@#KODE 1!@#USER_ID 76!@#ACTIVITY_CODE 4
12/11/2022 03:55:17 PM script INFO: SUCCESS!@#KODE 1!@#USER_ID 76!@#ACTIVITY_CODE 2
12/11/2022 03:55:17 PM script INFO: SUCCESS!@#KODE 1!@#USER_ID 76!@#ACTIVITY_CODE 2
12/11/2022 03:55:17 PM script INFO: SUCCESS!@#KODE 1!@#USER_ID 76!@#ACTIVITY_CODE 3
12/11/2022 03:55:17 PM script INFO: SUCCESS!@#KODE 1!@#USER_ID 76!@#ACTIVITY_CODE 1
12/11/2022 03:55:17 PM script INFO: SUCCESS!@#KODE 1!@#USER_ID 76!@#ACTIVITY_CODE 4
12/11/2022 03:55:17 PM script INFO: SUCCESS!@#KODE 1!@#USER_ID 76!@#ACTIVITY_CODE 1
12/11/2022 03:55:17 PM script INFO: SUCCESS!@#KODE 1!@#USER_ID 76!@#ACTIVITY_CODE 1
12/11/2022 03:55:17 PM script INFO: SUCCESS!@#KODE 1!@#USER_ID 76!@#ACTIVITY_CODE 1
12/11/2022 03:55:17 PM script INFO: SUCCESS!@#KODE 1!@#USER_ID 76!@#ACTIVITY_CODE 4
12/11/2022 03:55:17 PM script INFO: SUCCESS!@#KODE 1!@#USER_ID 76!@#ACTIVITY_CODE 3
12/11/2022 03:55:17 PM script INFO: SUCCESS!@#KODE 1!@#USER_ID 76!@#ACTIVITY_CODE 3
12/11/2022 03:55:17 PM script INFO: SUCCESS!@#KODE 1!@#USER_ID 76!@#ACTIVITY_CODE 3
12/11/2022 03:55:17 PM script INFO: SUCCESS!@#KODE 1!@#USER_ID 76!@#ACTIVITY_CODE 2
12/11/2022 03:55:17 PM script INFO: SUCCESS!@#KODE 1!@#USER_ID 76!@#ACTIVITY_CODE 3
12/11/2022 03:55:18 PM script INFO: SUCCESS!@#KODE 1!@#USER_ID 76!@#ACTIVITY_CODE 1
12/11/2022 03:55:18 PM script INFO: SUCCESS!@#KODE 1!@#USER_ID 76!@#ACTIVITY_CODE 3
12/11/2022 03:55:18 PM script INFO: SUCCESS!@#KODE 1!@#USER_ID 76!@#ACTIVITY_CODE 2
12/11/2022 03:55:18 PM script INFO: SUCCESS!@#KODE 1!@#USER_ID 76!@#ACTIVITY_CODE 2
12/11/2022 03:55:18 PM script INFO: SUCCESS!@#KODE 1!@#USER_ID 76!@#ACTIVITY_CODE 1
12/11/2022 03:55:18 PM script INFO: SUCCESS!@#KODE 1!@#USER_ID 76!@#ACTIVITY_CODE 1
12/11/2022 03:55:18 PM script INFO: SUCCESS!@#KODE 1!@#USER_ID 76!@#ACTIVITY_CODE 1
12/11/2022 03:55:18 PM script INFO: SUCCESS!@#KODE 1!@#USER_ID 76!@#ACTIVITY_CODE 3
12/11/2022 03:55:18 PM script INFO: SUCCESS!@#KODE 1!@#USER_ID 76!@#ACTIVITY_CODE 4
12/11/2022 03:55:18 PM script INFO: SUCCESS!@#KODE 1!@#USER_ID 76!@#ACTIVITY_CODE 2
12/11/2022 03:55:18 PM script INFO: SUCCESS!@#KODE 1!@#USER_ID 76!@#ACTIVITY_CODE 3
12/11/2022 03:55:18 PM script INFO: SUCCESS!@#KODE 1!@#USER_ID 76!@#ACTIVITY_CODE 3
12/11/2022 03:55:18 PM script INFO: SUCCESS!@#KODE 1!@#USER_ID 76!@#ACTIVITY_CODE 3
12/11/2022 03:55:19 PM script INFO: SUCCESS!@#KODE 1!@#USER_ID 76!@#ACTIVITY_CODE 3
12/11/2022 03:55:19 PM script INFO: SUCCESS!@#KODE 1!@#USER_ID 76!@#ACTIVITY_CODE 3
12/11/2022 03:55:19 PM script INFO: SUCCESS!@#KODE 1!@#USER_ID 76!@#ACTIVITY_CODE 2
12/11/2022 03:55:19 PM script INFO: SUCCESS!@#KODE 1!@#USER_ID 76!@#ACTIVITY_CODE 3
12/11/2022 03:55:19 PM script INFO: SUCCESS!@#KODE 1!@#USER_ID 76!@#ACTIVITY_CODE 3
12/11/2022 03:55:19 PM script INFO: SUCCESS!@#KODE 1!@#USER_ID 76!@#ACTIVITY_CODE 2
12/11/2022 03:55:19 PM script INFO: SUCCESS!@#KODE 1!@#USER_ID 76!@#ACTIVITY_CODE 1
12/11/2022 03:55:19 PM script INFO: SUCCESS!@#KODE 1!@#USER_ID 76!@#ACTIVITY_CODE 4
12/11/2022 03:55:19 PM script INFO: SUCCESS!@#KODE 1!@#USER_ID 76!@#ACTIVITY_CODE 3
12/11/2022 03:55:19 PM script INFO: SUCCESS!@#KODE 1!@#USER_ID 76!@#ACTIVITY_CODE 2
12/11/2022 03:55:19 PM script INFO: SUCCESS!@#KODE 1!@#USER_ID 76!@#ACTIVITY_CODE 2
12/11/2022 03:55:19 PM script INFO: SUCCESS!@#KODE 1!@#USER_ID 76!@#ACTIVITY_CODE 3
12/11/2022 03:55:20 PM script INFO: SUCCESS!@#KODE 1!@#USER_ID 76!@#ACTIVITY_CODE 3
12/11/2022 03:55:20 PM script INFO: SUCCESS!@#KODE 1!@#USER_ID 76!@#ACTIVITY_CODE 2
12/11/2022 03:55:20 PM script INFO: SUCCESS!@#KODE 1!@#USER_ID 76!@#ACTIVITY_CODE 3
12/11/2022 03:55:20 PM script INFO: SUCCESS!@#KODE 1!@#USER_ID 76!@#ACTIVITY_CODE 2
12/11/2022 03:55:20 PM script INFO: SUCCESS!@#KODE 1!@#USER_ID 76!@#ACTIVITY_CODE 3
12/11/2022 03:55:20 PM script INFO: SUCCESS!@#KODE 1!@#USER_ID 76!@#ACTIVITY_CODE 2
12/11/2022 03:55:20 PM script INFO: SUCCESS!@#KODE 1!@#USER_ID 76!@#ACTIVITY_CODE 1
12/11/2022 03:55:20 PM script INFO: SUCCESS!@#KODE 1!@#USER_ID 76!@#ACTIVITY_CODE 1
12/11/2022 03:55:20 PM script INFO: SUCCESS!@#KODE 1!@#USER_ID 76!@#ACTIVITY_CODE 2
12/11/2022 03:55:20 PM script INFO: Duration: 57.057910442352295
12/11/2022 03:55:20 PM script INFO: mengakhiri-quiz
12/11/2022 03:55:22 PM script INFO: SUCCESS!@#KODE 1!@#USER_ID 76!@#ACTIVITY_CODE 5
12/11/2022 03:55:22 PM script INFO: berhasil-submit
