12/23/2022 02:03:35 AM script INFO: Prepared chrome options..
12/23/2022 02:03:37 AM script INFO: Initialized chrome browser..
12/23/2022 02:03:37 AM script INFO: mengakses-homepage
12/23/2022 02:04:23 AM script INFO: mengakses-login-page
12/23/2022 02:05:15 AM script INFO: mengakses-site-home
12/23/2022 02:05:16 AM main_worker ERROR: Message: element click intercepted: Element <a class="list-group-item list-group-item-action  " href="http://35.238.154.97/?redirect=0" data-key="home" data-isexpandable="0" data-indent="0" data-showdivider="0" data-type="70" data-nodetype="0" data-collapse="0" data-forceopen="0" data-isactive="0" data-hidden="0" data-preceedwithhr="0" data-parent-key="myhome">...</a> is not clickable at point (142, 141). Other element would receive the click: <div class="yui3-widget-mask" style="position: fixed; width: 100%; height: 100%; top: 0px; left: 0px; z-index: 1044;"></div>
  (Session info: headless chrome=107.0.5304.87)
Stacktrace:
#0 0x5560f8895463 <unknown>
#1 0x5560f86598d8 <unknown>
#2 0x5560f869f23b <unknown>
#3 0x5560f869ca79 <unknown>
#4 0x5560f8699fe4 <unknown>
#5 0x5560f8698b21 <unknown>
#6 0x5560f868b421 <unknown>
#7 0x5560f86b8622 <unknown>
#8 0x5560f868aba7 <unknown>
#9 0x5560f86b878e <unknown>
#10 0x5560f86d130f <unknown>
#11 0x5560f86b8443 <unknown>
#12 0x5560f86893c5 <unknown>
#13 0x5560f868a531 <unknown>
#14 0x5560f88e7dce <unknown>
#15 0x5560f88eb192 <unknown>
#16 0x5560f88cc93e <unknown>
#17 0x5560f88ec103 <unknown>
#18 0x5560f88bfd85 <unknown>
#19 0x5560f890d0a8 <unknown>
#20 0x5560f890d239 <unknown>
#21 0x5560f8928492 <unknown>
#22 0x7f895691d609 start_thread

