12/21/2022 01:28:08 PM script INFO: Prepared chrome options..
12/21/2022 01:28:09 PM script INFO: Initialized chrome browser..
12/21/2022 01:28:09 PM script INFO: mengakses-homepage
12/21/2022 01:28:35 PM script INFO: mengakses-login-page
12/21/2022 01:28:57 PM script INFO: mengakses-site-home
12/21/2022 01:29:01 PM script INFO: mengakses-site-course
12/21/2022 01:29:30 PM script INFO: mengakses-quiz
12/21/2022 01:29:32 PM script INFO: mengakses-start-quiz-page
12/21/2022 01:29:34 PM script INFO: memulai-quiz
12/21/2022 01:29:34 PM script INFO: SUCCESS!@#KODE 1!@#USER_ID 46!@#ACTIVITY_CODE 5
12/21/2022 01:29:44 PM script INFO: SUCCESS!@#KODE 1!@#USER_ID 46!@#ACTIVITY_CODE 5
12/21/2022 01:29:44 PM script INFO: SUCCESS!@#KODE 1!@#USER_ID 46!@#ACTIVITY_CODE 5
12/21/2022 01:29:47 PM script INFO: SUCCESS!@#KODE 1!@#USER_ID 46!@#ACTIVITY_CODE 2
12/21/2022 01:29:47 PM script INFO: SUCCESS!@#KODE 1!@#USER_ID 46!@#ACTIVITY_CODE 5
12/21/2022 01:29:47 PM script INFO: SUCCESS!@#KODE 1!@#USER_ID 46!@#ACTIVITY_CODE 5
12/21/2022 01:29:50 PM script INFO: SUCCESS!@#KODE 1!@#USER_ID 46!@#ACTIVITY_CODE 2
12/21/2022 01:29:50 PM script INFO: SUCCESS!@#KODE 1!@#USER_ID 46!@#ACTIVITY_CODE 2
12/21/2022 01:29:50 PM script INFO: SUCCESS!@#KODE 1!@#USER_ID 46!@#ACTIVITY_CODE 3
12/21/2022 01:29:50 PM script INFO: SUCCESS!@#KODE 1!@#USER_ID 46!@#ACTIVITY_CODE 5
12/21/2022 01:29:50 PM script INFO: SUCCESS!@#KODE 1!@#USER_ID 46!@#ACTIVITY_CODE 5
12/21/2022 01:29:53 PM script INFO: SUCCESS!@#KODE 1!@#USER_ID 46!@#ACTIVITY_CODE 5
12/21/2022 01:29:53 PM script INFO: SUCCESS!@#KODE 1!@#USER_ID 46!@#ACTIVITY_CODE 5
12/21/2022 01:29:55 PM script INFO: SUCCESS!@#KODE 1!@#USER_ID 46!@#ACTIVITY_CODE 2
12/21/2022 01:29:55 PM script INFO: SUCCESS!@#KODE 1!@#USER_ID 46!@#ACTIVITY_CODE 5
12/21/2022 01:29:55 PM script INFO: SUCCESS!@#KODE 1!@#USER_ID 46!@#ACTIVITY_CODE 5
12/21/2022 01:29:58 PM script INFO: SUCCESS!@#KODE 1!@#USER_ID 46!@#ACTIVITY_CODE 2
12/21/2022 01:29:58 PM script INFO: SUCCESS!@#KODE 1!@#USER_ID 46!@#ACTIVITY_CODE 5
12/21/2022 01:29:58 PM script INFO: SUCCESS!@#KODE 1!@#USER_ID 46!@#ACTIVITY_CODE 5
12/21/2022 01:30:01 PM script INFO: SUCCESS!@#KODE 1!@#USER_ID 46!@#ACTIVITY_CODE 2
12/21/2022 01:30:01 PM script INFO: SUCCESS!@#KODE 1!@#USER_ID 46!@#ACTIVITY_CODE 3
12/21/2022 01:30:01 PM script INFO: SUCCESS!@#KODE 1!@#USER_ID 46!@#ACTIVITY_CODE 1
12/21/2022 01:30:01 PM script INFO: SUCCESS!@#KODE 1!@#USER_ID 46!@#ACTIVITY_CODE 1
12/21/2022 01:30:01 PM script INFO: SUCCESS!@#KODE 1!@#USER_ID 46!@#ACTIVITY_CODE 3
12/21/2022 01:30:01 PM script INFO: SUCCESS!@#KODE 1!@#USER_ID 46!@#ACTIVITY_CODE 1
12/21/2022 01:30:01 PM script INFO: SUCCESS!@#KODE 1!@#USER_ID 46!@#ACTIVITY_CODE 3
12/21/2022 01:30:01 PM script INFO: SUCCESS!@#KODE 1!@#USER_ID 46!@#ACTIVITY_CODE 2
12/21/2022 01:30:01 PM script INFO: SUCCESS!@#KODE 1!@#USER_ID 46!@#ACTIVITY_CODE 2
12/21/2022 01:30:02 PM script INFO: SUCCESS!@#KODE 1!@#USER_ID 46!@#ACTIVITY_CODE 3
12/21/2022 01:30:02 PM script INFO: SUCCESS!@#KODE 1!@#USER_ID 46!@#ACTIVITY_CODE 2
12/21/2022 01:30:02 PM script INFO: SUCCESS!@#KODE 1!@#USER_ID 46!@#ACTIVITY_CODE 2
12/21/2022 01:30:02 PM script INFO: SUCCESS!@#KODE 1!@#USER_ID 46!@#ACTIVITY_CODE 3
12/21/2022 01:30:02 PM script INFO: SUCCESS!@#KODE 1!@#USER_ID 46!@#ACTIVITY_CODE 2
12/21/2022 01:30:02 PM script INFO: SUCCESS!@#KODE 1!@#USER_ID 46!@#ACTIVITY_CODE 2
12/21/2022 01:30:03 PM script INFO: SUCCESS!@#KODE 1!@#USER_ID 46!@#ACTIVITY_CODE 2
12/21/2022 01:30:03 PM script INFO: SUCCESS!@#KODE 1!@#USER_ID 46!@#ACTIVITY_CODE 3
12/21/2022 01:30:03 PM script INFO: SUCCESS!@#KODE 1!@#USER_ID 46!@#ACTIVITY_CODE 2
12/21/2022 01:30:03 PM script INFO: SUCCESS!@#KODE 1!@#USER_ID 46!@#ACTIVITY_CODE 3
12/21/2022 01:30:03 PM script INFO: SUCCESS!@#KODE 1!@#USER_ID 46!@#ACTIVITY_CODE 1
12/21/2022 01:30:03 PM script INFO: SUCCESS!@#KODE 1!@#USER_ID 46!@#ACTIVITY_CODE 2
12/21/2022 01:30:03 PM script INFO: SUCCESS!@#KODE 1!@#USER_ID 46!@#ACTIVITY_CODE 3
12/21/2022 01:30:03 PM script INFO: SUCCESS!@#KODE 1!@#USER_ID 46!@#ACTIVITY_CODE 3
12/21/2022 01:30:03 PM script INFO: SUCCESS!@#KODE 1!@#USER_ID 46!@#ACTIVITY_CODE 3
12/21/2022 01:30:03 PM script INFO: SUCCESS!@#KODE 1!@#USER_ID 46!@#ACTIVITY_CODE 3
12/21/2022 01:30:03 PM script INFO: SUCCESS!@#KODE 1!@#USER_ID 46!@#ACTIVITY_CODE 3
12/21/2022 01:30:03 PM script INFO: SUCCESS!@#KODE 1!@#USER_ID 46!@#ACTIVITY_CODE 1
12/21/2022 01:30:04 PM script INFO: SUCCESS!@#KODE 1!@#USER_ID 46!@#ACTIVITY_CODE 3
12/21/2022 01:30:04 PM script INFO: SUCCESS!@#KODE 1!@#USER_ID 46!@#ACTIVITY_CODE 4
12/21/2022 01:30:04 PM script INFO: SUCCESS!@#KODE 1!@#USER_ID 46!@#ACTIVITY_CODE 2
12/21/2022 01:30:04 PM script INFO: Duration: 19.299635648727417
12/21/2022 01:30:04 PM script INFO: mengakhiri-quiz
12/21/2022 01:30:07 PM script INFO: SUCCESS!@#KODE 1!@#USER_ID 46!@#ACTIVITY_CODE 5
12/21/2022 01:30:07 PM script INFO: berhasil-submit
12/21/2022 01:31:37 PM script ERROR: TIMEOUT EXCEPTION!@#KODE 0!@#LOCATION berhasil-submit
12/21/2022 01:31:37 PM main_worker ERROR: Message: None

