12/23/2022 01:17:54 AM script INFO: Prepared chrome options..
12/23/2022 01:17:56 AM script INFO: Initialized chrome browser..
12/23/2022 01:17:56 AM script INFO: mengakses-homepage
12/23/2022 01:19:20 AM script INFO: mengakses-login-page
12/23/2022 01:19:53 AM script INFO: mengakses-site-home
12/23/2022 01:20:05 AM script INFO: mengakses-site-course
12/23/2022 01:20:36 AM script INFO: mengakses-quiz
12/23/2022 01:20:46 AM script INFO: mengakses-start-quiz-page
12/23/2022 01:20:55 AM script INFO: memulai-quiz
12/23/2022 01:20:55 AM script INFO: SUCCESS!@#KODE 1!@#USER_ID 93!@#ACTIVITY_CODE 5
12/23/2022 01:25:55 AM main_worker ERROR: Message: mengakses-quiz

