12/23/2022 07:30:31 AM script INFO: Prepared chrome options..
12/23/2022 07:30:32 AM script INFO: Initialized chrome browser..
12/23/2022 07:30:32 AM script INFO: mengakses-homepage
12/23/2022 07:31:21 AM script INFO: mengakses-login-page
12/23/2022 07:31:22 AM script INFO: mengakses-site-home
12/23/2022 07:31:39 AM script INFO: mengakses-site-course
12/23/2022 07:31:58 AM script INFO: mengakses-quiz
12/23/2022 07:32:41 AM script INFO: mengakses-start-quiz-page
12/23/2022 07:33:39 AM script INFO: memulai-quiz
12/23/2022 07:33:39 AM script INFO: SUCCESS!@#KODE 1!@#USER_ID 97!@#ACTIVITY_CODE 5
12/23/2022 07:33:49 AM script INFO: SUCCESS!@#KODE 1!@#USER_ID 97!@#ACTIVITY_CODE 5
12/23/2022 07:33:49 AM script INFO: SUCCESS!@#KODE 1!@#USER_ID 97!@#ACTIVITY_CODE 5
12/23/2022 07:33:52 AM script INFO: SUCCESS!@#KODE 1!@#USER_ID 97!@#ACTIVITY_CODE 5
12/23/2022 07:33:52 AM script INFO: SUCCESS!@#KODE 1!@#USER_ID 97!@#ACTIVITY_CODE 5
12/23/2022 07:33:54 AM script INFO: SUCCESS!@#KODE 1!@#USER_ID 97!@#ACTIVITY_CODE 1
12/23/2022 07:33:55 AM script INFO: SUCCESS!@#KODE 1!@#USER_ID 97!@#ACTIVITY_CODE 2
12/23/2022 07:33:55 AM script INFO: SUCCESS!@#KODE 1!@#USER_ID 97!@#ACTIVITY_CODE 1
12/23/2022 07:33:55 AM script INFO: SUCCESS!@#KODE 1!@#USER_ID 97!@#ACTIVITY_CODE 4
12/23/2022 07:33:55 AM script INFO: SUCCESS!@#KODE 1!@#USER_ID 97!@#ACTIVITY_CODE 5
12/23/2022 07:33:55 AM script INFO: SUCCESS!@#KODE 1!@#USER_ID 97!@#ACTIVITY_CODE 5
12/23/2022 07:33:57 AM script INFO: SUCCESS!@#KODE 1!@#USER_ID 97!@#ACTIVITY_CODE 1
12/23/2022 07:33:57 AM script INFO: SUCCESS!@#KODE 1!@#USER_ID 97!@#ACTIVITY_CODE 5
12/23/2022 07:33:57 AM script INFO: SUCCESS!@#KODE 1!@#USER_ID 97!@#ACTIVITY_CODE 5
12/23/2022 07:34:00 AM script INFO: SUCCESS!@#KODE 1!@#USER_ID 97!@#ACTIVITY_CODE 4
12/23/2022 07:34:00 AM script INFO: SUCCESS!@#KODE 1!@#USER_ID 97!@#ACTIVITY_CODE 1
12/23/2022 07:34:00 AM script INFO: SUCCESS!@#KODE 1!@#USER_ID 97!@#ACTIVITY_CODE 3
12/23/2022 07:34:00 AM script INFO: SUCCESS!@#KODE 1!@#USER_ID 97!@#ACTIVITY_CODE 5
12/23/2022 07:34:00 AM script INFO: SUCCESS!@#KODE 1!@#USER_ID 97!@#ACTIVITY_CODE 5
12/23/2022 07:34:02 AM script INFO: SUCCESS!@#KODE 1!@#USER_ID 97!@#ACTIVITY_CODE 3
12/23/2022 07:34:03 AM script INFO: SUCCESS!@#KODE 1!@#USER_ID 97!@#ACTIVITY_CODE 2
12/23/2022 07:34:03 AM script INFO: SUCCESS!@#KODE 1!@#USER_ID 97!@#ACTIVITY_CODE 1
12/23/2022 07:34:03 AM script INFO: SUCCESS!@#KODE 1!@#USER_ID 97!@#ACTIVITY_CODE 5
12/23/2022 07:34:03 AM script INFO: SUCCESS!@#KODE 1!@#USER_ID 97!@#ACTIVITY_CODE 5
12/23/2022 07:34:05 AM script INFO: SUCCESS!@#KODE 1!@#USER_ID 97!@#ACTIVITY_CODE 3
12/23/2022 07:34:05 AM script INFO: SUCCESS!@#KODE 1!@#USER_ID 97!@#ACTIVITY_CODE 1
12/23/2022 07:34:05 AM script INFO: SUCCESS!@#KODE 1!@#USER_ID 97!@#ACTIVITY_CODE 4
12/23/2022 07:34:05 AM script INFO: SUCCESS!@#KODE 1!@#USER_ID 97!@#ACTIVITY_CODE 3
12/23/2022 07:34:05 AM script INFO: SUCCESS!@#KODE 1!@#USER_ID 97!@#ACTIVITY_CODE 3
12/23/2022 07:34:06 AM script INFO: SUCCESS!@#KODE 1!@#USER_ID 97!@#ACTIVITY_CODE 2
12/23/2022 07:34:06 AM script INFO: SUCCESS!@#KODE 1!@#USER_ID 97!@#ACTIVITY_CODE 5
12/23/2022 07:34:06 AM script INFO: SUCCESS!@#KODE 1!@#USER_ID 97!@#ACTIVITY_CODE 5
12/23/2022 07:34:08 AM script INFO: SUCCESS!@#KODE 1!@#USER_ID 97!@#ACTIVITY_CODE 5
12/23/2022 07:34:08 AM script INFO: SUCCESS!@#KODE 1!@#USER_ID 97!@#ACTIVITY_CODE 5
12/23/2022 07:34:11 AM script INFO: SUCCESS!@#KODE 1!@#USER_ID 97!@#ACTIVITY_CODE 5
12/23/2022 07:34:11 AM script INFO: SUCCESS!@#KODE 1!@#USER_ID 97!@#ACTIVITY_CODE 5
12/23/2022 07:34:13 AM script INFO: SUCCESS!@#KODE 1!@#USER_ID 97!@#ACTIVITY_CODE 1
12/23/2022 07:34:13 AM script INFO: SUCCESS!@#KODE 1!@#USER_ID 97!@#ACTIVITY_CODE 1
12/23/2022 07:34:13 AM script INFO: SUCCESS!@#KODE 1!@#USER_ID 97!@#ACTIVITY_CODE 5
12/23/2022 07:34:13 AM script INFO: SUCCESS!@#KODE 1!@#USER_ID 97!@#ACTIVITY_CODE 5
12/23/2022 07:34:16 AM script INFO: SUCCESS!@#KODE 1!@#USER_ID 97!@#ACTIVITY_CODE 5
12/23/2022 07:34:16 AM script INFO: SUCCESS!@#KODE 1!@#USER_ID 97!@#ACTIVITY_CODE 5
12/23/2022 07:34:18 AM script INFO: SUCCESS!@#KODE 1!@#USER_ID 97!@#ACTIVITY_CODE 3
12/23/2022 07:34:18 AM script INFO: SUCCESS!@#KODE 1!@#USER_ID 97!@#ACTIVITY_CODE 3
12/23/2022 07:34:18 AM script INFO: SUCCESS!@#KODE 1!@#USER_ID 97!@#ACTIVITY_CODE 2
12/23/2022 07:34:18 AM script INFO: SUCCESS!@#KODE 1!@#USER_ID 97!@#ACTIVITY_CODE 1
12/23/2022 07:34:19 AM script INFO: SUCCESS!@#KODE 1!@#USER_ID 97!@#ACTIVITY_CODE 2
12/23/2022 07:34:19 AM script INFO: SUCCESS!@#KODE 1!@#USER_ID 97!@#ACTIVITY_CODE 1
12/23/2022 07:34:19 AM script INFO: SUCCESS!@#KODE 1!@#USER_ID 97!@#ACTIVITY_CODE 3
12/23/2022 07:34:19 AM script INFO: SUCCESS!@#KODE 1!@#USER_ID 97!@#ACTIVITY_CODE 5
12/23/2022 07:34:19 AM script INFO: SUCCESS!@#KODE 1!@#USER_ID 97!@#ACTIVITY_CODE 5
12/23/2022 07:34:21 AM script INFO: SUCCESS!@#KODE 1!@#USER_ID 97!@#ACTIVITY_CODE 5
12/23/2022 07:34:21 AM script INFO: SUCCESS!@#KODE 1!@#USER_ID 97!@#ACTIVITY_CODE 5
12/23/2022 07:34:24 AM script INFO: SUCCESS!@#KODE 1!@#USER_ID 97!@#ACTIVITY_CODE 1
12/23/2022 07:34:24 AM script INFO: SUCCESS!@#KODE 1!@#USER_ID 97!@#ACTIVITY_CODE 5
12/23/2022 07:34:24 AM script INFO: SUCCESS!@#KODE 1!@#USER_ID 97!@#ACTIVITY_CODE 5
12/23/2022 07:34:26 AM script INFO: SUCCESS!@#KODE 1!@#USER_ID 97!@#ACTIVITY_CODE 5
12/23/2022 07:34:26 AM script INFO: SUCCESS!@#KODE 1!@#USER_ID 97!@#ACTIVITY_CODE 5
12/23/2022 07:34:29 AM script INFO: SUCCESS!@#KODE 1!@#USER_ID 97!@#ACTIVITY_CODE 3
12/23/2022 07:34:29 AM script INFO: SUCCESS!@#KODE 1!@#USER_ID 97!@#ACTIVITY_CODE 1
12/23/2022 07:34:29 AM script INFO: SUCCESS!@#KODE 1!@#USER_ID 97!@#ACTIVITY_CODE 2
12/23/2022 07:34:29 AM script INFO: SUCCESS!@#KODE 1!@#USER_ID 97!@#ACTIVITY_CODE 5
12/23/2022 07:34:29 AM script INFO: SUCCESS!@#KODE 1!@#USER_ID 97!@#ACTIVITY_CODE 5
12/23/2022 07:34:32 AM script INFO: SUCCESS!@#KODE 1!@#USER_ID 97!@#ACTIVITY_CODE 2
12/23/2022 07:34:32 AM script INFO: SUCCESS!@#KODE 1!@#USER_ID 97!@#ACTIVITY_CODE 5
12/23/2022 07:34:32 AM script INFO: SUCCESS!@#KODE 1!@#USER_ID 97!@#ACTIVITY_CODE 5
12/23/2022 07:34:34 AM script INFO: SUCCESS!@#KODE 1!@#USER_ID 97!@#ACTIVITY_CODE 5
12/23/2022 07:34:34 AM script INFO: SUCCESS!@#KODE 1!@#USER_ID 97!@#ACTIVITY_CODE 5
12/23/2022 07:34:37 AM script INFO: SUCCESS!@#KODE 1!@#USER_ID 97!@#ACTIVITY_CODE 4
12/23/2022 07:34:37 AM script INFO: SUCCESS!@#KODE 1!@#USER_ID 97!@#ACTIVITY_CODE 1
12/23/2022 07:34:37 AM script INFO: SUCCESS!@#KODE 1!@#USER_ID 97!@#ACTIVITY_CODE 5
12/23/2022 07:34:37 AM script INFO: SUCCESS!@#KODE 1!@#USER_ID 97!@#ACTIVITY_CODE 5
12/23/2022 07:34:39 AM script INFO: SUCCESS!@#KODE 1!@#USER_ID 97!@#ACTIVITY_CODE 4
12/23/2022 07:34:39 AM script INFO: SUCCESS!@#KODE 1!@#USER_ID 97!@#ACTIVITY_CODE 5
12/23/2022 07:34:39 AM script INFO: SUCCESS!@#KODE 1!@#USER_ID 97!@#ACTIVITY_CODE 5
12/23/2022 07:34:42 AM script INFO: SUCCESS!@#KODE 1!@#USER_ID 97!@#ACTIVITY_CODE 2
12/23/2022 07:34:42 AM script INFO: SUCCESS!@#KODE 1!@#USER_ID 97!@#ACTIVITY_CODE 1
12/23/2022 07:34:42 AM script INFO: SUCCESS!@#KODE 1!@#USER_ID 97!@#ACTIVITY_CODE 4
12/23/2022 07:34:42 AM script INFO: SUCCESS!@#KODE 1!@#USER_ID 97!@#ACTIVITY_CODE 5
12/23/2022 07:34:42 AM script INFO: SUCCESS!@#KODE 1!@#USER_ID 97!@#ACTIVITY_CODE 5
12/23/2022 07:34:45 AM script INFO: SUCCESS!@#KODE 1!@#USER_ID 97!@#ACTIVITY_CODE 3
12/23/2022 07:34:45 AM script INFO: SUCCESS!@#KODE 1!@#USER_ID 97!@#ACTIVITY_CODE 1
12/23/2022 07:34:45 AM script INFO: SUCCESS!@#KODE 1!@#USER_ID 97!@#ACTIVITY_CODE 2
12/23/2022 07:34:45 AM script INFO: SUCCESS!@#KODE 1!@#USER_ID 97!@#ACTIVITY_CODE 1
12/23/2022 07:34:45 AM script INFO: SUCCESS!@#KODE 1!@#USER_ID 97!@#ACTIVITY_CODE 3
12/23/2022 07:34:45 AM script INFO: SUCCESS!@#KODE 1!@#USER_ID 97!@#ACTIVITY_CODE 1
12/23/2022 07:34:45 AM script INFO: SUCCESS!@#KODE 1!@#USER_ID 97!@#ACTIVITY_CODE 1
12/23/2022 07:34:45 AM script INFO: SUCCESS!@#KODE 1!@#USER_ID 97!@#ACTIVITY_CODE 3
12/23/2022 07:34:45 AM script INFO: SUCCESS!@#KODE 1!@#USER_ID 97!@#ACTIVITY_CODE 2
12/23/2022 07:34:45 AM script INFO: SUCCESS!@#KODE 1!@#USER_ID 97!@#ACTIVITY_CODE 3
12/23/2022 07:34:45 AM script INFO: SUCCESS!@#KODE 1!@#USER_ID 97!@#ACTIVITY_CODE 1
12/23/2022 07:34:45 AM script INFO: SUCCESS!@#KODE 1!@#USER_ID 97!@#ACTIVITY_CODE 3
12/23/2022 07:34:45 AM script INFO: SUCCESS!@#KODE 1!@#USER_ID 97!@#ACTIVITY_CODE 3
12/23/2022 07:34:45 AM script INFO: SUCCESS!@#KODE 1!@#USER_ID 97!@#ACTIVITY_CODE 4
12/23/2022 07:34:45 AM script INFO: SUCCESS!@#KODE 1!@#USER_ID 97!@#ACTIVITY_CODE 1
12/23/2022 07:34:45 AM script INFO: SUCCESS!@#KODE 1!@#USER_ID 97!@#ACTIVITY_CODE 3
12/23/2022 07:34:45 AM script INFO: SUCCESS!@#KODE 1!@#USER_ID 97!@#ACTIVITY_CODE 2
12/23/2022 07:34:45 AM script INFO: SUCCESS!@#KODE 1!@#USER_ID 97!@#ACTIVITY_CODE 3
12/23/2022 07:34:46 AM script INFO: SUCCESS!@#KODE 1!@#USER_ID 97!@#ACTIVITY_CODE 3
12/23/2022 07:34:46 AM script INFO: SUCCESS!@#KODE 1!@#USER_ID 97!@#ACTIVITY_CODE 1
12/23/2022 07:34:46 AM script INFO: SUCCESS!@#KODE 1!@#USER_ID 97!@#ACTIVITY_CODE 4
12/23/2022 07:34:46 AM script INFO: SUCCESS!@#KODE 1!@#USER_ID 97!@#ACTIVITY_CODE 3
12/23/2022 07:34:46 AM script INFO: SUCCESS!@#KODE 1!@#USER_ID 97!@#ACTIVITY_CODE 1
12/23/2022 07:34:46 AM script INFO: SUCCESS!@#KODE 1!@#USER_ID 97!@#ACTIVITY_CODE 1
12/23/2022 07:34:46 AM script INFO: SUCCESS!@#KODE 1!@#USER_ID 97!@#ACTIVITY_CODE 2
12/23/2022 07:34:46 AM script INFO: SUCCESS!@#KODE 1!@#USER_ID 97!@#ACTIVITY_CODE 3
12/23/2022 07:34:46 AM script INFO: SUCCESS!@#KODE 1!@#USER_ID 97!@#ACTIVITY_CODE 2
12/23/2022 07:34:46 AM script INFO: SUCCESS!@#KODE 1!@#USER_ID 97!@#ACTIVITY_CODE 1
12/23/2022 07:34:46 AM script INFO: SUCCESS!@#KODE 1!@#USER_ID 97!@#ACTIVITY_CODE 4
12/23/2022 07:34:46 AM script INFO: SUCCESS!@#KODE 1!@#USER_ID 97!@#ACTIVITY_CODE 2
12/23/2022 07:34:46 AM script INFO: SUCCESS!@#KODE 1!@#USER_ID 97!@#ACTIVITY_CODE 3
12/23/2022 07:34:46 AM script INFO: SUCCESS!@#KODE 1!@#USER_ID 97!@#ACTIVITY_CODE 2
12/23/2022 07:34:46 AM script INFO: SUCCESS!@#KODE 1!@#USER_ID 97!@#ACTIVITY_CODE 1
12/23/2022 07:34:46 AM script INFO: SUCCESS!@#KODE 1!@#USER_ID 97!@#ACTIVITY_CODE 4
12/23/2022 07:34:47 AM script INFO: SUCCESS!@#KODE 1!@#USER_ID 97!@#ACTIVITY_CODE 2
12/23/2022 07:34:47 AM script INFO: SUCCESS!@#KODE 1!@#USER_ID 97!@#ACTIVITY_CODE 4
12/23/2022 07:34:47 AM script INFO: SUCCESS!@#KODE 1!@#USER_ID 97!@#ACTIVITY_CODE 3
12/23/2022 07:34:47 AM script INFO: SUCCESS!@#KODE 1!@#USER_ID 97!@#ACTIVITY_CODE 2
12/23/2022 07:34:47 AM script INFO: SUCCESS!@#KODE 1!@#USER_ID 97!@#ACTIVITY_CODE 2
12/23/2022 07:34:47 AM script INFO: SUCCESS!@#KODE 1!@#USER_ID 97!@#ACTIVITY_CODE 3
12/23/2022 07:34:47 AM script INFO: SUCCESS!@#KODE 1!@#USER_ID 97!@#ACTIVITY_CODE 3
12/23/2022 07:34:47 AM script INFO: SUCCESS!@#KODE 1!@#USER_ID 97!@#ACTIVITY_CODE 1
12/23/2022 07:34:47 AM script INFO: SUCCESS!@#KODE 1!@#USER_ID 97!@#ACTIVITY_CODE 4
12/23/2022 07:34:47 AM script INFO: SUCCESS!@#KODE 1!@#USER_ID 97!@#ACTIVITY_CODE 2
12/23/2022 07:34:47 AM script INFO: SUCCESS!@#KODE 1!@#USER_ID 97!@#ACTIVITY_CODE 1
12/23/2022 07:34:47 AM script INFO: SUCCESS!@#KODE 1!@#USER_ID 97!@#ACTIVITY_CODE 3
12/23/2022 07:34:47 AM script INFO: SUCCESS!@#KODE 1!@#USER_ID 97!@#ACTIVITY_CODE 2
12/23/2022 07:34:47 AM script INFO: SUCCESS!@#KODE 1!@#USER_ID 97!@#ACTIVITY_CODE 1
12/23/2022 07:34:47 AM script INFO: SUCCESS!@#KODE 1!@#USER_ID 97!@#ACTIVITY_CODE 3
12/23/2022 07:34:47 AM script INFO: SUCCESS!@#KODE 1!@#USER_ID 97!@#ACTIVITY_CODE 1
12/23/2022 07:34:47 AM script INFO: SUCCESS!@#KODE 1!@#USER_ID 97!@#ACTIVITY_CODE 1
12/23/2022 07:34:47 AM script INFO: SUCCESS!@#KODE 1!@#USER_ID 97!@#ACTIVITY_CODE 1
12/23/2022 07:34:48 AM script INFO: SUCCESS!@#KODE 1!@#USER_ID 97!@#ACTIVITY_CODE 3
12/23/2022 07:34:48 AM script INFO: SUCCESS!@#KODE 1!@#USER_ID 97!@#ACTIVITY_CODE 3
12/23/2022 07:34:48 AM script INFO: SUCCESS!@#KODE 1!@#USER_ID 97!@#ACTIVITY_CODE 2
12/23/2022 07:34:48 AM script INFO: SUCCESS!@#KODE 1!@#USER_ID 97!@#ACTIVITY_CODE 4
12/23/2022 07:34:48 AM script INFO: SUCCESS!@#KODE 1!@#USER_ID 97!@#ACTIVITY_CODE 2
12/23/2022 07:34:48 AM script INFO: SUCCESS!@#KODE 1!@#USER_ID 97!@#ACTIVITY_CODE 2
12/23/2022 07:34:48 AM script INFO: SUCCESS!@#KODE 1!@#USER_ID 97!@#ACTIVITY_CODE 3
12/23/2022 07:34:48 AM script INFO: SUCCESS!@#KODE 1!@#USER_ID 97!@#ACTIVITY_CODE 3
12/23/2022 07:34:48 AM script INFO: SUCCESS!@#KODE 1!@#USER_ID 97!@#ACTIVITY_CODE 3
12/23/2022 07:34:48 AM script INFO: SUCCESS!@#KODE 1!@#USER_ID 97!@#ACTIVITY_CODE 1
12/23/2022 07:34:48 AM script INFO: SUCCESS!@#KODE 1!@#USER_ID 97!@#ACTIVITY_CODE 1
12/23/2022 07:34:48 AM script INFO: SUCCESS!@#KODE 1!@#USER_ID 97!@#ACTIVITY_CODE 4
12/23/2022 07:34:48 AM script INFO: SUCCESS!@#KODE 1!@#USER_ID 97!@#ACTIVITY_CODE 2
12/23/2022 07:34:48 AM script INFO: SUCCESS!@#KODE 1!@#USER_ID 97!@#ACTIVITY_CODE 3
12/23/2022 07:34:48 AM script INFO: SUCCESS!@#KODE 1!@#USER_ID 97!@#ACTIVITY_CODE 2
12/23/2022 07:34:49 AM script INFO: SUCCESS!@#KODE 1!@#USER_ID 97!@#ACTIVITY_CODE 2
12/23/2022 07:34:49 AM script INFO: SUCCESS!@#KODE 1!@#USER_ID 97!@#ACTIVITY_CODE 3
12/23/2022 07:34:49 AM script INFO: SUCCESS!@#KODE 1!@#USER_ID 97!@#ACTIVITY_CODE 1
12/23/2022 07:34:49 AM script INFO: SUCCESS!@#KODE 1!@#USER_ID 97!@#ACTIVITY_CODE 4
12/23/2022 07:34:49 AM script INFO: SUCCESS!@#KODE 1!@#USER_ID 97!@#ACTIVITY_CODE 3
12/23/2022 07:34:49 AM script INFO: SUCCESS!@#KODE 1!@#USER_ID 97!@#ACTIVITY_CODE 3
12/23/2022 07:34:49 AM script INFO: SUCCESS!@#KODE 1!@#USER_ID 97!@#ACTIVITY_CODE 3
12/23/2022 07:34:49 AM script INFO: SUCCESS!@#KODE 1!@#USER_ID 97!@#ACTIVITY_CODE 1
12/23/2022 07:34:49 AM script INFO: SUCCESS!@#KODE 1!@#USER_ID 97!@#ACTIVITY_CODE 1
12/23/2022 07:34:49 AM script INFO: SUCCESS!@#KODE 1!@#USER_ID 97!@#ACTIVITY_CODE 2
12/23/2022 07:34:49 AM script INFO: SUCCESS!@#KODE 1!@#USER_ID 97!@#ACTIVITY_CODE 3
12/23/2022 07:34:49 AM script INFO: SUCCESS!@#KODE 1!@#USER_ID 97!@#ACTIVITY_CODE 3
12/23/2022 07:34:49 AM script INFO: SUCCESS!@#KODE 1!@#USER_ID 97!@#ACTIVITY_CODE 2
12/23/2022 07:34:49 AM script INFO: SUCCESS!@#KODE 1!@#USER_ID 97!@#ACTIVITY_CODE 1
12/23/2022 07:34:49 AM script INFO: SUCCESS!@#KODE 1!@#USER_ID 97!@#ACTIVITY_CODE 3
12/23/2022 07:34:49 AM script INFO: SUCCESS!@#KODE 1!@#USER_ID 97!@#ACTIVITY_CODE 4
12/23/2022 07:34:49 AM script INFO: SUCCESS!@#KODE 1!@#USER_ID 97!@#ACTIVITY_CODE 3
12/23/2022 07:34:49 AM script INFO: SUCCESS!@#KODE 1!@#USER_ID 97!@#ACTIVITY_CODE 3
12/23/2022 07:34:49 AM script INFO: SUCCESS!@#KODE 1!@#USER_ID 97!@#ACTIVITY_CODE 1
12/23/2022 07:34:49 AM script INFO: SUCCESS!@#KODE 1!@#USER_ID 97!@#ACTIVITY_CODE 4
12/23/2022 07:34:50 AM script INFO: SUCCESS!@#KODE 1!@#USER_ID 97!@#ACTIVITY_CODE 2
12/23/2022 07:34:50 AM script INFO: SUCCESS!@#KODE 1!@#USER_ID 97!@#ACTIVITY_CODE 1
12/23/2022 07:34:50 AM script INFO: SUCCESS!@#KODE 1!@#USER_ID 97!@#ACTIVITY_CODE 1
12/23/2022 07:34:50 AM script INFO: SUCCESS!@#KODE 1!@#USER_ID 97!@#ACTIVITY_CODE 2
12/23/2022 07:34:50 AM script INFO: SUCCESS!@#KODE 1!@#USER_ID 97!@#ACTIVITY_CODE 2
12/23/2022 07:34:50 AM script INFO: SUCCESS!@#KODE 1!@#USER_ID 97!@#ACTIVITY_CODE 3
12/23/2022 07:34:50 AM script INFO: SUCCESS!@#KODE 1!@#USER_ID 97!@#ACTIVITY_CODE 3
12/23/2022 07:34:50 AM script INFO: SUCCESS!@#KODE 1!@#USER_ID 97!@#ACTIVITY_CODE 2
12/23/2022 07:34:50 AM script INFO: SUCCESS!@#KODE 1!@#USER_ID 97!@#ACTIVITY_CODE 4
12/23/2022 07:34:50 AM script INFO: SUCCESS!@#KODE 1!@#USER_ID 97!@#ACTIVITY_CODE 3
12/23/2022 07:34:50 AM script INFO: SUCCESS!@#KODE 1!@#USER_ID 97!@#ACTIVITY_CODE 3
12/23/2022 07:34:50 AM script INFO: SUCCESS!@#KODE 1!@#USER_ID 97!@#ACTIVITY_CODE 2
12/23/2022 07:34:50 AM script INFO: SUCCESS!@#KODE 1!@#USER_ID 97!@#ACTIVITY_CODE 2
12/23/2022 07:34:50 AM script INFO: SUCCESS!@#KODE 1!@#USER_ID 97!@#ACTIVITY_CODE 2
12/23/2022 07:34:50 AM script INFO: SUCCESS!@#KODE 1!@#USER_ID 97!@#ACTIVITY_CODE 3
12/23/2022 07:34:51 AM script INFO: SUCCESS!@#KODE 1!@#USER_ID 97!@#ACTIVITY_CODE 2
12/23/2022 07:34:51 AM script INFO: SUCCESS!@#KODE 1!@#USER_ID 97!@#ACTIVITY_CODE 1
12/23/2022 07:34:51 AM script INFO: SUCCESS!@#KODE 1!@#USER_ID 97!@#ACTIVITY_CODE 3
12/23/2022 07:34:51 AM script INFO: SUCCESS!@#KODE 1!@#USER_ID 97!@#ACTIVITY_CODE 1
12/23/2022 07:34:51 AM script INFO: SUCCESS!@#KODE 1!@#USER_ID 97!@#ACTIVITY_CODE 3
12/23/2022 07:34:51 AM script INFO: SUCCESS!@#KODE 1!@#USER_ID 97!@#ACTIVITY_CODE 2
12/23/2022 07:34:51 AM script INFO: SUCCESS!@#KODE 1!@#USER_ID 97!@#ACTIVITY_CODE 3
12/23/2022 07:34:51 AM script INFO: SUCCESS!@#KODE 1!@#USER_ID 97!@#ACTIVITY_CODE 1
12/23/2022 07:34:51 AM script INFO: SUCCESS!@#KODE 1!@#USER_ID 97!@#ACTIVITY_CODE 1
12/23/2022 07:34:51 AM script INFO: SUCCESS!@#KODE 1!@#USER_ID 97!@#ACTIVITY_CODE 1
12/23/2022 07:34:51 AM script INFO: SUCCESS!@#KODE 1!@#USER_ID 97!@#ACTIVITY_CODE 1
12/23/2022 07:34:51 AM script INFO: SUCCESS!@#KODE 1!@#USER_ID 97!@#ACTIVITY_CODE 1
12/23/2022 07:34:51 AM script INFO: SUCCESS!@#KODE 1!@#USER_ID 97!@#ACTIVITY_CODE 3
12/23/2022 07:34:51 AM script INFO: SUCCESS!@#KODE 1!@#USER_ID 97!@#ACTIVITY_CODE 3
12/23/2022 07:34:51 AM script INFO: SUCCESS!@#KODE 1!@#USER_ID 97!@#ACTIVITY_CODE 1
12/23/2022 07:34:51 AM script INFO: SUCCESS!@#KODE 1!@#USER_ID 97!@#ACTIVITY_CODE 3
12/23/2022 07:34:51 AM script INFO: SUCCESS!@#KODE 1!@#USER_ID 97!@#ACTIVITY_CODE 2
12/23/2022 07:34:51 AM script INFO: SUCCESS!@#KODE 1!@#USER_ID 97!@#ACTIVITY_CODE 2
12/23/2022 07:34:52 AM script INFO: SUCCESS!@#KODE 1!@#USER_ID 97!@#ACTIVITY_CODE 2
12/23/2022 07:34:52 AM script INFO: SUCCESS!@#KODE 1!@#USER_ID 97!@#ACTIVITY_CODE 3
12/23/2022 07:34:52 AM script INFO: SUCCESS!@#KODE 1!@#USER_ID 97!@#ACTIVITY_CODE 3
12/23/2022 07:34:52 AM script INFO: SUCCESS!@#KODE 1!@#USER_ID 97!@#ACTIVITY_CODE 3
12/23/2022 07:34:52 AM script INFO: SUCCESS!@#KODE 1!@#USER_ID 97!@#ACTIVITY_CODE 2
12/23/2022 07:34:52 AM script INFO: SUCCESS!@#KODE 1!@#USER_ID 97!@#ACTIVITY_CODE 1
12/23/2022 07:34:52 AM script INFO: SUCCESS!@#KODE 1!@#USER_ID 97!@#ACTIVITY_CODE 4
12/23/2022 07:34:52 AM script INFO: SUCCESS!@#KODE 1!@#USER_ID 97!@#ACTIVITY_CODE 1
12/23/2022 07:34:52 AM script INFO: SUCCESS!@#KODE 1!@#USER_ID 97!@#ACTIVITY_CODE 4
12/23/2022 07:34:52 AM script INFO: SUCCESS!@#KODE 1!@#USER_ID 97!@#ACTIVITY_CODE 2
12/23/2022 07:34:52 AM script INFO: SUCCESS!@#KODE 1!@#USER_ID 97!@#ACTIVITY_CODE 2
12/23/2022 07:34:52 AM script INFO: SUCCESS!@#KODE 1!@#USER_ID 97!@#ACTIVITY_CODE 2
12/23/2022 07:34:52 AM script INFO: SUCCESS!@#KODE 1!@#USER_ID 97!@#ACTIVITY_CODE 1
12/23/2022 07:34:52 AM script INFO: SUCCESS!@#KODE 1!@#USER_ID 97!@#ACTIVITY_CODE 3
12/23/2022 07:34:52 AM script INFO: SUCCESS!@#KODE 1!@#USER_ID 97!@#ACTIVITY_CODE 1
12/23/2022 07:34:52 AM script INFO: SUCCESS!@#KODE 1!@#USER_ID 97!@#ACTIVITY_CODE 3
12/23/2022 07:34:52 AM script INFO: SUCCESS!@#KODE 1!@#USER_ID 97!@#ACTIVITY_CODE 1
12/23/2022 07:34:52 AM script INFO: SUCCESS!@#KODE 1!@#USER_ID 97!@#ACTIVITY_CODE 3
12/23/2022 07:34:53 AM script INFO: SUCCESS!@#KODE 1!@#USER_ID 97!@#ACTIVITY_CODE 2
12/23/2022 07:34:53 AM script INFO: SUCCESS!@#KODE 1!@#USER_ID 97!@#ACTIVITY_CODE 3
12/23/2022 07:34:53 AM script INFO: SUCCESS!@#KODE 1!@#USER_ID 97!@#ACTIVITY_CODE 4
12/23/2022 07:34:53 AM script INFO: SUCCESS!@#KODE 1!@#USER_ID 97!@#ACTIVITY_CODE 1
12/23/2022 07:34:53 AM script INFO: SUCCESS!@#KODE 1!@#USER_ID 97!@#ACTIVITY_CODE 2
12/23/2022 07:34:53 AM script INFO: SUCCESS!@#KODE 1!@#USER_ID 97!@#ACTIVITY_CODE 3
12/23/2022 07:34:53 AM script INFO: SUCCESS!@#KODE 1!@#USER_ID 97!@#ACTIVITY_CODE 2
12/23/2022 07:34:53 AM script INFO: SUCCESS!@#KODE 1!@#USER_ID 97!@#ACTIVITY_CODE 2
12/23/2022 07:34:53 AM script INFO: SUCCESS!@#KODE 1!@#USER_ID 97!@#ACTIVITY_CODE 1
12/23/2022 07:34:53 AM script INFO: SUCCESS!@#KODE 1!@#USER_ID 97!@#ACTIVITY_CODE 2
12/23/2022 07:34:53 AM script INFO: SUCCESS!@#KODE 1!@#USER_ID 97!@#ACTIVITY_CODE 4
12/23/2022 07:34:53 AM script INFO: SUCCESS!@#KODE 1!@#USER_ID 97!@#ACTIVITY_CODE 2
12/23/2022 07:34:53 AM script INFO: SUCCESS!@#KODE 1!@#USER_ID 97!@#ACTIVITY_CODE 2
12/23/2022 07:34:53 AM script INFO: SUCCESS!@#KODE 1!@#USER_ID 97!@#ACTIVITY_CODE 1
12/23/2022 07:34:53 AM script INFO: SUCCESS!@#KODE 1!@#USER_ID 97!@#ACTIVITY_CODE 4
12/23/2022 07:34:54 AM script INFO: SUCCESS!@#KODE 1!@#USER_ID 97!@#ACTIVITY_CODE 1
12/23/2022 07:34:54 AM script INFO: SUCCESS!@#KODE 1!@#USER_ID 97!@#ACTIVITY_CODE 2
12/23/2022 07:34:54 AM script INFO: SUCCESS!@#KODE 1!@#USER_ID 97!@#ACTIVITY_CODE 4
12/23/2022 07:34:54 AM script INFO: SUCCESS!@#KODE 1!@#USER_ID 97!@#ACTIVITY_CODE 1
12/23/2022 07:34:54 AM script INFO: SUCCESS!@#KODE 1!@#USER_ID 97!@#ACTIVITY_CODE 1
12/23/2022 07:34:54 AM script INFO: SUCCESS!@#KODE 1!@#USER_ID 97!@#ACTIVITY_CODE 3
12/23/2022 07:34:54 AM script INFO: SUCCESS!@#KODE 1!@#USER_ID 97!@#ACTIVITY_CODE 3
12/23/2022 07:34:54 AM script INFO: SUCCESS!@#KODE 1!@#USER_ID 97!@#ACTIVITY_CODE 4
12/23/2022 07:34:54 AM script INFO: SUCCESS!@#KODE 1!@#USER_ID 97!@#ACTIVITY_CODE 2
12/23/2022 07:34:54 AM script INFO: SUCCESS!@#KODE 1!@#USER_ID 97!@#ACTIVITY_CODE 3
12/23/2022 07:34:54 AM script INFO: SUCCESS!@#KODE 1!@#USER_ID 97!@#ACTIVITY_CODE 3
12/23/2022 07:34:54 AM script INFO: SUCCESS!@#KODE 1!@#USER_ID 97!@#ACTIVITY_CODE 3
12/23/2022 07:34:54 AM script INFO: SUCCESS!@#KODE 1!@#USER_ID 97!@#ACTIVITY_CODE 3
12/23/2022 07:34:54 AM script INFO: SUCCESS!@#KODE 1!@#USER_ID 97!@#ACTIVITY_CODE 1
12/23/2022 07:34:54 AM script INFO: SUCCESS!@#KODE 1!@#USER_ID 97!@#ACTIVITY_CODE 2
12/23/2022 07:34:54 AM script INFO: SUCCESS!@#KODE 1!@#USER_ID 97!@#ACTIVITY_CODE 1
12/23/2022 07:34:54 AM script INFO: SUCCESS!@#KODE 1!@#USER_ID 97!@#ACTIVITY_CODE 2
12/23/2022 07:34:55 AM script INFO: SUCCESS!@#KODE 1!@#USER_ID 97!@#ACTIVITY_CODE 1
12/23/2022 07:34:55 AM script INFO: SUCCESS!@#KODE 1!@#USER_ID 97!@#ACTIVITY_CODE 1
12/23/2022 07:34:55 AM script INFO: SUCCESS!@#KODE 1!@#USER_ID 97!@#ACTIVITY_CODE 2
12/23/2022 07:34:55 AM script INFO: SUCCESS!@#KODE 1!@#USER_ID 97!@#ACTIVITY_CODE 3
12/23/2022 07:34:55 AM script INFO: SUCCESS!@#KODE 1!@#USER_ID 97!@#ACTIVITY_CODE 3
12/23/2022 07:34:55 AM script INFO: SUCCESS!@#KODE 1!@#USER_ID 97!@#ACTIVITY_CODE 2
12/23/2022 07:34:55 AM script INFO: SUCCESS!@#KODE 1!@#USER_ID 97!@#ACTIVITY_CODE 2
12/23/2022 07:34:55 AM script INFO: SUCCESS!@#KODE 1!@#USER_ID 97!@#ACTIVITY_CODE 2
12/23/2022 07:34:55 AM script INFO: SUCCESS!@#KODE 1!@#USER_ID 97!@#ACTIVITY_CODE 3
12/23/2022 07:34:55 AM script INFO: SUCCESS!@#KODE 1!@#USER_ID 97!@#ACTIVITY_CODE 1
12/23/2022 07:34:55 AM script INFO: SUCCESS!@#KODE 1!@#USER_ID 97!@#ACTIVITY_CODE 4
12/23/2022 07:34:55 AM script INFO: SUCCESS!@#KODE 1!@#USER_ID 97!@#ACTIVITY_CODE 1
12/23/2022 07:34:55 AM script INFO: SUCCESS!@#KODE 1!@#USER_ID 97!@#ACTIVITY_CODE 3
12/23/2022 07:34:55 AM script INFO: SUCCESS!@#KODE 1!@#USER_ID 97!@#ACTIVITY_CODE 4
12/23/2022 07:34:55 AM script INFO: SUCCESS!@#KODE 1!@#USER_ID 97!@#ACTIVITY_CODE 2
12/23/2022 07:34:56 AM script INFO: SUCCESS!@#KODE 1!@#USER_ID 97!@#ACTIVITY_CODE 2
12/23/2022 07:34:56 AM script INFO: SUCCESS!@#KODE 1!@#USER_ID 97!@#ACTIVITY_CODE 2
12/23/2022 07:34:56 AM script INFO: SUCCESS!@#KODE 1!@#USER_ID 97!@#ACTIVITY_CODE 2
12/23/2022 07:34:56 AM script INFO: SUCCESS!@#KODE 1!@#USER_ID 97!@#ACTIVITY_CODE 1
12/23/2022 07:34:56 AM script INFO: SUCCESS!@#KODE 1!@#USER_ID 97!@#ACTIVITY_CODE 3
12/23/2022 07:34:56 AM script INFO: SUCCESS!@#KODE 1!@#USER_ID 97!@#ACTIVITY_CODE 1
12/23/2022 07:34:56 AM script INFO: SUCCESS!@#KODE 1!@#USER_ID 97!@#ACTIVITY_CODE 3
12/23/2022 07:34:56 AM script INFO: SUCCESS!@#KODE 1!@#USER_ID 97!@#ACTIVITY_CODE 3
12/23/2022 07:34:56 AM script INFO: SUCCESS!@#KODE 1!@#USER_ID 97!@#ACTIVITY_CODE 3
12/23/2022 07:34:56 AM script INFO: SUCCESS!@#KODE 1!@#USER_ID 97!@#ACTIVITY_CODE 2
12/23/2022 07:34:56 AM script INFO: SUCCESS!@#KODE 1!@#USER_ID 97!@#ACTIVITY_CODE 4
12/23/2022 07:34:56 AM script INFO: SUCCESS!@#KODE 1!@#USER_ID 97!@#ACTIVITY_CODE 2
12/23/2022 07:34:56 AM script INFO: SUCCESS!@#KODE 1!@#USER_ID 97!@#ACTIVITY_CODE 1
12/23/2022 07:34:56 AM script INFO: SUCCESS!@#KODE 1!@#USER_ID 97!@#ACTIVITY_CODE 2
12/23/2022 07:34:56 AM script INFO: SUCCESS!@#KODE 1!@#USER_ID 97!@#ACTIVITY_CODE 1
12/23/2022 07:34:57 AM script INFO: SUCCESS!@#KODE 1!@#USER_ID 97!@#ACTIVITY_CODE 2
12/23/2022 07:34:57 AM script INFO: SUCCESS!@#KODE 1!@#USER_ID 97!@#ACTIVITY_CODE 4
12/23/2022 07:34:57 AM script INFO: SUCCESS!@#KODE 1!@#USER_ID 97!@#ACTIVITY_CODE 3
12/23/2022 07:34:57 AM script INFO: SUCCESS!@#KODE 1!@#USER_ID 97!@#ACTIVITY_CODE 1
12/23/2022 07:34:57 AM script INFO: SUCCESS!@#KODE 1!@#USER_ID 97!@#ACTIVITY_CODE 3
12/23/2022 07:34:57 AM script INFO: SUCCESS!@#KODE 1!@#USER_ID 97!@#ACTIVITY_CODE 1
12/23/2022 07:34:57 AM script INFO: SUCCESS!@#KODE 1!@#USER_ID 97!@#ACTIVITY_CODE 4
12/23/2022 07:34:57 AM script INFO: SUCCESS!@#KODE 1!@#USER_ID 97!@#ACTIVITY_CODE 3
12/23/2022 07:34:57 AM script INFO: SUCCESS!@#KODE 1!@#USER_ID 97!@#ACTIVITY_CODE 2
12/23/2022 07:34:57 AM script INFO: SUCCESS!@#KODE 1!@#USER_ID 97!@#ACTIVITY_CODE 3
12/23/2022 07:34:57 AM script INFO: SUCCESS!@#KODE 1!@#USER_ID 97!@#ACTIVITY_CODE 1
12/23/2022 07:34:57 AM script INFO: SUCCESS!@#KODE 1!@#USER_ID 97!@#ACTIVITY_CODE 2
12/23/2022 07:34:57 AM script INFO: SUCCESS!@#KODE 1!@#USER_ID 97!@#ACTIVITY_CODE 1
12/23/2022 07:34:57 AM script INFO: SUCCESS!@#KODE 1!@#USER_ID 97!@#ACTIVITY_CODE 4
12/23/2022 07:34:57 AM script INFO: SUCCESS!@#KODE 1!@#USER_ID 97!@#ACTIVITY_CODE 3
12/23/2022 07:34:57 AM script INFO: SUCCESS!@#KODE 1!@#USER_ID 97!@#ACTIVITY_CODE 1
12/23/2022 07:34:57 AM script INFO: SUCCESS!@#KODE 1!@#USER_ID 97!@#ACTIVITY_CODE 3
12/23/2022 07:34:57 AM script INFO: SUCCESS!@#KODE 1!@#USER_ID 97!@#ACTIVITY_CODE 2
12/23/2022 07:34:58 AM script INFO: SUCCESS!@#KODE 1!@#USER_ID 97!@#ACTIVITY_CODE 2
12/23/2022 07:34:58 AM script INFO: SUCCESS!@#KODE 1!@#USER_ID 97!@#ACTIVITY_CODE 2
12/23/2022 07:34:58 AM script INFO: SUCCESS!@#KODE 1!@#USER_ID 97!@#ACTIVITY_CODE 1
12/23/2022 07:34:58 AM script INFO: SUCCESS!@#KODE 1!@#USER_ID 97!@#ACTIVITY_CODE 1
12/23/2022 07:34:58 AM script INFO: SUCCESS!@#KODE 1!@#USER_ID 97!@#ACTIVITY_CODE 4
12/23/2022 07:34:58 AM script INFO: SUCCESS!@#KODE 1!@#USER_ID 97!@#ACTIVITY_CODE 1
12/23/2022 07:34:58 AM script INFO: SUCCESS!@#KODE 1!@#USER_ID 97!@#ACTIVITY_CODE 1
12/23/2022 07:34:58 AM script INFO: SUCCESS!@#KODE 1!@#USER_ID 97!@#ACTIVITY_CODE 3
12/23/2022 07:34:58 AM script INFO: SUCCESS!@#KODE 1!@#USER_ID 97!@#ACTIVITY_CODE 2
12/23/2022 07:34:58 AM script INFO: SUCCESS!@#KODE 1!@#USER_ID 97!@#ACTIVITY_CODE 2
12/23/2022 07:34:58 AM script INFO: SUCCESS!@#KODE 1!@#USER_ID 97!@#ACTIVITY_CODE 1
12/23/2022 07:34:58 AM script INFO: SUCCESS!@#KODE 1!@#USER_ID 97!@#ACTIVITY_CODE 1
12/23/2022 07:34:58 AM script INFO: SUCCESS!@#KODE 1!@#USER_ID 97!@#ACTIVITY_CODE 3
12/23/2022 07:34:58 AM script INFO: SUCCESS!@#KODE 1!@#USER_ID 97!@#ACTIVITY_CODE 1
12/23/2022 07:34:58 AM script INFO: SUCCESS!@#KODE 1!@#USER_ID 97!@#ACTIVITY_CODE 1
12/23/2022 07:34:58 AM script INFO: SUCCESS!@#KODE 1!@#USER_ID 97!@#ACTIVITY_CODE 2
12/23/2022 07:34:58 AM script INFO: SUCCESS!@#KODE 1!@#USER_ID 97!@#ACTIVITY_CODE 1
12/23/2022 07:34:58 AM script INFO: SUCCESS!@#KODE 1!@#USER_ID 97!@#ACTIVITY_CODE 1
12/23/2022 07:34:59 AM script INFO: SUCCESS!@#KODE 1!@#USER_ID 97!@#ACTIVITY_CODE 4
12/23/2022 07:34:59 AM script INFO: SUCCESS!@#KODE 1!@#USER_ID 97!@#ACTIVITY_CODE 1
12/23/2022 07:34:59 AM script INFO: SUCCESS!@#KODE 1!@#USER_ID 97!@#ACTIVITY_CODE 4
12/23/2022 07:34:59 AM script INFO: SUCCESS!@#KODE 1!@#USER_ID 97!@#ACTIVITY_CODE 3
12/23/2022 07:34:59 AM script INFO: SUCCESS!@#KODE 1!@#USER_ID 97!@#ACTIVITY_CODE 3
12/23/2022 07:34:59 AM script INFO: SUCCESS!@#KODE 1!@#USER_ID 97!@#ACTIVITY_CODE 1
12/23/2022 07:34:59 AM script INFO: SUCCESS!@#KODE 1!@#USER_ID 97!@#ACTIVITY_CODE 2
12/23/2022 07:34:59 AM script INFO: SUCCESS!@#KODE 1!@#USER_ID 97!@#ACTIVITY_CODE 1
12/23/2022 07:34:59 AM script INFO: SUCCESS!@#KODE 1!@#USER_ID 97!@#ACTIVITY_CODE 3
12/23/2022 07:34:59 AM script INFO: SUCCESS!@#KODE 1!@#USER_ID 97!@#ACTIVITY_CODE 2
12/23/2022 07:34:59 AM script INFO: SUCCESS!@#KODE 1!@#USER_ID 97!@#ACTIVITY_CODE 2
12/23/2022 07:34:59 AM script INFO: SUCCESS!@#KODE 1!@#USER_ID 97!@#ACTIVITY_CODE 2
12/23/2022 07:34:59 AM script INFO: SUCCESS!@#KODE 1!@#USER_ID 97!@#ACTIVITY_CODE 3
12/23/2022 07:34:59 AM script INFO: SUCCESS!@#KODE 1!@#USER_ID 97!@#ACTIVITY_CODE 3
12/23/2022 07:34:59 AM script INFO: SUCCESS!@#KODE 1!@#USER_ID 97!@#ACTIVITY_CODE 2
12/23/2022 07:34:59 AM script INFO: SUCCESS!@#KODE 1!@#USER_ID 97!@#ACTIVITY_CODE 2
12/23/2022 07:35:00 AM script INFO: SUCCESS!@#KODE 1!@#USER_ID 97!@#ACTIVITY_CODE 2
12/23/2022 07:35:00 AM script INFO: SUCCESS!@#KODE 1!@#USER_ID 97!@#ACTIVITY_CODE 2
12/23/2022 07:35:00 AM script INFO: SUCCESS!@#KODE 1!@#USER_ID 97!@#ACTIVITY_CODE 2
12/23/2022 07:35:00 AM script INFO: SUCCESS!@#KODE 1!@#USER_ID 97!@#ACTIVITY_CODE 4
12/23/2022 07:35:00 AM script INFO: SUCCESS!@#KODE 1!@#USER_ID 97!@#ACTIVITY_CODE 3
12/23/2022 07:35:00 AM script INFO: SUCCESS!@#KODE 1!@#USER_ID 97!@#ACTIVITY_CODE 1
12/23/2022 07:35:00 AM script INFO: SUCCESS!@#KODE 1!@#USER_ID 97!@#ACTIVITY_CODE 1
12/23/2022 07:35:00 AM script INFO: SUCCESS!@#KODE 1!@#USER_ID 97!@#ACTIVITY_CODE 2
12/23/2022 07:35:00 AM script INFO: SUCCESS!@#KODE 1!@#USER_ID 97!@#ACTIVITY_CODE 4
12/23/2022 07:35:00 AM script INFO: SUCCESS!@#KODE 1!@#USER_ID 97!@#ACTIVITY_CODE 3
12/23/2022 07:35:00 AM script INFO: SUCCESS!@#KODE 1!@#USER_ID 97!@#ACTIVITY_CODE 2
12/23/2022 07:35:00 AM script INFO: SUCCESS!@#KODE 1!@#USER_ID 97!@#ACTIVITY_CODE 2
12/23/2022 07:35:00 AM script INFO: SUCCESS!@#KODE 1!@#USER_ID 97!@#ACTIVITY_CODE 1
12/23/2022 07:35:00 AM script INFO: SUCCESS!@#KODE 1!@#USER_ID 97!@#ACTIVITY_CODE 3
12/23/2022 07:35:00 AM script INFO: SUCCESS!@#KODE 1!@#USER_ID 97!@#ACTIVITY_CODE 3
12/23/2022 07:35:01 AM script INFO: SUCCESS!@#KODE 1!@#USER_ID 97!@#ACTIVITY_CODE 2
12/23/2022 07:35:01 AM script INFO: SUCCESS!@#KODE 1!@#USER_ID 97!@#ACTIVITY_CODE 1
12/23/2022 07:35:01 AM script INFO: SUCCESS!@#KODE 1!@#USER_ID 97!@#ACTIVITY_CODE 2
12/23/2022 07:35:01 AM script INFO: SUCCESS!@#KODE 1!@#USER_ID 97!@#ACTIVITY_CODE 3
12/23/2022 07:35:01 AM script INFO: SUCCESS!@#KODE 1!@#USER_ID 97!@#ACTIVITY_CODE 2
12/23/2022 07:35:01 AM script INFO: SUCCESS!@#KODE 1!@#USER_ID 97!@#ACTIVITY_CODE 4
12/23/2022 07:35:01 AM script INFO: SUCCESS!@#KODE 1!@#USER_ID 97!@#ACTIVITY_CODE 1
12/23/2022 07:35:01 AM script INFO: SUCCESS!@#KODE 1!@#USER_ID 97!@#ACTIVITY_CODE 1
12/23/2022 07:35:01 AM script INFO: SUCCESS!@#KODE 1!@#USER_ID 97!@#ACTIVITY_CODE 4
12/23/2022 07:35:01 AM script INFO: SUCCESS!@#KODE 1!@#USER_ID 97!@#ACTIVITY_CODE 1
12/23/2022 07:35:01 AM script INFO: SUCCESS!@#KODE 1!@#USER_ID 97!@#ACTIVITY_CODE 3
12/23/2022 07:35:01 AM script INFO: SUCCESS!@#KODE 1!@#USER_ID 97!@#ACTIVITY_CODE 1
12/23/2022 07:35:01 AM script INFO: SUCCESS!@#KODE 1!@#USER_ID 97!@#ACTIVITY_CODE 4
12/23/2022 07:35:01 AM script INFO: SUCCESS!@#KODE 1!@#USER_ID 97!@#ACTIVITY_CODE 1
12/23/2022 07:35:01 AM script INFO: SUCCESS!@#KODE 1!@#USER_ID 97!@#ACTIVITY_CODE 2
12/23/2022 07:35:01 AM script INFO: SUCCESS!@#KODE 1!@#USER_ID 97!@#ACTIVITY_CODE 2
12/23/2022 07:35:01 AM script INFO: SUCCESS!@#KODE 1!@#USER_ID 97!@#ACTIVITY_CODE 3
12/23/2022 07:35:01 AM script INFO: SUCCESS!@#KODE 1!@#USER_ID 97!@#ACTIVITY_CODE 4
12/23/2022 07:35:02 AM script INFO: SUCCESS!@#KODE 1!@#USER_ID 97!@#ACTIVITY_CODE 2
12/23/2022 07:35:02 AM script INFO: SUCCESS!@#KODE 1!@#USER_ID 97!@#ACTIVITY_CODE 1
12/23/2022 07:35:02 AM script INFO: SUCCESS!@#KODE 1!@#USER_ID 97!@#ACTIVITY_CODE 3
12/23/2022 07:35:02 AM script INFO: SUCCESS!@#KODE 1!@#USER_ID 97!@#ACTIVITY_CODE 3
12/23/2022 07:35:02 AM script INFO: SUCCESS!@#KODE 1!@#USER_ID 97!@#ACTIVITY_CODE 2
12/23/2022 07:35:02 AM script INFO: SUCCESS!@#KODE 1!@#USER_ID 97!@#ACTIVITY_CODE 3
12/23/2022 07:35:02 AM script INFO: SUCCESS!@#KODE 1!@#USER_ID 97!@#ACTIVITY_CODE 3
12/23/2022 07:35:02 AM script INFO: SUCCESS!@#KODE 1!@#USER_ID 97!@#ACTIVITY_CODE 1
12/23/2022 07:35:02 AM script INFO: SUCCESS!@#KODE 1!@#USER_ID 97!@#ACTIVITY_CODE 4
12/23/2022 07:35:02 AM script INFO: SUCCESS!@#KODE 1!@#USER_ID 97!@#ACTIVITY_CODE 1
12/23/2022 07:35:02 AM script INFO: SUCCESS!@#KODE 1!@#USER_ID 97!@#ACTIVITY_CODE 3
12/23/2022 07:35:02 AM script INFO: SUCCESS!@#KODE 1!@#USER_ID 97!@#ACTIVITY_CODE 4
12/23/2022 07:35:02 AM script INFO: SUCCESS!@#KODE 1!@#USER_ID 97!@#ACTIVITY_CODE 3
12/23/2022 07:35:02 AM script INFO: SUCCESS!@#KODE 1!@#USER_ID 97!@#ACTIVITY_CODE 3
12/23/2022 07:35:02 AM script INFO: SUCCESS!@#KODE 1!@#USER_ID 97!@#ACTIVITY_CODE 2
12/23/2022 07:35:02 AM script INFO: SUCCESS!@#KODE 1!@#USER_ID 97!@#ACTIVITY_CODE 1
12/23/2022 07:35:02 AM script INFO: SUCCESS!@#KODE 1!@#USER_ID 97!@#ACTIVITY_CODE 1
12/23/2022 07:35:02 AM script INFO: SUCCESS!@#KODE 1!@#USER_ID 97!@#ACTIVITY_CODE 1
12/23/2022 07:35:03 AM script INFO: SUCCESS!@#KODE 1!@#USER_ID 97!@#ACTIVITY_CODE 4
12/23/2022 07:35:03 AM script INFO: SUCCESS!@#KODE 1!@#USER_ID 97!@#ACTIVITY_CODE 1
12/23/2022 07:35:03 AM script INFO: SUCCESS!@#KODE 1!@#USER_ID 97!@#ACTIVITY_CODE 3
12/23/2022 07:35:03 AM script INFO: SUCCESS!@#KODE 1!@#USER_ID 97!@#ACTIVITY_CODE 3
12/23/2022 07:35:03 AM script INFO: SUCCESS!@#KODE 1!@#USER_ID 97!@#ACTIVITY_CODE 1
12/23/2022 07:35:03 AM script INFO: SUCCESS!@#KODE 1!@#USER_ID 97!@#ACTIVITY_CODE 1
12/23/2022 07:35:03 AM script INFO: SUCCESS!@#KODE 1!@#USER_ID 97!@#ACTIVITY_CODE 3
12/23/2022 07:35:03 AM script INFO: SUCCESS!@#KODE 1!@#USER_ID 97!@#ACTIVITY_CODE 1
12/23/2022 07:35:03 AM script INFO: SUCCESS!@#KODE 1!@#USER_ID 97!@#ACTIVITY_CODE 3
12/23/2022 07:35:03 AM script INFO: SUCCESS!@#KODE 1!@#USER_ID 97!@#ACTIVITY_CODE 4
12/23/2022 07:35:03 AM script INFO: SUCCESS!@#KODE 1!@#USER_ID 97!@#ACTIVITY_CODE 2
12/23/2022 07:35:03 AM script INFO: SUCCESS!@#KODE 1!@#USER_ID 97!@#ACTIVITY_CODE 2
12/23/2022 07:35:03 AM script INFO: SUCCESS!@#KODE 1!@#USER_ID 97!@#ACTIVITY_CODE 2
12/23/2022 07:35:03 AM script INFO: SUCCESS!@#KODE 1!@#USER_ID 97!@#ACTIVITY_CODE 2
12/23/2022 07:35:03 AM script INFO: SUCCESS!@#KODE 1!@#USER_ID 97!@#ACTIVITY_CODE 3
12/23/2022 07:35:03 AM script INFO: SUCCESS!@#KODE 1!@#USER_ID 97!@#ACTIVITY_CODE 2
12/23/2022 07:35:03 AM script INFO: SUCCESS!@#KODE 1!@#USER_ID 97!@#ACTIVITY_CODE 2
12/23/2022 07:35:04 AM script INFO: SUCCESS!@#KODE 1!@#USER_ID 97!@#ACTIVITY_CODE 2
12/23/2022 07:35:04 AM script INFO: SUCCESS!@#KODE 1!@#USER_ID 97!@#ACTIVITY_CODE 1
12/23/2022 07:35:04 AM script INFO: SUCCESS!@#KODE 1!@#USER_ID 97!@#ACTIVITY_CODE 3
12/23/2022 07:35:04 AM script INFO: SUCCESS!@#KODE 1!@#USER_ID 97!@#ACTIVITY_CODE 2
12/23/2022 07:35:04 AM script INFO: SUCCESS!@#KODE 1!@#USER_ID 97!@#ACTIVITY_CODE 3
12/23/2022 07:35:04 AM script INFO: SUCCESS!@#KODE 1!@#USER_ID 97!@#ACTIVITY_CODE 2
12/23/2022 07:35:04 AM script INFO: SUCCESS!@#KODE 1!@#USER_ID 97!@#ACTIVITY_CODE 3
12/23/2022 07:35:04 AM script INFO: SUCCESS!@#KODE 1!@#USER_ID 97!@#ACTIVITY_CODE 3
12/23/2022 07:35:04 AM script INFO: SUCCESS!@#KODE 1!@#USER_ID 97!@#ACTIVITY_CODE 4
12/23/2022 07:35:04 AM script INFO: SUCCESS!@#KODE 1!@#USER_ID 97!@#ACTIVITY_CODE 2
12/23/2022 07:35:04 AM script INFO: SUCCESS!@#KODE 1!@#USER_ID 97!@#ACTIVITY_CODE 2
12/23/2022 07:35:04 AM script INFO: SUCCESS!@#KODE 1!@#USER_ID 97!@#ACTIVITY_CODE 2
12/23/2022 07:35:04 AM script INFO: SUCCESS!@#KODE 1!@#USER_ID 97!@#ACTIVITY_CODE 1
12/23/2022 07:35:04 AM script INFO: SUCCESS!@#KODE 1!@#USER_ID 97!@#ACTIVITY_CODE 1
12/23/2022 07:35:05 AM script INFO: SUCCESS!@#KODE 1!@#USER_ID 97!@#ACTIVITY_CODE 2
12/23/2022 07:35:05 AM script INFO: SUCCESS!@#KODE 1!@#USER_ID 97!@#ACTIVITY_CODE 2
12/23/2022 07:35:05 AM script INFO: SUCCESS!@#KODE 1!@#USER_ID 97!@#ACTIVITY_CODE 3
12/23/2022 07:35:05 AM script INFO: SUCCESS!@#KODE 1!@#USER_ID 97!@#ACTIVITY_CODE 3
12/23/2022 07:35:05 AM script INFO: SUCCESS!@#KODE 1!@#USER_ID 97!@#ACTIVITY_CODE 3
12/23/2022 07:35:05 AM script INFO: SUCCESS!@#KODE 1!@#USER_ID 97!@#ACTIVITY_CODE 3
12/23/2022 07:35:05 AM script INFO: SUCCESS!@#KODE 1!@#USER_ID 97!@#ACTIVITY_CODE 1
12/23/2022 07:35:05 AM script INFO: SUCCESS!@#KODE 1!@#USER_ID 97!@#ACTIVITY_CODE 4
12/23/2022 07:35:05 AM script INFO: SUCCESS!@#KODE 1!@#USER_ID 97!@#ACTIVITY_CODE 3
12/23/2022 07:35:05 AM script INFO: SUCCESS!@#KODE 1!@#USER_ID 97!@#ACTIVITY_CODE 3
12/23/2022 07:35:05 AM script INFO: SUCCESS!@#KODE 1!@#USER_ID 97!@#ACTIVITY_CODE 1
12/23/2022 07:35:05 AM script INFO: SUCCESS!@#KODE 1!@#USER_ID 97!@#ACTIVITY_CODE 3
12/23/2022 07:35:05 AM script INFO: SUCCESS!@#KODE 1!@#USER_ID 97!@#ACTIVITY_CODE 1
12/23/2022 07:35:05 AM script INFO: SUCCESS!@#KODE 1!@#USER_ID 97!@#ACTIVITY_CODE 4
12/23/2022 07:35:05 AM script INFO: SUCCESS!@#KODE 1!@#USER_ID 97!@#ACTIVITY_CODE 2
12/23/2022 07:35:05 AM script INFO: SUCCESS!@#KODE 1!@#USER_ID 97!@#ACTIVITY_CODE 2
12/23/2022 07:35:05 AM script INFO: SUCCESS!@#KODE 1!@#USER_ID 97!@#ACTIVITY_CODE 3
12/23/2022 07:35:05 AM script INFO: SUCCESS!@#KODE 1!@#USER_ID 97!@#ACTIVITY_CODE 1
12/23/2022 07:35:05 AM script INFO: SUCCESS!@#KODE 1!@#USER_ID 97!@#ACTIVITY_CODE 3
12/23/2022 07:35:05 AM script INFO: SUCCESS!@#KODE 1!@#USER_ID 97!@#ACTIVITY_CODE 1
12/23/2022 07:35:06 AM script INFO: SUCCESS!@#KODE 1!@#USER_ID 97!@#ACTIVITY_CODE 2
12/23/2022 07:35:06 AM script INFO: SUCCESS!@#KODE 1!@#USER_ID 97!@#ACTIVITY_CODE 1
12/23/2022 07:35:06 AM script INFO: SUCCESS!@#KODE 1!@#USER_ID 97!@#ACTIVITY_CODE 3
12/23/2022 07:35:06 AM script INFO: SUCCESS!@#KODE 1!@#USER_ID 97!@#ACTIVITY_CODE 1
12/23/2022 07:35:06 AM script INFO: SUCCESS!@#KODE 1!@#USER_ID 97!@#ACTIVITY_CODE 4
12/23/2022 07:35:06 AM script INFO: SUCCESS!@#KODE 1!@#USER_ID 97!@#ACTIVITY_CODE 2
12/23/2022 07:35:06 AM script INFO: SUCCESS!@#KODE 1!@#USER_ID 97!@#ACTIVITY_CODE 2
12/23/2022 07:35:06 AM script INFO: SUCCESS!@#KODE 1!@#USER_ID 97!@#ACTIVITY_CODE 3
12/23/2022 07:35:06 AM script INFO: SUCCESS!@#KODE 1!@#USER_ID 97!@#ACTIVITY_CODE 3
12/23/2022 07:35:06 AM script INFO: SUCCESS!@#KODE 1!@#USER_ID 97!@#ACTIVITY_CODE 4
12/23/2022 07:35:06 AM script INFO: SUCCESS!@#KODE 1!@#USER_ID 97!@#ACTIVITY_CODE 2
12/23/2022 07:35:06 AM script INFO: SUCCESS!@#KODE 1!@#USER_ID 97!@#ACTIVITY_CODE 3
12/23/2022 07:35:06 AM script INFO: SUCCESS!@#KODE 1!@#USER_ID 97!@#ACTIVITY_CODE 1
12/23/2022 07:35:06 AM script INFO: SUCCESS!@#KODE 1!@#USER_ID 97!@#ACTIVITY_CODE 2
12/23/2022 07:35:06 AM script INFO: SUCCESS!@#KODE 1!@#USER_ID 97!@#ACTIVITY_CODE 3
12/23/2022 07:35:06 AM script INFO: SUCCESS!@#KODE 1!@#USER_ID 97!@#ACTIVITY_CODE 2
12/23/2022 07:35:06 AM script INFO: SUCCESS!@#KODE 1!@#USER_ID 97!@#ACTIVITY_CODE 1
12/23/2022 07:35:07 AM script INFO: SUCCESS!@#KODE 1!@#USER_ID 97!@#ACTIVITY_CODE 1
12/23/2022 07:35:07 AM script INFO: SUCCESS!@#KODE 1!@#USER_ID 97!@#ACTIVITY_CODE 1
12/23/2022 07:35:07 AM script INFO: SUCCESS!@#KODE 1!@#USER_ID 97!@#ACTIVITY_CODE 2
12/23/2022 07:35:07 AM script INFO: SUCCESS!@#KODE 1!@#USER_ID 97!@#ACTIVITY_CODE 1
12/23/2022 07:35:07 AM script INFO: SUCCESS!@#KODE 1!@#USER_ID 97!@#ACTIVITY_CODE 1
12/23/2022 07:35:07 AM script INFO: SUCCESS!@#KODE 1!@#USER_ID 97!@#ACTIVITY_CODE 1
12/23/2022 07:35:07 AM script INFO: SUCCESS!@#KODE 1!@#USER_ID 97!@#ACTIVITY_CODE 4
12/23/2022 07:35:07 AM script INFO: SUCCESS!@#KODE 1!@#USER_ID 97!@#ACTIVITY_CODE 1
12/23/2022 07:35:07 AM script INFO: SUCCESS!@#KODE 1!@#USER_ID 97!@#ACTIVITY_CODE 1
12/23/2022 07:35:07 AM script INFO: SUCCESS!@#KODE 1!@#USER_ID 97!@#ACTIVITY_CODE 3
12/23/2022 07:35:07 AM script INFO: SUCCESS!@#KODE 1!@#USER_ID 97!@#ACTIVITY_CODE 2
12/23/2022 07:35:07 AM script INFO: SUCCESS!@#KODE 1!@#USER_ID 97!@#ACTIVITY_CODE 1
12/23/2022 07:35:07 AM script INFO: SUCCESS!@#KODE 1!@#USER_ID 97!@#ACTIVITY_CODE 3
12/23/2022 07:35:07 AM script INFO: SUCCESS!@#KODE 1!@#USER_ID 97!@#ACTIVITY_CODE 2
12/23/2022 07:35:07 AM script INFO: SUCCESS!@#KODE 1!@#USER_ID 97!@#ACTIVITY_CODE 2
12/23/2022 07:35:07 AM script INFO: SUCCESS!@#KODE 1!@#USER_ID 97!@#ACTIVITY_CODE 1
12/23/2022 07:35:07 AM script INFO: SUCCESS!@#KODE 1!@#USER_ID 97!@#ACTIVITY_CODE 1
12/23/2022 07:35:07 AM script INFO: SUCCESS!@#KODE 1!@#USER_ID 97!@#ACTIVITY_CODE 4
12/23/2022 07:35:07 AM script INFO: SUCCESS!@#KODE 1!@#USER_ID 97!@#ACTIVITY_CODE 1
12/23/2022 07:35:08 AM script INFO: SUCCESS!@#KODE 1!@#USER_ID 97!@#ACTIVITY_CODE 1
12/23/2022 07:35:08 AM script INFO: SUCCESS!@#KODE 1!@#USER_ID 97!@#ACTIVITY_CODE 1
12/23/2022 07:35:08 AM script INFO: SUCCESS!@#KODE 1!@#USER_ID 97!@#ACTIVITY_CODE 3
12/23/2022 07:35:08 AM script INFO: SUCCESS!@#KODE 1!@#USER_ID 97!@#ACTIVITY_CODE 3
12/23/2022 07:35:08 AM script INFO: SUCCESS!@#KODE 1!@#USER_ID 97!@#ACTIVITY_CODE 4
12/23/2022 07:35:08 AM script INFO: SUCCESS!@#KODE 1!@#USER_ID 97!@#ACTIVITY_CODE 1
12/23/2022 07:35:08 AM script INFO: SUCCESS!@#KODE 1!@#USER_ID 97!@#ACTIVITY_CODE 2
12/23/2022 07:35:08 AM script INFO: SUCCESS!@#KODE 1!@#USER_ID 97!@#ACTIVITY_CODE 2
12/23/2022 07:35:08 AM script INFO: SUCCESS!@#KODE 1!@#USER_ID 97!@#ACTIVITY_CODE 2
12/23/2022 07:35:08 AM script INFO: SUCCESS!@#KODE 1!@#USER_ID 97!@#ACTIVITY_CODE 2
12/23/2022 07:35:08 AM script INFO: SUCCESS!@#KODE 1!@#USER_ID 97!@#ACTIVITY_CODE 3
12/23/2022 07:35:08 AM script INFO: SUCCESS!@#KODE 1!@#USER_ID 97!@#ACTIVITY_CODE 3
12/23/2022 07:35:08 AM script INFO: SUCCESS!@#KODE 1!@#USER_ID 97!@#ACTIVITY_CODE 1
12/23/2022 07:35:08 AM script INFO: SUCCESS!@#KODE 1!@#USER_ID 97!@#ACTIVITY_CODE 2
12/23/2022 07:35:08 AM script INFO: SUCCESS!@#KODE 1!@#USER_ID 97!@#ACTIVITY_CODE 3
12/23/2022 07:35:08 AM script INFO: SUCCESS!@#KODE 1!@#USER_ID 97!@#ACTIVITY_CODE 3
12/23/2022 07:35:09 AM script INFO: SUCCESS!@#KODE 1!@#USER_ID 97!@#ACTIVITY_CODE 2
12/23/2022 07:35:09 AM script INFO: SUCCESS!@#KODE 1!@#USER_ID 97!@#ACTIVITY_CODE 3
12/23/2022 07:35:09 AM script INFO: SUCCESS!@#KODE 1!@#USER_ID 97!@#ACTIVITY_CODE 2
12/23/2022 07:35:09 AM script INFO: SUCCESS!@#KODE 1!@#USER_ID 97!@#ACTIVITY_CODE 1
12/23/2022 07:35:09 AM script INFO: SUCCESS!@#KODE 1!@#USER_ID 97!@#ACTIVITY_CODE 4
12/23/2022 07:35:09 AM script INFO: SUCCESS!@#KODE 1!@#USER_ID 97!@#ACTIVITY_CODE 1
12/23/2022 07:35:09 AM script INFO: SUCCESS!@#KODE 1!@#USER_ID 97!@#ACTIVITY_CODE 3
12/23/2022 07:35:09 AM script INFO: SUCCESS!@#KODE 1!@#USER_ID 97!@#ACTIVITY_CODE 2
12/23/2022 07:35:09 AM script INFO: SUCCESS!@#KODE 1!@#USER_ID 97!@#ACTIVITY_CODE 3
12/23/2022 07:35:09 AM script INFO: SUCCESS!@#KODE 1!@#USER_ID 97!@#ACTIVITY_CODE 3
12/23/2022 07:35:09 AM script INFO: SUCCESS!@#KODE 1!@#USER_ID 97!@#ACTIVITY_CODE 1
12/23/2022 07:35:09 AM script INFO: SUCCESS!@#KODE 1!@#USER_ID 97!@#ACTIVITY_CODE 1
12/23/2022 07:35:09 AM script INFO: SUCCESS!@#KODE 1!@#USER_ID 97!@#ACTIVITY_CODE 1
12/23/2022 07:35:09 AM script INFO: Duration: 79.8233630657196
12/23/2022 07:35:09 AM script INFO: mengakhiri-quiz
12/23/2022 07:35:10 AM script INFO: SUCCESS!@#KODE 1!@#USER_ID 97!@#ACTIVITY_CODE 5
12/23/2022 07:35:10 AM script INFO: berhasil-submit
