12/23/2022 03:21:10 AM script INFO: Prepared chrome options..
12/23/2022 03:21:11 AM script INFO: Initialized chrome browser..
12/23/2022 03:21:11 AM script INFO: mengakses-homepage
12/23/2022 03:21:28 AM script INFO: mengakses-login-page
12/23/2022 03:21:29 AM script INFO: mengakses-site-home
12/23/2022 03:21:30 AM script INFO: mengakses-site-course
12/23/2022 03:21:30 AM script INFO: mengakses-quiz
12/23/2022 03:21:31 AM script INFO: mengakses-start-quiz-page
12/23/2022 03:21:32 AM script INFO: memulai-quiz
12/23/2022 03:21:32 AM script INFO: SUCCESS!@#KODE 1!@#USER_ID 80!@#ACTIVITY_CODE 5
12/23/2022 03:21:43 AM script INFO: SUCCESS!@#KODE 1!@#USER_ID 80!@#ACTIVITY_CODE 5
12/23/2022 03:21:43 AM script INFO: SUCCESS!@#KODE 1!@#USER_ID 80!@#ACTIVITY_CODE 5
12/23/2022 03:21:45 AM script INFO: SUCCESS!@#KODE 1!@#USER_ID 80!@#ACTIVITY_CODE 2
12/23/2022 03:21:45 AM script INFO: SUCCESS!@#KODE 1!@#USER_ID 80!@#ACTIVITY_CODE 3
12/23/2022 03:21:45 AM script INFO: SUCCESS!@#KODE 1!@#USER_ID 80!@#ACTIVITY_CODE 3
12/23/2022 03:21:45 AM script INFO: SUCCESS!@#KODE 1!@#USER_ID 80!@#ACTIVITY_CODE 1
12/23/2022 03:21:46 AM script INFO: SUCCESS!@#KODE 1!@#USER_ID 80!@#ACTIVITY_CODE 1
12/23/2022 03:21:46 AM script INFO: SUCCESS!@#KODE 1!@#USER_ID 80!@#ACTIVITY_CODE 3
12/23/2022 03:21:46 AM script INFO: SUCCESS!@#KODE 1!@#USER_ID 80!@#ACTIVITY_CODE 2
12/23/2022 03:21:46 AM script INFO: SUCCESS!@#KODE 1!@#USER_ID 80!@#ACTIVITY_CODE 2
12/23/2022 03:21:46 AM script INFO: SUCCESS!@#KODE 1!@#USER_ID 80!@#ACTIVITY_CODE 3
12/23/2022 03:21:46 AM script INFO: SUCCESS!@#KODE 1!@#USER_ID 80!@#ACTIVITY_CODE 1
12/23/2022 03:21:46 AM script INFO: SUCCESS!@#KODE 1!@#USER_ID 80!@#ACTIVITY_CODE 5
12/23/2022 03:21:46 AM script INFO: SUCCESS!@#KODE 1!@#USER_ID 80!@#ACTIVITY_CODE 5
12/23/2022 03:21:49 AM script INFO: SUCCESS!@#KODE 1!@#USER_ID 80!@#ACTIVITY_CODE 3
12/23/2022 03:21:49 AM script INFO: SUCCESS!@#KODE 1!@#USER_ID 80!@#ACTIVITY_CODE 2
12/23/2022 03:21:49 AM script INFO: SUCCESS!@#KODE 1!@#USER_ID 80!@#ACTIVITY_CODE 2
12/23/2022 03:21:49 AM script INFO: SUCCESS!@#KODE 1!@#USER_ID 80!@#ACTIVITY_CODE 3
12/23/2022 03:21:49 AM script INFO: SUCCESS!@#KODE 1!@#USER_ID 80!@#ACTIVITY_CODE 5
12/23/2022 03:21:49 AM script INFO: SUCCESS!@#KODE 1!@#USER_ID 80!@#ACTIVITY_CODE 5
12/23/2022 03:21:51 AM script INFO: SUCCESS!@#KODE 1!@#USER_ID 80!@#ACTIVITY_CODE 5
12/23/2022 03:21:51 AM script INFO: SUCCESS!@#KODE 1!@#USER_ID 80!@#ACTIVITY_CODE 5
12/23/2022 03:21:54 AM script INFO: SUCCESS!@#KODE 1!@#USER_ID 80!@#ACTIVITY_CODE 1
12/23/2022 03:21:54 AM script INFO: SUCCESS!@#KODE 1!@#USER_ID 80!@#ACTIVITY_CODE 2
12/23/2022 03:21:54 AM script INFO: SUCCESS!@#KODE 1!@#USER_ID 80!@#ACTIVITY_CODE 5
12/23/2022 03:21:54 AM script INFO: SUCCESS!@#KODE 1!@#USER_ID 80!@#ACTIVITY_CODE 5
12/23/2022 03:21:57 AM script INFO: SUCCESS!@#KODE 1!@#USER_ID 80!@#ACTIVITY_CODE 2
12/23/2022 03:21:57 AM script INFO: SUCCESS!@#KODE 1!@#USER_ID 80!@#ACTIVITY_CODE 1
12/23/2022 03:21:57 AM script INFO: SUCCESS!@#KODE 1!@#USER_ID 80!@#ACTIVITY_CODE 1
12/23/2022 03:21:57 AM script INFO: SUCCESS!@#KODE 1!@#USER_ID 80!@#ACTIVITY_CODE 2
12/23/2022 03:21:57 AM script INFO: SUCCESS!@#KODE 1!@#USER_ID 80!@#ACTIVITY_CODE 3
12/23/2022 03:21:57 AM script INFO: SUCCESS!@#KODE 1!@#USER_ID 80!@#ACTIVITY_CODE 2
12/23/2022 03:21:57 AM script INFO: SUCCESS!@#KODE 1!@#USER_ID 80!@#ACTIVITY_CODE 2
12/23/2022 03:21:57 AM script INFO: SUCCESS!@#KODE 1!@#USER_ID 80!@#ACTIVITY_CODE 5
12/23/2022 03:21:57 AM script INFO: SUCCESS!@#KODE 1!@#USER_ID 80!@#ACTIVITY_CODE 5
12/23/2022 03:22:00 AM script INFO: SUCCESS!@#KODE 1!@#USER_ID 80!@#ACTIVITY_CODE 1
12/23/2022 03:22:00 AM script INFO: SUCCESS!@#KODE 1!@#USER_ID 80!@#ACTIVITY_CODE 4
12/23/2022 03:22:00 AM script INFO: SUCCESS!@#KODE 1!@#USER_ID 80!@#ACTIVITY_CODE 1
12/23/2022 03:22:00 AM script INFO: SUCCESS!@#KODE 1!@#USER_ID 80!@#ACTIVITY_CODE 5
12/23/2022 03:22:00 AM script INFO: SUCCESS!@#KODE 1!@#USER_ID 80!@#ACTIVITY_CODE 5
12/23/2022 03:22:03 AM script INFO: SUCCESS!@#KODE 1!@#USER_ID 80!@#ACTIVITY_CODE 4
12/23/2022 03:22:03 AM script INFO: SUCCESS!@#KODE 1!@#USER_ID 80!@#ACTIVITY_CODE 1
12/23/2022 03:22:03 AM script INFO: SUCCESS!@#KODE 1!@#USER_ID 80!@#ACTIVITY_CODE 3
12/23/2022 03:22:03 AM script INFO: SUCCESS!@#KODE 1!@#USER_ID 80!@#ACTIVITY_CODE 5
12/23/2022 03:22:03 AM script INFO: SUCCESS!@#KODE 1!@#USER_ID 80!@#ACTIVITY_CODE 5
12/23/2022 03:22:06 AM script INFO: SUCCESS!@#KODE 1!@#USER_ID 80!@#ACTIVITY_CODE 3
12/23/2022 03:22:06 AM script INFO: SUCCESS!@#KODE 1!@#USER_ID 80!@#ACTIVITY_CODE 5
12/23/2022 03:22:06 AM script INFO: SUCCESS!@#KODE 1!@#USER_ID 80!@#ACTIVITY_CODE 5
12/23/2022 03:22:08 AM script INFO: SUCCESS!@#KODE 1!@#USER_ID 80!@#ACTIVITY_CODE 2
12/23/2022 03:22:08 AM script INFO: SUCCESS!@#KODE 1!@#USER_ID 80!@#ACTIVITY_CODE 1
12/23/2022 03:22:08 AM script INFO: SUCCESS!@#KODE 1!@#USER_ID 80!@#ACTIVITY_CODE 1
12/23/2022 03:22:08 AM script INFO: SUCCESS!@#KODE 1!@#USER_ID 80!@#ACTIVITY_CODE 5
12/23/2022 03:22:08 AM script INFO: SUCCESS!@#KODE 1!@#USER_ID 80!@#ACTIVITY_CODE 5
12/23/2022 03:22:11 AM script INFO: SUCCESS!@#KODE 1!@#USER_ID 80!@#ACTIVITY_CODE 3
12/23/2022 03:22:11 AM script INFO: SUCCESS!@#KODE 1!@#USER_ID 80!@#ACTIVITY_CODE 1
12/23/2022 03:22:11 AM script INFO: SUCCESS!@#KODE 1!@#USER_ID 80!@#ACTIVITY_CODE 5
12/23/2022 03:22:11 AM script INFO: SUCCESS!@#KODE 1!@#USER_ID 80!@#ACTIVITY_CODE 5
12/23/2022 03:22:14 AM script INFO: SUCCESS!@#KODE 1!@#USER_ID 80!@#ACTIVITY_CODE 2
12/23/2022 03:22:14 AM script INFO: SUCCESS!@#KODE 1!@#USER_ID 80!@#ACTIVITY_CODE 3
12/23/2022 03:22:14 AM script INFO: SUCCESS!@#KODE 1!@#USER_ID 80!@#ACTIVITY_CODE 3
12/23/2022 03:22:14 AM script INFO: SUCCESS!@#KODE 1!@#USER_ID 80!@#ACTIVITY_CODE 2
12/23/2022 03:22:14 AM script INFO: SUCCESS!@#KODE 1!@#USER_ID 80!@#ACTIVITY_CODE 1
12/23/2022 03:22:14 AM script INFO: SUCCESS!@#KODE 1!@#USER_ID 80!@#ACTIVITY_CODE 1
12/23/2022 03:22:14 AM script INFO: SUCCESS!@#KODE 1!@#USER_ID 80!@#ACTIVITY_CODE 4
12/23/2022 03:22:14 AM script INFO: SUCCESS!@#KODE 1!@#USER_ID 80!@#ACTIVITY_CODE 2
12/23/2022 03:22:14 AM script INFO: SUCCESS!@#KODE 1!@#USER_ID 80!@#ACTIVITY_CODE 1
12/23/2022 03:22:15 AM script INFO: SUCCESS!@#KODE 1!@#USER_ID 80!@#ACTIVITY_CODE 2
12/23/2022 03:22:15 AM script INFO: SUCCESS!@#KODE 1!@#USER_ID 80!@#ACTIVITY_CODE 3
12/23/2022 03:22:15 AM script INFO: SUCCESS!@#KODE 1!@#USER_ID 80!@#ACTIVITY_CODE 3
12/23/2022 03:22:15 AM script INFO: SUCCESS!@#KODE 1!@#USER_ID 80!@#ACTIVITY_CODE 2
12/23/2022 03:22:15 AM script INFO: SUCCESS!@#KODE 1!@#USER_ID 80!@#ACTIVITY_CODE 4
12/23/2022 03:22:15 AM script INFO: SUCCESS!@#KODE 1!@#USER_ID 80!@#ACTIVITY_CODE 3
12/23/2022 03:22:15 AM script INFO: SUCCESS!@#KODE 1!@#USER_ID 80!@#ACTIVITY_CODE 3
12/23/2022 03:22:15 AM script INFO: SUCCESS!@#KODE 1!@#USER_ID 80!@#ACTIVITY_CODE 3
12/23/2022 03:22:15 AM script INFO: SUCCESS!@#KODE 1!@#USER_ID 80!@#ACTIVITY_CODE 1
12/23/2022 03:22:15 AM script INFO: SUCCESS!@#KODE 1!@#USER_ID 80!@#ACTIVITY_CODE 3
12/23/2022 03:22:15 AM script INFO: SUCCESS!@#KODE 1!@#USER_ID 80!@#ACTIVITY_CODE 4
12/23/2022 03:22:15 AM script INFO: SUCCESS!@#KODE 1!@#USER_ID 80!@#ACTIVITY_CODE 3
12/23/2022 03:22:16 AM script INFO: SUCCESS!@#KODE 1!@#USER_ID 80!@#ACTIVITY_CODE 3
12/23/2022 03:22:16 AM script INFO: SUCCESS!@#KODE 1!@#USER_ID 80!@#ACTIVITY_CODE 3
12/23/2022 03:22:16 AM script INFO: SUCCESS!@#KODE 1!@#USER_ID 80!@#ACTIVITY_CODE 3
12/23/2022 03:22:16 AM script INFO: SUCCESS!@#KODE 1!@#USER_ID 80!@#ACTIVITY_CODE 1
12/23/2022 03:22:16 AM script INFO: SUCCESS!@#KODE 1!@#USER_ID 80!@#ACTIVITY_CODE 2
12/23/2022 03:22:16 AM script INFO: SUCCESS!@#KODE 1!@#USER_ID 80!@#ACTIVITY_CODE 3
12/23/2022 03:22:16 AM script INFO: SUCCESS!@#KODE 1!@#USER_ID 80!@#ACTIVITY_CODE 3
12/23/2022 03:22:16 AM script INFO: SUCCESS!@#KODE 1!@#USER_ID 80!@#ACTIVITY_CODE 2
12/23/2022 03:22:16 AM script INFO: SUCCESS!@#KODE 1!@#USER_ID 80!@#ACTIVITY_CODE 4
12/23/2022 03:22:16 AM script INFO: SUCCESS!@#KODE 1!@#USER_ID 80!@#ACTIVITY_CODE 3
12/23/2022 03:22:16 AM script INFO: SUCCESS!@#KODE 1!@#USER_ID 80!@#ACTIVITY_CODE 2
12/23/2022 03:22:17 AM script INFO: SUCCESS!@#KODE 1!@#USER_ID 80!@#ACTIVITY_CODE 2
12/23/2022 03:22:17 AM script INFO: SUCCESS!@#KODE 1!@#USER_ID 80!@#ACTIVITY_CODE 1
12/23/2022 03:22:17 AM script INFO: SUCCESS!@#KODE 1!@#USER_ID 80!@#ACTIVITY_CODE 4
12/23/2022 03:22:17 AM script INFO: SUCCESS!@#KODE 1!@#USER_ID 80!@#ACTIVITY_CODE 3
12/23/2022 03:22:17 AM script INFO: SUCCESS!@#KODE 1!@#USER_ID 80!@#ACTIVITY_CODE 1
12/23/2022 03:22:17 AM script INFO: SUCCESS!@#KODE 1!@#USER_ID 80!@#ACTIVITY_CODE 2
12/23/2022 03:22:17 AM script INFO: SUCCESS!@#KODE 1!@#USER_ID 80!@#ACTIVITY_CODE 3
12/23/2022 03:22:17 AM script INFO: SUCCESS!@#KODE 1!@#USER_ID 80!@#ACTIVITY_CODE 4
12/23/2022 03:22:17 AM script INFO: SUCCESS!@#KODE 1!@#USER_ID 80!@#ACTIVITY_CODE 1
12/23/2022 03:22:17 AM script INFO: Duration: 34.45268964767456
12/23/2022 03:22:17 AM script INFO: mengakhiri-quiz
12/23/2022 03:22:23 AM script INFO: SUCCESS!@#KODE 1!@#USER_ID 80!@#ACTIVITY_CODE 5
12/23/2022 03:22:23 AM script INFO: berhasil-submit
