12/23/2022 07:21:05 AM script INFO: Prepared chrome options..
12/23/2022 07:21:06 AM script INFO: Initialized chrome browser..
12/23/2022 07:21:06 AM script INFO: mengakses-homepage
12/23/2022 07:21:25 AM script INFO: mengakses-login-page
12/23/2022 07:21:26 AM script INFO: mengakses-site-home
12/23/2022 07:21:27 AM script INFO: mengakses-site-course
12/23/2022 07:21:27 AM script INFO: mengakses-quiz
12/23/2022 07:21:28 AM script INFO: mengakses-start-quiz-page
12/23/2022 07:21:29 AM script INFO: memulai-quiz
12/23/2022 07:21:29 AM script INFO: SUCCESS!@#KODE 1!@#USER_ID 27!@#ACTIVITY_CODE 5
12/23/2022 07:21:40 AM script INFO: SUCCESS!@#KODE 1!@#USER_ID 27!@#ACTIVITY_CODE 5
12/23/2022 07:21:40 AM script INFO: SUCCESS!@#KODE 1!@#USER_ID 27!@#ACTIVITY_CODE 5
12/23/2022 07:21:42 AM script INFO: SUCCESS!@#KODE 1!@#USER_ID 27!@#ACTIVITY_CODE 3
12/23/2022 07:21:42 AM script INFO: SUCCESS!@#KODE 1!@#USER_ID 27!@#ACTIVITY_CODE 5
12/23/2022 07:21:42 AM script INFO: SUCCESS!@#KODE 1!@#USER_ID 27!@#ACTIVITY_CODE 5
12/23/2022 07:21:45 AM script INFO: SUCCESS!@#KODE 1!@#USER_ID 27!@#ACTIVITY_CODE 5
12/23/2022 07:21:45 AM script INFO: SUCCESS!@#KODE 1!@#USER_ID 27!@#ACTIVITY_CODE 5
12/23/2022 07:21:47 AM script INFO: SUCCESS!@#KODE 1!@#USER_ID 27!@#ACTIVITY_CODE 1
12/23/2022 07:21:47 AM script INFO: SUCCESS!@#KODE 1!@#USER_ID 27!@#ACTIVITY_CODE 3
12/23/2022 07:21:48 AM script INFO: SUCCESS!@#KODE 1!@#USER_ID 27!@#ACTIVITY_CODE 3
12/23/2022 07:21:48 AM script INFO: SUCCESS!@#KODE 1!@#USER_ID 27!@#ACTIVITY_CODE 4
12/23/2022 07:21:48 AM script INFO: SUCCESS!@#KODE 1!@#USER_ID 27!@#ACTIVITY_CODE 3
12/23/2022 07:21:48 AM script INFO: SUCCESS!@#KODE 1!@#USER_ID 27!@#ACTIVITY_CODE 5
12/23/2022 07:21:48 AM script INFO: SUCCESS!@#KODE 1!@#USER_ID 27!@#ACTIVITY_CODE 5
12/23/2022 07:21:50 AM script INFO: SUCCESS!@#KODE 1!@#USER_ID 27!@#ACTIVITY_CODE 5
12/23/2022 07:21:50 AM script INFO: SUCCESS!@#KODE 1!@#USER_ID 27!@#ACTIVITY_CODE 5
12/23/2022 07:21:53 AM script INFO: SUCCESS!@#KODE 1!@#USER_ID 27!@#ACTIVITY_CODE 3
12/23/2022 07:21:53 AM script INFO: SUCCESS!@#KODE 1!@#USER_ID 27!@#ACTIVITY_CODE 5
12/23/2022 07:21:53 AM script INFO: SUCCESS!@#KODE 1!@#USER_ID 27!@#ACTIVITY_CODE 5
12/23/2022 07:21:56 AM script INFO: SUCCESS!@#KODE 1!@#USER_ID 27!@#ACTIVITY_CODE 1
12/23/2022 07:21:56 AM script INFO: SUCCESS!@#KODE 1!@#USER_ID 27!@#ACTIVITY_CODE 1
12/23/2022 07:21:56 AM script INFO: SUCCESS!@#KODE 1!@#USER_ID 27!@#ACTIVITY_CODE 1
12/23/2022 07:21:56 AM script INFO: SUCCESS!@#KODE 1!@#USER_ID 27!@#ACTIVITY_CODE 5
12/23/2022 07:21:56 AM script INFO: SUCCESS!@#KODE 1!@#USER_ID 27!@#ACTIVITY_CODE 5
12/23/2022 07:21:58 AM script INFO: SUCCESS!@#KODE 1!@#USER_ID 27!@#ACTIVITY_CODE 5
12/23/2022 07:21:58 AM script INFO: SUCCESS!@#KODE 1!@#USER_ID 27!@#ACTIVITY_CODE 5
12/23/2022 07:22:01 AM script INFO: SUCCESS!@#KODE 1!@#USER_ID 27!@#ACTIVITY_CODE 5
12/23/2022 07:22:01 AM script INFO: SUCCESS!@#KODE 1!@#USER_ID 27!@#ACTIVITY_CODE 5
12/23/2022 07:22:03 AM script INFO: SUCCESS!@#KODE 1!@#USER_ID 27!@#ACTIVITY_CODE 3
12/23/2022 07:22:03 AM script INFO: SUCCESS!@#KODE 1!@#USER_ID 27!@#ACTIVITY_CODE 1
12/23/2022 07:22:03 AM script INFO: SUCCESS!@#KODE 1!@#USER_ID 27!@#ACTIVITY_CODE 4
12/23/2022 07:22:03 AM script INFO: SUCCESS!@#KODE 1!@#USER_ID 27!@#ACTIVITY_CODE 1
12/23/2022 07:22:04 AM script INFO: SUCCESS!@#KODE 1!@#USER_ID 27!@#ACTIVITY_CODE 4
12/23/2022 07:22:04 AM script INFO: SUCCESS!@#KODE 1!@#USER_ID 27!@#ACTIVITY_CODE 3
12/23/2022 07:22:04 AM script INFO: SUCCESS!@#KODE 1!@#USER_ID 27!@#ACTIVITY_CODE 1
12/23/2022 07:22:04 AM script INFO: SUCCESS!@#KODE 1!@#USER_ID 27!@#ACTIVITY_CODE 1
12/23/2022 07:22:04 AM script INFO: SUCCESS!@#KODE 1!@#USER_ID 27!@#ACTIVITY_CODE 1
12/23/2022 07:22:04 AM script INFO: SUCCESS!@#KODE 1!@#USER_ID 27!@#ACTIVITY_CODE 5
12/23/2022 07:22:04 AM script INFO: SUCCESS!@#KODE 1!@#USER_ID 27!@#ACTIVITY_CODE 5
12/23/2022 07:22:06 AM script INFO: SUCCESS!@#KODE 1!@#USER_ID 27!@#ACTIVITY_CODE 4
12/23/2022 07:22:06 AM script INFO: SUCCESS!@#KODE 1!@#USER_ID 27!@#ACTIVITY_CODE 5
12/23/2022 07:22:06 AM script INFO: SUCCESS!@#KODE 1!@#USER_ID 27!@#ACTIVITY_CODE 5
12/23/2022 07:22:09 AM script INFO: SUCCESS!@#KODE 1!@#USER_ID 27!@#ACTIVITY_CODE 3
12/23/2022 07:22:09 AM script INFO: SUCCESS!@#KODE 1!@#USER_ID 27!@#ACTIVITY_CODE 1
12/23/2022 07:22:09 AM script INFO: SUCCESS!@#KODE 1!@#USER_ID 27!@#ACTIVITY_CODE 2
12/23/2022 07:22:09 AM script INFO: SUCCESS!@#KODE 1!@#USER_ID 27!@#ACTIVITY_CODE 5
12/23/2022 07:22:09 AM script INFO: SUCCESS!@#KODE 1!@#USER_ID 27!@#ACTIVITY_CODE 5
12/23/2022 07:22:12 AM script INFO: SUCCESS!@#KODE 1!@#USER_ID 27!@#ACTIVITY_CODE 3
12/23/2022 07:22:12 AM script INFO: SUCCESS!@#KODE 1!@#USER_ID 27!@#ACTIVITY_CODE 3
12/23/2022 07:22:12 AM script INFO: SUCCESS!@#KODE 1!@#USER_ID 27!@#ACTIVITY_CODE 1
12/23/2022 07:22:12 AM script INFO: SUCCESS!@#KODE 1!@#USER_ID 27!@#ACTIVITY_CODE 3
12/23/2022 07:22:12 AM script INFO: SUCCESS!@#KODE 1!@#USER_ID 27!@#ACTIVITY_CODE 3
12/23/2022 07:22:12 AM script INFO: SUCCESS!@#KODE 1!@#USER_ID 27!@#ACTIVITY_CODE 3
12/23/2022 07:22:12 AM script INFO: SUCCESS!@#KODE 1!@#USER_ID 27!@#ACTIVITY_CODE 1
12/23/2022 07:22:12 AM script INFO: SUCCESS!@#KODE 1!@#USER_ID 27!@#ACTIVITY_CODE 2
12/23/2022 07:22:12 AM script INFO: SUCCESS!@#KODE 1!@#USER_ID 27!@#ACTIVITY_CODE 3
12/23/2022 07:22:13 AM script INFO: SUCCESS!@#KODE 1!@#USER_ID 27!@#ACTIVITY_CODE 1
12/23/2022 07:22:13 AM script INFO: SUCCESS!@#KODE 1!@#USER_ID 27!@#ACTIVITY_CODE 1
12/23/2022 07:22:13 AM script INFO: SUCCESS!@#KODE 1!@#USER_ID 27!@#ACTIVITY_CODE 3
12/23/2022 07:22:13 AM script INFO: SUCCESS!@#KODE 1!@#USER_ID 27!@#ACTIVITY_CODE 4
12/23/2022 07:22:13 AM script INFO: SUCCESS!@#KODE 1!@#USER_ID 27!@#ACTIVITY_CODE 5
12/23/2022 07:22:13 AM script INFO: SUCCESS!@#KODE 1!@#USER_ID 27!@#ACTIVITY_CODE 5
12/23/2022 07:22:15 AM script INFO: SUCCESS!@#KODE 1!@#USER_ID 27!@#ACTIVITY_CODE 1
12/23/2022 07:22:15 AM script INFO: SUCCESS!@#KODE 1!@#USER_ID 27!@#ACTIVITY_CODE 1
12/23/2022 07:22:15 AM script INFO: SUCCESS!@#KODE 1!@#USER_ID 27!@#ACTIVITY_CODE 3
12/23/2022 07:22:16 AM script INFO: SUCCESS!@#KODE 1!@#USER_ID 27!@#ACTIVITY_CODE 1
12/23/2022 07:22:16 AM script INFO: SUCCESS!@#KODE 1!@#USER_ID 27!@#ACTIVITY_CODE 1
12/23/2022 07:22:16 AM script INFO: SUCCESS!@#KODE 1!@#USER_ID 27!@#ACTIVITY_CODE 4
12/23/2022 07:22:16 AM script INFO: SUCCESS!@#KODE 1!@#USER_ID 27!@#ACTIVITY_CODE 1
12/23/2022 07:22:16 AM script INFO: SUCCESS!@#KODE 1!@#USER_ID 27!@#ACTIVITY_CODE 5
12/23/2022 07:22:16 AM script INFO: SUCCESS!@#KODE 1!@#USER_ID 27!@#ACTIVITY_CODE 5
12/23/2022 07:22:18 AM script INFO: SUCCESS!@#KODE 1!@#USER_ID 27!@#ACTIVITY_CODE 5
12/23/2022 07:22:18 AM script INFO: SUCCESS!@#KODE 1!@#USER_ID 27!@#ACTIVITY_CODE 5
12/23/2022 07:22:21 AM script INFO: SUCCESS!@#KODE 1!@#USER_ID 27!@#ACTIVITY_CODE 4
12/23/2022 07:22:21 AM script INFO: SUCCESS!@#KODE 1!@#USER_ID 27!@#ACTIVITY_CODE 2
12/23/2022 07:22:21 AM script INFO: SUCCESS!@#KODE 1!@#USER_ID 27!@#ACTIVITY_CODE 2
12/23/2022 07:22:21 AM script INFO: SUCCESS!@#KODE 1!@#USER_ID 27!@#ACTIVITY_CODE 1
12/23/2022 07:22:22 AM script INFO: SUCCESS!@#KODE 1!@#USER_ID 27!@#ACTIVITY_CODE 3
12/23/2022 07:22:22 AM script INFO: SUCCESS!@#KODE 1!@#USER_ID 27!@#ACTIVITY_CODE 4
12/23/2022 07:22:22 AM script INFO: SUCCESS!@#KODE 1!@#USER_ID 27!@#ACTIVITY_CODE 3
12/23/2022 07:22:22 AM script INFO: SUCCESS!@#KODE 1!@#USER_ID 27!@#ACTIVITY_CODE 3
12/23/2022 07:22:22 AM script INFO: SUCCESS!@#KODE 1!@#USER_ID 27!@#ACTIVITY_CODE 3
12/23/2022 07:22:22 AM script INFO: SUCCESS!@#KODE 1!@#USER_ID 27!@#ACTIVITY_CODE 1
12/23/2022 07:22:22 AM script INFO: SUCCESS!@#KODE 1!@#USER_ID 27!@#ACTIVITY_CODE 2
12/23/2022 07:22:22 AM script INFO: SUCCESS!@#KODE 1!@#USER_ID 27!@#ACTIVITY_CODE 3
12/23/2022 07:22:22 AM script INFO: SUCCESS!@#KODE 1!@#USER_ID 27!@#ACTIVITY_CODE 3
12/23/2022 07:22:22 AM script INFO: SUCCESS!@#KODE 1!@#USER_ID 27!@#ACTIVITY_CODE 1
12/23/2022 07:22:23 AM script INFO: SUCCESS!@#KODE 1!@#USER_ID 27!@#ACTIVITY_CODE 2
12/23/2022 07:22:23 AM script INFO: SUCCESS!@#KODE 1!@#USER_ID 27!@#ACTIVITY_CODE 1
12/23/2022 07:22:23 AM script INFO: SUCCESS!@#KODE 1!@#USER_ID 27!@#ACTIVITY_CODE 5
12/23/2022 07:22:23 AM script INFO: SUCCESS!@#KODE 1!@#USER_ID 27!@#ACTIVITY_CODE 5
12/23/2022 07:22:25 AM script INFO: SUCCESS!@#KODE 1!@#USER_ID 27!@#ACTIVITY_CODE 2
12/23/2022 07:22:26 AM script INFO: SUCCESS!@#KODE 1!@#USER_ID 27!@#ACTIVITY_CODE 2
12/23/2022 07:22:26 AM script INFO: SUCCESS!@#KODE 1!@#USER_ID 27!@#ACTIVITY_CODE 2
12/23/2022 07:22:26 AM script INFO: SUCCESS!@#KODE 1!@#USER_ID 27!@#ACTIVITY_CODE 1
12/23/2022 07:22:26 AM script INFO: SUCCESS!@#KODE 1!@#USER_ID 27!@#ACTIVITY_CODE 4
12/23/2022 07:22:26 AM script INFO: SUCCESS!@#KODE 1!@#USER_ID 27!@#ACTIVITY_CODE 3
12/23/2022 07:22:27 AM script INFO: SUCCESS!@#KODE 1!@#USER_ID 27!@#ACTIVITY_CODE 2
12/23/2022 07:22:27 AM script INFO: SUCCESS!@#KODE 1!@#USER_ID 27!@#ACTIVITY_CODE 3
12/23/2022 07:22:27 AM script INFO: SUCCESS!@#KODE 1!@#USER_ID 27!@#ACTIVITY_CODE 3
12/23/2022 07:22:27 AM script INFO: SUCCESS!@#KODE 1!@#USER_ID 27!@#ACTIVITY_CODE 3
12/23/2022 07:22:27 AM script INFO: SUCCESS!@#KODE 1!@#USER_ID 27!@#ACTIVITY_CODE 3
12/23/2022 07:22:27 AM script INFO: SUCCESS!@#KODE 1!@#USER_ID 27!@#ACTIVITY_CODE 2
12/23/2022 07:22:27 AM script INFO: SUCCESS!@#KODE 1!@#USER_ID 27!@#ACTIVITY_CODE 2
12/23/2022 07:22:28 AM script INFO: SUCCESS!@#KODE 1!@#USER_ID 27!@#ACTIVITY_CODE 1
12/23/2022 07:22:28 AM script INFO: SUCCESS!@#KODE 1!@#USER_ID 27!@#ACTIVITY_CODE 1
12/23/2022 07:22:28 AM script INFO: SUCCESS!@#KODE 1!@#USER_ID 27!@#ACTIVITY_CODE 4
12/23/2022 07:22:28 AM script INFO: SUCCESS!@#KODE 1!@#USER_ID 27!@#ACTIVITY_CODE 3
12/23/2022 07:22:28 AM script INFO: SUCCESS!@#KODE 1!@#USER_ID 27!@#ACTIVITY_CODE 2
12/23/2022 07:22:28 AM script INFO: SUCCESS!@#KODE 1!@#USER_ID 27!@#ACTIVITY_CODE 2
12/23/2022 07:22:29 AM script INFO: SUCCESS!@#KODE 1!@#USER_ID 27!@#ACTIVITY_CODE 1
12/23/2022 07:22:29 AM script INFO: SUCCESS!@#KODE 1!@#USER_ID 27!@#ACTIVITY_CODE 4
12/23/2022 07:22:29 AM script INFO: SUCCESS!@#KODE 1!@#USER_ID 27!@#ACTIVITY_CODE 2
12/23/2022 07:22:29 AM script INFO: SUCCESS!@#KODE 1!@#USER_ID 27!@#ACTIVITY_CODE 2
12/23/2022 07:22:29 AM script INFO: SUCCESS!@#KODE 1!@#USER_ID 27!@#ACTIVITY_CODE 4
12/23/2022 07:22:30 AM script INFO: SUCCESS!@#KODE 1!@#USER_ID 27!@#ACTIVITY_CODE 2
12/23/2022 07:22:30 AM script INFO: SUCCESS!@#KODE 1!@#USER_ID 27!@#ACTIVITY_CODE 2
12/23/2022 07:22:30 AM script INFO: SUCCESS!@#KODE 1!@#USER_ID 27!@#ACTIVITY_CODE 2
12/23/2022 07:22:30 AM script INFO: SUCCESS!@#KODE 1!@#USER_ID 27!@#ACTIVITY_CODE 3
12/23/2022 07:22:31 AM script INFO: SUCCESS!@#KODE 1!@#USER_ID 27!@#ACTIVITY_CODE 2
12/23/2022 07:22:31 AM script INFO: SUCCESS!@#KODE 1!@#USER_ID 27!@#ACTIVITY_CODE 2
12/23/2022 07:22:31 AM script INFO: SUCCESS!@#KODE 1!@#USER_ID 27!@#ACTIVITY_CODE 2
12/23/2022 07:22:31 AM script INFO: SUCCESS!@#KODE 1!@#USER_ID 27!@#ACTIVITY_CODE 2
12/23/2022 07:22:32 AM script INFO: SUCCESS!@#KODE 1!@#USER_ID 27!@#ACTIVITY_CODE 3
12/23/2022 07:22:32 AM script INFO: SUCCESS!@#KODE 1!@#USER_ID 27!@#ACTIVITY_CODE 1
12/23/2022 07:22:32 AM script INFO: SUCCESS!@#KODE 1!@#USER_ID 27!@#ACTIVITY_CODE 1
12/23/2022 07:22:32 AM script INFO: SUCCESS!@#KODE 1!@#USER_ID 27!@#ACTIVITY_CODE 4
12/23/2022 07:22:32 AM script INFO: SUCCESS!@#KODE 1!@#USER_ID 27!@#ACTIVITY_CODE 1
12/23/2022 07:22:32 AM script INFO: SUCCESS!@#KODE 1!@#USER_ID 27!@#ACTIVITY_CODE 1
12/23/2022 07:22:32 AM script INFO: SUCCESS!@#KODE 1!@#USER_ID 27!@#ACTIVITY_CODE 1
12/23/2022 07:22:32 AM script INFO: SUCCESS!@#KODE 1!@#USER_ID 27!@#ACTIVITY_CODE 4
12/23/2022 07:22:32 AM script INFO: SUCCESS!@#KODE 1!@#USER_ID 27!@#ACTIVITY_CODE 1
12/23/2022 07:22:33 AM script INFO: SUCCESS!@#KODE 1!@#USER_ID 27!@#ACTIVITY_CODE 4
12/23/2022 07:22:33 AM script INFO: SUCCESS!@#KODE 1!@#USER_ID 27!@#ACTIVITY_CODE 1
12/23/2022 07:22:33 AM script INFO: SUCCESS!@#KODE 1!@#USER_ID 27!@#ACTIVITY_CODE 4
12/23/2022 07:22:33 AM script INFO: SUCCESS!@#KODE 1!@#USER_ID 27!@#ACTIVITY_CODE 1
12/23/2022 07:22:33 AM script INFO: SUCCESS!@#KODE 1!@#USER_ID 27!@#ACTIVITY_CODE 2
12/23/2022 07:22:33 AM script INFO: SUCCESS!@#KODE 1!@#USER_ID 27!@#ACTIVITY_CODE 3
12/23/2022 07:22:34 AM script INFO: SUCCESS!@#KODE 1!@#USER_ID 27!@#ACTIVITY_CODE 3
12/23/2022 07:22:34 AM script INFO: SUCCESS!@#KODE 1!@#USER_ID 27!@#ACTIVITY_CODE 3
12/23/2022 07:22:34 AM script INFO: SUCCESS!@#KODE 1!@#USER_ID 27!@#ACTIVITY_CODE 4
12/23/2022 07:22:34 AM script INFO: SUCCESS!@#KODE 1!@#USER_ID 27!@#ACTIVITY_CODE 1
12/23/2022 07:22:34 AM script INFO: SUCCESS!@#KODE 1!@#USER_ID 27!@#ACTIVITY_CODE 2
12/23/2022 07:22:34 AM script INFO: SUCCESS!@#KODE 1!@#USER_ID 27!@#ACTIVITY_CODE 3
12/23/2022 07:22:34 AM script INFO: SUCCESS!@#KODE 1!@#USER_ID 27!@#ACTIVITY_CODE 3
12/23/2022 07:22:35 AM script INFO: SUCCESS!@#KODE 1!@#USER_ID 27!@#ACTIVITY_CODE 2
12/23/2022 07:22:35 AM script INFO: SUCCESS!@#KODE 1!@#USER_ID 27!@#ACTIVITY_CODE 4
12/23/2022 07:22:35 AM script INFO: SUCCESS!@#KODE 1!@#USER_ID 27!@#ACTIVITY_CODE 3
12/23/2022 07:22:35 AM script INFO: SUCCESS!@#KODE 1!@#USER_ID 27!@#ACTIVITY_CODE 2
12/23/2022 07:22:35 AM script INFO: SUCCESS!@#KODE 1!@#USER_ID 27!@#ACTIVITY_CODE 3
12/23/2022 07:22:35 AM script INFO: SUCCESS!@#KODE 1!@#USER_ID 27!@#ACTIVITY_CODE 3
12/23/2022 07:22:36 AM script INFO: SUCCESS!@#KODE 1!@#USER_ID 27!@#ACTIVITY_CODE 2
12/23/2022 07:22:36 AM script INFO: SUCCESS!@#KODE 1!@#USER_ID 27!@#ACTIVITY_CODE 2
12/23/2022 07:22:36 AM script INFO: SUCCESS!@#KODE 1!@#USER_ID 27!@#ACTIVITY_CODE 1
12/23/2022 07:22:36 AM script INFO: SUCCESS!@#KODE 1!@#USER_ID 27!@#ACTIVITY_CODE 4
12/23/2022 07:22:36 AM script INFO: SUCCESS!@#KODE 1!@#USER_ID 27!@#ACTIVITY_CODE 3
12/23/2022 07:22:36 AM script INFO: SUCCESS!@#KODE 1!@#USER_ID 27!@#ACTIVITY_CODE 3
12/23/2022 07:22:37 AM script INFO: SUCCESS!@#KODE 1!@#USER_ID 27!@#ACTIVITY_CODE 2
12/23/2022 07:22:37 AM script INFO: SUCCESS!@#KODE 1!@#USER_ID 27!@#ACTIVITY_CODE 2
12/23/2022 07:22:37 AM script INFO: SUCCESS!@#KODE 1!@#USER_ID 27!@#ACTIVITY_CODE 4
12/23/2022 07:22:37 AM script INFO: SUCCESS!@#KODE 1!@#USER_ID 27!@#ACTIVITY_CODE 1
12/23/2022 07:22:38 AM script INFO: SUCCESS!@#KODE 1!@#USER_ID 27!@#ACTIVITY_CODE 2
12/23/2022 07:22:38 AM script INFO: SUCCESS!@#KODE 1!@#USER_ID 27!@#ACTIVITY_CODE 3
12/23/2022 07:22:38 AM script INFO: SUCCESS!@#KODE 1!@#USER_ID 27!@#ACTIVITY_CODE 3
12/23/2022 07:22:38 AM script INFO: SUCCESS!@#KODE 1!@#USER_ID 27!@#ACTIVITY_CODE 3
12/23/2022 07:22:38 AM script INFO: SUCCESS!@#KODE 1!@#USER_ID 27!@#ACTIVITY_CODE 3
12/23/2022 07:22:38 AM script INFO: SUCCESS!@#KODE 1!@#USER_ID 27!@#ACTIVITY_CODE 1
12/23/2022 07:22:38 AM script INFO: SUCCESS!@#KODE 1!@#USER_ID 27!@#ACTIVITY_CODE 3
12/23/2022 07:22:38 AM script INFO: SUCCESS!@#KODE 1!@#USER_ID 27!@#ACTIVITY_CODE 4
12/23/2022 07:22:38 AM script INFO: SUCCESS!@#KODE 1!@#USER_ID 27!@#ACTIVITY_CODE 1
12/23/2022 07:22:39 AM script INFO: SUCCESS!@#KODE 1!@#USER_ID 27!@#ACTIVITY_CODE 3
12/23/2022 07:22:39 AM script INFO: SUCCESS!@#KODE 1!@#USER_ID 27!@#ACTIVITY_CODE 2
12/23/2022 07:22:39 AM script INFO: SUCCESS!@#KODE 1!@#USER_ID 27!@#ACTIVITY_CODE 2
12/23/2022 07:22:39 AM script INFO: SUCCESS!@#KODE 1!@#USER_ID 27!@#ACTIVITY_CODE 1
12/23/2022 07:22:39 AM script INFO: SUCCESS!@#KODE 1!@#USER_ID 27!@#ACTIVITY_CODE 3
12/23/2022 07:22:40 AM script INFO: SUCCESS!@#KODE 1!@#USER_ID 27!@#ACTIVITY_CODE 3
12/23/2022 07:22:40 AM script INFO: SUCCESS!@#KODE 1!@#USER_ID 27!@#ACTIVITY_CODE 2
12/23/2022 07:22:40 AM script INFO: SUCCESS!@#KODE 1!@#USER_ID 27!@#ACTIVITY_CODE 3
12/23/2022 07:22:40 AM script INFO: SUCCESS!@#KODE 1!@#USER_ID 27!@#ACTIVITY_CODE 1
12/23/2022 07:22:40 AM script INFO: SUCCESS!@#KODE 1!@#USER_ID 27!@#ACTIVITY_CODE 3
12/23/2022 07:22:40 AM script INFO: SUCCESS!@#KODE 1!@#USER_ID 27!@#ACTIVITY_CODE 1
12/23/2022 07:22:41 AM script INFO: SUCCESS!@#KODE 1!@#USER_ID 27!@#ACTIVITY_CODE 2
12/23/2022 07:22:41 AM script INFO: SUCCESS!@#KODE 1!@#USER_ID 27!@#ACTIVITY_CODE 1
12/23/2022 07:22:41 AM script INFO: SUCCESS!@#KODE 1!@#USER_ID 27!@#ACTIVITY_CODE 4
12/23/2022 07:22:41 AM script INFO: SUCCESS!@#KODE 1!@#USER_ID 27!@#ACTIVITY_CODE 1
12/23/2022 07:22:41 AM script INFO: SUCCESS!@#KODE 1!@#USER_ID 27!@#ACTIVITY_CODE 3
12/23/2022 07:22:41 AM script INFO: SUCCESS!@#KODE 1!@#USER_ID 27!@#ACTIVITY_CODE 1
12/23/2022 07:22:41 AM script INFO: SUCCESS!@#KODE 1!@#USER_ID 27!@#ACTIVITY_CODE 3
12/23/2022 07:22:41 AM script INFO: SUCCESS!@#KODE 1!@#USER_ID 27!@#ACTIVITY_CODE 3
12/23/2022 07:22:42 AM script INFO: SUCCESS!@#KODE 1!@#USER_ID 27!@#ACTIVITY_CODE 2
12/23/2022 07:22:42 AM script INFO: SUCCESS!@#KODE 1!@#USER_ID 27!@#ACTIVITY_CODE 1
12/23/2022 07:22:42 AM script INFO: SUCCESS!@#KODE 1!@#USER_ID 27!@#ACTIVITY_CODE 1
12/23/2022 07:22:42 AM script INFO: SUCCESS!@#KODE 1!@#USER_ID 27!@#ACTIVITY_CODE 2
12/23/2022 07:22:42 AM script INFO: SUCCESS!@#KODE 1!@#USER_ID 27!@#ACTIVITY_CODE 3
12/23/2022 07:22:42 AM script INFO: SUCCESS!@#KODE 1!@#USER_ID 27!@#ACTIVITY_CODE 3
12/23/2022 07:22:43 AM script INFO: SUCCESS!@#KODE 1!@#USER_ID 27!@#ACTIVITY_CODE 1
12/23/2022 07:22:43 AM script INFO: SUCCESS!@#KODE 1!@#USER_ID 27!@#ACTIVITY_CODE 1
12/23/2022 07:22:43 AM script INFO: SUCCESS!@#KODE 1!@#USER_ID 27!@#ACTIVITY_CODE 3
12/23/2022 07:22:43 AM script INFO: SUCCESS!@#KODE 1!@#USER_ID 27!@#ACTIVITY_CODE 1
12/23/2022 07:22:43 AM script INFO: SUCCESS!@#KODE 1!@#USER_ID 27!@#ACTIVITY_CODE 2
12/23/2022 07:22:43 AM script INFO: SUCCESS!@#KODE 1!@#USER_ID 27!@#ACTIVITY_CODE 2
12/23/2022 07:22:43 AM script INFO: SUCCESS!@#KODE 1!@#USER_ID 27!@#ACTIVITY_CODE 1
12/23/2022 07:22:44 AM script INFO: SUCCESS!@#KODE 1!@#USER_ID 27!@#ACTIVITY_CODE 3
12/23/2022 07:22:44 AM script INFO: SUCCESS!@#KODE 1!@#USER_ID 27!@#ACTIVITY_CODE 2
12/23/2022 07:22:44 AM script INFO: SUCCESS!@#KODE 1!@#USER_ID 27!@#ACTIVITY_CODE 3
12/23/2022 07:22:44 AM script INFO: SUCCESS!@#KODE 1!@#USER_ID 27!@#ACTIVITY_CODE 3
12/23/2022 07:22:44 AM script INFO: SUCCESS!@#KODE 1!@#USER_ID 27!@#ACTIVITY_CODE 2
12/23/2022 07:22:45 AM script INFO: SUCCESS!@#KODE 1!@#USER_ID 27!@#ACTIVITY_CODE 2
12/23/2022 07:22:45 AM script INFO: SUCCESS!@#KODE 1!@#USER_ID 27!@#ACTIVITY_CODE 4
12/23/2022 07:22:45 AM script INFO: SUCCESS!@#KODE 1!@#USER_ID 27!@#ACTIVITY_CODE 2
12/23/2022 07:22:45 AM script INFO: SUCCESS!@#KODE 1!@#USER_ID 27!@#ACTIVITY_CODE 2
12/23/2022 07:22:46 AM script INFO: SUCCESS!@#KODE 1!@#USER_ID 27!@#ACTIVITY_CODE 3
12/23/2022 07:22:46 AM script INFO: SUCCESS!@#KODE 1!@#USER_ID 27!@#ACTIVITY_CODE 3
12/23/2022 07:22:46 AM script INFO: SUCCESS!@#KODE 1!@#USER_ID 27!@#ACTIVITY_CODE 3
12/23/2022 07:22:46 AM script INFO: SUCCESS!@#KODE 1!@#USER_ID 27!@#ACTIVITY_CODE 3
12/23/2022 07:22:46 AM script INFO: SUCCESS!@#KODE 1!@#USER_ID 27!@#ACTIVITY_CODE 3
12/23/2022 07:22:46 AM script INFO: SUCCESS!@#KODE 1!@#USER_ID 27!@#ACTIVITY_CODE 1
12/23/2022 07:22:46 AM script INFO: SUCCESS!@#KODE 1!@#USER_ID 27!@#ACTIVITY_CODE 1
12/23/2022 07:22:46 AM script INFO: SUCCESS!@#KODE 1!@#USER_ID 27!@#ACTIVITY_CODE 3
12/23/2022 07:22:46 AM script INFO: SUCCESS!@#KODE 1!@#USER_ID 27!@#ACTIVITY_CODE 1
12/23/2022 07:22:47 AM script INFO: SUCCESS!@#KODE 1!@#USER_ID 27!@#ACTIVITY_CODE 3
12/23/2022 07:22:47 AM script INFO: SUCCESS!@#KODE 1!@#USER_ID 27!@#ACTIVITY_CODE 1
12/23/2022 07:22:47 AM script INFO: SUCCESS!@#KODE 1!@#USER_ID 27!@#ACTIVITY_CODE 4
12/23/2022 07:22:47 AM script INFO: SUCCESS!@#KODE 1!@#USER_ID 27!@#ACTIVITY_CODE 2
12/23/2022 07:22:47 AM script INFO: SUCCESS!@#KODE 1!@#USER_ID 27!@#ACTIVITY_CODE 3
12/23/2022 07:22:47 AM script INFO: SUCCESS!@#KODE 1!@#USER_ID 27!@#ACTIVITY_CODE 3
12/23/2022 07:22:48 AM script INFO: SUCCESS!@#KODE 1!@#USER_ID 27!@#ACTIVITY_CODE 1
12/23/2022 07:22:48 AM script INFO: SUCCESS!@#KODE 1!@#USER_ID 27!@#ACTIVITY_CODE 2
12/23/2022 07:22:48 AM script INFO: SUCCESS!@#KODE 1!@#USER_ID 27!@#ACTIVITY_CODE 3
12/23/2022 07:22:48 AM script INFO: SUCCESS!@#KODE 1!@#USER_ID 27!@#ACTIVITY_CODE 2
12/23/2022 07:22:48 AM script INFO: SUCCESS!@#KODE 1!@#USER_ID 27!@#ACTIVITY_CODE 1
12/23/2022 07:22:49 AM script INFO: SUCCESS!@#KODE 1!@#USER_ID 27!@#ACTIVITY_CODE 2
12/23/2022 07:22:49 AM script INFO: SUCCESS!@#KODE 1!@#USER_ID 27!@#ACTIVITY_CODE 1
12/23/2022 07:22:49 AM script INFO: SUCCESS!@#KODE 1!@#USER_ID 27!@#ACTIVITY_CODE 3
12/23/2022 07:22:49 AM script INFO: SUCCESS!@#KODE 1!@#USER_ID 27!@#ACTIVITY_CODE 3
12/23/2022 07:22:49 AM script INFO: SUCCESS!@#KODE 1!@#USER_ID 27!@#ACTIVITY_CODE 2
12/23/2022 07:22:49 AM script INFO: SUCCESS!@#KODE 1!@#USER_ID 27!@#ACTIVITY_CODE 1
12/23/2022 07:22:50 AM script INFO: SUCCESS!@#KODE 1!@#USER_ID 27!@#ACTIVITY_CODE 2
12/23/2022 07:22:50 AM script INFO: SUCCESS!@#KODE 1!@#USER_ID 27!@#ACTIVITY_CODE 4
12/23/2022 07:22:50 AM script INFO: SUCCESS!@#KODE 1!@#USER_ID 27!@#ACTIVITY_CODE 2
12/23/2022 07:22:50 AM script INFO: SUCCESS!@#KODE 1!@#USER_ID 27!@#ACTIVITY_CODE 4
12/23/2022 07:22:51 AM script INFO: SUCCESS!@#KODE 1!@#USER_ID 27!@#ACTIVITY_CODE 3
12/23/2022 07:22:51 AM script INFO: SUCCESS!@#KODE 1!@#USER_ID 27!@#ACTIVITY_CODE 2
12/23/2022 07:22:51 AM script INFO: SUCCESS!@#KODE 1!@#USER_ID 27!@#ACTIVITY_CODE 3
12/23/2022 07:22:51 AM script INFO: SUCCESS!@#KODE 1!@#USER_ID 27!@#ACTIVITY_CODE 4
12/23/2022 07:22:51 AM script INFO: SUCCESS!@#KODE 1!@#USER_ID 27!@#ACTIVITY_CODE 2
12/23/2022 07:22:52 AM script INFO: SUCCESS!@#KODE 1!@#USER_ID 27!@#ACTIVITY_CODE 2
12/23/2022 07:22:52 AM script INFO: SUCCESS!@#KODE 1!@#USER_ID 27!@#ACTIVITY_CODE 1
12/23/2022 07:22:52 AM script INFO: Duration: 72.08332395553589
12/23/2022 07:22:52 AM script INFO: mengakhiri-quiz
12/23/2022 07:23:04 AM script INFO: SUCCESS!@#KODE 1!@#USER_ID 27!@#ACTIVITY_CODE 5
12/23/2022 07:23:04 AM script INFO: berhasil-submit
