12/11/2022 03:05:19 PM script INFO: Prepared chrome options..
12/11/2022 03:05:20 PM script INFO: Initialized chrome browser..
12/11/2022 03:05:20 PM script INFO: mengakses-homepage
12/11/2022 03:05:34 PM script INFO: mengakses-login-page
12/11/2022 03:05:36 PM script INFO: mengakses-site-home
12/11/2022 03:05:38 PM script INFO: mengakses-site-course
12/11/2022 03:05:39 PM script INFO: mengakses-quiz
12/11/2022 03:05:41 PM script INFO: mengakses-start-quiz-page
12/11/2022 03:05:43 PM script INFO: memulai-quiz
12/11/2022 03:05:43 PM script INFO: SUCCESS!@#KODE 1!@#USER_ID 37!@#ACTIVITY_CODE 5
12/11/2022 03:05:54 PM script INFO: SUCCESS!@#KODE 1!@#USER_ID 37!@#ACTIVITY_CODE 1
12/11/2022 03:05:54 PM script INFO: SUCCESS!@#KODE 1!@#USER_ID 37!@#ACTIVITY_CODE 1
12/11/2022 03:05:54 PM script INFO: SUCCESS!@#KODE 1!@#USER_ID 37!@#ACTIVITY_CODE 5
12/11/2022 03:05:54 PM script INFO: SUCCESS!@#KODE 1!@#USER_ID 37!@#ACTIVITY_CODE 5
12/11/2022 03:05:56 PM script INFO: SUCCESS!@#KODE 1!@#USER_ID 37!@#ACTIVITY_CODE 5
12/11/2022 03:05:56 PM script INFO: SUCCESS!@#KODE 1!@#USER_ID 37!@#ACTIVITY_CODE 5
12/11/2022 03:05:59 PM script INFO: SUCCESS!@#KODE 1!@#USER_ID 37!@#ACTIVITY_CODE 3
12/11/2022 03:05:59 PM script INFO: SUCCESS!@#KODE 1!@#USER_ID 37!@#ACTIVITY_CODE 2
12/11/2022 03:05:59 PM script INFO: SUCCESS!@#KODE 1!@#USER_ID 37!@#ACTIVITY_CODE 2
12/11/2022 03:05:59 PM script INFO: SUCCESS!@#KODE 1!@#USER_ID 37!@#ACTIVITY_CODE 4
12/11/2022 03:05:59 PM script INFO: SUCCESS!@#KODE 1!@#USER_ID 37!@#ACTIVITY_CODE 2
12/11/2022 03:05:59 PM script INFO: SUCCESS!@#KODE 1!@#USER_ID 37!@#ACTIVITY_CODE 5
12/11/2022 03:05:59 PM script INFO: SUCCESS!@#KODE 1!@#USER_ID 37!@#ACTIVITY_CODE 5
12/11/2022 03:06:02 PM script INFO: SUCCESS!@#KODE 1!@#USER_ID 37!@#ACTIVITY_CODE 2
12/11/2022 03:06:02 PM script INFO: SUCCESS!@#KODE 1!@#USER_ID 37!@#ACTIVITY_CODE 3
12/11/2022 03:06:02 PM script INFO: SUCCESS!@#KODE 1!@#USER_ID 37!@#ACTIVITY_CODE 2
12/11/2022 03:06:02 PM script INFO: SUCCESS!@#KODE 1!@#USER_ID 37!@#ACTIVITY_CODE 5
12/11/2022 03:06:02 PM script INFO: SUCCESS!@#KODE 1!@#USER_ID 37!@#ACTIVITY_CODE 5
12/11/2022 03:06:05 PM script INFO: SUCCESS!@#KODE 1!@#USER_ID 37!@#ACTIVITY_CODE 3
12/11/2022 03:06:05 PM script INFO: SUCCESS!@#KODE 1!@#USER_ID 37!@#ACTIVITY_CODE 3
12/11/2022 03:06:05 PM script INFO: SUCCESS!@#KODE 1!@#USER_ID 37!@#ACTIVITY_CODE 2
12/11/2022 03:06:05 PM script INFO: SUCCESS!@#KODE 1!@#USER_ID 37!@#ACTIVITY_CODE 5
12/11/2022 03:06:05 PM script INFO: SUCCESS!@#KODE 1!@#USER_ID 37!@#ACTIVITY_CODE 5
12/11/2022 03:06:08 PM script INFO: SUCCESS!@#KODE 1!@#USER_ID 37!@#ACTIVITY_CODE 5
12/11/2022 03:06:08 PM script INFO: SUCCESS!@#KODE 1!@#USER_ID 37!@#ACTIVITY_CODE 5
12/11/2022 03:06:10 PM script INFO: SUCCESS!@#KODE 1!@#USER_ID 37!@#ACTIVITY_CODE 3
12/11/2022 03:06:10 PM script INFO: SUCCESS!@#KODE 1!@#USER_ID 37!@#ACTIVITY_CODE 3
12/11/2022 03:06:10 PM script INFO: SUCCESS!@#KODE 1!@#USER_ID 37!@#ACTIVITY_CODE 2
12/11/2022 03:06:10 PM script INFO: SUCCESS!@#KODE 1!@#USER_ID 37!@#ACTIVITY_CODE 2
12/11/2022 03:06:11 PM script INFO: SUCCESS!@#KODE 1!@#USER_ID 37!@#ACTIVITY_CODE 2
12/11/2022 03:06:11 PM script INFO: SUCCESS!@#KODE 1!@#USER_ID 37!@#ACTIVITY_CODE 1
12/11/2022 03:06:11 PM script INFO: SUCCESS!@#KODE 1!@#USER_ID 37!@#ACTIVITY_CODE 2
12/11/2022 03:06:11 PM script INFO: SUCCESS!@#KODE 1!@#USER_ID 37!@#ACTIVITY_CODE 3
12/11/2022 03:06:11 PM script INFO: SUCCESS!@#KODE 1!@#USER_ID 37!@#ACTIVITY_CODE 1
12/11/2022 03:06:11 PM script INFO: SUCCESS!@#KODE 1!@#USER_ID 37!@#ACTIVITY_CODE 2
12/11/2022 03:06:11 PM script INFO: SUCCESS!@#KODE 1!@#USER_ID 37!@#ACTIVITY_CODE 2
12/11/2022 03:06:11 PM script INFO: SUCCESS!@#KODE 1!@#USER_ID 37!@#ACTIVITY_CODE 1
12/11/2022 03:06:11 PM script INFO: SUCCESS!@#KODE 1!@#USER_ID 37!@#ACTIVITY_CODE 2
12/11/2022 03:06:11 PM script INFO: SUCCESS!@#KODE 1!@#USER_ID 37!@#ACTIVITY_CODE 3
12/11/2022 03:06:11 PM script INFO: SUCCESS!@#KODE 1!@#USER_ID 37!@#ACTIVITY_CODE 1
12/11/2022 03:06:12 PM script INFO: SUCCESS!@#KODE 1!@#USER_ID 37!@#ACTIVITY_CODE 2
12/11/2022 03:06:12 PM script INFO: SUCCESS!@#KODE 1!@#USER_ID 37!@#ACTIVITY_CODE 4
12/11/2022 03:06:12 PM script INFO: SUCCESS!@#KODE 1!@#USER_ID 37!@#ACTIVITY_CODE 3
12/11/2022 03:06:12 PM script INFO: SUCCESS!@#KODE 1!@#USER_ID 37!@#ACTIVITY_CODE 1
12/11/2022 03:06:12 PM script INFO: SUCCESS!@#KODE 1!@#USER_ID 37!@#ACTIVITY_CODE 3
12/11/2022 03:06:12 PM script INFO: SUCCESS!@#KODE 1!@#USER_ID 37!@#ACTIVITY_CODE 3
12/11/2022 03:06:12 PM script INFO: SUCCESS!@#KODE 1!@#USER_ID 37!@#ACTIVITY_CODE 1
12/11/2022 03:06:12 PM script INFO: SUCCESS!@#KODE 1!@#USER_ID 37!@#ACTIVITY_CODE 1
12/11/2022 03:06:12 PM script INFO: Duration: 18.365726470947266
12/11/2022 03:06:12 PM script INFO: mengakhiri-quiz
12/11/2022 03:06:25 PM script INFO: SUCCESS!@#KODE 1!@#USER_ID 37!@#ACTIVITY_CODE 5
12/11/2022 03:06:25 PM script INFO: berhasil-submit
