12/23/2022 03:21:10 AM script INFO: Prepared chrome options..
12/23/2022 03:21:11 AM script INFO: Initialized chrome browser..
12/23/2022 03:21:11 AM script INFO: mengakses-homepage
12/23/2022 03:21:43 AM script INFO: mengakses-login-page
12/23/2022 03:21:44 AM script INFO: mengakses-site-home
12/23/2022 03:21:45 AM script INFO: mengakses-site-course
12/23/2022 03:21:45 AM script INFO: mengakses-quiz
12/23/2022 03:21:46 AM script INFO: mengakses-start-quiz-page
12/23/2022 03:21:47 AM script INFO: memulai-quiz
12/23/2022 03:21:47 AM script INFO: SUCCESS!@#KODE 1!@#USER_ID 11!@#ACTIVITY_CODE 5
12/23/2022 03:21:58 AM script INFO: SUCCESS!@#KODE 1!@#USER_ID 11!@#ACTIVITY_CODE 1
12/23/2022 03:21:58 AM script INFO: SUCCESS!@#KODE 1!@#USER_ID 11!@#ACTIVITY_CODE 1
12/23/2022 03:21:58 AM script INFO: SUCCESS!@#KODE 1!@#USER_ID 11!@#ACTIVITY_CODE 3
12/23/2022 03:21:58 AM script INFO: SUCCESS!@#KODE 1!@#USER_ID 11!@#ACTIVITY_CODE 5
12/23/2022 03:21:58 AM script INFO: SUCCESS!@#KODE 1!@#USER_ID 11!@#ACTIVITY_CODE 5
12/23/2022 03:22:00 AM script INFO: SUCCESS!@#KODE 1!@#USER_ID 11!@#ACTIVITY_CODE 1
12/23/2022 03:22:00 AM script INFO: SUCCESS!@#KODE 1!@#USER_ID 11!@#ACTIVITY_CODE 5
12/23/2022 03:22:00 AM script INFO: SUCCESS!@#KODE 1!@#USER_ID 11!@#ACTIVITY_CODE 5
12/23/2022 03:22:03 AM script INFO: SUCCESS!@#KODE 1!@#USER_ID 11!@#ACTIVITY_CODE 5
12/23/2022 03:22:03 AM script INFO: SUCCESS!@#KODE 1!@#USER_ID 11!@#ACTIVITY_CODE 5
12/23/2022 03:22:05 AM script INFO: SUCCESS!@#KODE 1!@#USER_ID 11!@#ACTIVITY_CODE 5
12/23/2022 03:22:05 AM script INFO: SUCCESS!@#KODE 1!@#USER_ID 11!@#ACTIVITY_CODE 5
12/23/2022 03:22:08 AM script INFO: SUCCESS!@#KODE 1!@#USER_ID 11!@#ACTIVITY_CODE 4
12/23/2022 03:22:08 AM script INFO: SUCCESS!@#KODE 1!@#USER_ID 11!@#ACTIVITY_CODE 5
12/23/2022 03:22:08 AM script INFO: SUCCESS!@#KODE 1!@#USER_ID 11!@#ACTIVITY_CODE 5
12/23/2022 03:22:10 AM script INFO: SUCCESS!@#KODE 1!@#USER_ID 11!@#ACTIVITY_CODE 5
12/23/2022 03:22:10 AM script INFO: SUCCESS!@#KODE 1!@#USER_ID 11!@#ACTIVITY_CODE 5
12/23/2022 03:22:13 AM script INFO: SUCCESS!@#KODE 1!@#USER_ID 11!@#ACTIVITY_CODE 3
12/23/2022 03:22:13 AM script INFO: SUCCESS!@#KODE 1!@#USER_ID 11!@#ACTIVITY_CODE 1
12/23/2022 03:22:13 AM script INFO: SUCCESS!@#KODE 1!@#USER_ID 11!@#ACTIVITY_CODE 3
12/23/2022 03:22:13 AM script INFO: SUCCESS!@#KODE 1!@#USER_ID 11!@#ACTIVITY_CODE 2
12/23/2022 03:22:13 AM script INFO: SUCCESS!@#KODE 1!@#USER_ID 11!@#ACTIVITY_CODE 2
12/23/2022 03:22:13 AM script INFO: SUCCESS!@#KODE 1!@#USER_ID 11!@#ACTIVITY_CODE 1
12/23/2022 03:22:14 AM script INFO: SUCCESS!@#KODE 1!@#USER_ID 11!@#ACTIVITY_CODE 1
12/23/2022 03:22:14 AM script INFO: SUCCESS!@#KODE 1!@#USER_ID 11!@#ACTIVITY_CODE 5
12/23/2022 03:22:14 AM script INFO: SUCCESS!@#KODE 1!@#USER_ID 11!@#ACTIVITY_CODE 5
12/23/2022 03:22:16 AM script INFO: SUCCESS!@#KODE 1!@#USER_ID 11!@#ACTIVITY_CODE 3
12/23/2022 03:22:16 AM script INFO: SUCCESS!@#KODE 1!@#USER_ID 11!@#ACTIVITY_CODE 3
12/23/2022 03:22:16 AM script INFO: SUCCESS!@#KODE 1!@#USER_ID 11!@#ACTIVITY_CODE 5
12/23/2022 03:22:16 AM script INFO: SUCCESS!@#KODE 1!@#USER_ID 11!@#ACTIVITY_CODE 5
12/23/2022 03:22:19 AM script INFO: SUCCESS!@#KODE 1!@#USER_ID 11!@#ACTIVITY_CODE 5
12/23/2022 03:22:19 AM script INFO: SUCCESS!@#KODE 1!@#USER_ID 11!@#ACTIVITY_CODE 5
12/23/2022 03:22:21 AM script INFO: SUCCESS!@#KODE 1!@#USER_ID 11!@#ACTIVITY_CODE 1
12/23/2022 03:22:21 AM script INFO: SUCCESS!@#KODE 1!@#USER_ID 11!@#ACTIVITY_CODE 3
12/23/2022 03:22:21 AM script INFO: SUCCESS!@#KODE 1!@#USER_ID 11!@#ACTIVITY_CODE 5
12/23/2022 03:22:21 AM script INFO: SUCCESS!@#KODE 1!@#USER_ID 11!@#ACTIVITY_CODE 5
12/23/2022 03:22:24 AM script INFO: SUCCESS!@#KODE 1!@#USER_ID 11!@#ACTIVITY_CODE 2
12/23/2022 03:22:24 AM script INFO: SUCCESS!@#KODE 1!@#USER_ID 11!@#ACTIVITY_CODE 3
12/23/2022 03:22:24 AM script INFO: SUCCESS!@#KODE 1!@#USER_ID 11!@#ACTIVITY_CODE 3
12/23/2022 03:22:24 AM script INFO: SUCCESS!@#KODE 1!@#USER_ID 11!@#ACTIVITY_CODE 2
12/23/2022 03:22:24 AM script INFO: SUCCESS!@#KODE 1!@#USER_ID 11!@#ACTIVITY_CODE 2
12/23/2022 03:22:24 AM script INFO: SUCCESS!@#KODE 1!@#USER_ID 11!@#ACTIVITY_CODE 3
12/23/2022 03:22:25 AM script INFO: SUCCESS!@#KODE 1!@#USER_ID 11!@#ACTIVITY_CODE 4
12/23/2022 03:22:25 AM script INFO: SUCCESS!@#KODE 1!@#USER_ID 11!@#ACTIVITY_CODE 5
12/23/2022 03:22:25 AM script INFO: SUCCESS!@#KODE 1!@#USER_ID 11!@#ACTIVITY_CODE 5
12/23/2022 03:22:27 AM script INFO: SUCCESS!@#KODE 1!@#USER_ID 11!@#ACTIVITY_CODE 3
12/23/2022 03:22:27 AM script INFO: SUCCESS!@#KODE 1!@#USER_ID 11!@#ACTIVITY_CODE 2
12/23/2022 03:22:27 AM script INFO: SUCCESS!@#KODE 1!@#USER_ID 11!@#ACTIVITY_CODE 2
12/23/2022 03:22:28 AM script INFO: SUCCESS!@#KODE 1!@#USER_ID 11!@#ACTIVITY_CODE 1
12/23/2022 03:22:28 AM script INFO: SUCCESS!@#KODE 1!@#USER_ID 11!@#ACTIVITY_CODE 4
12/23/2022 03:22:28 AM script INFO: SUCCESS!@#KODE 1!@#USER_ID 11!@#ACTIVITY_CODE 3
12/23/2022 03:22:28 AM script INFO: SUCCESS!@#KODE 1!@#USER_ID 11!@#ACTIVITY_CODE 2
12/23/2022 03:22:28 AM script INFO: SUCCESS!@#KODE 1!@#USER_ID 11!@#ACTIVITY_CODE 1
12/23/2022 03:22:28 AM script INFO: SUCCESS!@#KODE 1!@#USER_ID 11!@#ACTIVITY_CODE 2
12/23/2022 03:22:28 AM script INFO: SUCCESS!@#KODE 1!@#USER_ID 11!@#ACTIVITY_CODE 1
12/23/2022 03:22:28 AM script INFO: SUCCESS!@#KODE 1!@#USER_ID 11!@#ACTIVITY_CODE 2
12/23/2022 03:22:28 AM script INFO: SUCCESS!@#KODE 1!@#USER_ID 11!@#ACTIVITY_CODE 2
12/23/2022 03:22:29 AM script INFO: SUCCESS!@#KODE 1!@#USER_ID 11!@#ACTIVITY_CODE 2
12/23/2022 03:22:29 AM script INFO: SUCCESS!@#KODE 1!@#USER_ID 11!@#ACTIVITY_CODE 3
12/23/2022 03:22:29 AM script INFO: SUCCESS!@#KODE 1!@#USER_ID 11!@#ACTIVITY_CODE 3
12/23/2022 03:22:29 AM script INFO: SUCCESS!@#KODE 1!@#USER_ID 11!@#ACTIVITY_CODE 4
12/23/2022 03:22:29 AM script INFO: SUCCESS!@#KODE 1!@#USER_ID 11!@#ACTIVITY_CODE 2
12/23/2022 03:22:29 AM script INFO: SUCCESS!@#KODE 1!@#USER_ID 11!@#ACTIVITY_CODE 1
12/23/2022 03:22:29 AM script INFO: SUCCESS!@#KODE 1!@#USER_ID 11!@#ACTIVITY_CODE 2
12/23/2022 03:22:29 AM script INFO: SUCCESS!@#KODE 1!@#USER_ID 11!@#ACTIVITY_CODE 1
12/23/2022 03:22:29 AM script INFO: SUCCESS!@#KODE 1!@#USER_ID 11!@#ACTIVITY_CODE 4
12/23/2022 03:22:29 AM script INFO: SUCCESS!@#KODE 1!@#USER_ID 11!@#ACTIVITY_CODE 1
12/23/2022 03:22:29 AM script INFO: SUCCESS!@#KODE 1!@#USER_ID 11!@#ACTIVITY_CODE 4
12/23/2022 03:22:29 AM script INFO: SUCCESS!@#KODE 1!@#USER_ID 11!@#ACTIVITY_CODE 1
12/23/2022 03:22:29 AM script INFO: SUCCESS!@#KODE 1!@#USER_ID 11!@#ACTIVITY_CODE 4
12/23/2022 03:22:29 AM script INFO: SUCCESS!@#KODE 1!@#USER_ID 11!@#ACTIVITY_CODE 1
12/23/2022 03:22:29 AM script INFO: SUCCESS!@#KODE 1!@#USER_ID 11!@#ACTIVITY_CODE 1
12/23/2022 03:22:30 AM script INFO: SUCCESS!@#KODE 1!@#USER_ID 11!@#ACTIVITY_CODE 3
12/23/2022 03:22:30 AM script INFO: SUCCESS!@#KODE 1!@#USER_ID 11!@#ACTIVITY_CODE 2
12/23/2022 03:22:30 AM script INFO: SUCCESS!@#KODE 1!@#USER_ID 11!@#ACTIVITY_CODE 2
12/23/2022 03:22:30 AM script INFO: SUCCESS!@#KODE 1!@#USER_ID 11!@#ACTIVITY_CODE 3
12/23/2022 03:22:30 AM script INFO: SUCCESS!@#KODE 1!@#USER_ID 11!@#ACTIVITY_CODE 2
12/23/2022 03:22:30 AM script INFO: SUCCESS!@#KODE 1!@#USER_ID 11!@#ACTIVITY_CODE 4
12/23/2022 03:22:30 AM script INFO: SUCCESS!@#KODE 1!@#USER_ID 11!@#ACTIVITY_CODE 3
12/23/2022 03:22:30 AM script INFO: SUCCESS!@#KODE 1!@#USER_ID 11!@#ACTIVITY_CODE 2
12/23/2022 03:22:30 AM script INFO: SUCCESS!@#KODE 1!@#USER_ID 11!@#ACTIVITY_CODE 1
12/23/2022 03:22:30 AM script INFO: SUCCESS!@#KODE 1!@#USER_ID 11!@#ACTIVITY_CODE 3
12/23/2022 03:22:30 AM script INFO: SUCCESS!@#KODE 1!@#USER_ID 11!@#ACTIVITY_CODE 4
12/23/2022 03:22:30 AM script INFO: SUCCESS!@#KODE 1!@#USER_ID 11!@#ACTIVITY_CODE 2
12/23/2022 03:22:31 AM script INFO: SUCCESS!@#KODE 1!@#USER_ID 11!@#ACTIVITY_CODE 4
12/23/2022 03:22:31 AM script INFO: SUCCESS!@#KODE 1!@#USER_ID 11!@#ACTIVITY_CODE 3
12/23/2022 03:22:31 AM script INFO: SUCCESS!@#KODE 1!@#USER_ID 11!@#ACTIVITY_CODE 2
12/23/2022 03:22:31 AM script INFO: SUCCESS!@#KODE 1!@#USER_ID 11!@#ACTIVITY_CODE 3
12/23/2022 03:22:31 AM script INFO: SUCCESS!@#KODE 1!@#USER_ID 11!@#ACTIVITY_CODE 1
12/23/2022 03:22:31 AM script INFO: SUCCESS!@#KODE 1!@#USER_ID 11!@#ACTIVITY_CODE 2
12/23/2022 03:22:31 AM script INFO: SUCCESS!@#KODE 1!@#USER_ID 11!@#ACTIVITY_CODE 2
12/23/2022 03:22:31 AM script INFO: SUCCESS!@#KODE 1!@#USER_ID 11!@#ACTIVITY_CODE 1
12/23/2022 03:22:31 AM script INFO: SUCCESS!@#KODE 1!@#USER_ID 11!@#ACTIVITY_CODE 2
12/23/2022 03:22:31 AM script INFO: SUCCESS!@#KODE 1!@#USER_ID 11!@#ACTIVITY_CODE 1
12/23/2022 03:22:31 AM script INFO: SUCCESS!@#KODE 1!@#USER_ID 11!@#ACTIVITY_CODE 1
12/23/2022 03:22:31 AM script INFO: SUCCESS!@#KODE 1!@#USER_ID 11!@#ACTIVITY_CODE 3
12/23/2022 03:22:31 AM script INFO: SUCCESS!@#KODE 1!@#USER_ID 11!@#ACTIVITY_CODE 3
12/23/2022 03:22:31 AM script INFO: SUCCESS!@#KODE 1!@#USER_ID 11!@#ACTIVITY_CODE 4
12/23/2022 03:22:31 AM script INFO: Duration: 33.97091102600098
12/23/2022 03:22:31 AM script INFO: mengakhiri-quiz
12/23/2022 03:22:32 AM script INFO: SUCCESS!@#KODE 1!@#USER_ID 11!@#ACTIVITY_CODE 5
12/23/2022 03:22:32 AM script INFO: berhasil-submit
12/23/2022 03:24:02 AM script ERROR: TIMEOUT EXCEPTION!@#KODE 0!@#LOCATION berhasil-submit
12/23/2022 03:24:02 AM main_worker ERROR: Message: None

