12/11/2022 03:52:31 PM script INFO: Prepared chrome options..
12/11/2022 03:52:32 PM script INFO: Initialized chrome browser..
12/11/2022 03:52:32 PM script INFO: mengakses-homepage
12/11/2022 03:52:39 PM script INFO: mengakses-login-page
12/11/2022 03:52:42 PM script INFO: mengakses-site-home
12/11/2022 03:52:42 PM script INFO: mengakses-site-course
12/11/2022 03:53:08 PM script INFO: mengakses-quiz
12/11/2022 03:53:23 PM script INFO: mengakses-start-quiz-page
12/11/2022 03:53:38 PM script INFO: memulai-quiz
12/11/2022 03:53:38 PM script INFO: SUCCESS!@#KODE 1!@#USER_ID 19!@#ACTIVITY_CODE 5
12/11/2022 03:53:49 PM script INFO: SUCCESS!@#KODE 1!@#USER_ID 19!@#ACTIVITY_CODE 5
12/11/2022 03:53:49 PM script INFO: SUCCESS!@#KODE 1!@#USER_ID 19!@#ACTIVITY_CODE 5
12/11/2022 03:53:52 PM script INFO: SUCCESS!@#KODE 1!@#USER_ID 19!@#ACTIVITY_CODE 2
12/11/2022 03:53:52 PM script INFO: SUCCESS!@#KODE 1!@#USER_ID 19!@#ACTIVITY_CODE 5
12/11/2022 03:53:52 PM script INFO: SUCCESS!@#KODE 1!@#USER_ID 19!@#ACTIVITY_CODE 5
12/11/2022 03:53:54 PM script INFO: SUCCESS!@#KODE 1!@#USER_ID 19!@#ACTIVITY_CODE 1
12/11/2022 03:53:55 PM script INFO: SUCCESS!@#KODE 1!@#USER_ID 19!@#ACTIVITY_CODE 2
12/11/2022 03:53:55 PM script INFO: SUCCESS!@#KODE 1!@#USER_ID 19!@#ACTIVITY_CODE 1
12/11/2022 03:53:55 PM script INFO: SUCCESS!@#KODE 1!@#USER_ID 19!@#ACTIVITY_CODE 2
12/11/2022 03:53:55 PM script INFO: SUCCESS!@#KODE 1!@#USER_ID 19!@#ACTIVITY_CODE 5
12/11/2022 03:53:55 PM script INFO: SUCCESS!@#KODE 1!@#USER_ID 19!@#ACTIVITY_CODE 5
12/11/2022 03:53:58 PM script INFO: SUCCESS!@#KODE 1!@#USER_ID 19!@#ACTIVITY_CODE 3
12/11/2022 03:53:58 PM script INFO: SUCCESS!@#KODE 1!@#USER_ID 19!@#ACTIVITY_CODE 1
12/11/2022 03:53:59 PM script INFO: SUCCESS!@#KODE 1!@#USER_ID 19!@#ACTIVITY_CODE 2
12/11/2022 03:53:59 PM script INFO: SUCCESS!@#KODE 1!@#USER_ID 19!@#ACTIVITY_CODE 1
12/11/2022 03:53:59 PM script INFO: SUCCESS!@#KODE 1!@#USER_ID 19!@#ACTIVITY_CODE 1
12/11/2022 03:53:59 PM script INFO: SUCCESS!@#KODE 1!@#USER_ID 19!@#ACTIVITY_CODE 5
12/11/2022 03:53:59 PM script INFO: SUCCESS!@#KODE 1!@#USER_ID 19!@#ACTIVITY_CODE 5
12/11/2022 03:54:01 PM script INFO: SUCCESS!@#KODE 1!@#USER_ID 19!@#ACTIVITY_CODE 5
12/11/2022 03:54:01 PM script INFO: SUCCESS!@#KODE 1!@#USER_ID 19!@#ACTIVITY_CODE 5
12/11/2022 03:54:04 PM script INFO: SUCCESS!@#KODE 1!@#USER_ID 19!@#ACTIVITY_CODE 3
12/11/2022 03:54:04 PM script INFO: SUCCESS!@#KODE 1!@#USER_ID 19!@#ACTIVITY_CODE 1
12/11/2022 03:54:04 PM script INFO: SUCCESS!@#KODE 1!@#USER_ID 19!@#ACTIVITY_CODE 2
12/11/2022 03:54:05 PM script INFO: SUCCESS!@#KODE 1!@#USER_ID 19!@#ACTIVITY_CODE 2
12/11/2022 03:54:05 PM script INFO: SUCCESS!@#KODE 1!@#USER_ID 19!@#ACTIVITY_CODE 3
12/11/2022 03:54:05 PM script INFO: SUCCESS!@#KODE 1!@#USER_ID 19!@#ACTIVITY_CODE 3
12/11/2022 03:54:05 PM script INFO: SUCCESS!@#KODE 1!@#USER_ID 19!@#ACTIVITY_CODE 5
12/11/2022 03:54:05 PM script INFO: SUCCESS!@#KODE 1!@#USER_ID 19!@#ACTIVITY_CODE 5
12/11/2022 03:54:08 PM script INFO: SUCCESS!@#KODE 1!@#USER_ID 19!@#ACTIVITY_CODE 3
12/11/2022 03:54:08 PM script INFO: SUCCESS!@#KODE 1!@#USER_ID 19!@#ACTIVITY_CODE 5
12/11/2022 03:54:08 PM script INFO: SUCCESS!@#KODE 1!@#USER_ID 19!@#ACTIVITY_CODE 5
12/11/2022 03:54:10 PM script INFO: SUCCESS!@#KODE 1!@#USER_ID 19!@#ACTIVITY_CODE 3
12/11/2022 03:54:11 PM script INFO: SUCCESS!@#KODE 1!@#USER_ID 19!@#ACTIVITY_CODE 1
12/11/2022 03:54:11 PM script INFO: SUCCESS!@#KODE 1!@#USER_ID 19!@#ACTIVITY_CODE 5
12/11/2022 03:54:11 PM script INFO: SUCCESS!@#KODE 1!@#USER_ID 19!@#ACTIVITY_CODE 5
12/11/2022 03:54:13 PM script INFO: SUCCESS!@#KODE 1!@#USER_ID 19!@#ACTIVITY_CODE 2
12/11/2022 03:54:13 PM script INFO: SUCCESS!@#KODE 1!@#USER_ID 19!@#ACTIVITY_CODE 5
12/11/2022 03:54:13 PM script INFO: SUCCESS!@#KODE 1!@#USER_ID 19!@#ACTIVITY_CODE 5
12/11/2022 03:54:16 PM script INFO: SUCCESS!@#KODE 1!@#USER_ID 19!@#ACTIVITY_CODE 4
12/11/2022 03:54:16 PM script INFO: SUCCESS!@#KODE 1!@#USER_ID 19!@#ACTIVITY_CODE 5
12/11/2022 03:54:16 PM script INFO: SUCCESS!@#KODE 1!@#USER_ID 19!@#ACTIVITY_CODE 5
12/11/2022 03:54:19 PM script INFO: SUCCESS!@#KODE 1!@#USER_ID 19!@#ACTIVITY_CODE 3
12/11/2022 03:54:19 PM script INFO: SUCCESS!@#KODE 1!@#USER_ID 19!@#ACTIVITY_CODE 2
12/11/2022 03:54:19 PM script INFO: SUCCESS!@#KODE 1!@#USER_ID 19!@#ACTIVITY_CODE 1
12/11/2022 03:54:19 PM script INFO: SUCCESS!@#KODE 1!@#USER_ID 19!@#ACTIVITY_CODE 3
12/11/2022 03:54:19 PM script INFO: SUCCESS!@#KODE 1!@#USER_ID 19!@#ACTIVITY_CODE 5
12/11/2022 03:54:19 PM script INFO: SUCCESS!@#KODE 1!@#USER_ID 19!@#ACTIVITY_CODE 5
12/11/2022 03:54:21 PM script INFO: SUCCESS!@#KODE 1!@#USER_ID 19!@#ACTIVITY_CODE 2
12/11/2022 03:54:21 PM script INFO: SUCCESS!@#KODE 1!@#USER_ID 19!@#ACTIVITY_CODE 5
12/11/2022 03:54:21 PM script INFO: SUCCESS!@#KODE 1!@#USER_ID 19!@#ACTIVITY_CODE 5
12/11/2022 03:54:24 PM script INFO: SUCCESS!@#KODE 1!@#USER_ID 19!@#ACTIVITY_CODE 1
12/11/2022 03:54:24 PM script INFO: SUCCESS!@#KODE 1!@#USER_ID 19!@#ACTIVITY_CODE 1
12/11/2022 03:54:24 PM script INFO: SUCCESS!@#KODE 1!@#USER_ID 19!@#ACTIVITY_CODE 2
12/11/2022 03:54:24 PM script INFO: SUCCESS!@#KODE 1!@#USER_ID 19!@#ACTIVITY_CODE 5
12/11/2022 03:54:24 PM script INFO: SUCCESS!@#KODE 1!@#USER_ID 19!@#ACTIVITY_CODE 5
12/11/2022 03:54:27 PM script INFO: SUCCESS!@#KODE 1!@#USER_ID 19!@#ACTIVITY_CODE 2
12/11/2022 03:54:27 PM script INFO: SUCCESS!@#KODE 1!@#USER_ID 19!@#ACTIVITY_CODE 1
12/11/2022 03:54:27 PM script INFO: SUCCESS!@#KODE 1!@#USER_ID 19!@#ACTIVITY_CODE 3
12/11/2022 03:54:27 PM script INFO: SUCCESS!@#KODE 1!@#USER_ID 19!@#ACTIVITY_CODE 5
12/11/2022 03:54:27 PM script INFO: SUCCESS!@#KODE 1!@#USER_ID 19!@#ACTIVITY_CODE 5
12/11/2022 03:54:29 PM script INFO: SUCCESS!@#KODE 1!@#USER_ID 19!@#ACTIVITY_CODE 4
12/11/2022 03:54:29 PM script INFO: SUCCESS!@#KODE 1!@#USER_ID 19!@#ACTIVITY_CODE 5
12/11/2022 03:54:29 PM script INFO: SUCCESS!@#KODE 1!@#USER_ID 19!@#ACTIVITY_CODE 5
12/11/2022 03:54:32 PM script INFO: SUCCESS!@#KODE 1!@#USER_ID 19!@#ACTIVITY_CODE 3
12/11/2022 03:54:32 PM script INFO: SUCCESS!@#KODE 1!@#USER_ID 19!@#ACTIVITY_CODE 5
12/11/2022 03:54:32 PM script INFO: SUCCESS!@#KODE 1!@#USER_ID 19!@#ACTIVITY_CODE 5
12/11/2022 03:54:35 PM script INFO: SUCCESS!@#KODE 1!@#USER_ID 19!@#ACTIVITY_CODE 3
12/11/2022 03:54:35 PM script INFO: SUCCESS!@#KODE 1!@#USER_ID 19!@#ACTIVITY_CODE 3
12/11/2022 03:54:35 PM script INFO: SUCCESS!@#KODE 1!@#USER_ID 19!@#ACTIVITY_CODE 2
12/11/2022 03:54:35 PM script INFO: SUCCESS!@#KODE 1!@#USER_ID 19!@#ACTIVITY_CODE 4
12/11/2022 03:54:35 PM script INFO: SUCCESS!@#KODE 1!@#USER_ID 19!@#ACTIVITY_CODE 3
12/11/2022 03:54:35 PM script INFO: SUCCESS!@#KODE 1!@#USER_ID 19!@#ACTIVITY_CODE 2
12/11/2022 03:54:35 PM script INFO: SUCCESS!@#KODE 1!@#USER_ID 19!@#ACTIVITY_CODE 3
12/11/2022 03:54:35 PM script INFO: SUCCESS!@#KODE 1!@#USER_ID 19!@#ACTIVITY_CODE 2
12/11/2022 03:54:35 PM script INFO: SUCCESS!@#KODE 1!@#USER_ID 19!@#ACTIVITY_CODE 1
12/11/2022 03:54:35 PM script INFO: SUCCESS!@#KODE 1!@#USER_ID 19!@#ACTIVITY_CODE 1
12/11/2022 03:54:35 PM script INFO: SUCCESS!@#KODE 1!@#USER_ID 19!@#ACTIVITY_CODE 3
12/11/2022 03:54:35 PM script INFO: SUCCESS!@#KODE 1!@#USER_ID 19!@#ACTIVITY_CODE 3
12/11/2022 03:54:36 PM script INFO: SUCCESS!@#KODE 1!@#USER_ID 19!@#ACTIVITY_CODE 1
12/11/2022 03:54:36 PM script INFO: SUCCESS!@#KODE 1!@#USER_ID 19!@#ACTIVITY_CODE 2
12/11/2022 03:54:36 PM script INFO: SUCCESS!@#KODE 1!@#USER_ID 19!@#ACTIVITY_CODE 3
12/11/2022 03:54:36 PM script INFO: SUCCESS!@#KODE 1!@#USER_ID 19!@#ACTIVITY_CODE 1
12/11/2022 03:54:36 PM script INFO: SUCCESS!@#KODE 1!@#USER_ID 19!@#ACTIVITY_CODE 4
12/11/2022 03:54:36 PM script INFO: SUCCESS!@#KODE 1!@#USER_ID 19!@#ACTIVITY_CODE 3
12/11/2022 03:54:36 PM script INFO: SUCCESS!@#KODE 1!@#USER_ID 19!@#ACTIVITY_CODE 1
12/11/2022 03:54:36 PM script INFO: SUCCESS!@#KODE 1!@#USER_ID 19!@#ACTIVITY_CODE 3
12/11/2022 03:54:36 PM script INFO: SUCCESS!@#KODE 1!@#USER_ID 19!@#ACTIVITY_CODE 2
12/11/2022 03:54:36 PM script INFO: SUCCESS!@#KODE 1!@#USER_ID 19!@#ACTIVITY_CODE 1
12/11/2022 03:54:36 PM script INFO: SUCCESS!@#KODE 1!@#USER_ID 19!@#ACTIVITY_CODE 3
12/11/2022 03:54:36 PM script INFO: SUCCESS!@#KODE 1!@#USER_ID 19!@#ACTIVITY_CODE 2
12/11/2022 03:54:36 PM script INFO: SUCCESS!@#KODE 1!@#USER_ID 19!@#ACTIVITY_CODE 2
12/11/2022 03:54:37 PM script INFO: SUCCESS!@#KODE 1!@#USER_ID 19!@#ACTIVITY_CODE 2
12/11/2022 03:54:37 PM script INFO: SUCCESS!@#KODE 1!@#USER_ID 19!@#ACTIVITY_CODE 3
12/11/2022 03:54:37 PM script INFO: SUCCESS!@#KODE 1!@#USER_ID 19!@#ACTIVITY_CODE 4
12/11/2022 03:54:37 PM script INFO: SUCCESS!@#KODE 1!@#USER_ID 19!@#ACTIVITY_CODE 1
12/11/2022 03:54:37 PM script INFO: SUCCESS!@#KODE 1!@#USER_ID 19!@#ACTIVITY_CODE 2
12/11/2022 03:54:37 PM script INFO: SUCCESS!@#KODE 1!@#USER_ID 19!@#ACTIVITY_CODE 3
12/11/2022 03:54:37 PM script INFO: SUCCESS!@#KODE 1!@#USER_ID 19!@#ACTIVITY_CODE 3
12/11/2022 03:54:37 PM script INFO: SUCCESS!@#KODE 1!@#USER_ID 19!@#ACTIVITY_CODE 4
12/11/2022 03:54:37 PM script INFO: SUCCESS!@#KODE 1!@#USER_ID 19!@#ACTIVITY_CODE 3
12/11/2022 03:54:37 PM script INFO: SUCCESS!@#KODE 1!@#USER_ID 19!@#ACTIVITY_CODE 1
12/11/2022 03:54:37 PM script INFO: SUCCESS!@#KODE 1!@#USER_ID 19!@#ACTIVITY_CODE 2
12/11/2022 03:54:37 PM script INFO: SUCCESS!@#KODE 1!@#USER_ID 19!@#ACTIVITY_CODE 2
12/11/2022 03:54:37 PM script INFO: SUCCESS!@#KODE 1!@#USER_ID 19!@#ACTIVITY_CODE 3
12/11/2022 03:54:38 PM script INFO: SUCCESS!@#KODE 1!@#USER_ID 19!@#ACTIVITY_CODE 1
12/11/2022 03:54:38 PM script INFO: SUCCESS!@#KODE 1!@#USER_ID 19!@#ACTIVITY_CODE 2
12/11/2022 03:54:38 PM script INFO: SUCCESS!@#KODE 1!@#USER_ID 19!@#ACTIVITY_CODE 3
12/11/2022 03:54:38 PM script INFO: SUCCESS!@#KODE 1!@#USER_ID 19!@#ACTIVITY_CODE 4
12/11/2022 03:54:38 PM script INFO: SUCCESS!@#KODE 1!@#USER_ID 19!@#ACTIVITY_CODE 2
12/11/2022 03:54:38 PM script INFO: SUCCESS!@#KODE 1!@#USER_ID 19!@#ACTIVITY_CODE 4
12/11/2022 03:54:38 PM script INFO: SUCCESS!@#KODE 1!@#USER_ID 19!@#ACTIVITY_CODE 1
12/11/2022 03:54:38 PM script INFO: SUCCESS!@#KODE 1!@#USER_ID 19!@#ACTIVITY_CODE 1
12/11/2022 03:54:38 PM script INFO: SUCCESS!@#KODE 1!@#USER_ID 19!@#ACTIVITY_CODE 1
12/11/2022 03:54:38 PM script INFO: SUCCESS!@#KODE 1!@#USER_ID 19!@#ACTIVITY_CODE 4
12/11/2022 03:54:38 PM script INFO: SUCCESS!@#KODE 1!@#USER_ID 19!@#ACTIVITY_CODE 1
12/11/2022 03:54:38 PM script INFO: SUCCESS!@#KODE 1!@#USER_ID 19!@#ACTIVITY_CODE 2
12/11/2022 03:54:38 PM script INFO: SUCCESS!@#KODE 1!@#USER_ID 19!@#ACTIVITY_CODE 1
12/11/2022 03:54:38 PM script INFO: SUCCESS!@#KODE 1!@#USER_ID 19!@#ACTIVITY_CODE 4
12/11/2022 03:54:38 PM script INFO: SUCCESS!@#KODE 1!@#USER_ID 19!@#ACTIVITY_CODE 3
12/11/2022 03:54:39 PM script INFO: SUCCESS!@#KODE 1!@#USER_ID 19!@#ACTIVITY_CODE 2
12/11/2022 03:54:39 PM script INFO: SUCCESS!@#KODE 1!@#USER_ID 19!@#ACTIVITY_CODE 3
12/11/2022 03:54:39 PM script INFO: SUCCESS!@#KODE 1!@#USER_ID 19!@#ACTIVITY_CODE 1
12/11/2022 03:54:39 PM script INFO: SUCCESS!@#KODE 1!@#USER_ID 19!@#ACTIVITY_CODE 1
12/11/2022 03:54:39 PM script INFO: SUCCESS!@#KODE 1!@#USER_ID 19!@#ACTIVITY_CODE 2
12/11/2022 03:54:39 PM script INFO: SUCCESS!@#KODE 1!@#USER_ID 19!@#ACTIVITY_CODE 3
12/11/2022 03:54:39 PM script INFO: SUCCESS!@#KODE 1!@#USER_ID 19!@#ACTIVITY_CODE 2
12/11/2022 03:54:39 PM script INFO: SUCCESS!@#KODE 1!@#USER_ID 19!@#ACTIVITY_CODE 1
12/11/2022 03:54:39 PM script INFO: SUCCESS!@#KODE 1!@#USER_ID 19!@#ACTIVITY_CODE 3
12/11/2022 03:54:39 PM script INFO: SUCCESS!@#KODE 1!@#USER_ID 19!@#ACTIVITY_CODE 1
12/11/2022 03:54:39 PM script INFO: SUCCESS!@#KODE 1!@#USER_ID 19!@#ACTIVITY_CODE 3
12/11/2022 03:54:39 PM script INFO: SUCCESS!@#KODE 1!@#USER_ID 19!@#ACTIVITY_CODE 3
12/11/2022 03:54:39 PM script INFO: SUCCESS!@#KODE 1!@#USER_ID 19!@#ACTIVITY_CODE 3
12/11/2022 03:54:40 PM script INFO: SUCCESS!@#KODE 1!@#USER_ID 19!@#ACTIVITY_CODE 2
12/11/2022 03:54:40 PM script INFO: SUCCESS!@#KODE 1!@#USER_ID 19!@#ACTIVITY_CODE 3
12/11/2022 03:54:40 PM script INFO: SUCCESS!@#KODE 1!@#USER_ID 19!@#ACTIVITY_CODE 3
12/11/2022 03:54:40 PM script INFO: SUCCESS!@#KODE 1!@#USER_ID 19!@#ACTIVITY_CODE 2
12/11/2022 03:54:40 PM script INFO: SUCCESS!@#KODE 1!@#USER_ID 19!@#ACTIVITY_CODE 2
12/11/2022 03:54:40 PM script INFO: SUCCESS!@#KODE 1!@#USER_ID 19!@#ACTIVITY_CODE 1
12/11/2022 03:54:40 PM script INFO: SUCCESS!@#KODE 1!@#USER_ID 19!@#ACTIVITY_CODE 3
12/11/2022 03:54:40 PM script INFO: SUCCESS!@#KODE 1!@#USER_ID 19!@#ACTIVITY_CODE 4
12/11/2022 03:54:40 PM script INFO: SUCCESS!@#KODE 1!@#USER_ID 19!@#ACTIVITY_CODE 2
12/11/2022 03:54:40 PM script INFO: SUCCESS!@#KODE 1!@#USER_ID 19!@#ACTIVITY_CODE 1
12/11/2022 03:54:40 PM script INFO: SUCCESS!@#KODE 1!@#USER_ID 19!@#ACTIVITY_CODE 1
12/11/2022 03:54:40 PM script INFO: SUCCESS!@#KODE 1!@#USER_ID 19!@#ACTIVITY_CODE 1
12/11/2022 03:54:40 PM script INFO: SUCCESS!@#KODE 1!@#USER_ID 19!@#ACTIVITY_CODE 2
12/11/2022 03:54:41 PM script INFO: SUCCESS!@#KODE 1!@#USER_ID 19!@#ACTIVITY_CODE 3
12/11/2022 03:54:41 PM script INFO: SUCCESS!@#KODE 1!@#USER_ID 19!@#ACTIVITY_CODE 1
12/11/2022 03:54:41 PM script INFO: SUCCESS!@#KODE 1!@#USER_ID 19!@#ACTIVITY_CODE 1
12/11/2022 03:54:41 PM script INFO: SUCCESS!@#KODE 1!@#USER_ID 19!@#ACTIVITY_CODE 4
12/11/2022 03:54:41 PM script INFO: SUCCESS!@#KODE 1!@#USER_ID 19!@#ACTIVITY_CODE 3
12/11/2022 03:54:41 PM script INFO: SUCCESS!@#KODE 1!@#USER_ID 19!@#ACTIVITY_CODE 2
12/11/2022 03:54:41 PM script INFO: SUCCESS!@#KODE 1!@#USER_ID 19!@#ACTIVITY_CODE 2
12/11/2022 03:54:41 PM script INFO: SUCCESS!@#KODE 1!@#USER_ID 19!@#ACTIVITY_CODE 3
12/11/2022 03:54:41 PM script INFO: SUCCESS!@#KODE 1!@#USER_ID 19!@#ACTIVITY_CODE 1
12/11/2022 03:54:41 PM script INFO: SUCCESS!@#KODE 1!@#USER_ID 19!@#ACTIVITY_CODE 1
12/11/2022 03:54:41 PM script INFO: SUCCESS!@#KODE 1!@#USER_ID 19!@#ACTIVITY_CODE 1
12/11/2022 03:54:41 PM script INFO: SUCCESS!@#KODE 1!@#USER_ID 19!@#ACTIVITY_CODE 1
12/11/2022 03:54:41 PM script INFO: SUCCESS!@#KODE 1!@#USER_ID 19!@#ACTIVITY_CODE 2
12/11/2022 03:54:42 PM script INFO: SUCCESS!@#KODE 1!@#USER_ID 19!@#ACTIVITY_CODE 2
12/11/2022 03:54:42 PM script INFO: SUCCESS!@#KODE 1!@#USER_ID 19!@#ACTIVITY_CODE 3
12/11/2022 03:54:42 PM script INFO: SUCCESS!@#KODE 1!@#USER_ID 19!@#ACTIVITY_CODE 3
12/11/2022 03:54:42 PM script INFO: SUCCESS!@#KODE 1!@#USER_ID 19!@#ACTIVITY_CODE 3
12/11/2022 03:54:42 PM script INFO: SUCCESS!@#KODE 1!@#USER_ID 19!@#ACTIVITY_CODE 3
12/11/2022 03:54:42 PM script INFO: SUCCESS!@#KODE 1!@#USER_ID 19!@#ACTIVITY_CODE 1
12/11/2022 03:54:42 PM script INFO: SUCCESS!@#KODE 1!@#USER_ID 19!@#ACTIVITY_CODE 1
12/11/2022 03:54:42 PM script INFO: SUCCESS!@#KODE 1!@#USER_ID 19!@#ACTIVITY_CODE 2
12/11/2022 03:54:42 PM script INFO: SUCCESS!@#KODE 1!@#USER_ID 19!@#ACTIVITY_CODE 3
12/11/2022 03:54:42 PM script INFO: SUCCESS!@#KODE 1!@#USER_ID 19!@#ACTIVITY_CODE 1
12/11/2022 03:54:42 PM script INFO: SUCCESS!@#KODE 1!@#USER_ID 19!@#ACTIVITY_CODE 3
12/11/2022 03:54:42 PM script INFO: SUCCESS!@#KODE 1!@#USER_ID 19!@#ACTIVITY_CODE 3
12/11/2022 03:54:42 PM script INFO: SUCCESS!@#KODE 1!@#USER_ID 19!@#ACTIVITY_CODE 4
12/11/2022 03:54:42 PM script INFO: SUCCESS!@#KODE 1!@#USER_ID 19!@#ACTIVITY_CODE 2
12/11/2022 03:54:43 PM script INFO: SUCCESS!@#KODE 1!@#USER_ID 19!@#ACTIVITY_CODE 4
12/11/2022 03:54:43 PM script INFO: SUCCESS!@#KODE 1!@#USER_ID 19!@#ACTIVITY_CODE 2
12/11/2022 03:54:43 PM script INFO: SUCCESS!@#KODE 1!@#USER_ID 19!@#ACTIVITY_CODE 1
12/11/2022 03:54:43 PM script INFO: SUCCESS!@#KODE 1!@#USER_ID 19!@#ACTIVITY_CODE 3
12/11/2022 03:54:43 PM script INFO: SUCCESS!@#KODE 1!@#USER_ID 19!@#ACTIVITY_CODE 1
12/11/2022 03:54:43 PM script INFO: SUCCESS!@#KODE 1!@#USER_ID 19!@#ACTIVITY_CODE 1
12/11/2022 03:54:43 PM script INFO: SUCCESS!@#KODE 1!@#USER_ID 19!@#ACTIVITY_CODE 1
12/11/2022 03:54:43 PM script INFO: SUCCESS!@#KODE 1!@#USER_ID 19!@#ACTIVITY_CODE 1
12/11/2022 03:54:43 PM script INFO: SUCCESS!@#KODE 1!@#USER_ID 19!@#ACTIVITY_CODE 3
12/11/2022 03:54:43 PM script INFO: SUCCESS!@#KODE 1!@#USER_ID 19!@#ACTIVITY_CODE 1
12/11/2022 03:54:43 PM script INFO: SUCCESS!@#KODE 1!@#USER_ID 19!@#ACTIVITY_CODE 1
12/11/2022 03:54:43 PM script INFO: SUCCESS!@#KODE 1!@#USER_ID 19!@#ACTIVITY_CODE 3
12/11/2022 03:54:43 PM script INFO: SUCCESS!@#KODE 1!@#USER_ID 19!@#ACTIVITY_CODE 3
12/11/2022 03:54:43 PM script INFO: SUCCESS!@#KODE 1!@#USER_ID 19!@#ACTIVITY_CODE 2
12/11/2022 03:54:44 PM script INFO: SUCCESS!@#KODE 1!@#USER_ID 19!@#ACTIVITY_CODE 2
12/11/2022 03:54:44 PM script INFO: SUCCESS!@#KODE 1!@#USER_ID 19!@#ACTIVITY_CODE 2
12/11/2022 03:54:44 PM script INFO: SUCCESS!@#KODE 1!@#USER_ID 19!@#ACTIVITY_CODE 1
12/11/2022 03:54:44 PM script INFO: SUCCESS!@#KODE 1!@#USER_ID 19!@#ACTIVITY_CODE 2
12/11/2022 03:54:44 PM script INFO: SUCCESS!@#KODE 1!@#USER_ID 19!@#ACTIVITY_CODE 1
12/11/2022 03:54:44 PM script INFO: SUCCESS!@#KODE 1!@#USER_ID 19!@#ACTIVITY_CODE 4
12/11/2022 03:54:44 PM script INFO: SUCCESS!@#KODE 1!@#USER_ID 19!@#ACTIVITY_CODE 3
12/11/2022 03:54:44 PM script INFO: SUCCESS!@#KODE 1!@#USER_ID 19!@#ACTIVITY_CODE 3
12/11/2022 03:54:44 PM script INFO: SUCCESS!@#KODE 1!@#USER_ID 19!@#ACTIVITY_CODE 1
12/11/2022 03:54:44 PM script INFO: SUCCESS!@#KODE 1!@#USER_ID 19!@#ACTIVITY_CODE 1
12/11/2022 03:54:44 PM script INFO: SUCCESS!@#KODE 1!@#USER_ID 19!@#ACTIVITY_CODE 2
12/11/2022 03:54:44 PM script INFO: SUCCESS!@#KODE 1!@#USER_ID 19!@#ACTIVITY_CODE 2
12/11/2022 03:54:44 PM script INFO: SUCCESS!@#KODE 1!@#USER_ID 19!@#ACTIVITY_CODE 4
12/11/2022 03:54:45 PM script INFO: SUCCESS!@#KODE 1!@#USER_ID 19!@#ACTIVITY_CODE 2
12/11/2022 03:54:45 PM script INFO: SUCCESS!@#KODE 1!@#USER_ID 19!@#ACTIVITY_CODE 2
12/11/2022 03:54:45 PM script INFO: SUCCESS!@#KODE 1!@#USER_ID 19!@#ACTIVITY_CODE 2
12/11/2022 03:54:45 PM script INFO: SUCCESS!@#KODE 1!@#USER_ID 19!@#ACTIVITY_CODE 1
12/11/2022 03:54:45 PM script INFO: SUCCESS!@#KODE 1!@#USER_ID 19!@#ACTIVITY_CODE 1
12/11/2022 03:54:45 PM script INFO: SUCCESS!@#KODE 1!@#USER_ID 19!@#ACTIVITY_CODE 4
12/11/2022 03:54:45 PM script INFO: SUCCESS!@#KODE 1!@#USER_ID 19!@#ACTIVITY_CODE 2
12/11/2022 03:54:45 PM script INFO: SUCCESS!@#KODE 1!@#USER_ID 19!@#ACTIVITY_CODE 3
12/11/2022 03:54:45 PM script INFO: SUCCESS!@#KODE 1!@#USER_ID 19!@#ACTIVITY_CODE 1
12/11/2022 03:54:45 PM script INFO: SUCCESS!@#KODE 1!@#USER_ID 19!@#ACTIVITY_CODE 4
12/11/2022 03:54:46 PM script INFO: SUCCESS!@#KODE 1!@#USER_ID 19!@#ACTIVITY_CODE 2
12/11/2022 03:54:46 PM script INFO: SUCCESS!@#KODE 1!@#USER_ID 19!@#ACTIVITY_CODE 2
12/11/2022 03:54:46 PM script INFO: SUCCESS!@#KODE 1!@#USER_ID 19!@#ACTIVITY_CODE 1
12/11/2022 03:54:46 PM script INFO: SUCCESS!@#KODE 1!@#USER_ID 19!@#ACTIVITY_CODE 2
12/11/2022 03:54:46 PM script INFO: SUCCESS!@#KODE 1!@#USER_ID 19!@#ACTIVITY_CODE 2
12/11/2022 03:54:46 PM script INFO: SUCCESS!@#KODE 1!@#USER_ID 19!@#ACTIVITY_CODE 3
12/11/2022 03:54:46 PM script INFO: SUCCESS!@#KODE 1!@#USER_ID 19!@#ACTIVITY_CODE 2
12/11/2022 03:54:46 PM script INFO: SUCCESS!@#KODE 1!@#USER_ID 19!@#ACTIVITY_CODE 2
12/11/2022 03:54:46 PM script INFO: SUCCESS!@#KODE 1!@#USER_ID 19!@#ACTIVITY_CODE 2
12/11/2022 03:54:47 PM script INFO: SUCCESS!@#KODE 1!@#USER_ID 19!@#ACTIVITY_CODE 2
12/11/2022 03:54:47 PM script INFO: SUCCESS!@#KODE 1!@#USER_ID 19!@#ACTIVITY_CODE 1
12/11/2022 03:54:47 PM script INFO: SUCCESS!@#KODE 1!@#USER_ID 19!@#ACTIVITY_CODE 4
12/11/2022 03:54:47 PM script INFO: SUCCESS!@#KODE 1!@#USER_ID 19!@#ACTIVITY_CODE 3
12/11/2022 03:54:47 PM script INFO: SUCCESS!@#KODE 1!@#USER_ID 19!@#ACTIVITY_CODE 2
12/11/2022 03:54:47 PM script INFO: SUCCESS!@#KODE 1!@#USER_ID 19!@#ACTIVITY_CODE 1
12/11/2022 03:54:47 PM script INFO: SUCCESS!@#KODE 1!@#USER_ID 19!@#ACTIVITY_CODE 1
12/11/2022 03:54:47 PM script INFO: SUCCESS!@#KODE 1!@#USER_ID 19!@#ACTIVITY_CODE 3
12/11/2022 03:54:47 PM script INFO: SUCCESS!@#KODE 1!@#USER_ID 19!@#ACTIVITY_CODE 4
12/11/2022 03:54:47 PM script INFO: SUCCESS!@#KODE 1!@#USER_ID 19!@#ACTIVITY_CODE 2
12/11/2022 03:54:47 PM script INFO: SUCCESS!@#KODE 1!@#USER_ID 19!@#ACTIVITY_CODE 3
12/11/2022 03:54:47 PM script INFO: SUCCESS!@#KODE 1!@#USER_ID 19!@#ACTIVITY_CODE 2
12/11/2022 03:54:48 PM script INFO: SUCCESS!@#KODE 1!@#USER_ID 19!@#ACTIVITY_CODE 2
12/11/2022 03:54:48 PM script INFO: SUCCESS!@#KODE 1!@#USER_ID 19!@#ACTIVITY_CODE 2
12/11/2022 03:54:48 PM script INFO: SUCCESS!@#KODE 1!@#USER_ID 19!@#ACTIVITY_CODE 2
12/11/2022 03:54:48 PM script INFO: SUCCESS!@#KODE 1!@#USER_ID 19!@#ACTIVITY_CODE 1
12/11/2022 03:54:48 PM script INFO: SUCCESS!@#KODE 1!@#USER_ID 19!@#ACTIVITY_CODE 1
12/11/2022 03:54:48 PM script INFO: SUCCESS!@#KODE 1!@#USER_ID 19!@#ACTIVITY_CODE 3
12/11/2022 03:54:48 PM script INFO: SUCCESS!@#KODE 1!@#USER_ID 19!@#ACTIVITY_CODE 3
12/11/2022 03:54:48 PM script INFO: SUCCESS!@#KODE 1!@#USER_ID 19!@#ACTIVITY_CODE 3
12/11/2022 03:54:48 PM script INFO: SUCCESS!@#KODE 1!@#USER_ID 19!@#ACTIVITY_CODE 2
12/11/2022 03:54:48 PM script INFO: SUCCESS!@#KODE 1!@#USER_ID 19!@#ACTIVITY_CODE 2
12/11/2022 03:54:49 PM script INFO: SUCCESS!@#KODE 1!@#USER_ID 19!@#ACTIVITY_CODE 4
12/11/2022 03:54:49 PM script INFO: SUCCESS!@#KODE 1!@#USER_ID 19!@#ACTIVITY_CODE 2
12/11/2022 03:54:49 PM script INFO: SUCCESS!@#KODE 1!@#USER_ID 19!@#ACTIVITY_CODE 3
12/11/2022 03:54:49 PM script INFO: SUCCESS!@#KODE 1!@#USER_ID 19!@#ACTIVITY_CODE 1
12/11/2022 03:54:49 PM script INFO: SUCCESS!@#KODE 1!@#USER_ID 19!@#ACTIVITY_CODE 3
12/11/2022 03:54:49 PM script INFO: SUCCESS!@#KODE 1!@#USER_ID 19!@#ACTIVITY_CODE 3
12/11/2022 03:54:49 PM script INFO: SUCCESS!@#KODE 1!@#USER_ID 19!@#ACTIVITY_CODE 3
12/11/2022 03:54:49 PM script INFO: SUCCESS!@#KODE 1!@#USER_ID 19!@#ACTIVITY_CODE 3
12/11/2022 03:54:49 PM script INFO: Duration: 60.09448313713074
12/11/2022 03:54:49 PM script INFO: mengakhiri-quiz
12/11/2022 03:55:10 PM script INFO: SUCCESS!@#KODE 1!@#USER_ID 19!@#ACTIVITY_CODE 5
12/11/2022 03:55:10 PM script INFO: berhasil-submit
