12/23/2022 04:20:19 AM script INFO: Prepared chrome options..
12/23/2022 04:20:21 AM script INFO: Initialized chrome browser..
12/23/2022 04:20:21 AM script INFO: mengakses-homepage
12/23/2022 04:21:49 AM script INFO: mengakses-login-page
12/23/2022 04:22:15 AM script INFO: mengakses-site-home
12/23/2022 04:22:24 AM script INFO: mengakses-site-course
12/23/2022 04:22:46 AM script INFO: mengakses-quiz
12/23/2022 04:22:49 AM script INFO: mengakses-start-quiz-page
12/23/2022 04:23:00 AM script INFO: memulai-quiz
12/23/2022 04:23:00 AM script INFO: SUCCESS!@#KODE 1!@#USER_ID 51!@#ACTIVITY_CODE 5
12/23/2022 04:23:11 AM script INFO: SUCCESS!@#KODE 1!@#USER_ID 51!@#ACTIVITY_CODE 1
12/23/2022 04:23:11 AM script INFO: SUCCESS!@#KODE 1!@#USER_ID 51!@#ACTIVITY_CODE 1
12/23/2022 04:23:11 AM script INFO: SUCCESS!@#KODE 1!@#USER_ID 51!@#ACTIVITY_CODE 5
12/23/2022 04:23:11 AM script INFO: SUCCESS!@#KODE 1!@#USER_ID 51!@#ACTIVITY_CODE 5
12/23/2022 04:23:13 AM script INFO: SUCCESS!@#KODE 1!@#USER_ID 51!@#ACTIVITY_CODE 3
12/23/2022 04:23:13 AM script INFO: SUCCESS!@#KODE 1!@#USER_ID 51!@#ACTIVITY_CODE 5
12/23/2022 04:23:13 AM script INFO: SUCCESS!@#KODE 1!@#USER_ID 51!@#ACTIVITY_CODE 5
12/23/2022 04:23:16 AM script INFO: SUCCESS!@#KODE 1!@#USER_ID 51!@#ACTIVITY_CODE 2
12/23/2022 04:23:16 AM script INFO: SUCCESS!@#KODE 1!@#USER_ID 51!@#ACTIVITY_CODE 2
12/23/2022 04:23:16 AM script INFO: SUCCESS!@#KODE 1!@#USER_ID 51!@#ACTIVITY_CODE 1
12/23/2022 04:23:16 AM script INFO: SUCCESS!@#KODE 1!@#USER_ID 51!@#ACTIVITY_CODE 1
12/23/2022 04:23:16 AM script INFO: SUCCESS!@#KODE 1!@#USER_ID 51!@#ACTIVITY_CODE 4
12/23/2022 04:23:16 AM script INFO: SUCCESS!@#KODE 1!@#USER_ID 51!@#ACTIVITY_CODE 1
12/23/2022 04:23:17 AM script INFO: SUCCESS!@#KODE 1!@#USER_ID 51!@#ACTIVITY_CODE 3
12/23/2022 04:23:17 AM script INFO: SUCCESS!@#KODE 1!@#USER_ID 51!@#ACTIVITY_CODE 4
12/23/2022 04:23:17 AM script INFO: SUCCESS!@#KODE 1!@#USER_ID 51!@#ACTIVITY_CODE 2
12/23/2022 04:23:17 AM script INFO: SUCCESS!@#KODE 1!@#USER_ID 51!@#ACTIVITY_CODE 5
12/23/2022 04:23:17 AM script INFO: SUCCESS!@#KODE 1!@#USER_ID 51!@#ACTIVITY_CODE 5
12/23/2022 04:23:19 AM script INFO: SUCCESS!@#KODE 1!@#USER_ID 51!@#ACTIVITY_CODE 2
12/23/2022 04:23:19 AM script INFO: SUCCESS!@#KODE 1!@#USER_ID 51!@#ACTIVITY_CODE 5
12/23/2022 04:23:19 AM script INFO: SUCCESS!@#KODE 1!@#USER_ID 51!@#ACTIVITY_CODE 5
12/23/2022 04:23:22 AM script INFO: SUCCESS!@#KODE 1!@#USER_ID 51!@#ACTIVITY_CODE 1
12/23/2022 04:23:22 AM script INFO: SUCCESS!@#KODE 1!@#USER_ID 51!@#ACTIVITY_CODE 2
12/23/2022 04:23:22 AM script INFO: SUCCESS!@#KODE 1!@#USER_ID 51!@#ACTIVITY_CODE 1
12/23/2022 04:23:22 AM script INFO: SUCCESS!@#KODE 1!@#USER_ID 51!@#ACTIVITY_CODE 5
12/23/2022 04:23:22 AM script INFO: SUCCESS!@#KODE 1!@#USER_ID 51!@#ACTIVITY_CODE 5
12/23/2022 04:23:25 AM script INFO: SUCCESS!@#KODE 1!@#USER_ID 51!@#ACTIVITY_CODE 5
12/23/2022 04:23:25 AM script INFO: SUCCESS!@#KODE 1!@#USER_ID 51!@#ACTIVITY_CODE 5
12/23/2022 04:23:27 AM script INFO: SUCCESS!@#KODE 1!@#USER_ID 51!@#ACTIVITY_CODE 1
12/23/2022 04:23:27 AM script INFO: SUCCESS!@#KODE 1!@#USER_ID 51!@#ACTIVITY_CODE 2
12/23/2022 04:23:27 AM script INFO: SUCCESS!@#KODE 1!@#USER_ID 51!@#ACTIVITY_CODE 4
12/23/2022 04:23:28 AM script INFO: SUCCESS!@#KODE 1!@#USER_ID 51!@#ACTIVITY_CODE 2
12/23/2022 04:23:28 AM script INFO: SUCCESS!@#KODE 1!@#USER_ID 51!@#ACTIVITY_CODE 2
12/23/2022 04:23:28 AM script INFO: SUCCESS!@#KODE 1!@#USER_ID 51!@#ACTIVITY_CODE 1
12/23/2022 04:23:28 AM script INFO: SUCCESS!@#KODE 1!@#USER_ID 51!@#ACTIVITY_CODE 3
12/23/2022 04:23:28 AM script INFO: SUCCESS!@#KODE 1!@#USER_ID 51!@#ACTIVITY_CODE 1
12/23/2022 04:23:28 AM script INFO: SUCCESS!@#KODE 1!@#USER_ID 51!@#ACTIVITY_CODE 2
12/23/2022 04:23:28 AM script INFO: SUCCESS!@#KODE 1!@#USER_ID 51!@#ACTIVITY_CODE 3
12/23/2022 04:23:28 AM script INFO: SUCCESS!@#KODE 1!@#USER_ID 51!@#ACTIVITY_CODE 1
12/23/2022 04:23:28 AM script INFO: SUCCESS!@#KODE 1!@#USER_ID 51!@#ACTIVITY_CODE 4
12/23/2022 04:23:28 AM script INFO: SUCCESS!@#KODE 1!@#USER_ID 51!@#ACTIVITY_CODE 3
12/23/2022 04:23:28 AM script INFO: SUCCESS!@#KODE 1!@#USER_ID 51!@#ACTIVITY_CODE 3
12/23/2022 04:23:28 AM script INFO: SUCCESS!@#KODE 1!@#USER_ID 51!@#ACTIVITY_CODE 2
12/23/2022 04:23:28 AM script INFO: SUCCESS!@#KODE 1!@#USER_ID 51!@#ACTIVITY_CODE 2
12/23/2022 04:23:28 AM script INFO: SUCCESS!@#KODE 1!@#USER_ID 51!@#ACTIVITY_CODE 1
12/23/2022 04:23:29 AM script INFO: SUCCESS!@#KODE 1!@#USER_ID 51!@#ACTIVITY_CODE 2
12/23/2022 04:23:29 AM script INFO: SUCCESS!@#KODE 1!@#USER_ID 51!@#ACTIVITY_CODE 3
12/23/2022 04:23:29 AM script INFO: SUCCESS!@#KODE 1!@#USER_ID 51!@#ACTIVITY_CODE 3
12/23/2022 04:23:29 AM script INFO: Duration: 17.937659978866577
12/23/2022 04:23:29 AM script INFO: mengakhiri-quiz
12/23/2022 04:23:29 AM script INFO: SUCCESS!@#KODE 1!@#USER_ID 51!@#ACTIVITY_CODE 5
12/23/2022 04:23:29 AM script INFO: berhasil-submit
12/23/2022 04:24:59 AM script ERROR: TIMEOUT EXCEPTION!@#KODE 0!@#LOCATION berhasil-submit
12/23/2022 04:24:59 AM main_worker ERROR: Message: None

