12/21/2022 01:36:43 PM script INFO: Prepared chrome options..
12/21/2022 01:36:44 PM script INFO: Initialized chrome browser..
12/21/2022 01:36:44 PM script INFO: mengakses-homepage
12/21/2022 01:36:53 PM script INFO: mengakses-login-page
12/21/2022 01:36:56 PM script INFO: mengakses-site-home
12/21/2022 01:36:58 PM script INFO: mengakses-site-course
12/21/2022 01:37:01 PM script INFO: mengakses-quiz
12/21/2022 01:37:02 PM script INFO: mengakses-start-quiz-page
12/21/2022 01:37:33 PM script INFO: memulai-quiz
12/21/2022 01:37:33 PM script INFO: SUCCESS!@#KODE 1!@#USER_ID 24!@#ACTIVITY_CODE 5
12/21/2022 01:37:44 PM script INFO: SUCCESS!@#KODE 1!@#USER_ID 24!@#ACTIVITY_CODE 3
12/21/2022 01:37:44 PM script INFO: SUCCESS!@#KODE 1!@#USER_ID 24!@#ACTIVITY_CODE 1
12/21/2022 01:37:44 PM script INFO: SUCCESS!@#KODE 1!@#USER_ID 24!@#ACTIVITY_CODE 3
12/21/2022 01:37:44 PM script INFO: SUCCESS!@#KODE 1!@#USER_ID 24!@#ACTIVITY_CODE 1
12/21/2022 01:37:44 PM script INFO: SUCCESS!@#KODE 1!@#USER_ID 24!@#ACTIVITY_CODE 1
12/21/2022 01:37:44 PM script INFO: SUCCESS!@#KODE 1!@#USER_ID 24!@#ACTIVITY_CODE 4
12/21/2022 01:37:45 PM script INFO: SUCCESS!@#KODE 1!@#USER_ID 24!@#ACTIVITY_CODE 2
12/21/2022 01:37:45 PM script INFO: SUCCESS!@#KODE 1!@#USER_ID 24!@#ACTIVITY_CODE 2
12/21/2022 01:37:45 PM script INFO: SUCCESS!@#KODE 1!@#USER_ID 24!@#ACTIVITY_CODE 2
12/21/2022 01:37:45 PM script INFO: SUCCESS!@#KODE 1!@#USER_ID 24!@#ACTIVITY_CODE 3
12/21/2022 01:37:45 PM script INFO: SUCCESS!@#KODE 1!@#USER_ID 24!@#ACTIVITY_CODE 5
12/21/2022 01:37:45 PM script INFO: SUCCESS!@#KODE 1!@#USER_ID 24!@#ACTIVITY_CODE 5
12/21/2022 01:37:47 PM script INFO: SUCCESS!@#KODE 1!@#USER_ID 24!@#ACTIVITY_CODE 2
12/21/2022 01:37:48 PM script INFO: SUCCESS!@#KODE 1!@#USER_ID 24!@#ACTIVITY_CODE 2
12/21/2022 01:37:48 PM script INFO: SUCCESS!@#KODE 1!@#USER_ID 24!@#ACTIVITY_CODE 3
12/21/2022 01:37:48 PM script INFO: SUCCESS!@#KODE 1!@#USER_ID 24!@#ACTIVITY_CODE 3
12/21/2022 01:37:48 PM script INFO: SUCCESS!@#KODE 1!@#USER_ID 24!@#ACTIVITY_CODE 5
12/21/2022 01:37:48 PM script INFO: SUCCESS!@#KODE 1!@#USER_ID 24!@#ACTIVITY_CODE 5
12/21/2022 01:37:50 PM script INFO: SUCCESS!@#KODE 1!@#USER_ID 24!@#ACTIVITY_CODE 2
12/21/2022 01:37:50 PM script INFO: SUCCESS!@#KODE 1!@#USER_ID 24!@#ACTIVITY_CODE 5
12/21/2022 01:37:50 PM script INFO: SUCCESS!@#KODE 1!@#USER_ID 24!@#ACTIVITY_CODE 5
12/21/2022 01:37:53 PM script INFO: SUCCESS!@#KODE 1!@#USER_ID 24!@#ACTIVITY_CODE 2
12/21/2022 01:37:53 PM script INFO: SUCCESS!@#KODE 1!@#USER_ID 24!@#ACTIVITY_CODE 3
12/21/2022 01:37:53 PM script INFO: SUCCESS!@#KODE 1!@#USER_ID 24!@#ACTIVITY_CODE 2
12/21/2022 01:37:53 PM script INFO: SUCCESS!@#KODE 1!@#USER_ID 24!@#ACTIVITY_CODE 1
12/21/2022 01:37:53 PM script INFO: SUCCESS!@#KODE 1!@#USER_ID 24!@#ACTIVITY_CODE 4
12/21/2022 01:37:53 PM script INFO: SUCCESS!@#KODE 1!@#USER_ID 24!@#ACTIVITY_CODE 5
12/21/2022 01:37:53 PM script INFO: SUCCESS!@#KODE 1!@#USER_ID 24!@#ACTIVITY_CODE 5
12/21/2022 01:37:56 PM script INFO: SUCCESS!@#KODE 1!@#USER_ID 24!@#ACTIVITY_CODE 1
12/21/2022 01:37:56 PM script INFO: SUCCESS!@#KODE 1!@#USER_ID 24!@#ACTIVITY_CODE 1
12/21/2022 01:37:56 PM script INFO: SUCCESS!@#KODE 1!@#USER_ID 24!@#ACTIVITY_CODE 5
12/21/2022 01:37:56 PM script INFO: SUCCESS!@#KODE 1!@#USER_ID 24!@#ACTIVITY_CODE 5
12/21/2022 01:37:58 PM script INFO: SUCCESS!@#KODE 1!@#USER_ID 24!@#ACTIVITY_CODE 1
12/21/2022 01:37:58 PM script INFO: SUCCESS!@#KODE 1!@#USER_ID 24!@#ACTIVITY_CODE 3
12/21/2022 01:37:58 PM script INFO: SUCCESS!@#KODE 1!@#USER_ID 24!@#ACTIVITY_CODE 4
12/21/2022 01:37:58 PM script INFO: SUCCESS!@#KODE 1!@#USER_ID 24!@#ACTIVITY_CODE 1
12/21/2022 01:37:58 PM script INFO: SUCCESS!@#KODE 1!@#USER_ID 24!@#ACTIVITY_CODE 1
12/21/2022 01:37:58 PM script INFO: SUCCESS!@#KODE 1!@#USER_ID 24!@#ACTIVITY_CODE 4
12/21/2022 01:37:58 PM script INFO: SUCCESS!@#KODE 1!@#USER_ID 24!@#ACTIVITY_CODE 5
12/21/2022 01:37:58 PM script INFO: SUCCESS!@#KODE 1!@#USER_ID 24!@#ACTIVITY_CODE 5
12/21/2022 01:38:01 PM script INFO: SUCCESS!@#KODE 1!@#USER_ID 24!@#ACTIVITY_CODE 1
12/21/2022 01:38:01 PM script INFO: SUCCESS!@#KODE 1!@#USER_ID 24!@#ACTIVITY_CODE 2
12/21/2022 01:38:01 PM script INFO: SUCCESS!@#KODE 1!@#USER_ID 24!@#ACTIVITY_CODE 1
12/21/2022 01:38:01 PM script INFO: SUCCESS!@#KODE 1!@#USER_ID 24!@#ACTIVITY_CODE 4
12/21/2022 01:38:01 PM script INFO: SUCCESS!@#KODE 1!@#USER_ID 24!@#ACTIVITY_CODE 3
12/21/2022 01:38:01 PM script INFO: SUCCESS!@#KODE 1!@#USER_ID 24!@#ACTIVITY_CODE 3
12/21/2022 01:38:01 PM script INFO: SUCCESS!@#KODE 1!@#USER_ID 24!@#ACTIVITY_CODE 5
12/21/2022 01:38:01 PM script INFO: SUCCESS!@#KODE 1!@#USER_ID 24!@#ACTIVITY_CODE 5
12/21/2022 01:38:04 PM script INFO: SUCCESS!@#KODE 1!@#USER_ID 24!@#ACTIVITY_CODE 5
12/21/2022 01:38:04 PM script INFO: SUCCESS!@#KODE 1!@#USER_ID 24!@#ACTIVITY_CODE 5
12/21/2022 01:38:06 PM script INFO: SUCCESS!@#KODE 1!@#USER_ID 24!@#ACTIVITY_CODE 5
12/21/2022 01:38:06 PM script INFO: SUCCESS!@#KODE 1!@#USER_ID 24!@#ACTIVITY_CODE 5
12/21/2022 01:38:09 PM script INFO: SUCCESS!@#KODE 1!@#USER_ID 24!@#ACTIVITY_CODE 2
12/21/2022 01:38:09 PM script INFO: SUCCESS!@#KODE 1!@#USER_ID 24!@#ACTIVITY_CODE 5
12/21/2022 01:38:09 PM script INFO: SUCCESS!@#KODE 1!@#USER_ID 24!@#ACTIVITY_CODE 5
12/21/2022 01:38:12 PM script INFO: SUCCESS!@#KODE 1!@#USER_ID 24!@#ACTIVITY_CODE 3
12/21/2022 01:38:12 PM script INFO: SUCCESS!@#KODE 1!@#USER_ID 24!@#ACTIVITY_CODE 3
12/21/2022 01:38:12 PM script INFO: SUCCESS!@#KODE 1!@#USER_ID 24!@#ACTIVITY_CODE 5
12/21/2022 01:38:12 PM script INFO: SUCCESS!@#KODE 1!@#USER_ID 24!@#ACTIVITY_CODE 5
12/21/2022 01:38:14 PM script INFO: SUCCESS!@#KODE 1!@#USER_ID 24!@#ACTIVITY_CODE 3
12/21/2022 01:38:14 PM script INFO: SUCCESS!@#KODE 1!@#USER_ID 24!@#ACTIVITY_CODE 1
12/21/2022 01:38:14 PM script INFO: SUCCESS!@#KODE 1!@#USER_ID 24!@#ACTIVITY_CODE 3
12/21/2022 01:38:14 PM script INFO: SUCCESS!@#KODE 1!@#USER_ID 24!@#ACTIVITY_CODE 4
12/21/2022 01:38:15 PM script INFO: SUCCESS!@#KODE 1!@#USER_ID 24!@#ACTIVITY_CODE 3
12/21/2022 01:38:15 PM script INFO: SUCCESS!@#KODE 1!@#USER_ID 24!@#ACTIVITY_CODE 3
12/21/2022 01:38:15 PM script INFO: SUCCESS!@#KODE 1!@#USER_ID 24!@#ACTIVITY_CODE 3
12/21/2022 01:38:15 PM script INFO: SUCCESS!@#KODE 1!@#USER_ID 24!@#ACTIVITY_CODE 2
12/21/2022 01:38:15 PM script INFO: SUCCESS!@#KODE 1!@#USER_ID 24!@#ACTIVITY_CODE 3
12/21/2022 01:38:15 PM script INFO: SUCCESS!@#KODE 1!@#USER_ID 24!@#ACTIVITY_CODE 3
12/21/2022 01:38:15 PM script INFO: SUCCESS!@#KODE 1!@#USER_ID 24!@#ACTIVITY_CODE 2
12/21/2022 01:38:15 PM script INFO: SUCCESS!@#KODE 1!@#USER_ID 24!@#ACTIVITY_CODE 2
12/21/2022 01:38:15 PM script INFO: SUCCESS!@#KODE 1!@#USER_ID 24!@#ACTIVITY_CODE 3
12/21/2022 01:38:15 PM script INFO: SUCCESS!@#KODE 1!@#USER_ID 24!@#ACTIVITY_CODE 2
12/21/2022 01:38:16 PM script INFO: SUCCESS!@#KODE 1!@#USER_ID 24!@#ACTIVITY_CODE 2
12/21/2022 01:38:16 PM script INFO: SUCCESS!@#KODE 1!@#USER_ID 24!@#ACTIVITY_CODE 1
12/21/2022 01:38:16 PM script INFO: SUCCESS!@#KODE 1!@#USER_ID 24!@#ACTIVITY_CODE 4
12/21/2022 01:38:16 PM script INFO: SUCCESS!@#KODE 1!@#USER_ID 24!@#ACTIVITY_CODE 3
12/21/2022 01:38:16 PM script INFO: SUCCESS!@#KODE 1!@#USER_ID 24!@#ACTIVITY_CODE 1
12/21/2022 01:38:16 PM script INFO: SUCCESS!@#KODE 1!@#USER_ID 24!@#ACTIVITY_CODE 3
12/21/2022 01:38:16 PM script INFO: SUCCESS!@#KODE 1!@#USER_ID 24!@#ACTIVITY_CODE 2
12/21/2022 01:38:16 PM script INFO: SUCCESS!@#KODE 1!@#USER_ID 24!@#ACTIVITY_CODE 2
12/21/2022 01:38:16 PM script INFO: SUCCESS!@#KODE 1!@#USER_ID 24!@#ACTIVITY_CODE 3
12/21/2022 01:38:16 PM script INFO: SUCCESS!@#KODE 1!@#USER_ID 24!@#ACTIVITY_CODE 3
12/21/2022 01:38:16 PM script INFO: SUCCESS!@#KODE 1!@#USER_ID 24!@#ACTIVITY_CODE 2
12/21/2022 01:38:16 PM script INFO: SUCCESS!@#KODE 1!@#USER_ID 24!@#ACTIVITY_CODE 2
12/21/2022 01:38:17 PM script INFO: SUCCESS!@#KODE 1!@#USER_ID 24!@#ACTIVITY_CODE 4
12/21/2022 01:38:17 PM script INFO: SUCCESS!@#KODE 1!@#USER_ID 24!@#ACTIVITY_CODE 2
12/21/2022 01:38:17 PM script INFO: SUCCESS!@#KODE 1!@#USER_ID 24!@#ACTIVITY_CODE 3
12/21/2022 01:38:17 PM script INFO: SUCCESS!@#KODE 1!@#USER_ID 24!@#ACTIVITY_CODE 2
12/21/2022 01:38:17 PM script INFO: SUCCESS!@#KODE 1!@#USER_ID 24!@#ACTIVITY_CODE 2
12/21/2022 01:38:17 PM script INFO: SUCCESS!@#KODE 1!@#USER_ID 24!@#ACTIVITY_CODE 2
12/21/2022 01:38:17 PM script INFO: SUCCESS!@#KODE 1!@#USER_ID 24!@#ACTIVITY_CODE 3
12/21/2022 01:38:17 PM script INFO: SUCCESS!@#KODE 1!@#USER_ID 24!@#ACTIVITY_CODE 1
12/21/2022 01:38:17 PM script INFO: SUCCESS!@#KODE 1!@#USER_ID 24!@#ACTIVITY_CODE 2
12/21/2022 01:38:17 PM script INFO: SUCCESS!@#KODE 1!@#USER_ID 24!@#ACTIVITY_CODE 3
12/21/2022 01:38:17 PM script INFO: SUCCESS!@#KODE 1!@#USER_ID 24!@#ACTIVITY_CODE 3
12/21/2022 01:38:18 PM script INFO: SUCCESS!@#KODE 1!@#USER_ID 24!@#ACTIVITY_CODE 1
12/21/2022 01:38:18 PM script INFO: SUCCESS!@#KODE 1!@#USER_ID 24!@#ACTIVITY_CODE 2
12/21/2022 01:38:18 PM script INFO: Duration: 33.63881468772888
12/21/2022 01:38:18 PM script INFO: mengakhiri-quiz
12/21/2022 01:38:58 PM script INFO: SUCCESS!@#KODE 1!@#USER_ID 24!@#ACTIVITY_CODE 5
12/21/2022 01:38:58 PM script INFO: berhasil-submit
