12/10/2022 09:12:07 AM script INFO: Prepared chrome options..
12/10/2022 09:12:09 AM script INFO: Initialized chrome browser..
12/10/2022 09:12:09 AM script INFO: mengakses-homepage
12/10/2022 09:12:42 AM script INFO: mengakses-login-page
12/10/2022 09:13:10 AM script INFO: mengakses-site-home
12/10/2022 09:13:14 AM script INFO: mengakses-site-course
12/10/2022 09:13:47 AM script INFO: mengakses-quiz
12/10/2022 09:13:48 AM script INFO: mengakses-start-quiz-page
12/10/2022 09:13:51 AM script INFO: memulai-quiz
12/10/2022 09:13:51 AM script INFO: SUCCESS!@#KODE 1!@#USER_ID 79!@#ACTIVITY_CODE 5
12/10/2022 09:14:02 AM script INFO: SUCCESS!@#KODE 1!@#USER_ID 79!@#ACTIVITY_CODE 2
12/10/2022 09:14:03 AM script INFO: SUCCESS!@#KODE 1!@#USER_ID 79!@#ACTIVITY_CODE 1
12/10/2022 09:14:03 AM script INFO: SUCCESS!@#KODE 1!@#USER_ID 79!@#ACTIVITY_CODE 1
12/10/2022 09:14:03 AM script INFO: SUCCESS!@#KODE 1!@#USER_ID 79!@#ACTIVITY_CODE 3
12/10/2022 09:14:03 AM script INFO: SUCCESS!@#KODE 1!@#USER_ID 79!@#ACTIVITY_CODE 4
12/10/2022 09:14:03 AM script INFO: SUCCESS!@#KODE 1!@#USER_ID 79!@#ACTIVITY_CODE 3
12/10/2022 09:14:03 AM script INFO: SUCCESS!@#KODE 1!@#USER_ID 79!@#ACTIVITY_CODE 1
12/10/2022 09:14:04 AM script INFO: SUCCESS!@#KODE 1!@#USER_ID 79!@#ACTIVITY_CODE 4
12/10/2022 09:14:04 AM script INFO: SUCCESS!@#KODE 1!@#USER_ID 79!@#ACTIVITY_CODE 2
12/10/2022 09:14:04 AM script INFO: SUCCESS!@#KODE 1!@#USER_ID 79!@#ACTIVITY_CODE 3
12/10/2022 09:14:04 AM script INFO: SUCCESS!@#KODE 1!@#USER_ID 79!@#ACTIVITY_CODE 1
12/10/2022 09:14:04 AM script INFO: SUCCESS!@#KODE 1!@#USER_ID 79!@#ACTIVITY_CODE 3
12/10/2022 09:14:05 AM script INFO: SUCCESS!@#KODE 1!@#USER_ID 79!@#ACTIVITY_CODE 4
12/10/2022 09:14:05 AM script INFO: SUCCESS!@#KODE 1!@#USER_ID 79!@#ACTIVITY_CODE 3
12/10/2022 09:14:05 AM script INFO: SUCCESS!@#KODE 1!@#USER_ID 79!@#ACTIVITY_CODE 1
12/10/2022 09:14:05 AM script INFO: SUCCESS!@#KODE 1!@#USER_ID 79!@#ACTIVITY_CODE 3
12/10/2022 09:14:05 AM script INFO: SUCCESS!@#KODE 1!@#USER_ID 79!@#ACTIVITY_CODE 4
12/10/2022 09:14:06 AM script INFO: SUCCESS!@#KODE 1!@#USER_ID 79!@#ACTIVITY_CODE 1
12/10/2022 09:14:06 AM script INFO: SUCCESS!@#KODE 1!@#USER_ID 79!@#ACTIVITY_CODE 5
12/10/2022 09:14:06 AM script INFO: SUCCESS!@#KODE 1!@#USER_ID 79!@#ACTIVITY_CODE 5
12/10/2022 09:14:08 AM script INFO: SUCCESS!@#KODE 1!@#USER_ID 79!@#ACTIVITY_CODE 5
12/10/2022 09:14:08 AM script INFO: SUCCESS!@#KODE 1!@#USER_ID 79!@#ACTIVITY_CODE 5
12/10/2022 09:14:11 AM script INFO: SUCCESS!@#KODE 1!@#USER_ID 79!@#ACTIVITY_CODE 2
12/10/2022 09:14:11 AM script INFO: SUCCESS!@#KODE 1!@#USER_ID 79!@#ACTIVITY_CODE 5
12/10/2022 09:14:11 AM script INFO: SUCCESS!@#KODE 1!@#USER_ID 79!@#ACTIVITY_CODE 5
12/10/2022 09:14:14 AM script INFO: SUCCESS!@#KODE 1!@#USER_ID 79!@#ACTIVITY_CODE 3
12/10/2022 09:14:14 AM script INFO: SUCCESS!@#KODE 1!@#USER_ID 79!@#ACTIVITY_CODE 3
12/10/2022 09:14:14 AM script INFO: SUCCESS!@#KODE 1!@#USER_ID 79!@#ACTIVITY_CODE 3
12/10/2022 09:14:14 AM script INFO: SUCCESS!@#KODE 1!@#USER_ID 79!@#ACTIVITY_CODE 2
12/10/2022 09:14:15 AM script INFO: SUCCESS!@#KODE 1!@#USER_ID 79!@#ACTIVITY_CODE 2
12/10/2022 09:14:15 AM script INFO: SUCCESS!@#KODE 1!@#USER_ID 79!@#ACTIVITY_CODE 1
12/10/2022 09:14:15 AM script INFO: SUCCESS!@#KODE 1!@#USER_ID 79!@#ACTIVITY_CODE 3
12/10/2022 09:14:15 AM script INFO: SUCCESS!@#KODE 1!@#USER_ID 79!@#ACTIVITY_CODE 1
12/10/2022 09:14:15 AM script INFO: SUCCESS!@#KODE 1!@#USER_ID 79!@#ACTIVITY_CODE 3
12/10/2022 09:14:15 AM script INFO: SUCCESS!@#KODE 1!@#USER_ID 79!@#ACTIVITY_CODE 1
12/10/2022 09:14:15 AM script INFO: SUCCESS!@#KODE 1!@#USER_ID 79!@#ACTIVITY_CODE 2
12/10/2022 09:14:16 AM script INFO: SUCCESS!@#KODE 1!@#USER_ID 79!@#ACTIVITY_CODE 3
12/10/2022 09:14:16 AM script INFO: SUCCESS!@#KODE 1!@#USER_ID 79!@#ACTIVITY_CODE 3
12/10/2022 09:14:16 AM script INFO: SUCCESS!@#KODE 1!@#USER_ID 79!@#ACTIVITY_CODE 2
12/10/2022 09:14:16 AM script INFO: SUCCESS!@#KODE 1!@#USER_ID 79!@#ACTIVITY_CODE 2
12/10/2022 09:14:16 AM script INFO: SUCCESS!@#KODE 1!@#USER_ID 79!@#ACTIVITY_CODE 5
12/10/2022 09:14:16 AM script INFO: SUCCESS!@#KODE 1!@#USER_ID 79!@#ACTIVITY_CODE 5
12/10/2022 09:14:19 AM script INFO: SUCCESS!@#KODE 1!@#USER_ID 79!@#ACTIVITY_CODE 3
12/10/2022 09:14:19 AM script INFO: SUCCESS!@#KODE 1!@#USER_ID 79!@#ACTIVITY_CODE 2
12/10/2022 09:14:19 AM script INFO: SUCCESS!@#KODE 1!@#USER_ID 79!@#ACTIVITY_CODE 1
12/10/2022 09:14:19 AM script INFO: SUCCESS!@#KODE 1!@#USER_ID 79!@#ACTIVITY_CODE 5
12/10/2022 09:14:19 AM script INFO: SUCCESS!@#KODE 1!@#USER_ID 79!@#ACTIVITY_CODE 5
12/10/2022 09:14:22 AM script INFO: SUCCESS!@#KODE 1!@#USER_ID 79!@#ACTIVITY_CODE 1
12/10/2022 09:14:22 AM script INFO: SUCCESS!@#KODE 1!@#USER_ID 79!@#ACTIVITY_CODE 5
12/10/2022 09:14:22 AM script INFO: SUCCESS!@#KODE 1!@#USER_ID 79!@#ACTIVITY_CODE 5
12/10/2022 09:14:25 AM script INFO: SUCCESS!@#KODE 1!@#USER_ID 79!@#ACTIVITY_CODE 1
12/10/2022 09:14:25 AM script INFO: SUCCESS!@#KODE 1!@#USER_ID 79!@#ACTIVITY_CODE 1
12/10/2022 09:14:25 AM script INFO: SUCCESS!@#KODE 1!@#USER_ID 79!@#ACTIVITY_CODE 3
12/10/2022 09:14:25 AM script INFO: SUCCESS!@#KODE 1!@#USER_ID 79!@#ACTIVITY_CODE 2
12/10/2022 09:14:25 AM script INFO: SUCCESS!@#KODE 1!@#USER_ID 79!@#ACTIVITY_CODE 3
12/10/2022 09:14:25 AM script INFO: SUCCESS!@#KODE 1!@#USER_ID 79!@#ACTIVITY_CODE 5
12/10/2022 09:14:25 AM script INFO: SUCCESS!@#KODE 1!@#USER_ID 79!@#ACTIVITY_CODE 5
12/10/2022 09:14:28 AM script INFO: SUCCESS!@#KODE 1!@#USER_ID 79!@#ACTIVITY_CODE 3
12/10/2022 09:14:28 AM script INFO: SUCCESS!@#KODE 1!@#USER_ID 79!@#ACTIVITY_CODE 1
12/10/2022 09:14:28 AM script INFO: SUCCESS!@#KODE 1!@#USER_ID 79!@#ACTIVITY_CODE 1
12/10/2022 09:14:28 AM script INFO: SUCCESS!@#KODE 1!@#USER_ID 79!@#ACTIVITY_CODE 5
12/10/2022 09:14:28 AM script INFO: SUCCESS!@#KODE 1!@#USER_ID 79!@#ACTIVITY_CODE 5
12/10/2022 09:14:31 AM script INFO: SUCCESS!@#KODE 1!@#USER_ID 79!@#ACTIVITY_CODE 1
12/10/2022 09:14:31 AM script INFO: SUCCESS!@#KODE 1!@#USER_ID 79!@#ACTIVITY_CODE 4
12/10/2022 09:14:31 AM script INFO: SUCCESS!@#KODE 1!@#USER_ID 79!@#ACTIVITY_CODE 3
12/10/2022 09:14:32 AM script INFO: SUCCESS!@#KODE 1!@#USER_ID 79!@#ACTIVITY_CODE 2
12/10/2022 09:14:32 AM script INFO: SUCCESS!@#KODE 1!@#USER_ID 79!@#ACTIVITY_CODE 3
12/10/2022 09:14:32 AM script INFO: SUCCESS!@#KODE 1!@#USER_ID 79!@#ACTIVITY_CODE 3
12/10/2022 09:14:32 AM script INFO: SUCCESS!@#KODE 1!@#USER_ID 79!@#ACTIVITY_CODE 2
12/10/2022 09:14:32 AM script INFO: SUCCESS!@#KODE 1!@#USER_ID 79!@#ACTIVITY_CODE 3
12/10/2022 09:14:33 AM script INFO: SUCCESS!@#KODE 1!@#USER_ID 79!@#ACTIVITY_CODE 2
12/10/2022 09:14:33 AM script INFO: SUCCESS!@#KODE 1!@#USER_ID 79!@#ACTIVITY_CODE 5
12/10/2022 09:14:33 AM script INFO: SUCCESS!@#KODE 1!@#USER_ID 79!@#ACTIVITY_CODE 5
12/10/2022 09:14:35 AM script INFO: SUCCESS!@#KODE 1!@#USER_ID 79!@#ACTIVITY_CODE 3
12/10/2022 09:14:36 AM script INFO: SUCCESS!@#KODE 1!@#USER_ID 79!@#ACTIVITY_CODE 2
12/10/2022 09:14:36 AM script INFO: SUCCESS!@#KODE 1!@#USER_ID 79!@#ACTIVITY_CODE 5
12/10/2022 09:14:36 AM script INFO: SUCCESS!@#KODE 1!@#USER_ID 79!@#ACTIVITY_CODE 5
12/10/2022 09:14:39 AM script INFO: SUCCESS!@#KODE 1!@#USER_ID 79!@#ACTIVITY_CODE 2
12/10/2022 09:14:39 AM script INFO: SUCCESS!@#KODE 1!@#USER_ID 79!@#ACTIVITY_CODE 3
12/10/2022 09:14:39 AM script INFO: SUCCESS!@#KODE 1!@#USER_ID 79!@#ACTIVITY_CODE 1
12/10/2022 09:14:39 AM script INFO: SUCCESS!@#KODE 1!@#USER_ID 79!@#ACTIVITY_CODE 4
12/10/2022 09:14:39 AM script INFO: SUCCESS!@#KODE 1!@#USER_ID 79!@#ACTIVITY_CODE 3
12/10/2022 09:14:39 AM script INFO: SUCCESS!@#KODE 1!@#USER_ID 79!@#ACTIVITY_CODE 3
12/10/2022 09:14:39 AM script INFO: SUCCESS!@#KODE 1!@#USER_ID 79!@#ACTIVITY_CODE 5
12/10/2022 09:14:39 AM script INFO: SUCCESS!@#KODE 1!@#USER_ID 79!@#ACTIVITY_CODE 5
12/10/2022 09:14:42 AM script INFO: SUCCESS!@#KODE 1!@#USER_ID 79!@#ACTIVITY_CODE 1
12/10/2022 09:14:42 AM script INFO: SUCCESS!@#KODE 1!@#USER_ID 79!@#ACTIVITY_CODE 4
12/10/2022 09:14:43 AM script INFO: SUCCESS!@#KODE 1!@#USER_ID 79!@#ACTIVITY_CODE 3
12/10/2022 09:14:43 AM script INFO: SUCCESS!@#KODE 1!@#USER_ID 79!@#ACTIVITY_CODE 1
12/10/2022 09:14:43 AM script INFO: SUCCESS!@#KODE 1!@#USER_ID 79!@#ACTIVITY_CODE 3
12/10/2022 09:14:43 AM script INFO: SUCCESS!@#KODE 1!@#USER_ID 79!@#ACTIVITY_CODE 1
12/10/2022 09:14:43 AM script INFO: SUCCESS!@#KODE 1!@#USER_ID 79!@#ACTIVITY_CODE 3
12/10/2022 09:14:43 AM script INFO: SUCCESS!@#KODE 1!@#USER_ID 79!@#ACTIVITY_CODE 5
12/10/2022 09:14:43 AM script INFO: SUCCESS!@#KODE 1!@#USER_ID 79!@#ACTIVITY_CODE 5
12/10/2022 09:14:46 AM script INFO: SUCCESS!@#KODE 1!@#USER_ID 79!@#ACTIVITY_CODE 2
12/10/2022 09:14:46 AM script INFO: SUCCESS!@#KODE 1!@#USER_ID 79!@#ACTIVITY_CODE 5
12/10/2022 09:14:46 AM script INFO: SUCCESS!@#KODE 1!@#USER_ID 79!@#ACTIVITY_CODE 5
12/10/2022 09:14:50 AM script INFO: SUCCESS!@#KODE 1!@#USER_ID 79!@#ACTIVITY_CODE 2
12/10/2022 09:14:50 AM script INFO: SUCCESS!@#KODE 1!@#USER_ID 79!@#ACTIVITY_CODE 1
12/10/2022 09:14:50 AM script INFO: SUCCESS!@#KODE 1!@#USER_ID 79!@#ACTIVITY_CODE 1
12/10/2022 09:14:50 AM script INFO: SUCCESS!@#KODE 1!@#USER_ID 79!@#ACTIVITY_CODE 3
12/10/2022 09:14:50 AM script INFO: SUCCESS!@#KODE 1!@#USER_ID 79!@#ACTIVITY_CODE 1
12/10/2022 09:14:50 AM script INFO: SUCCESS!@#KODE 1!@#USER_ID 79!@#ACTIVITY_CODE 5
12/10/2022 09:14:50 AM script INFO: SUCCESS!@#KODE 1!@#USER_ID 79!@#ACTIVITY_CODE 5
12/10/2022 09:14:53 AM script INFO: SUCCESS!@#KODE 1!@#USER_ID 79!@#ACTIVITY_CODE 5
12/10/2022 09:14:53 AM script INFO: SUCCESS!@#KODE 1!@#USER_ID 79!@#ACTIVITY_CODE 5
12/10/2022 09:14:56 AM script INFO: SUCCESS!@#KODE 1!@#USER_ID 79!@#ACTIVITY_CODE 4
12/10/2022 09:14:57 AM script INFO: SUCCESS!@#KODE 1!@#USER_ID 79!@#ACTIVITY_CODE 1
12/10/2022 09:14:58 AM script INFO: SUCCESS!@#KODE 1!@#USER_ID 79!@#ACTIVITY_CODE 4
12/10/2022 09:14:59 AM script INFO: SUCCESS!@#KODE 1!@#USER_ID 79!@#ACTIVITY_CODE 2
12/10/2022 09:14:59 AM script INFO: SUCCESS!@#KODE 1!@#USER_ID 79!@#ACTIVITY_CODE 5
12/10/2022 09:14:59 AM script INFO: SUCCESS!@#KODE 1!@#USER_ID 79!@#ACTIVITY_CODE 5
12/10/2022 09:15:01 AM script INFO: SUCCESS!@#KODE 1!@#USER_ID 79!@#ACTIVITY_CODE 1
12/10/2022 09:15:02 AM script INFO: SUCCESS!@#KODE 1!@#USER_ID 79!@#ACTIVITY_CODE 3
12/10/2022 09:15:02 AM script INFO: SUCCESS!@#KODE 1!@#USER_ID 79!@#ACTIVITY_CODE 1
12/10/2022 09:15:02 AM script INFO: SUCCESS!@#KODE 1!@#USER_ID 79!@#ACTIVITY_CODE 3
12/10/2022 09:15:03 AM script INFO: SUCCESS!@#KODE 1!@#USER_ID 79!@#ACTIVITY_CODE 2
12/10/2022 09:15:03 AM script INFO: SUCCESS!@#KODE 1!@#USER_ID 79!@#ACTIVITY_CODE 2
12/10/2022 09:15:03 AM script INFO: SUCCESS!@#KODE 1!@#USER_ID 79!@#ACTIVITY_CODE 3
12/10/2022 09:15:04 AM script INFO: SUCCESS!@#KODE 1!@#USER_ID 79!@#ACTIVITY_CODE 3
12/10/2022 09:15:05 AM script INFO: SUCCESS!@#KODE 1!@#USER_ID 79!@#ACTIVITY_CODE 2
12/10/2022 09:15:05 AM script INFO: SUCCESS!@#KODE 1!@#USER_ID 79!@#ACTIVITY_CODE 1
12/10/2022 09:15:05 AM script INFO: SUCCESS!@#KODE 1!@#USER_ID 79!@#ACTIVITY_CODE 4
12/10/2022 09:15:06 AM script INFO: SUCCESS!@#KODE 1!@#USER_ID 79!@#ACTIVITY_CODE 3
12/10/2022 09:15:06 AM script INFO: SUCCESS!@#KODE 1!@#USER_ID 79!@#ACTIVITY_CODE 1
12/10/2022 09:15:07 AM script INFO: SUCCESS!@#KODE 1!@#USER_ID 79!@#ACTIVITY_CODE 3
12/10/2022 09:15:07 AM script INFO: SUCCESS!@#KODE 1!@#USER_ID 79!@#ACTIVITY_CODE 3
12/10/2022 09:15:07 AM script INFO: SUCCESS!@#KODE 1!@#USER_ID 79!@#ACTIVITY_CODE 4
12/10/2022 09:15:08 AM script INFO: SUCCESS!@#KODE 1!@#USER_ID 79!@#ACTIVITY_CODE 1
12/10/2022 09:15:08 AM script INFO: SUCCESS!@#KODE 1!@#USER_ID 79!@#ACTIVITY_CODE 3
12/10/2022 09:15:09 AM script INFO: SUCCESS!@#KODE 1!@#USER_ID 79!@#ACTIVITY_CODE 2
12/10/2022 09:15:10 AM script INFO: SUCCESS!@#KODE 1!@#USER_ID 79!@#ACTIVITY_CODE 2
12/10/2022 09:15:10 AM script INFO: SUCCESS!@#KODE 1!@#USER_ID 79!@#ACTIVITY_CODE 3
12/10/2022 09:15:11 AM script INFO: SUCCESS!@#KODE 1!@#USER_ID 79!@#ACTIVITY_CODE 4
12/10/2022 09:15:11 AM script INFO: SUCCESS!@#KODE 1!@#USER_ID 79!@#ACTIVITY_CODE 1
12/10/2022 09:15:12 AM script INFO: SUCCESS!@#KODE 1!@#USER_ID 79!@#ACTIVITY_CODE 2
12/10/2022 09:15:13 AM script INFO: SUCCESS!@#KODE 1!@#USER_ID 79!@#ACTIVITY_CODE 2
12/10/2022 09:15:13 AM script INFO: SUCCESS!@#KODE 1!@#USER_ID 79!@#ACTIVITY_CODE 3
12/10/2022 09:15:14 AM script INFO: SUCCESS!@#KODE 1!@#USER_ID 79!@#ACTIVITY_CODE 1
12/10/2022 09:15:14 AM script INFO: SUCCESS!@#KODE 1!@#USER_ID 79!@#ACTIVITY_CODE 4
12/10/2022 09:15:15 AM script INFO: SUCCESS!@#KODE 1!@#USER_ID 79!@#ACTIVITY_CODE 1
12/10/2022 09:15:15 AM script INFO: SUCCESS!@#KODE 1!@#USER_ID 79!@#ACTIVITY_CODE 2
12/10/2022 09:15:16 AM script INFO: SUCCESS!@#KODE 1!@#USER_ID 79!@#ACTIVITY_CODE 1
12/10/2022 09:15:16 AM script INFO: SUCCESS!@#KODE 1!@#USER_ID 79!@#ACTIVITY_CODE 3
12/10/2022 09:15:17 AM script INFO: SUCCESS!@#KODE 1!@#USER_ID 79!@#ACTIVITY_CODE 4
12/10/2022 09:15:17 AM script INFO: SUCCESS!@#KODE 1!@#USER_ID 79!@#ACTIVITY_CODE 3
12/10/2022 09:15:17 AM script INFO: SUCCESS!@#KODE 1!@#USER_ID 79!@#ACTIVITY_CODE 2
12/10/2022 09:15:18 AM script INFO: SUCCESS!@#KODE 1!@#USER_ID 79!@#ACTIVITY_CODE 4
12/10/2022 09:15:18 AM script INFO: SUCCESS!@#KODE 1!@#USER_ID 79!@#ACTIVITY_CODE 2
12/10/2022 09:15:19 AM script INFO: SUCCESS!@#KODE 1!@#USER_ID 79!@#ACTIVITY_CODE 3
12/10/2022 09:15:19 AM script INFO: SUCCESS!@#KODE 1!@#USER_ID 79!@#ACTIVITY_CODE 3
12/10/2022 09:15:20 AM script INFO: SUCCESS!@#KODE 1!@#USER_ID 79!@#ACTIVITY_CODE 3
12/10/2022 09:15:20 AM script INFO: SUCCESS!@#KODE 1!@#USER_ID 79!@#ACTIVITY_CODE 2
12/10/2022 09:15:22 AM script INFO: SUCCESS!@#KODE 1!@#USER_ID 79!@#ACTIVITY_CODE 2
12/10/2022 09:15:22 AM script INFO: SUCCESS!@#KODE 1!@#USER_ID 79!@#ACTIVITY_CODE 1
12/10/2022 09:15:22 AM script INFO: SUCCESS!@#KODE 1!@#USER_ID 79!@#ACTIVITY_CODE 1
12/10/2022 09:15:23 AM script INFO: SUCCESS!@#KODE 1!@#USER_ID 79!@#ACTIVITY_CODE 4
12/10/2022 09:15:23 AM script INFO: SUCCESS!@#KODE 1!@#USER_ID 79!@#ACTIVITY_CODE 3
12/10/2022 09:15:23 AM script INFO: SUCCESS!@#KODE 1!@#USER_ID 79!@#ACTIVITY_CODE 3
12/10/2022 09:15:23 AM script INFO: SUCCESS!@#KODE 1!@#USER_ID 79!@#ACTIVITY_CODE 1
12/10/2022 09:15:24 AM script INFO: SUCCESS!@#KODE 1!@#USER_ID 79!@#ACTIVITY_CODE 2
12/10/2022 09:15:24 AM script INFO: SUCCESS!@#KODE 1!@#USER_ID 79!@#ACTIVITY_CODE 3
12/10/2022 09:15:25 AM script INFO: SUCCESS!@#KODE 1!@#USER_ID 79!@#ACTIVITY_CODE 3
12/10/2022 09:15:25 AM script INFO: SUCCESS!@#KODE 1!@#USER_ID 79!@#ACTIVITY_CODE 1
12/10/2022 09:15:25 AM script INFO: SUCCESS!@#KODE 1!@#USER_ID 79!@#ACTIVITY_CODE 3
12/10/2022 09:15:25 AM script INFO: SUCCESS!@#KODE 1!@#USER_ID 79!@#ACTIVITY_CODE 1
12/10/2022 09:15:26 AM script INFO: SUCCESS!@#KODE 1!@#USER_ID 79!@#ACTIVITY_CODE 2
12/10/2022 09:15:26 AM script INFO: SUCCESS!@#KODE 1!@#USER_ID 79!@#ACTIVITY_CODE 4
12/10/2022 09:15:28 AM script INFO: SUCCESS!@#KODE 1!@#USER_ID 79!@#ACTIVITY_CODE 2
12/10/2022 09:15:28 AM script INFO: SUCCESS!@#KODE 1!@#USER_ID 79!@#ACTIVITY_CODE 3
12/10/2022 09:15:28 AM script INFO: SUCCESS!@#KODE 1!@#USER_ID 79!@#ACTIVITY_CODE 3
12/10/2022 09:15:29 AM script INFO: SUCCESS!@#KODE 1!@#USER_ID 79!@#ACTIVITY_CODE 1
12/10/2022 09:15:29 AM script INFO: SUCCESS!@#KODE 1!@#USER_ID 79!@#ACTIVITY_CODE 3
12/10/2022 09:15:31 AM script INFO: SUCCESS!@#KODE 1!@#USER_ID 79!@#ACTIVITY_CODE 2
12/10/2022 09:15:32 AM script INFO: SUCCESS!@#KODE 1!@#USER_ID 79!@#ACTIVITY_CODE 2
12/10/2022 09:15:33 AM script INFO: SUCCESS!@#KODE 1!@#USER_ID 79!@#ACTIVITY_CODE 4
12/10/2022 09:15:34 AM script INFO: SUCCESS!@#KODE 1!@#USER_ID 79!@#ACTIVITY_CODE 1
12/10/2022 09:15:34 AM script INFO: SUCCESS!@#KODE 1!@#USER_ID 79!@#ACTIVITY_CODE 4
12/10/2022 09:15:34 AM script INFO: SUCCESS!@#KODE 1!@#USER_ID 79!@#ACTIVITY_CODE 1
12/10/2022 09:15:34 AM script INFO: SUCCESS!@#KODE 1!@#USER_ID 79!@#ACTIVITY_CODE 1
12/10/2022 09:15:35 AM script INFO: SUCCESS!@#KODE 1!@#USER_ID 79!@#ACTIVITY_CODE 2
12/10/2022 09:15:35 AM script INFO: SUCCESS!@#KODE 1!@#USER_ID 79!@#ACTIVITY_CODE 2
12/10/2022 09:15:36 AM script INFO: SUCCESS!@#KODE 1!@#USER_ID 79!@#ACTIVITY_CODE 2
12/10/2022 09:15:36 AM script INFO: SUCCESS!@#KODE 1!@#USER_ID 79!@#ACTIVITY_CODE 3
12/10/2022 09:15:37 AM script INFO: SUCCESS!@#KODE 1!@#USER_ID 79!@#ACTIVITY_CODE 1
12/10/2022 09:15:37 AM script INFO: SUCCESS!@#KODE 1!@#USER_ID 79!@#ACTIVITY_CODE 1
12/10/2022 09:15:37 AM script INFO: SUCCESS!@#KODE 1!@#USER_ID 79!@#ACTIVITY_CODE 2
12/10/2022 09:15:37 AM script INFO: SUCCESS!@#KODE 1!@#USER_ID 79!@#ACTIVITY_CODE 3
12/10/2022 09:15:38 AM script INFO: SUCCESS!@#KODE 1!@#USER_ID 79!@#ACTIVITY_CODE 3
12/10/2022 09:15:38 AM script INFO: SUCCESS!@#KODE 1!@#USER_ID 79!@#ACTIVITY_CODE 3
12/10/2022 09:15:38 AM script INFO: SUCCESS!@#KODE 1!@#USER_ID 79!@#ACTIVITY_CODE 1
12/10/2022 09:15:38 AM script INFO: SUCCESS!@#KODE 1!@#USER_ID 79!@#ACTIVITY_CODE 3
12/10/2022 09:15:39 AM script INFO: SUCCESS!@#KODE 1!@#USER_ID 79!@#ACTIVITY_CODE 3
12/10/2022 09:15:39 AM script INFO: SUCCESS!@#KODE 1!@#USER_ID 79!@#ACTIVITY_CODE 3
12/10/2022 09:15:39 AM script INFO: SUCCESS!@#KODE 1!@#USER_ID 79!@#ACTIVITY_CODE 4
12/10/2022 09:15:39 AM script INFO: SUCCESS!@#KODE 1!@#USER_ID 79!@#ACTIVITY_CODE 3
12/10/2022 09:15:40 AM script INFO: SUCCESS!@#KODE 1!@#USER_ID 79!@#ACTIVITY_CODE 1
12/10/2022 09:15:40 AM script INFO: SUCCESS!@#KODE 1!@#USER_ID 79!@#ACTIVITY_CODE 1
12/10/2022 09:15:40 AM script INFO: SUCCESS!@#KODE 1!@#USER_ID 79!@#ACTIVITY_CODE 4
12/10/2022 09:15:40 AM script INFO: SUCCESS!@#KODE 1!@#USER_ID 79!@#ACTIVITY_CODE 3
12/10/2022 09:15:41 AM script INFO: SUCCESS!@#KODE 1!@#USER_ID 79!@#ACTIVITY_CODE 3
12/10/2022 09:15:41 AM script INFO: SUCCESS!@#KODE 1!@#USER_ID 79!@#ACTIVITY_CODE 1
12/10/2022 09:15:42 AM script INFO: SUCCESS!@#KODE 1!@#USER_ID 79!@#ACTIVITY_CODE 2
12/10/2022 09:15:43 AM script INFO: SUCCESS!@#KODE 1!@#USER_ID 79!@#ACTIVITY_CODE 3
12/10/2022 09:15:43 AM script INFO: SUCCESS!@#KODE 1!@#USER_ID 79!@#ACTIVITY_CODE 3
12/10/2022 09:15:44 AM script INFO: SUCCESS!@#KODE 1!@#USER_ID 79!@#ACTIVITY_CODE 2
12/10/2022 09:15:45 AM script INFO: SUCCESS!@#KODE 1!@#USER_ID 79!@#ACTIVITY_CODE 2
12/10/2022 09:15:45 AM script INFO: SUCCESS!@#KODE 1!@#USER_ID 79!@#ACTIVITY_CODE 4
12/10/2022 09:15:46 AM script INFO: SUCCESS!@#KODE 1!@#USER_ID 79!@#ACTIVITY_CODE 2
12/10/2022 09:15:48 AM script INFO: SUCCESS!@#KODE 1!@#USER_ID 79!@#ACTIVITY_CODE 2
12/10/2022 09:15:48 AM script INFO: SUCCESS!@#KODE 1!@#USER_ID 79!@#ACTIVITY_CODE 3
12/10/2022 09:15:48 AM script INFO: SUCCESS!@#KODE 1!@#USER_ID 79!@#ACTIVITY_CODE 3
12/10/2022 09:15:48 AM script INFO: SUCCESS!@#KODE 1!@#USER_ID 79!@#ACTIVITY_CODE 1
12/10/2022 09:15:48 AM script INFO: SUCCESS!@#KODE 1!@#USER_ID 79!@#ACTIVITY_CODE 3
12/10/2022 09:15:49 AM script INFO: SUCCESS!@#KODE 1!@#USER_ID 79!@#ACTIVITY_CODE 2
12/10/2022 09:15:50 AM script INFO: SUCCESS!@#KODE 1!@#USER_ID 79!@#ACTIVITY_CODE 3
12/10/2022 09:15:50 AM script INFO: SUCCESS!@#KODE 1!@#USER_ID 79!@#ACTIVITY_CODE 1
12/10/2022 09:15:50 AM script INFO: SUCCESS!@#KODE 1!@#USER_ID 79!@#ACTIVITY_CODE 4
12/10/2022 09:15:51 AM script INFO: SUCCESS!@#KODE 1!@#USER_ID 79!@#ACTIVITY_CODE 1
12/10/2022 09:15:51 AM script INFO: SUCCESS!@#KODE 1!@#USER_ID 79!@#ACTIVITY_CODE 1
12/10/2022 09:15:52 AM script INFO: SUCCESS!@#KODE 1!@#USER_ID 79!@#ACTIVITY_CODE 4
12/10/2022 09:15:52 AM script INFO: SUCCESS!@#KODE 1!@#USER_ID 79!@#ACTIVITY_CODE 3
12/10/2022 09:15:52 AM script INFO: SUCCESS!@#KODE 1!@#USER_ID 79!@#ACTIVITY_CODE 2
12/10/2022 09:15:52 AM script INFO: SUCCESS!@#KODE 1!@#USER_ID 79!@#ACTIVITY_CODE 1
12/10/2022 09:15:52 AM script INFO: SUCCESS!@#KODE 1!@#USER_ID 79!@#ACTIVITY_CODE 1
12/10/2022 09:15:53 AM script INFO: SUCCESS!@#KODE 1!@#USER_ID 79!@#ACTIVITY_CODE 1
12/10/2022 09:15:53 AM script INFO: SUCCESS!@#KODE 1!@#USER_ID 79!@#ACTIVITY_CODE 4
12/10/2022 09:15:53 AM script INFO: SUCCESS!@#KODE 1!@#USER_ID 79!@#ACTIVITY_CODE 1
12/10/2022 09:15:54 AM script INFO: SUCCESS!@#KODE 1!@#USER_ID 79!@#ACTIVITY_CODE 2
12/10/2022 09:15:54 AM script INFO: SUCCESS!@#KODE 1!@#USER_ID 79!@#ACTIVITY_CODE 2
12/10/2022 09:15:55 AM script INFO: SUCCESS!@#KODE 1!@#USER_ID 79!@#ACTIVITY_CODE 1
12/10/2022 09:15:55 AM script INFO: SUCCESS!@#KODE 1!@#USER_ID 79!@#ACTIVITY_CODE 3
12/10/2022 09:15:56 AM script INFO: SUCCESS!@#KODE 1!@#USER_ID 79!@#ACTIVITY_CODE 2
12/10/2022 09:15:56 AM script INFO: SUCCESS!@#KODE 1!@#USER_ID 79!@#ACTIVITY_CODE 1
12/10/2022 09:15:56 AM script INFO: SUCCESS!@#KODE 1!@#USER_ID 79!@#ACTIVITY_CODE 1
12/10/2022 09:15:57 AM script INFO: SUCCESS!@#KODE 1!@#USER_ID 79!@#ACTIVITY_CODE 2
12/10/2022 09:15:57 AM script INFO: SUCCESS!@#KODE 1!@#USER_ID 79!@#ACTIVITY_CODE 1
12/10/2022 09:15:58 AM script INFO: SUCCESS!@#KODE 1!@#USER_ID 79!@#ACTIVITY_CODE 2
12/10/2022 09:15:58 AM script INFO: SUCCESS!@#KODE 1!@#USER_ID 79!@#ACTIVITY_CODE 1
12/10/2022 09:15:58 AM script INFO: SUCCESS!@#KODE 1!@#USER_ID 79!@#ACTIVITY_CODE 4
12/10/2022 09:15:59 AM script INFO: SUCCESS!@#KODE 1!@#USER_ID 79!@#ACTIVITY_CODE 2
12/10/2022 09:16:00 AM script INFO: SUCCESS!@#KODE 1!@#USER_ID 79!@#ACTIVITY_CODE 3
12/10/2022 09:16:00 AM script INFO: SUCCESS!@#KODE 1!@#USER_ID 79!@#ACTIVITY_CODE 2
12/10/2022 09:16:01 AM script INFO: SUCCESS!@#KODE 1!@#USER_ID 79!@#ACTIVITY_CODE 4
12/10/2022 09:16:01 AM script INFO: SUCCESS!@#KODE 1!@#USER_ID 79!@#ACTIVITY_CODE 3
12/10/2022 09:16:01 AM script INFO: SUCCESS!@#KODE 1!@#USER_ID 79!@#ACTIVITY_CODE 3
12/10/2022 09:16:02 AM script INFO: SUCCESS!@#KODE 1!@#USER_ID 79!@#ACTIVITY_CODE 2
12/10/2022 09:16:02 AM script INFO: SUCCESS!@#KODE 1!@#USER_ID 79!@#ACTIVITY_CODE 3
12/10/2022 09:16:02 AM script INFO: Duration: 119.85987448692322
12/10/2022 09:16:02 AM script INFO: mengakhiri-quiz
12/10/2022 09:16:10 AM script INFO: SUCCESS!@#KODE 1!@#USER_ID 79!@#ACTIVITY_CODE 5
12/10/2022 09:16:10 AM script INFO: berhasil-submit
12/10/2022 09:17:40 AM script ERROR: TIMEOUT EXCEPTION!@#KODE 0!@#LOCATION berhasil-submit
12/10/2022 09:17:40 AM main_worker ERROR: Message: None

