12/23/2022 04:26:04 AM script INFO: Prepared chrome options..
12/23/2022 04:26:05 AM script INFO: Initialized chrome browser..
12/23/2022 04:26:05 AM script INFO: mengakses-homepage
12/23/2022 04:26:22 AM script INFO: mengakses-login-page
12/23/2022 04:27:43 AM script INFO: mengakses-site-home
12/23/2022 04:27:57 AM script INFO: mengakses-site-course
12/23/2022 04:28:31 AM script INFO: mengakses-quiz
12/23/2022 04:28:40 AM script INFO: mengakses-start-quiz-page
12/23/2022 04:29:31 AM script INFO: memulai-quiz
12/23/2022 04:29:31 AM script INFO: SUCCESS!@#KODE 1!@#USER_ID 20!@#ACTIVITY_CODE 5
12/23/2022 04:29:42 AM script INFO: SUCCESS!@#KODE 1!@#USER_ID 20!@#ACTIVITY_CODE 1
12/23/2022 04:29:42 AM script INFO: SUCCESS!@#KODE 1!@#USER_ID 20!@#ACTIVITY_CODE 3
12/23/2022 04:29:42 AM script INFO: SUCCESS!@#KODE 1!@#USER_ID 20!@#ACTIVITY_CODE 2
12/23/2022 04:29:42 AM script INFO: SUCCESS!@#KODE 1!@#USER_ID 20!@#ACTIVITY_CODE 5
12/23/2022 04:29:42 AM script INFO: SUCCESS!@#KODE 1!@#USER_ID 20!@#ACTIVITY_CODE 5
12/23/2022 04:29:45 AM script INFO: SUCCESS!@#KODE 1!@#USER_ID 20!@#ACTIVITY_CODE 1
12/23/2022 04:29:45 AM script INFO: SUCCESS!@#KODE 1!@#USER_ID 20!@#ACTIVITY_CODE 3
12/23/2022 04:29:45 AM script INFO: SUCCESS!@#KODE 1!@#USER_ID 20!@#ACTIVITY_CODE 3
12/23/2022 04:29:45 AM script INFO: SUCCESS!@#KODE 1!@#USER_ID 20!@#ACTIVITY_CODE 1
12/23/2022 04:29:45 AM script INFO: SUCCESS!@#KODE 1!@#USER_ID 20!@#ACTIVITY_CODE 5
12/23/2022 04:29:45 AM script INFO: SUCCESS!@#KODE 1!@#USER_ID 20!@#ACTIVITY_CODE 5
12/23/2022 04:29:47 AM script INFO: SUCCESS!@#KODE 1!@#USER_ID 20!@#ACTIVITY_CODE 3
12/23/2022 04:29:47 AM script INFO: SUCCESS!@#KODE 1!@#USER_ID 20!@#ACTIVITY_CODE 2
12/23/2022 04:29:48 AM script INFO: SUCCESS!@#KODE 1!@#USER_ID 20!@#ACTIVITY_CODE 2
12/23/2022 04:29:48 AM script INFO: SUCCESS!@#KODE 1!@#USER_ID 20!@#ACTIVITY_CODE 2
12/23/2022 04:29:48 AM script INFO: SUCCESS!@#KODE 1!@#USER_ID 20!@#ACTIVITY_CODE 1
12/23/2022 04:29:48 AM script INFO: SUCCESS!@#KODE 1!@#USER_ID 20!@#ACTIVITY_CODE 3
12/23/2022 04:29:48 AM script INFO: SUCCESS!@#KODE 1!@#USER_ID 20!@#ACTIVITY_CODE 2
12/23/2022 04:29:48 AM script INFO: SUCCESS!@#KODE 1!@#USER_ID 20!@#ACTIVITY_CODE 1
12/23/2022 04:29:48 AM script INFO: SUCCESS!@#KODE 1!@#USER_ID 20!@#ACTIVITY_CODE 4
12/23/2022 04:29:48 AM script INFO: SUCCESS!@#KODE 1!@#USER_ID 20!@#ACTIVITY_CODE 1
12/23/2022 04:29:48 AM script INFO: SUCCESS!@#KODE 1!@#USER_ID 20!@#ACTIVITY_CODE 3
12/23/2022 04:29:48 AM script INFO: SUCCESS!@#KODE 1!@#USER_ID 20!@#ACTIVITY_CODE 1
12/23/2022 04:29:48 AM script INFO: SUCCESS!@#KODE 1!@#USER_ID 20!@#ACTIVITY_CODE 3
12/23/2022 04:29:48 AM script INFO: SUCCESS!@#KODE 1!@#USER_ID 20!@#ACTIVITY_CODE 2
12/23/2022 04:29:48 AM script INFO: SUCCESS!@#KODE 1!@#USER_ID 20!@#ACTIVITY_CODE 2
12/23/2022 04:29:49 AM script INFO: SUCCESS!@#KODE 1!@#USER_ID 20!@#ACTIVITY_CODE 4
12/23/2022 04:29:49 AM script INFO: SUCCESS!@#KODE 1!@#USER_ID 20!@#ACTIVITY_CODE 1
12/23/2022 04:29:49 AM script INFO: SUCCESS!@#KODE 1!@#USER_ID 20!@#ACTIVITY_CODE 5
12/23/2022 04:29:49 AM script INFO: SUCCESS!@#KODE 1!@#USER_ID 20!@#ACTIVITY_CODE 5
12/23/2022 04:29:51 AM script INFO: SUCCESS!@#KODE 1!@#USER_ID 20!@#ACTIVITY_CODE 5
12/23/2022 04:29:51 AM script INFO: SUCCESS!@#KODE 1!@#USER_ID 20!@#ACTIVITY_CODE 5
12/23/2022 04:29:54 AM script INFO: SUCCESS!@#KODE 1!@#USER_ID 20!@#ACTIVITY_CODE 3
12/23/2022 04:29:54 AM script INFO: SUCCESS!@#KODE 1!@#USER_ID 20!@#ACTIVITY_CODE 2
12/23/2022 04:29:54 AM script INFO: SUCCESS!@#KODE 1!@#USER_ID 20!@#ACTIVITY_CODE 1
12/23/2022 04:29:54 AM script INFO: SUCCESS!@#KODE 1!@#USER_ID 20!@#ACTIVITY_CODE 5
12/23/2022 04:29:54 AM script INFO: SUCCESS!@#KODE 1!@#USER_ID 20!@#ACTIVITY_CODE 5
12/23/2022 04:29:56 AM script INFO: SUCCESS!@#KODE 1!@#USER_ID 20!@#ACTIVITY_CODE 3
12/23/2022 04:29:56 AM script INFO: SUCCESS!@#KODE 1!@#USER_ID 20!@#ACTIVITY_CODE 5
12/23/2022 04:29:56 AM script INFO: SUCCESS!@#KODE 1!@#USER_ID 20!@#ACTIVITY_CODE 5
12/23/2022 04:29:59 AM script INFO: SUCCESS!@#KODE 1!@#USER_ID 20!@#ACTIVITY_CODE 1
12/23/2022 04:29:59 AM script INFO: SUCCESS!@#KODE 1!@#USER_ID 20!@#ACTIVITY_CODE 1
12/23/2022 04:29:59 AM script INFO: SUCCESS!@#KODE 1!@#USER_ID 20!@#ACTIVITY_CODE 3
12/23/2022 04:29:59 AM script INFO: SUCCESS!@#KODE 1!@#USER_ID 20!@#ACTIVITY_CODE 1
12/23/2022 04:29:59 AM script INFO: SUCCESS!@#KODE 1!@#USER_ID 20!@#ACTIVITY_CODE 5
12/23/2022 04:29:59 AM script INFO: SUCCESS!@#KODE 1!@#USER_ID 20!@#ACTIVITY_CODE 5
12/23/2022 04:30:02 AM script INFO: SUCCESS!@#KODE 1!@#USER_ID 20!@#ACTIVITY_CODE 3
12/23/2022 04:30:02 AM script INFO: SUCCESS!@#KODE 1!@#USER_ID 20!@#ACTIVITY_CODE 3
12/23/2022 04:30:02 AM script INFO: SUCCESS!@#KODE 1!@#USER_ID 20!@#ACTIVITY_CODE 3
12/23/2022 04:30:02 AM script INFO: SUCCESS!@#KODE 1!@#USER_ID 20!@#ACTIVITY_CODE 5
12/23/2022 04:30:02 AM script INFO: SUCCESS!@#KODE 1!@#USER_ID 20!@#ACTIVITY_CODE 5
12/23/2022 04:30:04 AM script INFO: SUCCESS!@#KODE 1!@#USER_ID 20!@#ACTIVITY_CODE 2
12/23/2022 04:30:04 AM script INFO: SUCCESS!@#KODE 1!@#USER_ID 20!@#ACTIVITY_CODE 4
12/23/2022 04:30:04 AM script INFO: SUCCESS!@#KODE 1!@#USER_ID 20!@#ACTIVITY_CODE 5
12/23/2022 04:30:04 AM script INFO: SUCCESS!@#KODE 1!@#USER_ID 20!@#ACTIVITY_CODE 5
12/23/2022 04:30:07 AM script INFO: SUCCESS!@#KODE 1!@#USER_ID 20!@#ACTIVITY_CODE 1
12/23/2022 04:30:07 AM script INFO: SUCCESS!@#KODE 1!@#USER_ID 20!@#ACTIVITY_CODE 4
12/23/2022 04:30:07 AM script INFO: SUCCESS!@#KODE 1!@#USER_ID 20!@#ACTIVITY_CODE 2
12/23/2022 04:30:07 AM script INFO: SUCCESS!@#KODE 1!@#USER_ID 20!@#ACTIVITY_CODE 2
12/23/2022 04:30:07 AM script INFO: SUCCESS!@#KODE 1!@#USER_ID 20!@#ACTIVITY_CODE 3
12/23/2022 04:30:07 AM script INFO: SUCCESS!@#KODE 1!@#USER_ID 20!@#ACTIVITY_CODE 3
12/23/2022 04:30:07 AM script INFO: SUCCESS!@#KODE 1!@#USER_ID 20!@#ACTIVITY_CODE 3
12/23/2022 04:30:08 AM script INFO: SUCCESS!@#KODE 1!@#USER_ID 20!@#ACTIVITY_CODE 2
12/23/2022 04:30:08 AM script INFO: SUCCESS!@#KODE 1!@#USER_ID 20!@#ACTIVITY_CODE 2
12/23/2022 04:30:08 AM script INFO: SUCCESS!@#KODE 1!@#USER_ID 20!@#ACTIVITY_CODE 1
12/23/2022 04:30:08 AM script INFO: SUCCESS!@#KODE 1!@#USER_ID 20!@#ACTIVITY_CODE 1
12/23/2022 04:30:08 AM script INFO: SUCCESS!@#KODE 1!@#USER_ID 20!@#ACTIVITY_CODE 4
12/23/2022 04:30:08 AM script INFO: SUCCESS!@#KODE 1!@#USER_ID 20!@#ACTIVITY_CODE 2
12/23/2022 04:30:08 AM script INFO: SUCCESS!@#KODE 1!@#USER_ID 20!@#ACTIVITY_CODE 4
12/23/2022 04:30:08 AM script INFO: SUCCESS!@#KODE 1!@#USER_ID 20!@#ACTIVITY_CODE 3
12/23/2022 04:30:08 AM script INFO: SUCCESS!@#KODE 1!@#USER_ID 20!@#ACTIVITY_CODE 1
12/23/2022 04:30:08 AM script INFO: SUCCESS!@#KODE 1!@#USER_ID 20!@#ACTIVITY_CODE 5
12/23/2022 04:30:08 AM script INFO: SUCCESS!@#KODE 1!@#USER_ID 20!@#ACTIVITY_CODE 5
12/23/2022 04:30:11 AM script INFO: SUCCESS!@#KODE 1!@#USER_ID 20!@#ACTIVITY_CODE 4
12/23/2022 04:30:11 AM script INFO: SUCCESS!@#KODE 1!@#USER_ID 20!@#ACTIVITY_CODE 2
12/23/2022 04:30:11 AM script INFO: SUCCESS!@#KODE 1!@#USER_ID 20!@#ACTIVITY_CODE 5
12/23/2022 04:30:11 AM script INFO: SUCCESS!@#KODE 1!@#USER_ID 20!@#ACTIVITY_CODE 5
12/23/2022 04:30:13 AM script INFO: SUCCESS!@#KODE 1!@#USER_ID 20!@#ACTIVITY_CODE 3
12/23/2022 04:30:13 AM script INFO: SUCCESS!@#KODE 1!@#USER_ID 20!@#ACTIVITY_CODE 3
12/23/2022 04:30:14 AM script INFO: SUCCESS!@#KODE 1!@#USER_ID 20!@#ACTIVITY_CODE 2
12/23/2022 04:30:14 AM script INFO: SUCCESS!@#KODE 1!@#USER_ID 20!@#ACTIVITY_CODE 3
12/23/2022 04:30:14 AM script INFO: SUCCESS!@#KODE 1!@#USER_ID 20!@#ACTIVITY_CODE 3
12/23/2022 04:30:14 AM script INFO: SUCCESS!@#KODE 1!@#USER_ID 20!@#ACTIVITY_CODE 3
12/23/2022 04:30:14 AM script INFO: SUCCESS!@#KODE 1!@#USER_ID 20!@#ACTIVITY_CODE 2
12/23/2022 04:30:14 AM script INFO: SUCCESS!@#KODE 1!@#USER_ID 20!@#ACTIVITY_CODE 3
12/23/2022 04:30:14 AM script INFO: SUCCESS!@#KODE 1!@#USER_ID 20!@#ACTIVITY_CODE 3
12/23/2022 04:30:14 AM script INFO: SUCCESS!@#KODE 1!@#USER_ID 20!@#ACTIVITY_CODE 3
12/23/2022 04:30:14 AM script INFO: SUCCESS!@#KODE 1!@#USER_ID 20!@#ACTIVITY_CODE 1
12/23/2022 04:30:14 AM script INFO: SUCCESS!@#KODE 1!@#USER_ID 20!@#ACTIVITY_CODE 3
12/23/2022 04:30:14 AM script INFO: SUCCESS!@#KODE 1!@#USER_ID 20!@#ACTIVITY_CODE 2
12/23/2022 04:30:14 AM script INFO: SUCCESS!@#KODE 1!@#USER_ID 20!@#ACTIVITY_CODE 3
12/23/2022 04:30:14 AM script INFO: SUCCESS!@#KODE 1!@#USER_ID 20!@#ACTIVITY_CODE 3
12/23/2022 04:30:14 AM script INFO: SUCCESS!@#KODE 1!@#USER_ID 20!@#ACTIVITY_CODE 3
12/23/2022 04:30:14 AM script INFO: SUCCESS!@#KODE 1!@#USER_ID 20!@#ACTIVITY_CODE 3
12/23/2022 04:30:14 AM script INFO: SUCCESS!@#KODE 1!@#USER_ID 20!@#ACTIVITY_CODE 3
12/23/2022 04:30:14 AM script INFO: SUCCESS!@#KODE 1!@#USER_ID 20!@#ACTIVITY_CODE 3
12/23/2022 04:30:14 AM script INFO: SUCCESS!@#KODE 1!@#USER_ID 20!@#ACTIVITY_CODE 3
12/23/2022 04:30:14 AM script INFO: SUCCESS!@#KODE 1!@#USER_ID 20!@#ACTIVITY_CODE 3
12/23/2022 04:30:14 AM script INFO: Duration: 32.79056787490845
12/23/2022 04:30:14 AM script INFO: mengakhiri-quiz
12/23/2022 04:30:17 AM script INFO: SUCCESS!@#KODE 1!@#USER_ID 20!@#ACTIVITY_CODE 5
12/23/2022 04:30:17 AM script INFO: berhasil-submit
