12/21/2022 02:29:40 PM script INFO: Prepared chrome options..
12/21/2022 02:29:41 PM script INFO: Initialized chrome browser..
12/21/2022 02:29:41 PM script INFO: mengakses-homepage
12/21/2022 02:29:47 PM script INFO: mengakses-login-page
12/21/2022 02:29:48 PM script INFO: mengakses-site-home
12/21/2022 02:29:49 PM script INFO: mengakses-site-course
12/21/2022 02:29:51 PM script INFO: mengakses-quiz
12/21/2022 02:29:52 PM script INFO: mengakses-start-quiz-page
12/21/2022 02:29:53 PM script INFO: memulai-quiz
12/21/2022 02:29:53 PM script INFO: SUCCESS!@#KODE 1!@#USER_ID 62!@#ACTIVITY_CODE 5
12/21/2022 02:30:04 PM script INFO: SUCCESS!@#KODE 1!@#USER_ID 62!@#ACTIVITY_CODE 3
12/21/2022 02:30:04 PM script INFO: SUCCESS!@#KODE 1!@#USER_ID 62!@#ACTIVITY_CODE 1
12/21/2022 02:30:04 PM script INFO: SUCCESS!@#KODE 1!@#USER_ID 62!@#ACTIVITY_CODE 1
12/21/2022 02:30:04 PM script INFO: SUCCESS!@#KODE 1!@#USER_ID 62!@#ACTIVITY_CODE 5
12/21/2022 02:30:04 PM script INFO: SUCCESS!@#KODE 1!@#USER_ID 62!@#ACTIVITY_CODE 5
12/21/2022 02:30:07 PM script INFO: SUCCESS!@#KODE 1!@#USER_ID 62!@#ACTIVITY_CODE 1
12/21/2022 02:30:07 PM script INFO: SUCCESS!@#KODE 1!@#USER_ID 62!@#ACTIVITY_CODE 2
12/21/2022 02:30:07 PM script INFO: SUCCESS!@#KODE 1!@#USER_ID 62!@#ACTIVITY_CODE 3
12/21/2022 02:30:07 PM script INFO: SUCCESS!@#KODE 1!@#USER_ID 62!@#ACTIVITY_CODE 2
12/21/2022 02:30:07 PM script INFO: SUCCESS!@#KODE 1!@#USER_ID 62!@#ACTIVITY_CODE 3
12/21/2022 02:30:07 PM script INFO: SUCCESS!@#KODE 1!@#USER_ID 62!@#ACTIVITY_CODE 2
12/21/2022 02:30:07 PM script INFO: SUCCESS!@#KODE 1!@#USER_ID 62!@#ACTIVITY_CODE 5
12/21/2022 02:30:07 PM script INFO: SUCCESS!@#KODE 1!@#USER_ID 62!@#ACTIVITY_CODE 5
12/21/2022 02:30:10 PM script INFO: SUCCESS!@#KODE 1!@#USER_ID 62!@#ACTIVITY_CODE 5
12/21/2022 02:30:10 PM script INFO: SUCCESS!@#KODE 1!@#USER_ID 62!@#ACTIVITY_CODE 5
12/21/2022 02:30:12 PM script INFO: SUCCESS!@#KODE 1!@#USER_ID 62!@#ACTIVITY_CODE 2
12/21/2022 02:30:12 PM script INFO: SUCCESS!@#KODE 1!@#USER_ID 62!@#ACTIVITY_CODE 2
12/21/2022 02:30:12 PM script INFO: SUCCESS!@#KODE 1!@#USER_ID 62!@#ACTIVITY_CODE 5
12/21/2022 02:30:12 PM script INFO: SUCCESS!@#KODE 1!@#USER_ID 62!@#ACTIVITY_CODE 5
12/21/2022 02:30:15 PM script INFO: SUCCESS!@#KODE 1!@#USER_ID 62!@#ACTIVITY_CODE 2
12/21/2022 02:30:15 PM script INFO: SUCCESS!@#KODE 1!@#USER_ID 62!@#ACTIVITY_CODE 1
12/21/2022 02:30:15 PM script INFO: SUCCESS!@#KODE 1!@#USER_ID 62!@#ACTIVITY_CODE 3
12/21/2022 02:30:15 PM script INFO: SUCCESS!@#KODE 1!@#USER_ID 62!@#ACTIVITY_CODE 2
12/21/2022 02:30:16 PM script INFO: SUCCESS!@#KODE 1!@#USER_ID 62!@#ACTIVITY_CODE 2
12/21/2022 02:30:16 PM script INFO: SUCCESS!@#KODE 1!@#USER_ID 62!@#ACTIVITY_CODE 5
12/21/2022 02:30:16 PM script INFO: SUCCESS!@#KODE 1!@#USER_ID 62!@#ACTIVITY_CODE 5
12/21/2022 02:30:18 PM script INFO: SUCCESS!@#KODE 1!@#USER_ID 62!@#ACTIVITY_CODE 3
12/21/2022 02:30:18 PM script INFO: SUCCESS!@#KODE 1!@#USER_ID 62!@#ACTIVITY_CODE 1
12/21/2022 02:30:18 PM script INFO: SUCCESS!@#KODE 1!@#USER_ID 62!@#ACTIVITY_CODE 5
12/21/2022 02:30:18 PM script INFO: SUCCESS!@#KODE 1!@#USER_ID 62!@#ACTIVITY_CODE 5
12/21/2022 02:30:21 PM script INFO: SUCCESS!@#KODE 1!@#USER_ID 62!@#ACTIVITY_CODE 3
12/21/2022 02:30:21 PM script INFO: SUCCESS!@#KODE 1!@#USER_ID 62!@#ACTIVITY_CODE 1
12/21/2022 02:30:21 PM script INFO: SUCCESS!@#KODE 1!@#USER_ID 62!@#ACTIVITY_CODE 4
12/21/2022 02:30:21 PM script INFO: SUCCESS!@#KODE 1!@#USER_ID 62!@#ACTIVITY_CODE 1
12/21/2022 02:30:21 PM script INFO: SUCCESS!@#KODE 1!@#USER_ID 62!@#ACTIVITY_CODE 1
12/21/2022 02:30:21 PM script INFO: SUCCESS!@#KODE 1!@#USER_ID 62!@#ACTIVITY_CODE 3
12/21/2022 02:30:21 PM script INFO: SUCCESS!@#KODE 1!@#USER_ID 62!@#ACTIVITY_CODE 4
12/21/2022 02:30:21 PM script INFO: SUCCESS!@#KODE 1!@#USER_ID 62!@#ACTIVITY_CODE 1
12/21/2022 02:30:21 PM script INFO: SUCCESS!@#KODE 1!@#USER_ID 62!@#ACTIVITY_CODE 3
12/21/2022 02:30:21 PM script INFO: SUCCESS!@#KODE 1!@#USER_ID 62!@#ACTIVITY_CODE 3
12/21/2022 02:30:22 PM script INFO: SUCCESS!@#KODE 1!@#USER_ID 62!@#ACTIVITY_CODE 2
12/21/2022 02:30:22 PM script INFO: SUCCESS!@#KODE 1!@#USER_ID 62!@#ACTIVITY_CODE 1
12/21/2022 02:30:22 PM script INFO: SUCCESS!@#KODE 1!@#USER_ID 62!@#ACTIVITY_CODE 4
12/21/2022 02:30:22 PM script INFO: SUCCESS!@#KODE 1!@#USER_ID 62!@#ACTIVITY_CODE 2
12/21/2022 02:30:22 PM script INFO: SUCCESS!@#KODE 1!@#USER_ID 62!@#ACTIVITY_CODE 3
12/21/2022 02:30:22 PM script INFO: SUCCESS!@#KODE 1!@#USER_ID 62!@#ACTIVITY_CODE 2
12/21/2022 02:30:22 PM script INFO: SUCCESS!@#KODE 1!@#USER_ID 62!@#ACTIVITY_CODE 4
12/21/2022 02:30:22 PM script INFO: SUCCESS!@#KODE 1!@#USER_ID 62!@#ACTIVITY_CODE 3
12/21/2022 02:30:22 PM script INFO: Duration: 18.640674114227295
12/21/2022 02:30:22 PM script INFO: mengakhiri-quiz
12/21/2022 02:30:39 PM script INFO: SUCCESS!@#KODE 1!@#USER_ID 62!@#ACTIVITY_CODE 5
12/21/2022 02:30:39 PM script INFO: berhasil-submit
