12/23/2022 01:17:54 AM script INFO: Prepared chrome options..
12/23/2022 01:17:56 AM script INFO: Initialized chrome browser..
12/23/2022 01:17:56 AM script INFO: mengakses-homepage
12/23/2022 01:18:47 AM script INFO: mengakses-login-page
12/23/2022 01:19:44 AM script INFO: mengakses-site-home
12/23/2022 01:19:55 AM script INFO: mengakses-site-course
12/23/2022 01:20:29 AM script INFO: mengakses-quiz
12/23/2022 01:20:38 AM script INFO: mengakses-start-quiz-page
12/23/2022 01:21:40 AM script INFO: memulai-quiz
12/23/2022 01:21:40 AM script INFO: SUCCESS!@#KODE 1!@#USER_ID 101!@#ACTIVITY_CODE 5
12/23/2022 01:21:50 AM script INFO: SUCCESS!@#KODE 1!@#USER_ID 101!@#ACTIVITY_CODE 1
12/23/2022 01:21:50 AM script INFO: SUCCESS!@#KODE 1!@#USER_ID 101!@#ACTIVITY_CODE 1
12/23/2022 01:21:50 AM script INFO: SUCCESS!@#KODE 1!@#USER_ID 101!@#ACTIVITY_CODE 1
12/23/2022 01:21:50 AM script INFO: SUCCESS!@#KODE 1!@#USER_ID 101!@#ACTIVITY_CODE 5
12/23/2022 01:21:50 AM script INFO: SUCCESS!@#KODE 1!@#USER_ID 101!@#ACTIVITY_CODE 5
12/23/2022 01:21:53 AM script INFO: SUCCESS!@#KODE 1!@#USER_ID 101!@#ACTIVITY_CODE 3
12/23/2022 01:21:53 AM script INFO: SUCCESS!@#KODE 1!@#USER_ID 101!@#ACTIVITY_CODE 1
12/23/2022 01:21:53 AM script INFO: SUCCESS!@#KODE 1!@#USER_ID 101!@#ACTIVITY_CODE 4
12/23/2022 01:21:53 AM script INFO: SUCCESS!@#KODE 1!@#USER_ID 101!@#ACTIVITY_CODE 1
12/23/2022 01:21:53 AM script INFO: SUCCESS!@#KODE 1!@#USER_ID 101!@#ACTIVITY_CODE 2
12/23/2022 01:21:53 AM script INFO: SUCCESS!@#KODE 1!@#USER_ID 101!@#ACTIVITY_CODE 5
12/23/2022 01:21:53 AM script INFO: SUCCESS!@#KODE 1!@#USER_ID 101!@#ACTIVITY_CODE 5
12/23/2022 01:21:56 AM script INFO: SUCCESS!@#KODE 1!@#USER_ID 101!@#ACTIVITY_CODE 2
12/23/2022 01:21:56 AM script INFO: SUCCESS!@#KODE 1!@#USER_ID 101!@#ACTIVITY_CODE 1
12/23/2022 01:21:56 AM script INFO: SUCCESS!@#KODE 1!@#USER_ID 101!@#ACTIVITY_CODE 1
12/23/2022 01:21:56 AM script INFO: SUCCESS!@#KODE 1!@#USER_ID 101!@#ACTIVITY_CODE 4
12/23/2022 01:21:56 AM script INFO: SUCCESS!@#KODE 1!@#USER_ID 101!@#ACTIVITY_CODE 5
12/23/2022 01:21:56 AM script INFO: SUCCESS!@#KODE 1!@#USER_ID 101!@#ACTIVITY_CODE 5
12/23/2022 01:21:59 AM script INFO: SUCCESS!@#KODE 1!@#USER_ID 101!@#ACTIVITY_CODE 1
12/23/2022 01:21:59 AM script INFO: SUCCESS!@#KODE 1!@#USER_ID 101!@#ACTIVITY_CODE 4
12/23/2022 01:21:59 AM script INFO: SUCCESS!@#KODE 1!@#USER_ID 101!@#ACTIVITY_CODE 1
12/23/2022 01:21:59 AM script INFO: SUCCESS!@#KODE 1!@#USER_ID 101!@#ACTIVITY_CODE 3
12/23/2022 01:21:59 AM script INFO: SUCCESS!@#KODE 1!@#USER_ID 101!@#ACTIVITY_CODE 3
12/23/2022 01:21:59 AM script INFO: SUCCESS!@#KODE 1!@#USER_ID 101!@#ACTIVITY_CODE 2
12/23/2022 01:21:59 AM script INFO: SUCCESS!@#KODE 1!@#USER_ID 101!@#ACTIVITY_CODE 2
12/23/2022 01:21:59 AM script INFO: SUCCESS!@#KODE 1!@#USER_ID 101!@#ACTIVITY_CODE 3
12/23/2022 01:21:59 AM script INFO: SUCCESS!@#KODE 1!@#USER_ID 101!@#ACTIVITY_CODE 5
12/23/2022 01:21:59 AM script INFO: SUCCESS!@#KODE 1!@#USER_ID 101!@#ACTIVITY_CODE 5
12/23/2022 01:22:02 AM script INFO: SUCCESS!@#KODE 1!@#USER_ID 101!@#ACTIVITY_CODE 1
12/23/2022 01:22:02 AM script INFO: SUCCESS!@#KODE 1!@#USER_ID 101!@#ACTIVITY_CODE 5
12/23/2022 01:22:02 AM script INFO: SUCCESS!@#KODE 1!@#USER_ID 101!@#ACTIVITY_CODE 5
12/23/2022 01:22:04 AM script INFO: SUCCESS!@#KODE 1!@#USER_ID 101!@#ACTIVITY_CODE 3
12/23/2022 01:22:04 AM script INFO: SUCCESS!@#KODE 1!@#USER_ID 101!@#ACTIVITY_CODE 3
12/23/2022 01:22:05 AM script INFO: SUCCESS!@#KODE 1!@#USER_ID 101!@#ACTIVITY_CODE 2
12/23/2022 01:22:05 AM script INFO: SUCCESS!@#KODE 1!@#USER_ID 101!@#ACTIVITY_CODE 5
12/23/2022 01:22:05 AM script INFO: SUCCESS!@#KODE 1!@#USER_ID 101!@#ACTIVITY_CODE 5
12/23/2022 01:22:07 AM script INFO: SUCCESS!@#KODE 1!@#USER_ID 101!@#ACTIVITY_CODE 5
12/23/2022 01:22:07 AM script INFO: SUCCESS!@#KODE 1!@#USER_ID 101!@#ACTIVITY_CODE 5
12/23/2022 01:22:10 AM script INFO: SUCCESS!@#KODE 1!@#USER_ID 101!@#ACTIVITY_CODE 5
12/23/2022 01:22:10 AM script INFO: SUCCESS!@#KODE 1!@#USER_ID 101!@#ACTIVITY_CODE 5
12/23/2022 01:22:12 AM script INFO: SUCCESS!@#KODE 1!@#USER_ID 101!@#ACTIVITY_CODE 2
12/23/2022 01:22:12 AM script INFO: SUCCESS!@#KODE 1!@#USER_ID 101!@#ACTIVITY_CODE 1
12/23/2022 01:22:12 AM script INFO: SUCCESS!@#KODE 1!@#USER_ID 101!@#ACTIVITY_CODE 5
12/23/2022 01:22:12 AM script INFO: SUCCESS!@#KODE 1!@#USER_ID 101!@#ACTIVITY_CODE 5
12/23/2022 01:22:15 AM script INFO: SUCCESS!@#KODE 1!@#USER_ID 101!@#ACTIVITY_CODE 1
12/23/2022 01:22:15 AM script INFO: SUCCESS!@#KODE 1!@#USER_ID 101!@#ACTIVITY_CODE 3
12/23/2022 01:22:15 AM script INFO: SUCCESS!@#KODE 1!@#USER_ID 101!@#ACTIVITY_CODE 1
12/23/2022 01:22:15 AM script INFO: SUCCESS!@#KODE 1!@#USER_ID 101!@#ACTIVITY_CODE 2
12/23/2022 01:22:15 AM script INFO: SUCCESS!@#KODE 1!@#USER_ID 101!@#ACTIVITY_CODE 5
12/23/2022 01:22:15 AM script INFO: SUCCESS!@#KODE 1!@#USER_ID 101!@#ACTIVITY_CODE 5
12/23/2022 01:22:18 AM script INFO: SUCCESS!@#KODE 1!@#USER_ID 101!@#ACTIVITY_CODE 1
12/23/2022 01:22:18 AM script INFO: SUCCESS!@#KODE 1!@#USER_ID 101!@#ACTIVITY_CODE 3
12/23/2022 01:22:18 AM script INFO: SUCCESS!@#KODE 1!@#USER_ID 101!@#ACTIVITY_CODE 3
12/23/2022 01:22:18 AM script INFO: SUCCESS!@#KODE 1!@#USER_ID 101!@#ACTIVITY_CODE 3
12/23/2022 01:22:18 AM script INFO: SUCCESS!@#KODE 1!@#USER_ID 101!@#ACTIVITY_CODE 2
12/23/2022 01:22:18 AM script INFO: SUCCESS!@#KODE 1!@#USER_ID 101!@#ACTIVITY_CODE 3
12/23/2022 01:22:18 AM script INFO: SUCCESS!@#KODE 1!@#USER_ID 101!@#ACTIVITY_CODE 1
12/23/2022 01:22:18 AM script INFO: SUCCESS!@#KODE 1!@#USER_ID 101!@#ACTIVITY_CODE 2
12/23/2022 01:22:18 AM script INFO: SUCCESS!@#KODE 1!@#USER_ID 101!@#ACTIVITY_CODE 5
12/23/2022 01:22:18 AM script INFO: SUCCESS!@#KODE 1!@#USER_ID 101!@#ACTIVITY_CODE 5
12/23/2022 01:22:21 AM script INFO: SUCCESS!@#KODE 1!@#USER_ID 101!@#ACTIVITY_CODE 2
12/23/2022 01:22:21 AM script INFO: SUCCESS!@#KODE 1!@#USER_ID 101!@#ACTIVITY_CODE 4
12/23/2022 01:22:21 AM script INFO: SUCCESS!@#KODE 1!@#USER_ID 101!@#ACTIVITY_CODE 3
12/23/2022 01:22:21 AM script INFO: SUCCESS!@#KODE 1!@#USER_ID 101!@#ACTIVITY_CODE 1
12/23/2022 01:22:21 AM script INFO: SUCCESS!@#KODE 1!@#USER_ID 101!@#ACTIVITY_CODE 2
12/23/2022 01:22:21 AM script INFO: SUCCESS!@#KODE 1!@#USER_ID 101!@#ACTIVITY_CODE 2
12/23/2022 01:22:21 AM script INFO: SUCCESS!@#KODE 1!@#USER_ID 101!@#ACTIVITY_CODE 4
12/23/2022 01:22:21 AM script INFO: SUCCESS!@#KODE 1!@#USER_ID 101!@#ACTIVITY_CODE 2
12/23/2022 01:22:21 AM script INFO: SUCCESS!@#KODE 1!@#USER_ID 101!@#ACTIVITY_CODE 2
12/23/2022 01:22:21 AM script INFO: SUCCESS!@#KODE 1!@#USER_ID 101!@#ACTIVITY_CODE 3
12/23/2022 01:22:22 AM script INFO: SUCCESS!@#KODE 1!@#USER_ID 101!@#ACTIVITY_CODE 2
12/23/2022 01:22:22 AM script INFO: SUCCESS!@#KODE 1!@#USER_ID 101!@#ACTIVITY_CODE 1
12/23/2022 01:22:22 AM script INFO: SUCCESS!@#KODE 1!@#USER_ID 101!@#ACTIVITY_CODE 4
12/23/2022 01:22:22 AM script INFO: SUCCESS!@#KODE 1!@#USER_ID 101!@#ACTIVITY_CODE 1
12/23/2022 01:22:22 AM script INFO: SUCCESS!@#KODE 1!@#USER_ID 101!@#ACTIVITY_CODE 4
12/23/2022 01:22:22 AM script INFO: SUCCESS!@#KODE 1!@#USER_ID 101!@#ACTIVITY_CODE 1
12/23/2022 01:22:22 AM script INFO: SUCCESS!@#KODE 1!@#USER_ID 101!@#ACTIVITY_CODE 2
12/23/2022 01:22:22 AM script INFO: SUCCESS!@#KODE 1!@#USER_ID 101!@#ACTIVITY_CODE 3
12/23/2022 01:22:22 AM script INFO: SUCCESS!@#KODE 1!@#USER_ID 101!@#ACTIVITY_CODE 1
12/23/2022 01:22:22 AM script INFO: SUCCESS!@#KODE 1!@#USER_ID 101!@#ACTIVITY_CODE 1
12/23/2022 01:22:22 AM script INFO: SUCCESS!@#KODE 1!@#USER_ID 101!@#ACTIVITY_CODE 4
12/23/2022 01:22:22 AM script INFO: SUCCESS!@#KODE 1!@#USER_ID 101!@#ACTIVITY_CODE 3
12/23/2022 01:22:22 AM script INFO: SUCCESS!@#KODE 1!@#USER_ID 101!@#ACTIVITY_CODE 2
12/23/2022 01:22:22 AM script INFO: SUCCESS!@#KODE 1!@#USER_ID 101!@#ACTIVITY_CODE 1
12/23/2022 01:22:22 AM script INFO: SUCCESS!@#KODE 1!@#USER_ID 101!@#ACTIVITY_CODE 3
12/23/2022 01:22:22 AM script INFO: SUCCESS!@#KODE 1!@#USER_ID 101!@#ACTIVITY_CODE 1
12/23/2022 01:22:22 AM script INFO: SUCCESS!@#KODE 1!@#USER_ID 101!@#ACTIVITY_CODE 1
12/23/2022 01:22:22 AM script INFO: SUCCESS!@#KODE 1!@#USER_ID 101!@#ACTIVITY_CODE 1
12/23/2022 01:22:23 AM script INFO: SUCCESS!@#KODE 1!@#USER_ID 101!@#ACTIVITY_CODE 2
12/23/2022 01:22:23 AM script INFO: SUCCESS!@#KODE 1!@#USER_ID 101!@#ACTIVITY_CODE 1
12/23/2022 01:22:23 AM script INFO: SUCCESS!@#KODE 1!@#USER_ID 101!@#ACTIVITY_CODE 3
12/23/2022 01:22:23 AM script INFO: SUCCESS!@#KODE 1!@#USER_ID 101!@#ACTIVITY_CODE 3
12/23/2022 01:22:23 AM script INFO: SUCCESS!@#KODE 1!@#USER_ID 101!@#ACTIVITY_CODE 3
12/23/2022 01:22:23 AM script INFO: SUCCESS!@#KODE 1!@#USER_ID 101!@#ACTIVITY_CODE 3
12/23/2022 01:22:23 AM script INFO: SUCCESS!@#KODE 1!@#USER_ID 101!@#ACTIVITY_CODE 1
12/23/2022 01:22:23 AM script INFO: SUCCESS!@#KODE 1!@#USER_ID 101!@#ACTIVITY_CODE 4
12/23/2022 01:22:23 AM script INFO: SUCCESS!@#KODE 1!@#USER_ID 101!@#ACTIVITY_CODE 3
12/23/2022 01:22:23 AM script INFO: SUCCESS!@#KODE 1!@#USER_ID 101!@#ACTIVITY_CODE 3
12/23/2022 01:22:23 AM script INFO: Duration: 32.62313747406006
12/23/2022 01:22:23 AM script INFO: mengakhiri-quiz
12/23/2022 01:22:31 AM script INFO: SUCCESS!@#KODE 1!@#USER_ID 101!@#ACTIVITY_CODE 5
12/23/2022 01:22:31 AM script INFO: berhasil-submit
