12/23/2022 07:11:47 AM script INFO: Prepared chrome options..
12/23/2022 07:11:48 AM script INFO: Initialized chrome browser..
12/23/2022 07:11:48 AM script INFO: mengakses-homepage
12/23/2022 07:12:18 AM script INFO: mengakses-login-page
12/23/2022 07:12:19 AM script INFO: mengakses-site-home
12/23/2022 07:12:20 AM script INFO: mengakses-site-course
12/23/2022 07:12:20 AM script INFO: mengakses-quiz
12/23/2022 07:12:21 AM script INFO: mengakses-start-quiz-page
12/23/2022 07:12:22 AM script INFO: memulai-quiz
12/23/2022 07:12:22 AM script INFO: SUCCESS!@#KODE 1!@#USER_ID 96!@#ACTIVITY_CODE 5
12/23/2022 07:12:33 AM script INFO: SUCCESS!@#KODE 1!@#USER_ID 96!@#ACTIVITY_CODE 5
12/23/2022 07:12:33 AM script INFO: SUCCESS!@#KODE 1!@#USER_ID 96!@#ACTIVITY_CODE 5
12/23/2022 07:12:35 AM script INFO: SUCCESS!@#KODE 1!@#USER_ID 96!@#ACTIVITY_CODE 1
12/23/2022 07:12:35 AM script INFO: SUCCESS!@#KODE 1!@#USER_ID 96!@#ACTIVITY_CODE 3
12/23/2022 07:12:35 AM script INFO: SUCCESS!@#KODE 1!@#USER_ID 96!@#ACTIVITY_CODE 5
12/23/2022 07:12:35 AM script INFO: SUCCESS!@#KODE 1!@#USER_ID 96!@#ACTIVITY_CODE 5
12/23/2022 07:12:38 AM script INFO: SUCCESS!@#KODE 1!@#USER_ID 96!@#ACTIVITY_CODE 2
12/23/2022 07:12:38 AM script INFO: SUCCESS!@#KODE 1!@#USER_ID 96!@#ACTIVITY_CODE 5
12/23/2022 07:12:38 AM script INFO: SUCCESS!@#KODE 1!@#USER_ID 96!@#ACTIVITY_CODE 5
12/23/2022 07:12:40 AM script INFO: SUCCESS!@#KODE 1!@#USER_ID 96!@#ACTIVITY_CODE 5
12/23/2022 07:12:40 AM script INFO: SUCCESS!@#KODE 1!@#USER_ID 96!@#ACTIVITY_CODE 5
12/23/2022 07:12:43 AM script INFO: SUCCESS!@#KODE 1!@#USER_ID 96!@#ACTIVITY_CODE 5
12/23/2022 07:12:43 AM script INFO: SUCCESS!@#KODE 1!@#USER_ID 96!@#ACTIVITY_CODE 5
12/23/2022 07:12:46 AM script INFO: SUCCESS!@#KODE 1!@#USER_ID 96!@#ACTIVITY_CODE 2
12/23/2022 07:12:46 AM script INFO: SUCCESS!@#KODE 1!@#USER_ID 96!@#ACTIVITY_CODE 2
12/23/2022 07:12:46 AM script INFO: SUCCESS!@#KODE 1!@#USER_ID 96!@#ACTIVITY_CODE 5
12/23/2022 07:12:46 AM script INFO: SUCCESS!@#KODE 1!@#USER_ID 96!@#ACTIVITY_CODE 5
12/23/2022 07:12:48 AM script INFO: SUCCESS!@#KODE 1!@#USER_ID 96!@#ACTIVITY_CODE 5
12/23/2022 07:12:48 AM script INFO: SUCCESS!@#KODE 1!@#USER_ID 96!@#ACTIVITY_CODE 5
12/23/2022 07:12:51 AM script INFO: SUCCESS!@#KODE 1!@#USER_ID 96!@#ACTIVITY_CODE 3
12/23/2022 07:12:51 AM script INFO: SUCCESS!@#KODE 1!@#USER_ID 96!@#ACTIVITY_CODE 2
12/23/2022 07:12:51 AM script INFO: SUCCESS!@#KODE 1!@#USER_ID 96!@#ACTIVITY_CODE 5
12/23/2022 07:12:51 AM script INFO: SUCCESS!@#KODE 1!@#USER_ID 96!@#ACTIVITY_CODE 5
12/23/2022 07:12:54 AM script INFO: SUCCESS!@#KODE 1!@#USER_ID 96!@#ACTIVITY_CODE 1
12/23/2022 07:12:54 AM script INFO: SUCCESS!@#KODE 1!@#USER_ID 96!@#ACTIVITY_CODE 2
12/23/2022 07:12:54 AM script INFO: SUCCESS!@#KODE 1!@#USER_ID 96!@#ACTIVITY_CODE 3
12/23/2022 07:12:54 AM script INFO: SUCCESS!@#KODE 1!@#USER_ID 96!@#ACTIVITY_CODE 1
12/23/2022 07:12:54 AM script INFO: SUCCESS!@#KODE 1!@#USER_ID 96!@#ACTIVITY_CODE 1
12/23/2022 07:12:54 AM script INFO: SUCCESS!@#KODE 1!@#USER_ID 96!@#ACTIVITY_CODE 3
12/23/2022 07:12:54 AM script INFO: SUCCESS!@#KODE 1!@#USER_ID 96!@#ACTIVITY_CODE 3
12/23/2022 07:12:54 AM script INFO: SUCCESS!@#KODE 1!@#USER_ID 96!@#ACTIVITY_CODE 3
12/23/2022 07:12:54 AM script INFO: SUCCESS!@#KODE 1!@#USER_ID 96!@#ACTIVITY_CODE 2
12/23/2022 07:12:54 AM script INFO: SUCCESS!@#KODE 1!@#USER_ID 96!@#ACTIVITY_CODE 5
12/23/2022 07:12:54 AM script INFO: SUCCESS!@#KODE 1!@#USER_ID 96!@#ACTIVITY_CODE 5
12/23/2022 07:12:57 AM script INFO: SUCCESS!@#KODE 1!@#USER_ID 96!@#ACTIVITY_CODE 2
12/23/2022 07:12:57 AM script INFO: SUCCESS!@#KODE 1!@#USER_ID 96!@#ACTIVITY_CODE 2
12/23/2022 07:12:57 AM script INFO: SUCCESS!@#KODE 1!@#USER_ID 96!@#ACTIVITY_CODE 2
12/23/2022 07:12:57 AM script INFO: SUCCESS!@#KODE 1!@#USER_ID 96!@#ACTIVITY_CODE 5
12/23/2022 07:12:57 AM script INFO: SUCCESS!@#KODE 1!@#USER_ID 96!@#ACTIVITY_CODE 5
12/23/2022 07:13:00 AM script INFO: SUCCESS!@#KODE 1!@#USER_ID 96!@#ACTIVITY_CODE 5
12/23/2022 07:13:00 AM script INFO: SUCCESS!@#KODE 1!@#USER_ID 96!@#ACTIVITY_CODE 5
12/23/2022 07:13:02 AM script INFO: SUCCESS!@#KODE 1!@#USER_ID 96!@#ACTIVITY_CODE 1
12/23/2022 07:13:02 AM script INFO: SUCCESS!@#KODE 1!@#USER_ID 96!@#ACTIVITY_CODE 1
12/23/2022 07:13:02 AM script INFO: SUCCESS!@#KODE 1!@#USER_ID 96!@#ACTIVITY_CODE 1
12/23/2022 07:13:03 AM script INFO: SUCCESS!@#KODE 1!@#USER_ID 96!@#ACTIVITY_CODE 2
12/23/2022 07:13:03 AM script INFO: SUCCESS!@#KODE 1!@#USER_ID 96!@#ACTIVITY_CODE 3
12/23/2022 07:13:03 AM script INFO: SUCCESS!@#KODE 1!@#USER_ID 96!@#ACTIVITY_CODE 1
12/23/2022 07:13:03 AM script INFO: SUCCESS!@#KODE 1!@#USER_ID 96!@#ACTIVITY_CODE 1
12/23/2022 07:13:03 AM script INFO: SUCCESS!@#KODE 1!@#USER_ID 96!@#ACTIVITY_CODE 4
12/23/2022 07:13:03 AM script INFO: SUCCESS!@#KODE 1!@#USER_ID 96!@#ACTIVITY_CODE 1
12/23/2022 07:13:03 AM script INFO: SUCCESS!@#KODE 1!@#USER_ID 96!@#ACTIVITY_CODE 2
12/23/2022 07:13:03 AM script INFO: SUCCESS!@#KODE 1!@#USER_ID 96!@#ACTIVITY_CODE 3
12/23/2022 07:13:03 AM script INFO: SUCCESS!@#KODE 1!@#USER_ID 96!@#ACTIVITY_CODE 3
12/23/2022 07:13:03 AM script INFO: SUCCESS!@#KODE 1!@#USER_ID 96!@#ACTIVITY_CODE 1
12/23/2022 07:13:03 AM script INFO: SUCCESS!@#KODE 1!@#USER_ID 96!@#ACTIVITY_CODE 1
12/23/2022 07:13:04 AM script INFO: SUCCESS!@#KODE 1!@#USER_ID 96!@#ACTIVITY_CODE 4
12/23/2022 07:13:04 AM script INFO: SUCCESS!@#KODE 1!@#USER_ID 96!@#ACTIVITY_CODE 3
12/23/2022 07:13:04 AM script INFO: SUCCESS!@#KODE 1!@#USER_ID 96!@#ACTIVITY_CODE 3
12/23/2022 07:13:04 AM script INFO: SUCCESS!@#KODE 1!@#USER_ID 96!@#ACTIVITY_CODE 1
12/23/2022 07:13:04 AM script INFO: SUCCESS!@#KODE 1!@#USER_ID 96!@#ACTIVITY_CODE 1
12/23/2022 07:13:04 AM script INFO: SUCCESS!@#KODE 1!@#USER_ID 96!@#ACTIVITY_CODE 2
12/23/2022 07:13:04 AM script INFO: SUCCESS!@#KODE 1!@#USER_ID 96!@#ACTIVITY_CODE 3
12/23/2022 07:13:04 AM script INFO: SUCCESS!@#KODE 1!@#USER_ID 96!@#ACTIVITY_CODE 1
12/23/2022 07:13:04 AM script INFO: SUCCESS!@#KODE 1!@#USER_ID 96!@#ACTIVITY_CODE 2
12/23/2022 07:13:04 AM script INFO: SUCCESS!@#KODE 1!@#USER_ID 96!@#ACTIVITY_CODE 3
12/23/2022 07:13:05 AM script INFO: SUCCESS!@#KODE 1!@#USER_ID 96!@#ACTIVITY_CODE 2
12/23/2022 07:13:05 AM script INFO: SUCCESS!@#KODE 1!@#USER_ID 96!@#ACTIVITY_CODE 2
12/23/2022 07:13:05 AM script INFO: SUCCESS!@#KODE 1!@#USER_ID 96!@#ACTIVITY_CODE 3
12/23/2022 07:13:05 AM script INFO: SUCCESS!@#KODE 1!@#USER_ID 96!@#ACTIVITY_CODE 2
12/23/2022 07:13:05 AM script INFO: SUCCESS!@#KODE 1!@#USER_ID 96!@#ACTIVITY_CODE 3
12/23/2022 07:13:05 AM script INFO: SUCCESS!@#KODE 1!@#USER_ID 96!@#ACTIVITY_CODE 2
12/23/2022 07:13:05 AM script INFO: SUCCESS!@#KODE 1!@#USER_ID 96!@#ACTIVITY_CODE 2
12/23/2022 07:13:05 AM script INFO: SUCCESS!@#KODE 1!@#USER_ID 96!@#ACTIVITY_CODE 2
12/23/2022 07:13:05 AM script INFO: SUCCESS!@#KODE 1!@#USER_ID 96!@#ACTIVITY_CODE 1
12/23/2022 07:13:06 AM script INFO: SUCCESS!@#KODE 1!@#USER_ID 96!@#ACTIVITY_CODE 3
12/23/2022 07:13:06 AM script INFO: SUCCESS!@#KODE 1!@#USER_ID 96!@#ACTIVITY_CODE 2
12/23/2022 07:13:06 AM script INFO: SUCCESS!@#KODE 1!@#USER_ID 96!@#ACTIVITY_CODE 4
12/23/2022 07:13:06 AM script INFO: SUCCESS!@#KODE 1!@#USER_ID 96!@#ACTIVITY_CODE 1
12/23/2022 07:13:06 AM script INFO: SUCCESS!@#KODE 1!@#USER_ID 96!@#ACTIVITY_CODE 1
12/23/2022 07:13:06 AM script INFO: SUCCESS!@#KODE 1!@#USER_ID 96!@#ACTIVITY_CODE 2
12/23/2022 07:13:06 AM script INFO: SUCCESS!@#KODE 1!@#USER_ID 96!@#ACTIVITY_CODE 4
12/23/2022 07:13:06 AM script INFO: SUCCESS!@#KODE 1!@#USER_ID 96!@#ACTIVITY_CODE 3
12/23/2022 07:13:06 AM script INFO: SUCCESS!@#KODE 1!@#USER_ID 96!@#ACTIVITY_CODE 2
12/23/2022 07:13:07 AM script INFO: SUCCESS!@#KODE 1!@#USER_ID 96!@#ACTIVITY_CODE 1
12/23/2022 07:13:07 AM script INFO: SUCCESS!@#KODE 1!@#USER_ID 96!@#ACTIVITY_CODE 2
12/23/2022 07:13:07 AM script INFO: SUCCESS!@#KODE 1!@#USER_ID 96!@#ACTIVITY_CODE 1
12/23/2022 07:13:07 AM script INFO: SUCCESS!@#KODE 1!@#USER_ID 96!@#ACTIVITY_CODE 1
12/23/2022 07:13:07 AM script INFO: SUCCESS!@#KODE 1!@#USER_ID 96!@#ACTIVITY_CODE 1
12/23/2022 07:13:07 AM script INFO: SUCCESS!@#KODE 1!@#USER_ID 96!@#ACTIVITY_CODE 2
12/23/2022 07:13:07 AM script INFO: SUCCESS!@#KODE 1!@#USER_ID 96!@#ACTIVITY_CODE 3
12/23/2022 07:13:07 AM script INFO: SUCCESS!@#KODE 1!@#USER_ID 96!@#ACTIVITY_CODE 1
12/23/2022 07:13:07 AM script INFO: SUCCESS!@#KODE 1!@#USER_ID 96!@#ACTIVITY_CODE 2
12/23/2022 07:13:07 AM script INFO: SUCCESS!@#KODE 1!@#USER_ID 96!@#ACTIVITY_CODE 3
12/23/2022 07:13:07 AM script INFO: SUCCESS!@#KODE 1!@#USER_ID 96!@#ACTIVITY_CODE 3
12/23/2022 07:13:08 AM script INFO: SUCCESS!@#KODE 1!@#USER_ID 96!@#ACTIVITY_CODE 2
12/23/2022 07:13:08 AM script INFO: SUCCESS!@#KODE 1!@#USER_ID 96!@#ACTIVITY_CODE 4
12/23/2022 07:13:08 AM script INFO: SUCCESS!@#KODE 1!@#USER_ID 96!@#ACTIVITY_CODE 2
12/23/2022 07:13:08 AM script INFO: SUCCESS!@#KODE 1!@#USER_ID 96!@#ACTIVITY_CODE 1
12/23/2022 07:13:08 AM script INFO: Duration: 35.316818714141846
12/23/2022 07:13:08 AM script INFO: mengakhiri-quiz
12/23/2022 07:13:09 AM script INFO: SUCCESS!@#KODE 1!@#USER_ID 96!@#ACTIVITY_CODE 5
12/23/2022 07:13:09 AM script INFO: berhasil-submit
