12/23/2022 01:40:09 AM script INFO: Prepared chrome options..
12/23/2022 01:40:11 AM script INFO: Initialized chrome browser..
12/23/2022 01:40:11 AM script INFO: mengakses-homepage
12/23/2022 01:41:52 AM script INFO: mengakses-login-page
12/23/2022 01:43:22 AM script ERROR: TIMEOUT EXCEPTION!@#KODE 0!@#LOCATION mengakses-login-page
12/23/2022 01:43:22 AM main_worker ERROR: Message: None

