12/23/2022 05:52:03 AM script INFO: Prepared chrome options..
12/23/2022 05:52:04 AM script INFO: Initialized chrome browser..
12/23/2022 05:52:04 AM script INFO: mengakses-homepage
12/23/2022 05:52:39 AM script INFO: mengakses-login-page
12/23/2022 05:53:07 AM script INFO: mengakses-site-home
12/23/2022 05:53:32 AM script INFO: mengakses-site-course
12/23/2022 05:55:03 AM script ERROR: TIMEOUT EXCEPTION!@#KODE 0!@#LOCATION mengakses-site-course
12/23/2022 05:55:03 AM main_worker ERROR: Message: None

