12/23/2022 01:40:09 AM script INFO: Prepared chrome options..
12/23/2022 01:40:10 AM script INFO: Initialized chrome browser..
12/23/2022 01:40:10 AM script INFO: mengakses-homepage
12/23/2022 01:40:31 AM script INFO: mengakses-login-page
12/23/2022 01:41:15 AM script INFO: mengakses-site-home
12/23/2022 01:41:24 AM script INFO: mengakses-site-course
12/23/2022 01:41:24 AM script INFO: mengakses-quiz
12/23/2022 01:42:54 AM script ERROR: TIMEOUT EXCEPTION!@#KODE 0!@#LOCATION mengakses-quiz
12/23/2022 01:42:54 AM main_worker ERROR: Message: None

