12/10/2022 09:03:33 AM script INFO: Prepared chrome options..
12/10/2022 09:03:34 AM script INFO: Initialized chrome browser..
12/10/2022 09:03:34 AM script INFO: mengakses-homepage
12/10/2022 09:03:51 AM script INFO: mengakses-login-page
12/10/2022 09:04:19 AM script INFO: mengakses-site-home
12/10/2022 09:04:23 AM script INFO: mengakses-site-course
12/10/2022 09:04:50 AM script INFO: mengakses-quiz
12/10/2022 09:04:54 AM script INFO: mengakses-start-quiz-page
12/10/2022 09:05:22 AM script INFO: memulai-quiz
12/10/2022 09:05:22 AM script INFO: SUCCESS!@#KODE 1!@#USER_ID 75!@#ACTIVITY_CODE 5
12/10/2022 09:05:33 AM script INFO: SUCCESS!@#KODE 1!@#USER_ID 75!@#ACTIVITY_CODE 2
12/10/2022 09:05:33 AM script INFO: SUCCESS!@#KODE 1!@#USER_ID 75!@#ACTIVITY_CODE 1
12/10/2022 09:05:33 AM script INFO: SUCCESS!@#KODE 1!@#USER_ID 75!@#ACTIVITY_CODE 5
12/10/2022 09:05:33 AM script INFO: SUCCESS!@#KODE 1!@#USER_ID 75!@#ACTIVITY_CODE 5
12/10/2022 09:05:36 AM script INFO: SUCCESS!@#KODE 1!@#USER_ID 75!@#ACTIVITY_CODE 3
12/10/2022 09:05:36 AM script INFO: SUCCESS!@#KODE 1!@#USER_ID 75!@#ACTIVITY_CODE 5
12/10/2022 09:05:36 AM script INFO: SUCCESS!@#KODE 1!@#USER_ID 75!@#ACTIVITY_CODE 5
12/10/2022 09:05:39 AM script INFO: SUCCESS!@#KODE 1!@#USER_ID 75!@#ACTIVITY_CODE 3
12/10/2022 09:05:39 AM script INFO: SUCCESS!@#KODE 1!@#USER_ID 75!@#ACTIVITY_CODE 1
12/10/2022 09:05:39 AM script INFO: SUCCESS!@#KODE 1!@#USER_ID 75!@#ACTIVITY_CODE 3
12/10/2022 09:05:39 AM script INFO: SUCCESS!@#KODE 1!@#USER_ID 75!@#ACTIVITY_CODE 3
12/10/2022 09:05:40 AM script INFO: SUCCESS!@#KODE 1!@#USER_ID 75!@#ACTIVITY_CODE 1
12/10/2022 09:05:40 AM script INFO: SUCCESS!@#KODE 1!@#USER_ID 75!@#ACTIVITY_CODE 1
12/10/2022 09:05:40 AM script INFO: SUCCESS!@#KODE 1!@#USER_ID 75!@#ACTIVITY_CODE 1
12/10/2022 09:05:40 AM script INFO: SUCCESS!@#KODE 1!@#USER_ID 75!@#ACTIVITY_CODE 2
12/10/2022 09:05:41 AM script INFO: SUCCESS!@#KODE 1!@#USER_ID 75!@#ACTIVITY_CODE 3
12/10/2022 09:05:41 AM script INFO: SUCCESS!@#KODE 1!@#USER_ID 75!@#ACTIVITY_CODE 1
12/10/2022 09:05:41 AM script INFO: SUCCESS!@#KODE 1!@#USER_ID 75!@#ACTIVITY_CODE 1
12/10/2022 09:05:41 AM script INFO: SUCCESS!@#KODE 1!@#USER_ID 75!@#ACTIVITY_CODE 1
12/10/2022 09:05:42 AM script INFO: SUCCESS!@#KODE 1!@#USER_ID 75!@#ACTIVITY_CODE 3
12/10/2022 09:05:42 AM script INFO: SUCCESS!@#KODE 1!@#USER_ID 75!@#ACTIVITY_CODE 3
12/10/2022 09:05:42 AM script INFO: SUCCESS!@#KODE 1!@#USER_ID 75!@#ACTIVITY_CODE 1
12/10/2022 09:05:42 AM script INFO: SUCCESS!@#KODE 1!@#USER_ID 75!@#ACTIVITY_CODE 1
12/10/2022 09:05:42 AM script INFO: SUCCESS!@#KODE 1!@#USER_ID 75!@#ACTIVITY_CODE 3
12/10/2022 09:05:42 AM script INFO: SUCCESS!@#KODE 1!@#USER_ID 75!@#ACTIVITY_CODE 1
12/10/2022 09:05:43 AM script INFO: SUCCESS!@#KODE 1!@#USER_ID 75!@#ACTIVITY_CODE 4
12/10/2022 09:05:43 AM script INFO: SUCCESS!@#KODE 1!@#USER_ID 75!@#ACTIVITY_CODE 1
12/10/2022 09:05:43 AM script INFO: SUCCESS!@#KODE 1!@#USER_ID 75!@#ACTIVITY_CODE 5
12/10/2022 09:05:43 AM script INFO: SUCCESS!@#KODE 1!@#USER_ID 75!@#ACTIVITY_CODE 5
12/10/2022 09:05:46 AM script INFO: SUCCESS!@#KODE 1!@#USER_ID 75!@#ACTIVITY_CODE 2
12/10/2022 09:05:46 AM script INFO: SUCCESS!@#KODE 1!@#USER_ID 75!@#ACTIVITY_CODE 4
12/10/2022 09:05:46 AM script INFO: SUCCESS!@#KODE 1!@#USER_ID 75!@#ACTIVITY_CODE 1
12/10/2022 09:05:46 AM script INFO: SUCCESS!@#KODE 1!@#USER_ID 75!@#ACTIVITY_CODE 4
12/10/2022 09:05:46 AM script INFO: SUCCESS!@#KODE 1!@#USER_ID 75!@#ACTIVITY_CODE 1
12/10/2022 09:05:46 AM script INFO: SUCCESS!@#KODE 1!@#USER_ID 75!@#ACTIVITY_CODE 5
12/10/2022 09:05:46 AM script INFO: SUCCESS!@#KODE 1!@#USER_ID 75!@#ACTIVITY_CODE 5
12/10/2022 09:05:49 AM script INFO: SUCCESS!@#KODE 1!@#USER_ID 75!@#ACTIVITY_CODE 3
12/10/2022 09:05:49 AM script INFO: SUCCESS!@#KODE 1!@#USER_ID 75!@#ACTIVITY_CODE 3
12/10/2022 09:05:50 AM script INFO: SUCCESS!@#KODE 1!@#USER_ID 75!@#ACTIVITY_CODE 2
12/10/2022 09:05:50 AM script INFO: SUCCESS!@#KODE 1!@#USER_ID 75!@#ACTIVITY_CODE 5
12/10/2022 09:05:50 AM script INFO: SUCCESS!@#KODE 1!@#USER_ID 75!@#ACTIVITY_CODE 5
12/10/2022 09:05:53 AM script INFO: SUCCESS!@#KODE 1!@#USER_ID 75!@#ACTIVITY_CODE 2
12/10/2022 09:05:53 AM script INFO: SUCCESS!@#KODE 1!@#USER_ID 75!@#ACTIVITY_CODE 1
12/10/2022 09:05:53 AM script INFO: SUCCESS!@#KODE 1!@#USER_ID 75!@#ACTIVITY_CODE 2
12/10/2022 09:05:53 AM script INFO: SUCCESS!@#KODE 1!@#USER_ID 75!@#ACTIVITY_CODE 5
12/10/2022 09:05:53 AM script INFO: SUCCESS!@#KODE 1!@#USER_ID 75!@#ACTIVITY_CODE 5
12/10/2022 09:05:57 AM script INFO: SUCCESS!@#KODE 1!@#USER_ID 75!@#ACTIVITY_CODE 2
12/10/2022 09:05:57 AM script INFO: SUCCESS!@#KODE 1!@#USER_ID 75!@#ACTIVITY_CODE 5
12/10/2022 09:05:57 AM script INFO: SUCCESS!@#KODE 1!@#USER_ID 75!@#ACTIVITY_CODE 5
12/10/2022 09:06:00 AM script INFO: SUCCESS!@#KODE 1!@#USER_ID 75!@#ACTIVITY_CODE 2
12/10/2022 09:06:00 AM script INFO: SUCCESS!@#KODE 1!@#USER_ID 75!@#ACTIVITY_CODE 3
12/10/2022 09:06:00 AM script INFO: SUCCESS!@#KODE 1!@#USER_ID 75!@#ACTIVITY_CODE 5
12/10/2022 09:06:00 AM script INFO: SUCCESS!@#KODE 1!@#USER_ID 75!@#ACTIVITY_CODE 5
12/10/2022 09:06:03 AM script INFO: SUCCESS!@#KODE 1!@#USER_ID 75!@#ACTIVITY_CODE 4
12/10/2022 09:06:03 AM script INFO: SUCCESS!@#KODE 1!@#USER_ID 75!@#ACTIVITY_CODE 5
12/10/2022 09:06:03 AM script INFO: SUCCESS!@#KODE 1!@#USER_ID 75!@#ACTIVITY_CODE 5
12/10/2022 09:06:06 AM script INFO: SUCCESS!@#KODE 1!@#USER_ID 75!@#ACTIVITY_CODE 1
12/10/2022 09:06:06 AM script INFO: SUCCESS!@#KODE 1!@#USER_ID 75!@#ACTIVITY_CODE 1
12/10/2022 09:06:07 AM script INFO: SUCCESS!@#KODE 1!@#USER_ID 75!@#ACTIVITY_CODE 4
12/10/2022 09:06:07 AM script INFO: SUCCESS!@#KODE 1!@#USER_ID 75!@#ACTIVITY_CODE 5
12/10/2022 09:06:07 AM script INFO: SUCCESS!@#KODE 1!@#USER_ID 75!@#ACTIVITY_CODE 5
12/10/2022 09:06:10 AM script INFO: SUCCESS!@#KODE 1!@#USER_ID 75!@#ACTIVITY_CODE 3
12/10/2022 09:06:10 AM script INFO: SUCCESS!@#KODE 1!@#USER_ID 75!@#ACTIVITY_CODE 5
12/10/2022 09:06:10 AM script INFO: SUCCESS!@#KODE 1!@#USER_ID 75!@#ACTIVITY_CODE 5
12/10/2022 09:06:13 AM script INFO: SUCCESS!@#KODE 1!@#USER_ID 75!@#ACTIVITY_CODE 2
12/10/2022 09:06:14 AM script INFO: SUCCESS!@#KODE 1!@#USER_ID 75!@#ACTIVITY_CODE 1
12/10/2022 09:06:14 AM script INFO: SUCCESS!@#KODE 1!@#USER_ID 75!@#ACTIVITY_CODE 2
12/10/2022 09:06:14 AM script INFO: SUCCESS!@#KODE 1!@#USER_ID 75!@#ACTIVITY_CODE 4
12/10/2022 09:06:15 AM script INFO: SUCCESS!@#KODE 1!@#USER_ID 75!@#ACTIVITY_CODE 1
12/10/2022 09:06:15 AM script INFO: SUCCESS!@#KODE 1!@#USER_ID 75!@#ACTIVITY_CODE 4
12/10/2022 09:06:16 AM script INFO: SUCCESS!@#KODE 1!@#USER_ID 75!@#ACTIVITY_CODE 2
12/10/2022 09:06:17 AM script INFO: SUCCESS!@#KODE 1!@#USER_ID 75!@#ACTIVITY_CODE 3
12/10/2022 09:06:18 AM script INFO: SUCCESS!@#KODE 1!@#USER_ID 75!@#ACTIVITY_CODE 4
12/10/2022 09:06:18 AM script INFO: SUCCESS!@#KODE 1!@#USER_ID 75!@#ACTIVITY_CODE 1
12/10/2022 09:06:18 AM script INFO: SUCCESS!@#KODE 1!@#USER_ID 75!@#ACTIVITY_CODE 4
12/10/2022 09:06:18 AM script INFO: SUCCESS!@#KODE 1!@#USER_ID 75!@#ACTIVITY_CODE 1
12/10/2022 09:06:19 AM script INFO: SUCCESS!@#KODE 1!@#USER_ID 75!@#ACTIVITY_CODE 2
12/10/2022 09:06:20 AM script INFO: SUCCESS!@#KODE 1!@#USER_ID 75!@#ACTIVITY_CODE 3
12/10/2022 09:06:20 AM script INFO: SUCCESS!@#KODE 1!@#USER_ID 75!@#ACTIVITY_CODE 1
12/10/2022 09:06:20 AM script INFO: SUCCESS!@#KODE 1!@#USER_ID 75!@#ACTIVITY_CODE 3
12/10/2022 09:06:20 AM script INFO: SUCCESS!@#KODE 1!@#USER_ID 75!@#ACTIVITY_CODE 3
12/10/2022 09:06:21 AM script INFO: SUCCESS!@#KODE 1!@#USER_ID 75!@#ACTIVITY_CODE 3
12/10/2022 09:06:21 AM script INFO: SUCCESS!@#KODE 1!@#USER_ID 75!@#ACTIVITY_CODE 3
12/10/2022 09:06:21 AM script INFO: SUCCESS!@#KODE 1!@#USER_ID 75!@#ACTIVITY_CODE 1
12/10/2022 09:06:21 AM script INFO: SUCCESS!@#KODE 1!@#USER_ID 75!@#ACTIVITY_CODE 1
12/10/2022 09:06:22 AM script INFO: SUCCESS!@#KODE 1!@#USER_ID 75!@#ACTIVITY_CODE 2
12/10/2022 09:06:22 AM script INFO: SUCCESS!@#KODE 1!@#USER_ID 75!@#ACTIVITY_CODE 2
12/10/2022 09:06:22 AM script INFO: SUCCESS!@#KODE 1!@#USER_ID 75!@#ACTIVITY_CODE 1
12/10/2022 09:06:22 AM script INFO: SUCCESS!@#KODE 1!@#USER_ID 75!@#ACTIVITY_CODE 3
12/10/2022 09:06:23 AM script INFO: SUCCESS!@#KODE 1!@#USER_ID 75!@#ACTIVITY_CODE 2
12/10/2022 09:06:23 AM script INFO: SUCCESS!@#KODE 1!@#USER_ID 75!@#ACTIVITY_CODE 3
12/10/2022 09:06:23 AM script INFO: SUCCESS!@#KODE 1!@#USER_ID 75!@#ACTIVITY_CODE 2
12/10/2022 09:06:23 AM script INFO: SUCCESS!@#KODE 1!@#USER_ID 75!@#ACTIVITY_CODE 4
12/10/2022 09:06:23 AM script INFO: SUCCESS!@#KODE 1!@#USER_ID 75!@#ACTIVITY_CODE 1
12/10/2022 09:06:23 AM script INFO: SUCCESS!@#KODE 1!@#USER_ID 75!@#ACTIVITY_CODE 1
12/10/2022 09:06:24 AM script INFO: SUCCESS!@#KODE 1!@#USER_ID 75!@#ACTIVITY_CODE 2
12/10/2022 09:06:24 AM script INFO: SUCCESS!@#KODE 1!@#USER_ID 75!@#ACTIVITY_CODE 1
12/10/2022 09:06:24 AM script INFO: SUCCESS!@#KODE 1!@#USER_ID 75!@#ACTIVITY_CODE 1
12/10/2022 09:06:24 AM script INFO: Duration: 51.11804914474487
12/10/2022 09:06:24 AM script INFO: mengakhiri-quiz
12/10/2022 09:06:24 AM script INFO: SUCCESS!@#KODE 1!@#USER_ID 75!@#ACTIVITY_CODE 5
12/10/2022 09:06:24 AM script INFO: berhasil-submit
12/10/2022 09:07:55 AM script ERROR: TIMEOUT EXCEPTION!@#KODE 0!@#LOCATION berhasil-submit
12/10/2022 09:07:55 AM main_worker ERROR: Message: None

