12/23/2022 04:20:19 AM script INFO: Prepared chrome options..
12/23/2022 04:20:21 AM script INFO: Initialized chrome browser..
12/23/2022 04:20:21 AM script INFO: mengakses-homepage
12/23/2022 04:20:45 AM script INFO: mengakses-login-page
12/23/2022 04:21:35 AM script INFO: mengakses-site-home
12/23/2022 04:21:44 AM script INFO: mengakses-site-course
12/23/2022 04:22:18 AM script INFO: mengakses-quiz
12/23/2022 04:22:28 AM script INFO: mengakses-start-quiz-page
12/23/2022 04:22:44 AM script INFO: memulai-quiz
12/23/2022 04:22:44 AM script INFO: SUCCESS!@#KODE 1!@#USER_ID 82!@#ACTIVITY_CODE 5
12/23/2022 04:22:55 AM script INFO: SUCCESS!@#KODE 1!@#USER_ID 82!@#ACTIVITY_CODE 5
12/23/2022 04:22:55 AM script INFO: SUCCESS!@#KODE 1!@#USER_ID 82!@#ACTIVITY_CODE 5
12/23/2022 04:22:58 AM script INFO: SUCCESS!@#KODE 1!@#USER_ID 82!@#ACTIVITY_CODE 2
12/23/2022 04:22:58 AM script INFO: SUCCESS!@#KODE 1!@#USER_ID 82!@#ACTIVITY_CODE 1
12/23/2022 04:22:58 AM script INFO: SUCCESS!@#KODE 1!@#USER_ID 82!@#ACTIVITY_CODE 4
12/23/2022 04:22:58 AM script INFO: SUCCESS!@#KODE 1!@#USER_ID 82!@#ACTIVITY_CODE 3
12/23/2022 04:22:58 AM script INFO: SUCCESS!@#KODE 1!@#USER_ID 82!@#ACTIVITY_CODE 3
12/23/2022 04:22:58 AM script INFO: SUCCESS!@#KODE 1!@#USER_ID 82!@#ACTIVITY_CODE 2
12/23/2022 04:22:58 AM script INFO: SUCCESS!@#KODE 1!@#USER_ID 82!@#ACTIVITY_CODE 1
12/23/2022 04:22:58 AM script INFO: SUCCESS!@#KODE 1!@#USER_ID 82!@#ACTIVITY_CODE 4
12/23/2022 04:22:58 AM script INFO: SUCCESS!@#KODE 1!@#USER_ID 82!@#ACTIVITY_CODE 1
12/23/2022 04:22:59 AM script INFO: SUCCESS!@#KODE 1!@#USER_ID 82!@#ACTIVITY_CODE 4
12/23/2022 04:22:59 AM script INFO: SUCCESS!@#KODE 1!@#USER_ID 82!@#ACTIVITY_CODE 2
12/23/2022 04:22:59 AM script INFO: SUCCESS!@#KODE 1!@#USER_ID 82!@#ACTIVITY_CODE 1
12/23/2022 04:22:59 AM script INFO: SUCCESS!@#KODE 1!@#USER_ID 82!@#ACTIVITY_CODE 1
12/23/2022 04:22:59 AM script INFO: SUCCESS!@#KODE 1!@#USER_ID 82!@#ACTIVITY_CODE 3
12/23/2022 04:22:59 AM script INFO: SUCCESS!@#KODE 1!@#USER_ID 82!@#ACTIVITY_CODE 3
12/23/2022 04:22:59 AM script INFO: SUCCESS!@#KODE 1!@#USER_ID 82!@#ACTIVITY_CODE 2
12/23/2022 04:22:59 AM script INFO: SUCCESS!@#KODE 1!@#USER_ID 82!@#ACTIVITY_CODE 2
12/23/2022 04:22:59 AM script INFO: SUCCESS!@#KODE 1!@#USER_ID 82!@#ACTIVITY_CODE 1
12/23/2022 04:22:59 AM script INFO: SUCCESS!@#KODE 1!@#USER_ID 82!@#ACTIVITY_CODE 2
12/23/2022 04:23:00 AM script INFO: SUCCESS!@#KODE 1!@#USER_ID 82!@#ACTIVITY_CODE 2
12/23/2022 04:23:00 AM script INFO: SUCCESS!@#KODE 1!@#USER_ID 82!@#ACTIVITY_CODE 2
12/23/2022 04:23:00 AM script INFO: SUCCESS!@#KODE 1!@#USER_ID 82!@#ACTIVITY_CODE 1
12/23/2022 04:23:00 AM script INFO: SUCCESS!@#KODE 1!@#USER_ID 82!@#ACTIVITY_CODE 5
12/23/2022 04:23:00 AM script INFO: SUCCESS!@#KODE 1!@#USER_ID 82!@#ACTIVITY_CODE 5
12/23/2022 04:23:02 AM script INFO: SUCCESS!@#KODE 1!@#USER_ID 82!@#ACTIVITY_CODE 2
12/23/2022 04:23:02 AM script INFO: SUCCESS!@#KODE 1!@#USER_ID 82!@#ACTIVITY_CODE 3
12/23/2022 04:23:03 AM script INFO: SUCCESS!@#KODE 1!@#USER_ID 82!@#ACTIVITY_CODE 2
12/23/2022 04:23:03 AM script INFO: SUCCESS!@#KODE 1!@#USER_ID 82!@#ACTIVITY_CODE 5
12/23/2022 04:23:03 AM script INFO: SUCCESS!@#KODE 1!@#USER_ID 82!@#ACTIVITY_CODE 5
12/23/2022 04:23:05 AM script INFO: SUCCESS!@#KODE 1!@#USER_ID 82!@#ACTIVITY_CODE 1
12/23/2022 04:23:05 AM script INFO: SUCCESS!@#KODE 1!@#USER_ID 82!@#ACTIVITY_CODE 5
12/23/2022 04:23:05 AM script INFO: SUCCESS!@#KODE 1!@#USER_ID 82!@#ACTIVITY_CODE 5
12/23/2022 04:23:08 AM script INFO: SUCCESS!@#KODE 1!@#USER_ID 82!@#ACTIVITY_CODE 5
12/23/2022 04:23:08 AM script INFO: SUCCESS!@#KODE 1!@#USER_ID 82!@#ACTIVITY_CODE 5
12/23/2022 04:23:10 AM script INFO: SUCCESS!@#KODE 1!@#USER_ID 82!@#ACTIVITY_CODE 2
12/23/2022 04:23:10 AM script INFO: SUCCESS!@#KODE 1!@#USER_ID 82!@#ACTIVITY_CODE 3
12/23/2022 04:23:10 AM script INFO: SUCCESS!@#KODE 1!@#USER_ID 82!@#ACTIVITY_CODE 3
12/23/2022 04:23:11 AM script INFO: SUCCESS!@#KODE 1!@#USER_ID 82!@#ACTIVITY_CODE 1
12/23/2022 04:23:11 AM script INFO: SUCCESS!@#KODE 1!@#USER_ID 82!@#ACTIVITY_CODE 4
12/23/2022 04:23:11 AM script INFO: SUCCESS!@#KODE 1!@#USER_ID 82!@#ACTIVITY_CODE 5
12/23/2022 04:23:11 AM script INFO: SUCCESS!@#KODE 1!@#USER_ID 82!@#ACTIVITY_CODE 5
12/23/2022 04:23:13 AM script INFO: SUCCESS!@#KODE 1!@#USER_ID 82!@#ACTIVITY_CODE 1
12/23/2022 04:23:13 AM script INFO: SUCCESS!@#KODE 1!@#USER_ID 82!@#ACTIVITY_CODE 1
12/23/2022 04:23:13 AM script INFO: SUCCESS!@#KODE 1!@#USER_ID 82!@#ACTIVITY_CODE 3
12/23/2022 04:23:14 AM script INFO: SUCCESS!@#KODE 1!@#USER_ID 82!@#ACTIVITY_CODE 3
12/23/2022 04:23:14 AM script INFO: SUCCESS!@#KODE 1!@#USER_ID 82!@#ACTIVITY_CODE 2
12/23/2022 04:23:14 AM script INFO: Duration: 18.729608297348022
12/23/2022 04:23:14 AM script INFO: mengakhiri-quiz
12/23/2022 04:23:24 AM script INFO: SUCCESS!@#KODE 1!@#USER_ID 82!@#ACTIVITY_CODE 5
12/23/2022 04:23:24 AM script INFO: berhasil-submit
12/23/2022 04:24:55 AM script ERROR: TIMEOUT EXCEPTION!@#KODE 0!@#LOCATION berhasil-submit
12/23/2022 04:24:55 AM main_worker ERROR: Message: None

