12/11/2022 04:01:09 PM script INFO: Prepared chrome options..
12/11/2022 04:01:11 PM script INFO: Initialized chrome browser..
12/11/2022 04:01:11 PM script INFO: mengakses-homepage
12/11/2022 04:02:02 PM script INFO: mengakses-login-page
12/11/2022 04:02:21 PM script INFO: mengakses-site-home
12/11/2022 04:02:22 PM script INFO: mengakses-site-course
12/11/2022 04:02:49 PM script INFO: mengakses-quiz
12/11/2022 04:04:33 PM script INFO: mengakses-start-quiz-page
12/11/2022 04:04:36 PM script INFO: memulai-quiz
12/11/2022 04:04:36 PM script INFO: SUCCESS!@#KODE 1!@#USER_ID 5!@#ACTIVITY_CODE 5
12/11/2022 04:09:36 PM main_worker ERROR: Message: mengakses-quiz

