12/21/2022 02:35:01 PM script INFO: Prepared chrome options..
12/21/2022 02:35:02 PM script INFO: Initialized chrome browser..
12/21/2022 02:35:02 PM script INFO: mengakses-homepage
12/21/2022 02:35:07 PM script INFO: mengakses-login-page
12/21/2022 02:35:09 PM script INFO: mengakses-site-home
12/21/2022 02:35:10 PM script INFO: mengakses-site-course
12/21/2022 02:35:10 PM script INFO: mengakses-quiz
12/21/2022 02:35:11 PM script INFO: mengakses-start-quiz-page
12/21/2022 02:35:12 PM script INFO: memulai-quiz
12/21/2022 02:35:12 PM script INFO: SUCCESS!@#KODE 1!@#USER_ID 13!@#ACTIVITY_CODE 5
12/21/2022 02:35:23 PM script INFO: SUCCESS!@#KODE 1!@#USER_ID 13!@#ACTIVITY_CODE 3
12/21/2022 02:35:23 PM script INFO: SUCCESS!@#KODE 1!@#USER_ID 13!@#ACTIVITY_CODE 2
12/21/2022 02:35:23 PM script INFO: SUCCESS!@#KODE 1!@#USER_ID 13!@#ACTIVITY_CODE 5
12/21/2022 02:35:23 PM script INFO: SUCCESS!@#KODE 1!@#USER_ID 13!@#ACTIVITY_CODE 5
12/21/2022 02:35:25 PM script INFO: SUCCESS!@#KODE 1!@#USER_ID 13!@#ACTIVITY_CODE 1
12/21/2022 02:35:25 PM script INFO: SUCCESS!@#KODE 1!@#USER_ID 13!@#ACTIVITY_CODE 5
12/21/2022 02:35:25 PM script INFO: SUCCESS!@#KODE 1!@#USER_ID 13!@#ACTIVITY_CODE 5
12/21/2022 02:35:28 PM script INFO: SUCCESS!@#KODE 1!@#USER_ID 13!@#ACTIVITY_CODE 5
12/21/2022 02:35:28 PM script INFO: SUCCESS!@#KODE 1!@#USER_ID 13!@#ACTIVITY_CODE 5
12/21/2022 02:35:31 PM script INFO: SUCCESS!@#KODE 1!@#USER_ID 13!@#ACTIVITY_CODE 1
12/21/2022 02:35:31 PM script INFO: SUCCESS!@#KODE 1!@#USER_ID 13!@#ACTIVITY_CODE 5
12/21/2022 02:35:31 PM script INFO: SUCCESS!@#KODE 1!@#USER_ID 13!@#ACTIVITY_CODE 5
12/21/2022 02:35:33 PM script INFO: SUCCESS!@#KODE 1!@#USER_ID 13!@#ACTIVITY_CODE 2
12/21/2022 02:35:33 PM script INFO: SUCCESS!@#KODE 1!@#USER_ID 13!@#ACTIVITY_CODE 5
12/21/2022 02:35:33 PM script INFO: SUCCESS!@#KODE 1!@#USER_ID 13!@#ACTIVITY_CODE 5
12/21/2022 02:35:36 PM script INFO: SUCCESS!@#KODE 1!@#USER_ID 13!@#ACTIVITY_CODE 5
12/21/2022 02:35:36 PM script INFO: SUCCESS!@#KODE 1!@#USER_ID 13!@#ACTIVITY_CODE 5
12/21/2022 02:35:38 PM script INFO: SUCCESS!@#KODE 1!@#USER_ID 13!@#ACTIVITY_CODE 5
12/21/2022 02:35:38 PM script INFO: SUCCESS!@#KODE 1!@#USER_ID 13!@#ACTIVITY_CODE 5
12/21/2022 02:35:41 PM script INFO: SUCCESS!@#KODE 1!@#USER_ID 13!@#ACTIVITY_CODE 3
12/21/2022 02:35:41 PM script INFO: SUCCESS!@#KODE 1!@#USER_ID 13!@#ACTIVITY_CODE 2
12/21/2022 02:35:41 PM script INFO: SUCCESS!@#KODE 1!@#USER_ID 13!@#ACTIVITY_CODE 3
12/21/2022 02:35:41 PM script INFO: SUCCESS!@#KODE 1!@#USER_ID 13!@#ACTIVITY_CODE 1
12/21/2022 02:35:41 PM script INFO: SUCCESS!@#KODE 1!@#USER_ID 13!@#ACTIVITY_CODE 3
12/21/2022 02:35:41 PM script INFO: SUCCESS!@#KODE 1!@#USER_ID 13!@#ACTIVITY_CODE 5
12/21/2022 02:35:41 PM script INFO: SUCCESS!@#KODE 1!@#USER_ID 13!@#ACTIVITY_CODE 5
12/21/2022 02:35:44 PM script INFO: SUCCESS!@#KODE 1!@#USER_ID 13!@#ACTIVITY_CODE 3
12/21/2022 02:35:44 PM script INFO: SUCCESS!@#KODE 1!@#USER_ID 13!@#ACTIVITY_CODE 3
12/21/2022 02:35:44 PM script INFO: SUCCESS!@#KODE 1!@#USER_ID 13!@#ACTIVITY_CODE 3
12/21/2022 02:35:44 PM script INFO: SUCCESS!@#KODE 1!@#USER_ID 13!@#ACTIVITY_CODE 5
12/21/2022 02:35:44 PM script INFO: SUCCESS!@#KODE 1!@#USER_ID 13!@#ACTIVITY_CODE 5
12/21/2022 02:35:46 PM script INFO: SUCCESS!@#KODE 1!@#USER_ID 13!@#ACTIVITY_CODE 2
12/21/2022 02:35:46 PM script INFO: SUCCESS!@#KODE 1!@#USER_ID 13!@#ACTIVITY_CODE 1
12/21/2022 02:35:46 PM script INFO: SUCCESS!@#KODE 1!@#USER_ID 13!@#ACTIVITY_CODE 3
12/21/2022 02:35:46 PM script INFO: SUCCESS!@#KODE 1!@#USER_ID 13!@#ACTIVITY_CODE 3
12/21/2022 02:35:47 PM script INFO: SUCCESS!@#KODE 1!@#USER_ID 13!@#ACTIVITY_CODE 2
12/21/2022 02:35:47 PM script INFO: SUCCESS!@#KODE 1!@#USER_ID 13!@#ACTIVITY_CODE 3
12/21/2022 02:35:47 PM script INFO: SUCCESS!@#KODE 1!@#USER_ID 13!@#ACTIVITY_CODE 2
12/21/2022 02:35:47 PM script INFO: SUCCESS!@#KODE 1!@#USER_ID 13!@#ACTIVITY_CODE 3
12/21/2022 02:35:47 PM script INFO: SUCCESS!@#KODE 1!@#USER_ID 13!@#ACTIVITY_CODE 3
12/21/2022 02:35:47 PM script INFO: SUCCESS!@#KODE 1!@#USER_ID 13!@#ACTIVITY_CODE 3
12/21/2022 02:35:47 PM script INFO: SUCCESS!@#KODE 1!@#USER_ID 13!@#ACTIVITY_CODE 1
12/21/2022 02:35:47 PM script INFO: SUCCESS!@#KODE 1!@#USER_ID 13!@#ACTIVITY_CODE 3
12/21/2022 02:35:47 PM script INFO: SUCCESS!@#KODE 1!@#USER_ID 13!@#ACTIVITY_CODE 4
12/21/2022 02:35:47 PM script INFO: SUCCESS!@#KODE 1!@#USER_ID 13!@#ACTIVITY_CODE 2
12/21/2022 02:35:47 PM script INFO: SUCCESS!@#KODE 1!@#USER_ID 13!@#ACTIVITY_CODE 5
12/21/2022 02:35:47 PM script INFO: SUCCESS!@#KODE 1!@#USER_ID 13!@#ACTIVITY_CODE 5
12/21/2022 02:35:50 PM script INFO: SUCCESS!@#KODE 1!@#USER_ID 13!@#ACTIVITY_CODE 2
12/21/2022 02:35:50 PM script INFO: SUCCESS!@#KODE 1!@#USER_ID 13!@#ACTIVITY_CODE 4
12/21/2022 02:35:50 PM script INFO: SUCCESS!@#KODE 1!@#USER_ID 13!@#ACTIVITY_CODE 5
12/21/2022 02:35:50 PM script INFO: SUCCESS!@#KODE 1!@#USER_ID 13!@#ACTIVITY_CODE 5
12/21/2022 02:35:53 PM script INFO: SUCCESS!@#KODE 1!@#USER_ID 13!@#ACTIVITY_CODE 1
12/21/2022 02:35:53 PM script INFO: SUCCESS!@#KODE 1!@#USER_ID 13!@#ACTIVITY_CODE 3
12/21/2022 02:35:53 PM script INFO: SUCCESS!@#KODE 1!@#USER_ID 13!@#ACTIVITY_CODE 1
12/21/2022 02:35:53 PM script INFO: SUCCESS!@#KODE 1!@#USER_ID 13!@#ACTIVITY_CODE 3
12/21/2022 02:35:53 PM script INFO: SUCCESS!@#KODE 1!@#USER_ID 13!@#ACTIVITY_CODE 4
12/21/2022 02:35:53 PM script INFO: SUCCESS!@#KODE 1!@#USER_ID 13!@#ACTIVITY_CODE 2
12/21/2022 02:35:53 PM script INFO: SUCCESS!@#KODE 1!@#USER_ID 13!@#ACTIVITY_CODE 2
12/21/2022 02:35:53 PM script INFO: SUCCESS!@#KODE 1!@#USER_ID 13!@#ACTIVITY_CODE 3
12/21/2022 02:35:53 PM script INFO: SUCCESS!@#KODE 1!@#USER_ID 13!@#ACTIVITY_CODE 1
12/21/2022 02:35:53 PM script INFO: SUCCESS!@#KODE 1!@#USER_ID 13!@#ACTIVITY_CODE 4
12/21/2022 02:35:53 PM script INFO: SUCCESS!@#KODE 1!@#USER_ID 13!@#ACTIVITY_CODE 1
12/21/2022 02:35:54 PM script INFO: SUCCESS!@#KODE 1!@#USER_ID 13!@#ACTIVITY_CODE 4
12/21/2022 02:35:54 PM script INFO: SUCCESS!@#KODE 1!@#USER_ID 13!@#ACTIVITY_CODE 3
12/21/2022 02:35:54 PM script INFO: SUCCESS!@#KODE 1!@#USER_ID 13!@#ACTIVITY_CODE 1
12/21/2022 02:35:54 PM script INFO: SUCCESS!@#KODE 1!@#USER_ID 13!@#ACTIVITY_CODE 4
12/21/2022 02:35:54 PM script INFO: SUCCESS!@#KODE 1!@#USER_ID 13!@#ACTIVITY_CODE 2
12/21/2022 02:35:54 PM script INFO: SUCCESS!@#KODE 1!@#USER_ID 13!@#ACTIVITY_CODE 3
12/21/2022 02:35:54 PM script INFO: SUCCESS!@#KODE 1!@#USER_ID 13!@#ACTIVITY_CODE 1
12/21/2022 02:35:54 PM script INFO: SUCCESS!@#KODE 1!@#USER_ID 13!@#ACTIVITY_CODE 3
12/21/2022 02:35:54 PM script INFO: SUCCESS!@#KODE 1!@#USER_ID 13!@#ACTIVITY_CODE 1
12/21/2022 02:35:54 PM script INFO: SUCCESS!@#KODE 1!@#USER_ID 13!@#ACTIVITY_CODE 1
12/21/2022 02:35:54 PM script INFO: SUCCESS!@#KODE 1!@#USER_ID 13!@#ACTIVITY_CODE 1
12/21/2022 02:35:54 PM script INFO: SUCCESS!@#KODE 1!@#USER_ID 13!@#ACTIVITY_CODE 1
12/21/2022 02:35:54 PM script INFO: SUCCESS!@#KODE 1!@#USER_ID 13!@#ACTIVITY_CODE 1
12/21/2022 02:35:54 PM script INFO: SUCCESS!@#KODE 1!@#USER_ID 13!@#ACTIVITY_CODE 3
12/21/2022 02:35:54 PM script INFO: SUCCESS!@#KODE 1!@#USER_ID 13!@#ACTIVITY_CODE 1
12/21/2022 02:35:54 PM script INFO: SUCCESS!@#KODE 1!@#USER_ID 13!@#ACTIVITY_CODE 3
12/21/2022 02:35:55 PM script INFO: SUCCESS!@#KODE 1!@#USER_ID 13!@#ACTIVITY_CODE 2
12/21/2022 02:35:55 PM script INFO: SUCCESS!@#KODE 1!@#USER_ID 13!@#ACTIVITY_CODE 1
12/21/2022 02:35:55 PM script INFO: SUCCESS!@#KODE 1!@#USER_ID 13!@#ACTIVITY_CODE 3
12/21/2022 02:35:55 PM script INFO: SUCCESS!@#KODE 1!@#USER_ID 13!@#ACTIVITY_CODE 3
12/21/2022 02:35:55 PM script INFO: SUCCESS!@#KODE 1!@#USER_ID 13!@#ACTIVITY_CODE 4
12/21/2022 02:35:55 PM script INFO: SUCCESS!@#KODE 1!@#USER_ID 13!@#ACTIVITY_CODE 2
12/21/2022 02:35:55 PM script INFO: SUCCESS!@#KODE 1!@#USER_ID 13!@#ACTIVITY_CODE 2
12/21/2022 02:35:55 PM script INFO: SUCCESS!@#KODE 1!@#USER_ID 13!@#ACTIVITY_CODE 1
12/21/2022 02:35:55 PM script INFO: SUCCESS!@#KODE 1!@#USER_ID 13!@#ACTIVITY_CODE 1
12/21/2022 02:35:55 PM script INFO: SUCCESS!@#KODE 1!@#USER_ID 13!@#ACTIVITY_CODE 1
12/21/2022 02:35:55 PM script INFO: SUCCESS!@#KODE 1!@#USER_ID 13!@#ACTIVITY_CODE 4
12/21/2022 02:35:55 PM script INFO: SUCCESS!@#KODE 1!@#USER_ID 13!@#ACTIVITY_CODE 3
12/21/2022 02:35:56 PM script INFO: SUCCESS!@#KODE 1!@#USER_ID 13!@#ACTIVITY_CODE 2
12/21/2022 02:35:56 PM script INFO: SUCCESS!@#KODE 1!@#USER_ID 13!@#ACTIVITY_CODE 1
12/21/2022 02:35:56 PM script INFO: SUCCESS!@#KODE 1!@#USER_ID 13!@#ACTIVITY_CODE 4
12/21/2022 02:35:56 PM script INFO: SUCCESS!@#KODE 1!@#USER_ID 13!@#ACTIVITY_CODE 3
12/21/2022 02:35:56 PM script INFO: SUCCESS!@#KODE 1!@#USER_ID 13!@#ACTIVITY_CODE 2
12/21/2022 02:35:56 PM script INFO: SUCCESS!@#KODE 1!@#USER_ID 13!@#ACTIVITY_CODE 3
12/21/2022 02:35:56 PM script INFO: SUCCESS!@#KODE 1!@#USER_ID 13!@#ACTIVITY_CODE 3
12/21/2022 02:35:56 PM script INFO: SUCCESS!@#KODE 1!@#USER_ID 13!@#ACTIVITY_CODE 2
12/21/2022 02:35:56 PM script INFO: Duration: 33.48285460472107
12/21/2022 02:35:56 PM script INFO: mengakhiri-quiz
12/21/2022 02:36:09 PM script INFO: SUCCESS!@#KODE 1!@#USER_ID 13!@#ACTIVITY_CODE 5
12/21/2022 02:36:09 PM script INFO: berhasil-submit
