12/21/2022 02:41:06 PM script INFO: Prepared chrome options..
12/21/2022 02:41:07 PM script INFO: Initialized chrome browser..
12/21/2022 02:41:07 PM script INFO: mengakses-homepage
12/21/2022 02:41:40 PM script INFO: mengakses-login-page
12/21/2022 02:41:41 PM script INFO: mengakses-site-home
12/21/2022 02:41:42 PM script INFO: mengakses-site-course
12/21/2022 02:41:57 PM script INFO: mengakses-quiz
12/21/2022 02:42:12 PM script INFO: mengakses-start-quiz-page
12/21/2022 02:42:40 PM script INFO: memulai-quiz
12/21/2022 02:42:40 PM script INFO: SUCCESS!@#KODE 1!@#USER_ID 8!@#ACTIVITY_CODE 5
12/21/2022 02:42:51 PM script INFO: SUCCESS!@#KODE 1!@#USER_ID 8!@#ACTIVITY_CODE 3
12/21/2022 02:42:51 PM script INFO: SUCCESS!@#KODE 1!@#USER_ID 8!@#ACTIVITY_CODE 3
12/21/2022 02:42:51 PM script INFO: SUCCESS!@#KODE 1!@#USER_ID 8!@#ACTIVITY_CODE 2
12/21/2022 02:42:51 PM script INFO: SUCCESS!@#KODE 1!@#USER_ID 8!@#ACTIVITY_CODE 5
12/21/2022 02:42:51 PM script INFO: SUCCESS!@#KODE 1!@#USER_ID 8!@#ACTIVITY_CODE 5
12/21/2022 02:42:54 PM script INFO: SUCCESS!@#KODE 1!@#USER_ID 8!@#ACTIVITY_CODE 1
12/21/2022 02:42:54 PM script INFO: SUCCESS!@#KODE 1!@#USER_ID 8!@#ACTIVITY_CODE 2
12/21/2022 02:42:54 PM script INFO: SUCCESS!@#KODE 1!@#USER_ID 8!@#ACTIVITY_CODE 2
12/21/2022 02:42:54 PM script INFO: SUCCESS!@#KODE 1!@#USER_ID 8!@#ACTIVITY_CODE 1
12/21/2022 02:42:54 PM script INFO: SUCCESS!@#KODE 1!@#USER_ID 8!@#ACTIVITY_CODE 1
12/21/2022 02:42:55 PM script INFO: SUCCESS!@#KODE 1!@#USER_ID 8!@#ACTIVITY_CODE 2
12/21/2022 02:42:55 PM script INFO: SUCCESS!@#KODE 1!@#USER_ID 8!@#ACTIVITY_CODE 1
12/21/2022 02:42:55 PM script INFO: SUCCESS!@#KODE 1!@#USER_ID 8!@#ACTIVITY_CODE 3
12/21/2022 02:42:55 PM script INFO: SUCCESS!@#KODE 1!@#USER_ID 8!@#ACTIVITY_CODE 3
12/21/2022 02:42:55 PM script INFO: SUCCESS!@#KODE 1!@#USER_ID 8!@#ACTIVITY_CODE 1
12/21/2022 02:42:55 PM script INFO: SUCCESS!@#KODE 1!@#USER_ID 8!@#ACTIVITY_CODE 1
12/21/2022 02:42:55 PM script INFO: SUCCESS!@#KODE 1!@#USER_ID 8!@#ACTIVITY_CODE 1
12/21/2022 02:42:55 PM script INFO: SUCCESS!@#KODE 1!@#USER_ID 8!@#ACTIVITY_CODE 5
12/21/2022 02:42:55 PM script INFO: SUCCESS!@#KODE 1!@#USER_ID 8!@#ACTIVITY_CODE 5
12/21/2022 02:42:58 PM script INFO: SUCCESS!@#KODE 1!@#USER_ID 8!@#ACTIVITY_CODE 2
12/21/2022 02:42:58 PM script INFO: SUCCESS!@#KODE 1!@#USER_ID 8!@#ACTIVITY_CODE 1
12/21/2022 02:42:58 PM script INFO: SUCCESS!@#KODE 1!@#USER_ID 8!@#ACTIVITY_CODE 1
12/21/2022 02:42:58 PM script INFO: SUCCESS!@#KODE 1!@#USER_ID 8!@#ACTIVITY_CODE 3
12/21/2022 02:42:58 PM script INFO: SUCCESS!@#KODE 1!@#USER_ID 8!@#ACTIVITY_CODE 2
12/21/2022 02:42:58 PM script INFO: SUCCESS!@#KODE 1!@#USER_ID 8!@#ACTIVITY_CODE 2
12/21/2022 02:42:59 PM script INFO: SUCCESS!@#KODE 1!@#USER_ID 8!@#ACTIVITY_CODE 2
12/21/2022 02:42:59 PM script INFO: SUCCESS!@#KODE 1!@#USER_ID 8!@#ACTIVITY_CODE 4
12/21/2022 02:42:59 PM script INFO: SUCCESS!@#KODE 1!@#USER_ID 8!@#ACTIVITY_CODE 1
12/21/2022 02:42:59 PM script INFO: SUCCESS!@#KODE 1!@#USER_ID 8!@#ACTIVITY_CODE 3
12/21/2022 02:42:59 PM script INFO: SUCCESS!@#KODE 1!@#USER_ID 8!@#ACTIVITY_CODE 2
12/21/2022 02:42:59 PM script INFO: SUCCESS!@#KODE 1!@#USER_ID 8!@#ACTIVITY_CODE 5
12/21/2022 02:42:59 PM script INFO: SUCCESS!@#KODE 1!@#USER_ID 8!@#ACTIVITY_CODE 5
12/21/2022 02:43:02 PM script INFO: SUCCESS!@#KODE 1!@#USER_ID 8!@#ACTIVITY_CODE 1
12/21/2022 02:43:02 PM script INFO: SUCCESS!@#KODE 1!@#USER_ID 8!@#ACTIVITY_CODE 4
12/21/2022 02:43:02 PM script INFO: SUCCESS!@#KODE 1!@#USER_ID 8!@#ACTIVITY_CODE 2
12/21/2022 02:43:02 PM script INFO: SUCCESS!@#KODE 1!@#USER_ID 8!@#ACTIVITY_CODE 5
12/21/2022 02:43:02 PM script INFO: SUCCESS!@#KODE 1!@#USER_ID 8!@#ACTIVITY_CODE 5
12/21/2022 02:43:05 PM script INFO: SUCCESS!@#KODE 1!@#USER_ID 8!@#ACTIVITY_CODE 1
12/21/2022 02:43:05 PM script INFO: SUCCESS!@#KODE 1!@#USER_ID 8!@#ACTIVITY_CODE 3
12/21/2022 02:43:05 PM script INFO: SUCCESS!@#KODE 1!@#USER_ID 8!@#ACTIVITY_CODE 5
12/21/2022 02:43:05 PM script INFO: SUCCESS!@#KODE 1!@#USER_ID 8!@#ACTIVITY_CODE 5
12/21/2022 02:43:07 PM script INFO: SUCCESS!@#KODE 1!@#USER_ID 8!@#ACTIVITY_CODE 1
12/21/2022 02:43:07 PM script INFO: SUCCESS!@#KODE 1!@#USER_ID 8!@#ACTIVITY_CODE 3
12/21/2022 02:43:07 PM script INFO: SUCCESS!@#KODE 1!@#USER_ID 8!@#ACTIVITY_CODE 5
12/21/2022 02:43:07 PM script INFO: SUCCESS!@#KODE 1!@#USER_ID 8!@#ACTIVITY_CODE 5
12/21/2022 02:43:10 PM script INFO: SUCCESS!@#KODE 1!@#USER_ID 8!@#ACTIVITY_CODE 2
12/21/2022 02:43:10 PM script INFO: SUCCESS!@#KODE 1!@#USER_ID 8!@#ACTIVITY_CODE 5
12/21/2022 02:43:10 PM script INFO: SUCCESS!@#KODE 1!@#USER_ID 8!@#ACTIVITY_CODE 5
12/21/2022 02:43:13 PM script INFO: SUCCESS!@#KODE 1!@#USER_ID 8!@#ACTIVITY_CODE 2
12/21/2022 02:43:13 PM script INFO: SUCCESS!@#KODE 1!@#USER_ID 8!@#ACTIVITY_CODE 2
12/21/2022 02:43:13 PM script INFO: SUCCESS!@#KODE 1!@#USER_ID 8!@#ACTIVITY_CODE 1
12/21/2022 02:43:13 PM script INFO: SUCCESS!@#KODE 1!@#USER_ID 8!@#ACTIVITY_CODE 3
12/21/2022 02:43:13 PM script INFO: SUCCESS!@#KODE 1!@#USER_ID 8!@#ACTIVITY_CODE 2
12/21/2022 02:43:13 PM script INFO: SUCCESS!@#KODE 1!@#USER_ID 8!@#ACTIVITY_CODE 5
12/21/2022 02:43:13 PM script INFO: SUCCESS!@#KODE 1!@#USER_ID 8!@#ACTIVITY_CODE 5
12/21/2022 02:43:16 PM script INFO: SUCCESS!@#KODE 1!@#USER_ID 8!@#ACTIVITY_CODE 2
12/21/2022 02:43:16 PM script INFO: SUCCESS!@#KODE 1!@#USER_ID 8!@#ACTIVITY_CODE 1
12/21/2022 02:43:16 PM script INFO: SUCCESS!@#KODE 1!@#USER_ID 8!@#ACTIVITY_CODE 2
12/21/2022 02:43:16 PM script INFO: SUCCESS!@#KODE 1!@#USER_ID 8!@#ACTIVITY_CODE 3
12/21/2022 02:43:16 PM script INFO: SUCCESS!@#KODE 1!@#USER_ID 8!@#ACTIVITY_CODE 4
12/21/2022 02:43:16 PM script INFO: SUCCESS!@#KODE 1!@#USER_ID 8!@#ACTIVITY_CODE 1
12/21/2022 02:43:16 PM script INFO: SUCCESS!@#KODE 1!@#USER_ID 8!@#ACTIVITY_CODE 5
12/21/2022 02:43:16 PM script INFO: SUCCESS!@#KODE 1!@#USER_ID 8!@#ACTIVITY_CODE 5
12/21/2022 02:43:19 PM script INFO: SUCCESS!@#KODE 1!@#USER_ID 8!@#ACTIVITY_CODE 4
12/21/2022 02:43:19 PM script INFO: SUCCESS!@#KODE 1!@#USER_ID 8!@#ACTIVITY_CODE 3
12/21/2022 02:43:19 PM script INFO: SUCCESS!@#KODE 1!@#USER_ID 8!@#ACTIVITY_CODE 1
12/21/2022 02:43:19 PM script INFO: SUCCESS!@#KODE 1!@#USER_ID 8!@#ACTIVITY_CODE 1
12/21/2022 02:43:19 PM script INFO: SUCCESS!@#KODE 1!@#USER_ID 8!@#ACTIVITY_CODE 5
12/21/2022 02:43:19 PM script INFO: SUCCESS!@#KODE 1!@#USER_ID 8!@#ACTIVITY_CODE 5
12/21/2022 02:43:21 PM script INFO: SUCCESS!@#KODE 1!@#USER_ID 8!@#ACTIVITY_CODE 5
12/21/2022 02:43:21 PM script INFO: SUCCESS!@#KODE 1!@#USER_ID 8!@#ACTIVITY_CODE 5
12/21/2022 02:43:24 PM script INFO: SUCCESS!@#KODE 1!@#USER_ID 8!@#ACTIVITY_CODE 5
12/21/2022 02:43:24 PM script INFO: SUCCESS!@#KODE 1!@#USER_ID 8!@#ACTIVITY_CODE 5
12/21/2022 02:43:26 PM script INFO: SUCCESS!@#KODE 1!@#USER_ID 8!@#ACTIVITY_CODE 2
12/21/2022 02:43:26 PM script INFO: SUCCESS!@#KODE 1!@#USER_ID 8!@#ACTIVITY_CODE 1
12/21/2022 02:43:26 PM script INFO: SUCCESS!@#KODE 1!@#USER_ID 8!@#ACTIVITY_CODE 5
12/21/2022 02:43:26 PM script INFO: SUCCESS!@#KODE 1!@#USER_ID 8!@#ACTIVITY_CODE 5
12/21/2022 02:43:29 PM script INFO: SUCCESS!@#KODE 1!@#USER_ID 8!@#ACTIVITY_CODE 2
12/21/2022 02:43:29 PM script INFO: SUCCESS!@#KODE 1!@#USER_ID 8!@#ACTIVITY_CODE 4
12/21/2022 02:43:29 PM script INFO: SUCCESS!@#KODE 1!@#USER_ID 8!@#ACTIVITY_CODE 2
12/21/2022 02:43:29 PM script INFO: SUCCESS!@#KODE 1!@#USER_ID 8!@#ACTIVITY_CODE 3
12/21/2022 02:43:29 PM script INFO: SUCCESS!@#KODE 1!@#USER_ID 8!@#ACTIVITY_CODE 3
12/21/2022 02:43:29 PM script INFO: SUCCESS!@#KODE 1!@#USER_ID 8!@#ACTIVITY_CODE 2
12/21/2022 02:43:30 PM script INFO: SUCCESS!@#KODE 1!@#USER_ID 8!@#ACTIVITY_CODE 2
12/21/2022 02:43:30 PM script INFO: SUCCESS!@#KODE 1!@#USER_ID 8!@#ACTIVITY_CODE 3
12/21/2022 02:43:30 PM script INFO: SUCCESS!@#KODE 1!@#USER_ID 8!@#ACTIVITY_CODE 1
12/21/2022 02:43:30 PM script INFO: SUCCESS!@#KODE 1!@#USER_ID 8!@#ACTIVITY_CODE 2
12/21/2022 02:43:30 PM script INFO: SUCCESS!@#KODE 1!@#USER_ID 8!@#ACTIVITY_CODE 5
12/21/2022 02:43:30 PM script INFO: SUCCESS!@#KODE 1!@#USER_ID 8!@#ACTIVITY_CODE 5
12/21/2022 02:43:32 PM script INFO: SUCCESS!@#KODE 1!@#USER_ID 8!@#ACTIVITY_CODE 5
12/21/2022 02:43:32 PM script INFO: SUCCESS!@#KODE 1!@#USER_ID 8!@#ACTIVITY_CODE 5
12/21/2022 02:43:35 PM script INFO: SUCCESS!@#KODE 1!@#USER_ID 8!@#ACTIVITY_CODE 3
12/21/2022 02:43:35 PM script INFO: SUCCESS!@#KODE 1!@#USER_ID 8!@#ACTIVITY_CODE 5
12/21/2022 02:43:35 PM script INFO: SUCCESS!@#KODE 1!@#USER_ID 8!@#ACTIVITY_CODE 5
12/21/2022 02:43:37 PM script INFO: SUCCESS!@#KODE 1!@#USER_ID 8!@#ACTIVITY_CODE 1
12/21/2022 02:43:37 PM script INFO: SUCCESS!@#KODE 1!@#USER_ID 8!@#ACTIVITY_CODE 3
12/21/2022 02:43:37 PM script INFO: SUCCESS!@#KODE 1!@#USER_ID 8!@#ACTIVITY_CODE 4
12/21/2022 02:43:38 PM script INFO: SUCCESS!@#KODE 1!@#USER_ID 8!@#ACTIVITY_CODE 3
12/21/2022 02:43:38 PM script INFO: SUCCESS!@#KODE 1!@#USER_ID 8!@#ACTIVITY_CODE 1
12/21/2022 02:43:38 PM script INFO: SUCCESS!@#KODE 1!@#USER_ID 8!@#ACTIVITY_CODE 1
12/21/2022 02:43:38 PM script INFO: SUCCESS!@#KODE 1!@#USER_ID 8!@#ACTIVITY_CODE 4
12/21/2022 02:43:38 PM script INFO: SUCCESS!@#KODE 1!@#USER_ID 8!@#ACTIVITY_CODE 3
12/21/2022 02:43:38 PM script INFO: SUCCESS!@#KODE 1!@#USER_ID 8!@#ACTIVITY_CODE 1
12/21/2022 02:43:38 PM script INFO: SUCCESS!@#KODE 1!@#USER_ID 8!@#ACTIVITY_CODE 4
12/21/2022 02:43:38 PM script INFO: SUCCESS!@#KODE 1!@#USER_ID 8!@#ACTIVITY_CODE 1
12/21/2022 02:43:38 PM script INFO: SUCCESS!@#KODE 1!@#USER_ID 8!@#ACTIVITY_CODE 3
12/21/2022 02:43:38 PM script INFO: SUCCESS!@#KODE 1!@#USER_ID 8!@#ACTIVITY_CODE 2
12/21/2022 02:43:38 PM script INFO: SUCCESS!@#KODE 1!@#USER_ID 8!@#ACTIVITY_CODE 4
12/21/2022 02:43:38 PM script INFO: SUCCESS!@#KODE 1!@#USER_ID 8!@#ACTIVITY_CODE 3
12/21/2022 02:43:38 PM script INFO: SUCCESS!@#KODE 1!@#USER_ID 8!@#ACTIVITY_CODE 2
12/21/2022 02:43:38 PM script INFO: SUCCESS!@#KODE 1!@#USER_ID 8!@#ACTIVITY_CODE 4
12/21/2022 02:43:38 PM script INFO: SUCCESS!@#KODE 1!@#USER_ID 8!@#ACTIVITY_CODE 1
12/21/2022 02:43:38 PM script INFO: SUCCESS!@#KODE 1!@#USER_ID 8!@#ACTIVITY_CODE 3
12/21/2022 02:43:39 PM script INFO: SUCCESS!@#KODE 1!@#USER_ID 8!@#ACTIVITY_CODE 4
12/21/2022 02:43:39 PM script INFO: SUCCESS!@#KODE 1!@#USER_ID 8!@#ACTIVITY_CODE 3
12/21/2022 02:43:39 PM script INFO: SUCCESS!@#KODE 1!@#USER_ID 8!@#ACTIVITY_CODE 2
12/21/2022 02:43:39 PM script INFO: SUCCESS!@#KODE 1!@#USER_ID 8!@#ACTIVITY_CODE 1
12/21/2022 02:43:39 PM script INFO: SUCCESS!@#KODE 1!@#USER_ID 8!@#ACTIVITY_CODE 2
12/21/2022 02:43:39 PM script INFO: SUCCESS!@#KODE 1!@#USER_ID 8!@#ACTIVITY_CODE 2
12/21/2022 02:43:39 PM script INFO: SUCCESS!@#KODE 1!@#USER_ID 8!@#ACTIVITY_CODE 1
12/21/2022 02:43:39 PM script INFO: SUCCESS!@#KODE 1!@#USER_ID 8!@#ACTIVITY_CODE 2
12/21/2022 02:43:39 PM script INFO: SUCCESS!@#KODE 1!@#USER_ID 8!@#ACTIVITY_CODE 3
12/21/2022 02:43:39 PM script INFO: SUCCESS!@#KODE 1!@#USER_ID 8!@#ACTIVITY_CODE 2
12/21/2022 02:43:39 PM script INFO: SUCCESS!@#KODE 1!@#USER_ID 8!@#ACTIVITY_CODE 3
12/21/2022 02:43:39 PM script INFO: SUCCESS!@#KODE 1!@#USER_ID 8!@#ACTIVITY_CODE 3
12/21/2022 02:43:39 PM script INFO: SUCCESS!@#KODE 1!@#USER_ID 8!@#ACTIVITY_CODE 1
12/21/2022 02:43:39 PM script INFO: SUCCESS!@#KODE 1!@#USER_ID 8!@#ACTIVITY_CODE 1
12/21/2022 02:43:40 PM script INFO: SUCCESS!@#KODE 1!@#USER_ID 8!@#ACTIVITY_CODE 2
12/21/2022 02:43:40 PM script INFO: SUCCESS!@#KODE 1!@#USER_ID 8!@#ACTIVITY_CODE 3
12/21/2022 02:43:40 PM script INFO: SUCCESS!@#KODE 1!@#USER_ID 8!@#ACTIVITY_CODE 4
12/21/2022 02:43:40 PM script INFO: SUCCESS!@#KODE 1!@#USER_ID 8!@#ACTIVITY_CODE 1
12/21/2022 02:43:40 PM script INFO: SUCCESS!@#KODE 1!@#USER_ID 8!@#ACTIVITY_CODE 3
12/21/2022 02:43:40 PM script INFO: SUCCESS!@#KODE 1!@#USER_ID 8!@#ACTIVITY_CODE 2
12/21/2022 02:43:40 PM script INFO: SUCCESS!@#KODE 1!@#USER_ID 8!@#ACTIVITY_CODE 1
12/21/2022 02:43:40 PM script INFO: SUCCESS!@#KODE 1!@#USER_ID 8!@#ACTIVITY_CODE 3
12/21/2022 02:43:40 PM script INFO: SUCCESS!@#KODE 1!@#USER_ID 8!@#ACTIVITY_CODE 3
12/21/2022 02:43:40 PM script INFO: SUCCESS!@#KODE 1!@#USER_ID 8!@#ACTIVITY_CODE 3
12/21/2022 02:43:40 PM script INFO: SUCCESS!@#KODE 1!@#USER_ID 8!@#ACTIVITY_CODE 4
12/21/2022 02:43:40 PM script INFO: SUCCESS!@#KODE 1!@#USER_ID 8!@#ACTIVITY_CODE 3
12/21/2022 02:43:40 PM script INFO: SUCCESS!@#KODE 1!@#USER_ID 8!@#ACTIVITY_CODE 3
12/21/2022 02:43:40 PM script INFO: SUCCESS!@#KODE 1!@#USER_ID 8!@#ACTIVITY_CODE 3
12/21/2022 02:43:40 PM script INFO: SUCCESS!@#KODE 1!@#USER_ID 8!@#ACTIVITY_CODE 1
12/21/2022 02:43:40 PM script INFO: SUCCESS!@#KODE 1!@#USER_ID 8!@#ACTIVITY_CODE 2
12/21/2022 02:43:40 PM script INFO: SUCCESS!@#KODE 1!@#USER_ID 8!@#ACTIVITY_CODE 3
12/21/2022 02:43:40 PM script INFO: SUCCESS!@#KODE 1!@#USER_ID 8!@#ACTIVITY_CODE 3
12/21/2022 02:43:41 PM script INFO: SUCCESS!@#KODE 1!@#USER_ID 8!@#ACTIVITY_CODE 1
12/21/2022 02:43:41 PM script INFO: SUCCESS!@#KODE 1!@#USER_ID 8!@#ACTIVITY_CODE 2
12/21/2022 02:43:41 PM script INFO: SUCCESS!@#KODE 1!@#USER_ID 8!@#ACTIVITY_CODE 3
12/21/2022 02:43:41 PM script INFO: SUCCESS!@#KODE 1!@#USER_ID 8!@#ACTIVITY_CODE 3
12/21/2022 02:43:41 PM script INFO: SUCCESS!@#KODE 1!@#USER_ID 8!@#ACTIVITY_CODE 4
12/21/2022 02:43:41 PM script INFO: SUCCESS!@#KODE 1!@#USER_ID 8!@#ACTIVITY_CODE 3
12/21/2022 02:43:41 PM script INFO: SUCCESS!@#KODE 1!@#USER_ID 8!@#ACTIVITY_CODE 2
12/21/2022 02:43:41 PM script INFO: SUCCESS!@#KODE 1!@#USER_ID 8!@#ACTIVITY_CODE 2
12/21/2022 02:43:41 PM script INFO: SUCCESS!@#KODE 1!@#USER_ID 8!@#ACTIVITY_CODE 3
12/21/2022 02:43:41 PM script INFO: SUCCESS!@#KODE 1!@#USER_ID 8!@#ACTIVITY_CODE 3
12/21/2022 02:43:41 PM script INFO: SUCCESS!@#KODE 1!@#USER_ID 8!@#ACTIVITY_CODE 1
12/21/2022 02:43:41 PM script INFO: SUCCESS!@#KODE 1!@#USER_ID 8!@#ACTIVITY_CODE 4
12/21/2022 02:43:41 PM script INFO: SUCCESS!@#KODE 1!@#USER_ID 8!@#ACTIVITY_CODE 3
12/21/2022 02:43:41 PM script INFO: SUCCESS!@#KODE 1!@#USER_ID 8!@#ACTIVITY_CODE 3
12/21/2022 02:43:41 PM script INFO: SUCCESS!@#KODE 1!@#USER_ID 8!@#ACTIVITY_CODE 1
12/21/2022 02:43:41 PM script INFO: SUCCESS!@#KODE 1!@#USER_ID 8!@#ACTIVITY_CODE 3
12/21/2022 02:43:41 PM script INFO: SUCCESS!@#KODE 1!@#USER_ID 8!@#ACTIVITY_CODE 1
12/21/2022 02:43:41 PM script INFO: SUCCESS!@#KODE 1!@#USER_ID 8!@#ACTIVITY_CODE 1
12/21/2022 02:43:42 PM script INFO: SUCCESS!@#KODE 1!@#USER_ID 8!@#ACTIVITY_CODE 2
12/21/2022 02:43:42 PM script INFO: SUCCESS!@#KODE 1!@#USER_ID 8!@#ACTIVITY_CODE 3
12/21/2022 02:43:42 PM script INFO: SUCCESS!@#KODE 1!@#USER_ID 8!@#ACTIVITY_CODE 2
12/21/2022 02:43:42 PM script INFO: SUCCESS!@#KODE 1!@#USER_ID 8!@#ACTIVITY_CODE 2
12/21/2022 02:43:42 PM script INFO: SUCCESS!@#KODE 1!@#USER_ID 8!@#ACTIVITY_CODE 4
12/21/2022 02:43:42 PM script INFO: SUCCESS!@#KODE 1!@#USER_ID 8!@#ACTIVITY_CODE 1
12/21/2022 02:43:42 PM script INFO: SUCCESS!@#KODE 1!@#USER_ID 8!@#ACTIVITY_CODE 2
12/21/2022 02:43:42 PM script INFO: SUCCESS!@#KODE 1!@#USER_ID 8!@#ACTIVITY_CODE 3
12/21/2022 02:43:42 PM script INFO: SUCCESS!@#KODE 1!@#USER_ID 8!@#ACTIVITY_CODE 3
12/21/2022 02:43:42 PM script INFO: SUCCESS!@#KODE 1!@#USER_ID 8!@#ACTIVITY_CODE 2
12/21/2022 02:43:42 PM script INFO: SUCCESS!@#KODE 1!@#USER_ID 8!@#ACTIVITY_CODE 2
12/21/2022 02:43:42 PM script INFO: SUCCESS!@#KODE 1!@#USER_ID 8!@#ACTIVITY_CODE 3
12/21/2022 02:43:43 PM script INFO: SUCCESS!@#KODE 1!@#USER_ID 8!@#ACTIVITY_CODE 2
12/21/2022 02:43:43 PM script INFO: SUCCESS!@#KODE 1!@#USER_ID 8!@#ACTIVITY_CODE 2
12/21/2022 02:43:43 PM script INFO: SUCCESS!@#KODE 1!@#USER_ID 8!@#ACTIVITY_CODE 3
12/21/2022 02:43:43 PM script INFO: SUCCESS!@#KODE 1!@#USER_ID 8!@#ACTIVITY_CODE 3
12/21/2022 02:43:43 PM script INFO: SUCCESS!@#KODE 1!@#USER_ID 8!@#ACTIVITY_CODE 3
12/21/2022 02:43:43 PM script INFO: SUCCESS!@#KODE 1!@#USER_ID 8!@#ACTIVITY_CODE 4
12/21/2022 02:43:43 PM script INFO: SUCCESS!@#KODE 1!@#USER_ID 8!@#ACTIVITY_CODE 2
12/21/2022 02:43:43 PM script INFO: SUCCESS!@#KODE 1!@#USER_ID 8!@#ACTIVITY_CODE 1
12/21/2022 02:43:43 PM script INFO: SUCCESS!@#KODE 1!@#USER_ID 8!@#ACTIVITY_CODE 1
12/21/2022 02:43:43 PM script INFO: SUCCESS!@#KODE 1!@#USER_ID 8!@#ACTIVITY_CODE 2
12/21/2022 02:43:43 PM script INFO: SUCCESS!@#KODE 1!@#USER_ID 8!@#ACTIVITY_CODE 4
12/21/2022 02:43:43 PM script INFO: SUCCESS!@#KODE 1!@#USER_ID 8!@#ACTIVITY_CODE 1
12/21/2022 02:43:43 PM script INFO: SUCCESS!@#KODE 1!@#USER_ID 8!@#ACTIVITY_CODE 2
12/21/2022 02:43:43 PM script INFO: SUCCESS!@#KODE 1!@#USER_ID 8!@#ACTIVITY_CODE 2
12/21/2022 02:43:44 PM script INFO: SUCCESS!@#KODE 1!@#USER_ID 8!@#ACTIVITY_CODE 2
12/21/2022 02:43:44 PM script INFO: SUCCESS!@#KODE 1!@#USER_ID 8!@#ACTIVITY_CODE 1
12/21/2022 02:43:44 PM script INFO: SUCCESS!@#KODE 1!@#USER_ID 8!@#ACTIVITY_CODE 4
12/21/2022 02:43:44 PM script INFO: SUCCESS!@#KODE 1!@#USER_ID 8!@#ACTIVITY_CODE 3
12/21/2022 02:43:44 PM script INFO: SUCCESS!@#KODE 1!@#USER_ID 8!@#ACTIVITY_CODE 3
12/21/2022 02:43:44 PM script INFO: SUCCESS!@#KODE 1!@#USER_ID 8!@#ACTIVITY_CODE 3
12/21/2022 02:43:44 PM script INFO: SUCCESS!@#KODE 1!@#USER_ID 8!@#ACTIVITY_CODE 2
12/21/2022 02:43:44 PM script INFO: SUCCESS!@#KODE 1!@#USER_ID 8!@#ACTIVITY_CODE 3
12/21/2022 02:43:44 PM script INFO: SUCCESS!@#KODE 1!@#USER_ID 8!@#ACTIVITY_CODE 2
12/21/2022 02:43:44 PM script INFO: SUCCESS!@#KODE 1!@#USER_ID 8!@#ACTIVITY_CODE 3
12/21/2022 02:43:44 PM script INFO: SUCCESS!@#KODE 1!@#USER_ID 8!@#ACTIVITY_CODE 2
12/21/2022 02:43:44 PM script INFO: SUCCESS!@#KODE 1!@#USER_ID 8!@#ACTIVITY_CODE 1
12/21/2022 02:43:44 PM script INFO: SUCCESS!@#KODE 1!@#USER_ID 8!@#ACTIVITY_CODE 4
12/21/2022 02:43:44 PM script INFO: SUCCESS!@#KODE 1!@#USER_ID 8!@#ACTIVITY_CODE 2
12/21/2022 02:43:44 PM script INFO: SUCCESS!@#KODE 1!@#USER_ID 8!@#ACTIVITY_CODE 2
12/21/2022 02:43:45 PM script INFO: SUCCESS!@#KODE 1!@#USER_ID 8!@#ACTIVITY_CODE 3
12/21/2022 02:43:45 PM script INFO: SUCCESS!@#KODE 1!@#USER_ID 8!@#ACTIVITY_CODE 1
12/21/2022 02:43:45 PM script INFO: SUCCESS!@#KODE 1!@#USER_ID 8!@#ACTIVITY_CODE 3
12/21/2022 02:43:45 PM script INFO: SUCCESS!@#KODE 1!@#USER_ID 8!@#ACTIVITY_CODE 4
12/21/2022 02:43:45 PM script INFO: SUCCESS!@#KODE 1!@#USER_ID 8!@#ACTIVITY_CODE 2
12/21/2022 02:43:45 PM script INFO: SUCCESS!@#KODE 1!@#USER_ID 8!@#ACTIVITY_CODE 1
12/21/2022 02:43:45 PM script INFO: SUCCESS!@#KODE 1!@#USER_ID 8!@#ACTIVITY_CODE 3
12/21/2022 02:43:45 PM script INFO: SUCCESS!@#KODE 1!@#USER_ID 8!@#ACTIVITY_CODE 1
12/21/2022 02:43:45 PM script INFO: SUCCESS!@#KODE 1!@#USER_ID 8!@#ACTIVITY_CODE 2
12/21/2022 02:43:45 PM script INFO: SUCCESS!@#KODE 1!@#USER_ID 8!@#ACTIVITY_CODE 2
12/21/2022 02:43:45 PM script INFO: SUCCESS!@#KODE 1!@#USER_ID 8!@#ACTIVITY_CODE 2
12/21/2022 02:43:45 PM script INFO: SUCCESS!@#KODE 1!@#USER_ID 8!@#ACTIVITY_CODE 3
12/21/2022 02:43:45 PM script INFO: SUCCESS!@#KODE 1!@#USER_ID 8!@#ACTIVITY_CODE 1
12/21/2022 02:43:45 PM script INFO: SUCCESS!@#KODE 1!@#USER_ID 8!@#ACTIVITY_CODE 4
12/21/2022 02:43:45 PM script INFO: SUCCESS!@#KODE 1!@#USER_ID 8!@#ACTIVITY_CODE 1
12/21/2022 02:43:45 PM script INFO: SUCCESS!@#KODE 1!@#USER_ID 8!@#ACTIVITY_CODE 1
12/21/2022 02:43:45 PM script INFO: SUCCESS!@#KODE 1!@#USER_ID 8!@#ACTIVITY_CODE 4
12/21/2022 02:43:45 PM script INFO: SUCCESS!@#KODE 1!@#USER_ID 8!@#ACTIVITY_CODE 3
12/21/2022 02:43:46 PM script INFO: SUCCESS!@#KODE 1!@#USER_ID 8!@#ACTIVITY_CODE 2
12/21/2022 02:43:46 PM script INFO: SUCCESS!@#KODE 1!@#USER_ID 8!@#ACTIVITY_CODE 3
12/21/2022 02:43:46 PM script INFO: SUCCESS!@#KODE 1!@#USER_ID 8!@#ACTIVITY_CODE 1
12/21/2022 02:43:46 PM script INFO: SUCCESS!@#KODE 1!@#USER_ID 8!@#ACTIVITY_CODE 1
12/21/2022 02:43:46 PM script INFO: SUCCESS!@#KODE 1!@#USER_ID 8!@#ACTIVITY_CODE 1
12/21/2022 02:43:46 PM script INFO: SUCCESS!@#KODE 1!@#USER_ID 8!@#ACTIVITY_CODE 1
12/21/2022 02:43:46 PM script INFO: SUCCESS!@#KODE 1!@#USER_ID 8!@#ACTIVITY_CODE 2
12/21/2022 02:43:46 PM script INFO: SUCCESS!@#KODE 1!@#USER_ID 8!@#ACTIVITY_CODE 3
12/21/2022 02:43:46 PM script INFO: SUCCESS!@#KODE 1!@#USER_ID 8!@#ACTIVITY_CODE 1
12/21/2022 02:43:46 PM script INFO: SUCCESS!@#KODE 1!@#USER_ID 8!@#ACTIVITY_CODE 4
12/21/2022 02:43:46 PM script INFO: SUCCESS!@#KODE 1!@#USER_ID 8!@#ACTIVITY_CODE 2
12/21/2022 02:43:46 PM script INFO: SUCCESS!@#KODE 1!@#USER_ID 8!@#ACTIVITY_CODE 1
12/21/2022 02:43:46 PM script INFO: SUCCESS!@#KODE 1!@#USER_ID 8!@#ACTIVITY_CODE 1
12/21/2022 02:43:46 PM script INFO: SUCCESS!@#KODE 1!@#USER_ID 8!@#ACTIVITY_CODE 1
12/21/2022 02:43:46 PM script INFO: SUCCESS!@#KODE 1!@#USER_ID 8!@#ACTIVITY_CODE 2
12/21/2022 02:43:46 PM script INFO: SUCCESS!@#KODE 1!@#USER_ID 8!@#ACTIVITY_CODE 2
12/21/2022 02:43:46 PM script INFO: SUCCESS!@#KODE 1!@#USER_ID 8!@#ACTIVITY_CODE 1
12/21/2022 02:43:46 PM script INFO: SUCCESS!@#KODE 1!@#USER_ID 8!@#ACTIVITY_CODE 2
12/21/2022 02:43:46 PM script INFO: SUCCESS!@#KODE 1!@#USER_ID 8!@#ACTIVITY_CODE 1
12/21/2022 02:43:47 PM script INFO: SUCCESS!@#KODE 1!@#USER_ID 8!@#ACTIVITY_CODE 2
12/21/2022 02:43:47 PM script INFO: SUCCESS!@#KODE 1!@#USER_ID 8!@#ACTIVITY_CODE 3
12/21/2022 02:43:47 PM script INFO: SUCCESS!@#KODE 1!@#USER_ID 8!@#ACTIVITY_CODE 3
12/21/2022 02:43:47 PM script INFO: SUCCESS!@#KODE 1!@#USER_ID 8!@#ACTIVITY_CODE 1
12/21/2022 02:43:47 PM script INFO: SUCCESS!@#KODE 1!@#USER_ID 8!@#ACTIVITY_CODE 2
12/21/2022 02:43:47 PM script INFO: SUCCESS!@#KODE 1!@#USER_ID 8!@#ACTIVITY_CODE 1
12/21/2022 02:43:47 PM script INFO: SUCCESS!@#KODE 1!@#USER_ID 8!@#ACTIVITY_CODE 1
12/21/2022 02:43:47 PM script INFO: Duration: 56.433807373046875
12/21/2022 02:43:47 PM script INFO: mengakhiri-quiz
12/21/2022 02:43:47 PM script INFO: SUCCESS!@#KODE 1!@#USER_ID 8!@#ACTIVITY_CODE 5
12/21/2022 02:43:47 PM script INFO: berhasil-submit
