12/10/2022 09:12:07 AM script INFO: Prepared chrome options..
12/10/2022 09:12:10 AM script INFO: Initialized chrome browser..
12/10/2022 09:12:10 AM script INFO: mengakses-homepage
12/10/2022 09:12:50 AM script INFO: mengakses-login-page
12/10/2022 09:13:20 AM script INFO: mengakses-site-home
12/10/2022 09:13:21 AM main_worker ERROR: Message: element click intercepted: Element <a class="list-group-item list-group-item-action  " href="http://34.70.248.228/?redirect=0" data-key="home" data-isexpandable="0" data-indent="0" data-showdivider="0" data-type="70" data-nodetype="0" data-collapse="0" data-forceopen="0" data-isactive="0" data-hidden="0" data-preceedwithhr="0" data-parent-key="myhome">...</a> is not clickable at point (142, 141). Other element would receive the click: <div class="yui3-widget-mask" style="position: fixed; width: 100%; height: 100%; top: 0px; left: 0px; z-index: 1041;"></div>
  (Session info: headless chrome=107.0.5304.87)
Stacktrace:
#0 0x55ad1b5b5463 <unknown>
#1 0x55ad1b3798d8 <unknown>
#2 0x55ad1b3bf23b <unknown>
#3 0x55ad1b3bca79 <unknown>
#4 0x55ad1b3b9fe4 <unknown>
#5 0x55ad1b3b8b21 <unknown>
#6 0x55ad1b3ab421 <unknown>
#7 0x55ad1b3d8622 <unknown>
#8 0x55ad1b3aaba7 <unknown>
#9 0x55ad1b3d878e <unknown>
#10 0x55ad1b3f130f <unknown>
#11 0x55ad1b3d8443 <unknown>
#12 0x55ad1b3a93c5 <unknown>
#13 0x55ad1b3aa531 <unknown>
#14 0x55ad1b607dce <unknown>
#15 0x55ad1b60b192 <unknown>
#16 0x55ad1b5ec93e <unknown>
#17 0x55ad1b60c103 <unknown>
#18 0x55ad1b5dfd85 <unknown>
#19 0x55ad1b62d0a8 <unknown>
#20 0x55ad1b62d239 <unknown>
#21 0x55ad1b648492 <unknown>
#22 0x7f76490c7609 start_thread

