12/21/2022 01:28:08 PM script INFO: Prepared chrome options..
12/21/2022 01:28:09 PM script INFO: Initialized chrome browser..
12/21/2022 01:28:09 PM script INFO: mengakses-homepage
12/21/2022 01:28:55 PM script INFO: mengakses-login-page
12/21/2022 01:29:19 PM script INFO: mengakses-site-home
12/21/2022 01:29:22 PM script INFO: mengakses-site-course
12/21/2022 01:29:48 PM script INFO: mengakses-quiz
12/21/2022 01:29:49 PM script INFO: mengakses-start-quiz-page
12/21/2022 01:29:50 PM script INFO: memulai-quiz
12/21/2022 01:29:50 PM script INFO: SUCCESS!@#KODE 1!@#USER_ID 87!@#ACTIVITY_CODE 5
12/21/2022 01:30:00 PM script INFO: SUCCESS!@#KODE 1!@#USER_ID 87!@#ACTIVITY_CODE 3
12/21/2022 01:30:00 PM script INFO: SUCCESS!@#KODE 1!@#USER_ID 87!@#ACTIVITY_CODE 1
12/21/2022 01:30:00 PM script INFO: SUCCESS!@#KODE 1!@#USER_ID 87!@#ACTIVITY_CODE 1
12/21/2022 01:30:00 PM script INFO: SUCCESS!@#KODE 1!@#USER_ID 87!@#ACTIVITY_CODE 5
12/21/2022 01:30:00 PM script INFO: SUCCESS!@#KODE 1!@#USER_ID 87!@#ACTIVITY_CODE 5
12/21/2022 01:30:03 PM script INFO: SUCCESS!@#KODE 1!@#USER_ID 87!@#ACTIVITY_CODE 4
12/21/2022 01:30:03 PM script INFO: SUCCESS!@#KODE 1!@#USER_ID 87!@#ACTIVITY_CODE 3
12/21/2022 01:30:03 PM script INFO: SUCCESS!@#KODE 1!@#USER_ID 87!@#ACTIVITY_CODE 1
12/21/2022 01:30:03 PM script INFO: SUCCESS!@#KODE 1!@#USER_ID 87!@#ACTIVITY_CODE 5
12/21/2022 01:30:03 PM script INFO: SUCCESS!@#KODE 1!@#USER_ID 87!@#ACTIVITY_CODE 5
12/21/2022 01:30:06 PM script INFO: SUCCESS!@#KODE 1!@#USER_ID 87!@#ACTIVITY_CODE 4
12/21/2022 01:30:06 PM script INFO: SUCCESS!@#KODE 1!@#USER_ID 87!@#ACTIVITY_CODE 3
12/21/2022 01:30:06 PM script INFO: SUCCESS!@#KODE 1!@#USER_ID 87!@#ACTIVITY_CODE 3
12/21/2022 01:30:06 PM script INFO: SUCCESS!@#KODE 1!@#USER_ID 87!@#ACTIVITY_CODE 5
12/21/2022 01:30:06 PM script INFO: SUCCESS!@#KODE 1!@#USER_ID 87!@#ACTIVITY_CODE 5
12/21/2022 01:30:08 PM script INFO: SUCCESS!@#KODE 1!@#USER_ID 87!@#ACTIVITY_CODE 3
12/21/2022 01:30:09 PM script INFO: SUCCESS!@#KODE 1!@#USER_ID 87!@#ACTIVITY_CODE 3
12/21/2022 01:30:09 PM script INFO: SUCCESS!@#KODE 1!@#USER_ID 87!@#ACTIVITY_CODE 5
12/21/2022 01:30:09 PM script INFO: SUCCESS!@#KODE 1!@#USER_ID 87!@#ACTIVITY_CODE 5
12/21/2022 01:30:11 PM script INFO: SUCCESS!@#KODE 1!@#USER_ID 87!@#ACTIVITY_CODE 2
12/21/2022 01:30:11 PM script INFO: SUCCESS!@#KODE 1!@#USER_ID 87!@#ACTIVITY_CODE 3
12/21/2022 01:30:11 PM script INFO: SUCCESS!@#KODE 1!@#USER_ID 87!@#ACTIVITY_CODE 1
12/21/2022 01:30:11 PM script INFO: SUCCESS!@#KODE 1!@#USER_ID 87!@#ACTIVITY_CODE 2
12/21/2022 01:30:12 PM script INFO: SUCCESS!@#KODE 1!@#USER_ID 87!@#ACTIVITY_CODE 2
12/21/2022 01:30:12 PM script INFO: SUCCESS!@#KODE 1!@#USER_ID 87!@#ACTIVITY_CODE 3
12/21/2022 01:30:12 PM script INFO: SUCCESS!@#KODE 1!@#USER_ID 87!@#ACTIVITY_CODE 1
12/21/2022 01:30:12 PM script INFO: SUCCESS!@#KODE 1!@#USER_ID 87!@#ACTIVITY_CODE 3
12/21/2022 01:30:12 PM script INFO: SUCCESS!@#KODE 1!@#USER_ID 87!@#ACTIVITY_CODE 5
12/21/2022 01:30:12 PM script INFO: SUCCESS!@#KODE 1!@#USER_ID 87!@#ACTIVITY_CODE 5
12/21/2022 01:30:14 PM script INFO: SUCCESS!@#KODE 1!@#USER_ID 87!@#ACTIVITY_CODE 2
12/21/2022 01:30:15 PM script INFO: SUCCESS!@#KODE 1!@#USER_ID 87!@#ACTIVITY_CODE 2
12/21/2022 01:30:15 PM script INFO: SUCCESS!@#KODE 1!@#USER_ID 87!@#ACTIVITY_CODE 4
12/21/2022 01:30:15 PM script INFO: SUCCESS!@#KODE 1!@#USER_ID 87!@#ACTIVITY_CODE 1
12/21/2022 01:30:15 PM script INFO: SUCCESS!@#KODE 1!@#USER_ID 87!@#ACTIVITY_CODE 3
12/21/2022 01:30:15 PM script INFO: SUCCESS!@#KODE 1!@#USER_ID 87!@#ACTIVITY_CODE 4
12/21/2022 01:30:15 PM script INFO: SUCCESS!@#KODE 1!@#USER_ID 87!@#ACTIVITY_CODE 3
12/21/2022 01:30:15 PM script INFO: SUCCESS!@#KODE 1!@#USER_ID 87!@#ACTIVITY_CODE 1
12/21/2022 01:30:15 PM script INFO: SUCCESS!@#KODE 1!@#USER_ID 87!@#ACTIVITY_CODE 5
12/21/2022 01:30:15 PM script INFO: SUCCESS!@#KODE 1!@#USER_ID 87!@#ACTIVITY_CODE 5
12/21/2022 01:30:17 PM script INFO: SUCCESS!@#KODE 1!@#USER_ID 87!@#ACTIVITY_CODE 1
12/21/2022 01:30:18 PM script INFO: SUCCESS!@#KODE 1!@#USER_ID 87!@#ACTIVITY_CODE 2
12/21/2022 01:30:18 PM script INFO: SUCCESS!@#KODE 1!@#USER_ID 87!@#ACTIVITY_CODE 3
12/21/2022 01:30:18 PM script INFO: SUCCESS!@#KODE 1!@#USER_ID 87!@#ACTIVITY_CODE 2
12/21/2022 01:30:18 PM script INFO: SUCCESS!@#KODE 1!@#USER_ID 87!@#ACTIVITY_CODE 4
12/21/2022 01:30:18 PM script INFO: SUCCESS!@#KODE 1!@#USER_ID 87!@#ACTIVITY_CODE 1
12/21/2022 01:30:18 PM script INFO: SUCCESS!@#KODE 1!@#USER_ID 87!@#ACTIVITY_CODE 3
12/21/2022 01:30:18 PM script INFO: SUCCESS!@#KODE 1!@#USER_ID 87!@#ACTIVITY_CODE 2
12/21/2022 01:30:18 PM script INFO: SUCCESS!@#KODE 1!@#USER_ID 87!@#ACTIVITY_CODE 4
12/21/2022 01:30:18 PM script INFO: Duration: 17.710107803344727
12/21/2022 01:30:18 PM script INFO: mengakhiri-quiz
12/21/2022 01:30:22 PM script INFO: SUCCESS!@#KODE 1!@#USER_ID 87!@#ACTIVITY_CODE 5
12/21/2022 01:30:22 PM script INFO: berhasil-submit
