12/11/2022 03:11:15 PM script INFO: Prepared chrome options..
12/11/2022 03:11:16 PM script INFO: Initialized chrome browser..
12/11/2022 03:11:16 PM script INFO: mengakses-homepage
12/11/2022 03:11:26 PM script INFO: mengakses-login-page
12/11/2022 03:11:28 PM script INFO: mengakses-site-home
12/11/2022 03:11:28 PM script INFO: mengakses-site-course
12/11/2022 03:11:29 PM script INFO: mengakses-quiz
12/11/2022 03:11:30 PM script INFO: mengakses-start-quiz-page
12/11/2022 03:11:31 PM script INFO: memulai-quiz
12/11/2022 03:11:31 PM script INFO: SUCCESS!@#KODE 1!@#USER_ID 28!@#ACTIVITY_CODE 5
12/11/2022 03:11:42 PM script INFO: SUCCESS!@#KODE 1!@#USER_ID 28!@#ACTIVITY_CODE 5
12/11/2022 03:11:42 PM script INFO: SUCCESS!@#KODE 1!@#USER_ID 28!@#ACTIVITY_CODE 5
12/11/2022 03:11:45 PM script INFO: SUCCESS!@#KODE 1!@#USER_ID 28!@#ACTIVITY_CODE 5
12/11/2022 03:11:45 PM script INFO: SUCCESS!@#KODE 1!@#USER_ID 28!@#ACTIVITY_CODE 5
12/11/2022 03:11:47 PM script INFO: SUCCESS!@#KODE 1!@#USER_ID 28!@#ACTIVITY_CODE 1
12/11/2022 03:11:47 PM script INFO: SUCCESS!@#KODE 1!@#USER_ID 28!@#ACTIVITY_CODE 1
12/11/2022 03:11:47 PM script INFO: SUCCESS!@#KODE 1!@#USER_ID 28!@#ACTIVITY_CODE 1
12/11/2022 03:11:47 PM script INFO: SUCCESS!@#KODE 1!@#USER_ID 28!@#ACTIVITY_CODE 4
12/11/2022 03:11:47 PM script INFO: SUCCESS!@#KODE 1!@#USER_ID 28!@#ACTIVITY_CODE 3
12/11/2022 03:11:48 PM script INFO: SUCCESS!@#KODE 1!@#USER_ID 28!@#ACTIVITY_CODE 2
12/11/2022 03:11:48 PM script INFO: SUCCESS!@#KODE 1!@#USER_ID 28!@#ACTIVITY_CODE 1
12/11/2022 03:11:48 PM script INFO: SUCCESS!@#KODE 1!@#USER_ID 28!@#ACTIVITY_CODE 2
12/11/2022 03:11:48 PM script INFO: SUCCESS!@#KODE 1!@#USER_ID 28!@#ACTIVITY_CODE 5
12/11/2022 03:11:48 PM script INFO: SUCCESS!@#KODE 1!@#USER_ID 28!@#ACTIVITY_CODE 5
12/11/2022 03:11:50 PM script INFO: SUCCESS!@#KODE 1!@#USER_ID 28!@#ACTIVITY_CODE 3
12/11/2022 03:11:50 PM script INFO: SUCCESS!@#KODE 1!@#USER_ID 28!@#ACTIVITY_CODE 5
12/11/2022 03:11:50 PM script INFO: SUCCESS!@#KODE 1!@#USER_ID 28!@#ACTIVITY_CODE 5
12/11/2022 03:11:53 PM script INFO: SUCCESS!@#KODE 1!@#USER_ID 28!@#ACTIVITY_CODE 1
12/11/2022 03:11:53 PM script INFO: SUCCESS!@#KODE 1!@#USER_ID 28!@#ACTIVITY_CODE 4
12/11/2022 03:11:53 PM script INFO: SUCCESS!@#KODE 1!@#USER_ID 28!@#ACTIVITY_CODE 2
12/11/2022 03:11:53 PM script INFO: SUCCESS!@#KODE 1!@#USER_ID 28!@#ACTIVITY_CODE 2
12/11/2022 03:11:53 PM script INFO: SUCCESS!@#KODE 1!@#USER_ID 28!@#ACTIVITY_CODE 1
12/11/2022 03:11:53 PM script INFO: SUCCESS!@#KODE 1!@#USER_ID 28!@#ACTIVITY_CODE 5
12/11/2022 03:11:53 PM script INFO: SUCCESS!@#KODE 1!@#USER_ID 28!@#ACTIVITY_CODE 5
12/11/2022 03:11:56 PM script INFO: SUCCESS!@#KODE 1!@#USER_ID 28!@#ACTIVITY_CODE 3
12/11/2022 03:11:56 PM script INFO: SUCCESS!@#KODE 1!@#USER_ID 28!@#ACTIVITY_CODE 2
12/11/2022 03:11:56 PM script INFO: SUCCESS!@#KODE 1!@#USER_ID 28!@#ACTIVITY_CODE 2
12/11/2022 03:11:56 PM script INFO: SUCCESS!@#KODE 1!@#USER_ID 28!@#ACTIVITY_CODE 3
12/11/2022 03:11:56 PM script INFO: SUCCESS!@#KODE 1!@#USER_ID 28!@#ACTIVITY_CODE 3
12/11/2022 03:11:57 PM script INFO: SUCCESS!@#KODE 1!@#USER_ID 28!@#ACTIVITY_CODE 1
12/11/2022 03:11:57 PM script INFO: SUCCESS!@#KODE 1!@#USER_ID 28!@#ACTIVITY_CODE 5
12/11/2022 03:11:57 PM script INFO: SUCCESS!@#KODE 1!@#USER_ID 28!@#ACTIVITY_CODE 5
12/11/2022 03:11:59 PM script INFO: SUCCESS!@#KODE 1!@#USER_ID 28!@#ACTIVITY_CODE 3
12/11/2022 03:11:59 PM script INFO: SUCCESS!@#KODE 1!@#USER_ID 28!@#ACTIVITY_CODE 4
12/11/2022 03:11:59 PM script INFO: SUCCESS!@#KODE 1!@#USER_ID 28!@#ACTIVITY_CODE 1
12/11/2022 03:11:59 PM script INFO: SUCCESS!@#KODE 1!@#USER_ID 28!@#ACTIVITY_CODE 4
12/11/2022 03:11:59 PM script INFO: SUCCESS!@#KODE 1!@#USER_ID 28!@#ACTIVITY_CODE 3
12/11/2022 03:11:59 PM script INFO: SUCCESS!@#KODE 1!@#USER_ID 28!@#ACTIVITY_CODE 1
12/11/2022 03:11:59 PM script INFO: SUCCESS!@#KODE 1!@#USER_ID 28!@#ACTIVITY_CODE 4
12/11/2022 03:12:00 PM script INFO: SUCCESS!@#KODE 1!@#USER_ID 28!@#ACTIVITY_CODE 2
12/11/2022 03:12:00 PM script INFO: SUCCESS!@#KODE 1!@#USER_ID 28!@#ACTIVITY_CODE 2
12/11/2022 03:12:00 PM script INFO: SUCCESS!@#KODE 1!@#USER_ID 28!@#ACTIVITY_CODE 2
12/11/2022 03:12:00 PM script INFO: SUCCESS!@#KODE 1!@#USER_ID 28!@#ACTIVITY_CODE 5
12/11/2022 03:12:00 PM script INFO: SUCCESS!@#KODE 1!@#USER_ID 28!@#ACTIVITY_CODE 5
12/11/2022 03:12:02 PM script INFO: SUCCESS!@#KODE 1!@#USER_ID 28!@#ACTIVITY_CODE 3
12/11/2022 03:12:02 PM script INFO: SUCCESS!@#KODE 1!@#USER_ID 28!@#ACTIVITY_CODE 5
12/11/2022 03:12:02 PM script INFO: SUCCESS!@#KODE 1!@#USER_ID 28!@#ACTIVITY_CODE 5
12/11/2022 03:12:05 PM script INFO: SUCCESS!@#KODE 1!@#USER_ID 28!@#ACTIVITY_CODE 2
12/11/2022 03:12:05 PM script INFO: SUCCESS!@#KODE 1!@#USER_ID 28!@#ACTIVITY_CODE 3
12/11/2022 03:12:05 PM script INFO: SUCCESS!@#KODE 1!@#USER_ID 28!@#ACTIVITY_CODE 3
12/11/2022 03:12:05 PM script INFO: SUCCESS!@#KODE 1!@#USER_ID 28!@#ACTIVITY_CODE 3
12/11/2022 03:12:05 PM script INFO: SUCCESS!@#KODE 1!@#USER_ID 28!@#ACTIVITY_CODE 5
12/11/2022 03:12:05 PM script INFO: SUCCESS!@#KODE 1!@#USER_ID 28!@#ACTIVITY_CODE 5
12/11/2022 03:12:08 PM script INFO: SUCCESS!@#KODE 1!@#USER_ID 28!@#ACTIVITY_CODE 5
12/11/2022 03:12:08 PM script INFO: SUCCESS!@#KODE 1!@#USER_ID 28!@#ACTIVITY_CODE 5
12/11/2022 03:12:10 PM script INFO: SUCCESS!@#KODE 1!@#USER_ID 28!@#ACTIVITY_CODE 5
12/11/2022 03:12:10 PM script INFO: SUCCESS!@#KODE 1!@#USER_ID 28!@#ACTIVITY_CODE 5
12/11/2022 03:12:13 PM script INFO: SUCCESS!@#KODE 1!@#USER_ID 28!@#ACTIVITY_CODE 2
12/11/2022 03:12:13 PM script INFO: SUCCESS!@#KODE 1!@#USER_ID 28!@#ACTIVITY_CODE 3
12/11/2022 03:12:13 PM script INFO: SUCCESS!@#KODE 1!@#USER_ID 28!@#ACTIVITY_CODE 1
12/11/2022 03:12:13 PM script INFO: SUCCESS!@#KODE 1!@#USER_ID 28!@#ACTIVITY_CODE 1
12/11/2022 03:12:13 PM script INFO: SUCCESS!@#KODE 1!@#USER_ID 28!@#ACTIVITY_CODE 2
12/11/2022 03:12:13 PM script INFO: SUCCESS!@#KODE 1!@#USER_ID 28!@#ACTIVITY_CODE 1
12/11/2022 03:12:13 PM script INFO: SUCCESS!@#KODE 1!@#USER_ID 28!@#ACTIVITY_CODE 1
12/11/2022 03:12:14 PM script INFO: SUCCESS!@#KODE 1!@#USER_ID 28!@#ACTIVITY_CODE 1
12/11/2022 03:12:14 PM script INFO: SUCCESS!@#KODE 1!@#USER_ID 28!@#ACTIVITY_CODE 2
12/11/2022 03:12:14 PM script INFO: SUCCESS!@#KODE 1!@#USER_ID 28!@#ACTIVITY_CODE 3
12/11/2022 03:12:14 PM script INFO: SUCCESS!@#KODE 1!@#USER_ID 28!@#ACTIVITY_CODE 3
12/11/2022 03:12:14 PM script INFO: SUCCESS!@#KODE 1!@#USER_ID 28!@#ACTIVITY_CODE 2
12/11/2022 03:12:14 PM script INFO: SUCCESS!@#KODE 1!@#USER_ID 28!@#ACTIVITY_CODE 1
12/11/2022 03:12:14 PM script INFO: SUCCESS!@#KODE 1!@#USER_ID 28!@#ACTIVITY_CODE 3
12/11/2022 03:12:14 PM script INFO: SUCCESS!@#KODE 1!@#USER_ID 28!@#ACTIVITY_CODE 3
12/11/2022 03:12:14 PM script INFO: SUCCESS!@#KODE 1!@#USER_ID 28!@#ACTIVITY_CODE 4
12/11/2022 03:12:14 PM script INFO: SUCCESS!@#KODE 1!@#USER_ID 28!@#ACTIVITY_CODE 3
12/11/2022 03:12:14 PM script INFO: SUCCESS!@#KODE 1!@#USER_ID 28!@#ACTIVITY_CODE 3
12/11/2022 03:12:14 PM script INFO: SUCCESS!@#KODE 1!@#USER_ID 28!@#ACTIVITY_CODE 3
12/11/2022 03:12:14 PM script INFO: SUCCESS!@#KODE 1!@#USER_ID 28!@#ACTIVITY_CODE 3
12/11/2022 03:12:15 PM script INFO: SUCCESS!@#KODE 1!@#USER_ID 28!@#ACTIVITY_CODE 1
12/11/2022 03:12:15 PM script INFO: SUCCESS!@#KODE 1!@#USER_ID 28!@#ACTIVITY_CODE 1
12/11/2022 03:12:15 PM script INFO: SUCCESS!@#KODE 1!@#USER_ID 28!@#ACTIVITY_CODE 4
12/11/2022 03:12:15 PM script INFO: SUCCESS!@#KODE 1!@#USER_ID 28!@#ACTIVITY_CODE 3
12/11/2022 03:12:15 PM script INFO: SUCCESS!@#KODE 1!@#USER_ID 28!@#ACTIVITY_CODE 1
12/11/2022 03:12:15 PM script INFO: SUCCESS!@#KODE 1!@#USER_ID 28!@#ACTIVITY_CODE 4
12/11/2022 03:12:15 PM script INFO: SUCCESS!@#KODE 1!@#USER_ID 28!@#ACTIVITY_CODE 2
12/11/2022 03:12:15 PM script INFO: SUCCESS!@#KODE 1!@#USER_ID 28!@#ACTIVITY_CODE 2
12/11/2022 03:12:15 PM script INFO: SUCCESS!@#KODE 1!@#USER_ID 28!@#ACTIVITY_CODE 3
12/11/2022 03:12:15 PM script INFO: SUCCESS!@#KODE 1!@#USER_ID 28!@#ACTIVITY_CODE 3
12/11/2022 03:12:15 PM script INFO: SUCCESS!@#KODE 1!@#USER_ID 28!@#ACTIVITY_CODE 1
12/11/2022 03:12:15 PM script INFO: SUCCESS!@#KODE 1!@#USER_ID 28!@#ACTIVITY_CODE 1
12/11/2022 03:12:15 PM script INFO: SUCCESS!@#KODE 1!@#USER_ID 28!@#ACTIVITY_CODE 1
12/11/2022 03:12:16 PM script INFO: SUCCESS!@#KODE 1!@#USER_ID 28!@#ACTIVITY_CODE 1
12/11/2022 03:12:16 PM script INFO: SUCCESS!@#KODE 1!@#USER_ID 28!@#ACTIVITY_CODE 3
12/11/2022 03:12:16 PM script INFO: SUCCESS!@#KODE 1!@#USER_ID 28!@#ACTIVITY_CODE 1
12/11/2022 03:12:16 PM script INFO: SUCCESS!@#KODE 1!@#USER_ID 28!@#ACTIVITY_CODE 3
12/11/2022 03:12:16 PM script INFO: SUCCESS!@#KODE 1!@#USER_ID 28!@#ACTIVITY_CODE 1
12/11/2022 03:12:16 PM script INFO: SUCCESS!@#KODE 1!@#USER_ID 28!@#ACTIVITY_CODE 2
12/11/2022 03:12:16 PM script INFO: SUCCESS!@#KODE 1!@#USER_ID 28!@#ACTIVITY_CODE 2
12/11/2022 03:12:16 PM script INFO: SUCCESS!@#KODE 1!@#USER_ID 28!@#ACTIVITY_CODE 1
12/11/2022 03:12:16 PM script INFO: Duration: 33.98345375061035
12/11/2022 03:12:16 PM script INFO: mengakhiri-quiz
12/11/2022 03:12:43 PM script INFO: SUCCESS!@#KODE 1!@#USER_ID 28!@#ACTIVITY_CODE 5
12/11/2022 03:12:43 PM script INFO: berhasil-submit
