12/12/2022 01:32:05 AM script INFO: Prepared chrome options..
12/12/2022 01:32:07 AM script INFO: Initialized chrome browser..
12/12/2022 01:32:07 AM script INFO: mengakses-homepage
12/12/2022 01:32:51 AM script INFO: mengakses-login-page
12/12/2022 01:33:07 AM script INFO: mengakses-site-home
12/12/2022 01:33:08 AM script INFO: mengakses-site-course
12/12/2022 01:33:28 AM script INFO: mengakses-quiz
12/12/2022 01:33:30 AM script INFO: mengakses-start-quiz-page
12/12/2022 01:33:32 AM script INFO: memulai-quiz
12/12/2022 01:33:32 AM script INFO: SUCCESS!@#KODE 1!@#USER_ID 26!@#ACTIVITY_CODE 5
12/12/2022 01:33:43 AM script INFO: SUCCESS!@#KODE 1!@#USER_ID 26!@#ACTIVITY_CODE 5
12/12/2022 01:33:43 AM script INFO: SUCCESS!@#KODE 1!@#USER_ID 26!@#ACTIVITY_CODE 5
12/12/2022 01:33:46 AM script INFO: SUCCESS!@#KODE 1!@#USER_ID 26!@#ACTIVITY_CODE 1
12/12/2022 01:33:46 AM script INFO: SUCCESS!@#KODE 1!@#USER_ID 26!@#ACTIVITY_CODE 2
12/12/2022 01:33:47 AM script INFO: SUCCESS!@#KODE 1!@#USER_ID 26!@#ACTIVITY_CODE 1
12/12/2022 01:33:47 AM script INFO: SUCCESS!@#KODE 1!@#USER_ID 26!@#ACTIVITY_CODE 4
12/12/2022 01:33:47 AM script INFO: SUCCESS!@#KODE 1!@#USER_ID 26!@#ACTIVITY_CODE 3
12/12/2022 01:33:47 AM script INFO: SUCCESS!@#KODE 1!@#USER_ID 26!@#ACTIVITY_CODE 3
12/12/2022 01:33:47 AM script INFO: SUCCESS!@#KODE 1!@#USER_ID 26!@#ACTIVITY_CODE 2
12/12/2022 01:33:48 AM script INFO: SUCCESS!@#KODE 1!@#USER_ID 26!@#ACTIVITY_CODE 2
12/12/2022 01:33:48 AM script INFO: SUCCESS!@#KODE 1!@#USER_ID 26!@#ACTIVITY_CODE 3
12/12/2022 01:33:48 AM script INFO: SUCCESS!@#KODE 1!@#USER_ID 26!@#ACTIVITY_CODE 1
12/12/2022 01:33:48 AM script INFO: SUCCESS!@#KODE 1!@#USER_ID 26!@#ACTIVITY_CODE 5
12/12/2022 01:33:48 AM script INFO: SUCCESS!@#KODE 1!@#USER_ID 26!@#ACTIVITY_CODE 5
12/12/2022 01:33:50 AM script INFO: SUCCESS!@#KODE 1!@#USER_ID 26!@#ACTIVITY_CODE 1
12/12/2022 01:33:50 AM script INFO: SUCCESS!@#KODE 1!@#USER_ID 26!@#ACTIVITY_CODE 5
12/12/2022 01:33:50 AM script INFO: SUCCESS!@#KODE 1!@#USER_ID 26!@#ACTIVITY_CODE 5
12/12/2022 01:33:53 AM script INFO: SUCCESS!@#KODE 1!@#USER_ID 26!@#ACTIVITY_CODE 1
12/12/2022 01:33:53 AM script INFO: SUCCESS!@#KODE 1!@#USER_ID 26!@#ACTIVITY_CODE 5
12/12/2022 01:33:53 AM script INFO: SUCCESS!@#KODE 1!@#USER_ID 26!@#ACTIVITY_CODE 5
12/12/2022 01:33:56 AM script INFO: SUCCESS!@#KODE 1!@#USER_ID 26!@#ACTIVITY_CODE 4
12/12/2022 01:33:56 AM script INFO: SUCCESS!@#KODE 1!@#USER_ID 26!@#ACTIVITY_CODE 1
12/12/2022 01:33:56 AM script INFO: SUCCESS!@#KODE 1!@#USER_ID 26!@#ACTIVITY_CODE 3
12/12/2022 01:33:56 AM script INFO: SUCCESS!@#KODE 1!@#USER_ID 26!@#ACTIVITY_CODE 3
12/12/2022 01:33:56 AM script INFO: SUCCESS!@#KODE 1!@#USER_ID 26!@#ACTIVITY_CODE 3
12/12/2022 01:33:56 AM script INFO: SUCCESS!@#KODE 1!@#USER_ID 26!@#ACTIVITY_CODE 4
12/12/2022 01:33:57 AM script INFO: SUCCESS!@#KODE 1!@#USER_ID 26!@#ACTIVITY_CODE 1
12/12/2022 01:33:57 AM script INFO: SUCCESS!@#KODE 1!@#USER_ID 26!@#ACTIVITY_CODE 4
12/12/2022 01:33:57 AM script INFO: SUCCESS!@#KODE 1!@#USER_ID 26!@#ACTIVITY_CODE 2
12/12/2022 01:33:57 AM script INFO: SUCCESS!@#KODE 1!@#USER_ID 26!@#ACTIVITY_CODE 5
12/12/2022 01:33:57 AM script INFO: SUCCESS!@#KODE 1!@#USER_ID 26!@#ACTIVITY_CODE 5
12/12/2022 01:34:00 AM script INFO: SUCCESS!@#KODE 1!@#USER_ID 26!@#ACTIVITY_CODE 5
12/12/2022 01:34:00 AM script INFO: SUCCESS!@#KODE 1!@#USER_ID 26!@#ACTIVITY_CODE 5
12/12/2022 01:34:02 AM script INFO: SUCCESS!@#KODE 1!@#USER_ID 26!@#ACTIVITY_CODE 1
12/12/2022 01:34:02 AM script INFO: SUCCESS!@#KODE 1!@#USER_ID 26!@#ACTIVITY_CODE 5
12/12/2022 01:34:02 AM script INFO: SUCCESS!@#KODE 1!@#USER_ID 26!@#ACTIVITY_CODE 5
12/12/2022 01:34:05 AM script INFO: SUCCESS!@#KODE 1!@#USER_ID 26!@#ACTIVITY_CODE 5
12/12/2022 01:34:05 AM script INFO: SUCCESS!@#KODE 1!@#USER_ID 26!@#ACTIVITY_CODE 5
12/12/2022 01:34:07 AM script INFO: SUCCESS!@#KODE 1!@#USER_ID 26!@#ACTIVITY_CODE 3
12/12/2022 01:34:07 AM script INFO: SUCCESS!@#KODE 1!@#USER_ID 26!@#ACTIVITY_CODE 3
12/12/2022 01:34:07 AM script INFO: SUCCESS!@#KODE 1!@#USER_ID 26!@#ACTIVITY_CODE 2
12/12/2022 01:34:07 AM script INFO: SUCCESS!@#KODE 1!@#USER_ID 26!@#ACTIVITY_CODE 5
12/12/2022 01:34:07 AM script INFO: SUCCESS!@#KODE 1!@#USER_ID 26!@#ACTIVITY_CODE 5
12/12/2022 01:34:10 AM script INFO: SUCCESS!@#KODE 1!@#USER_ID 26!@#ACTIVITY_CODE 2
12/12/2022 01:34:10 AM script INFO: SUCCESS!@#KODE 1!@#USER_ID 26!@#ACTIVITY_CODE 5
12/12/2022 01:34:10 AM script INFO: SUCCESS!@#KODE 1!@#USER_ID 26!@#ACTIVITY_CODE 5
12/12/2022 01:34:13 AM script INFO: SUCCESS!@#KODE 1!@#USER_ID 26!@#ACTIVITY_CODE 3
12/12/2022 01:34:13 AM script INFO: SUCCESS!@#KODE 1!@#USER_ID 26!@#ACTIVITY_CODE 2
12/12/2022 01:34:13 AM script INFO: SUCCESS!@#KODE 1!@#USER_ID 26!@#ACTIVITY_CODE 2
12/12/2022 01:34:13 AM script INFO: SUCCESS!@#KODE 1!@#USER_ID 26!@#ACTIVITY_CODE 4
12/12/2022 01:34:13 AM script INFO: SUCCESS!@#KODE 1!@#USER_ID 26!@#ACTIVITY_CODE 5
12/12/2022 01:34:13 AM script INFO: SUCCESS!@#KODE 1!@#USER_ID 26!@#ACTIVITY_CODE 5
12/12/2022 01:34:16 AM script INFO: SUCCESS!@#KODE 1!@#USER_ID 26!@#ACTIVITY_CODE 1
12/12/2022 01:34:16 AM script INFO: SUCCESS!@#KODE 1!@#USER_ID 26!@#ACTIVITY_CODE 1
12/12/2022 01:34:16 AM script INFO: SUCCESS!@#KODE 1!@#USER_ID 26!@#ACTIVITY_CODE 1
12/12/2022 01:34:16 AM script INFO: SUCCESS!@#KODE 1!@#USER_ID 26!@#ACTIVITY_CODE 3
12/12/2022 01:34:16 AM script INFO: SUCCESS!@#KODE 1!@#USER_ID 26!@#ACTIVITY_CODE 2
12/12/2022 01:34:16 AM script INFO: SUCCESS!@#KODE 1!@#USER_ID 26!@#ACTIVITY_CODE 2
12/12/2022 01:34:16 AM script INFO: SUCCESS!@#KODE 1!@#USER_ID 26!@#ACTIVITY_CODE 5
12/12/2022 01:34:16 AM script INFO: SUCCESS!@#KODE 1!@#USER_ID 26!@#ACTIVITY_CODE 5
12/12/2022 01:34:19 AM script INFO: SUCCESS!@#KODE 1!@#USER_ID 26!@#ACTIVITY_CODE 2
12/12/2022 01:34:19 AM script INFO: SUCCESS!@#KODE 1!@#USER_ID 26!@#ACTIVITY_CODE 2
12/12/2022 01:34:19 AM script INFO: SUCCESS!@#KODE 1!@#USER_ID 26!@#ACTIVITY_CODE 2
12/12/2022 01:34:19 AM script INFO: SUCCESS!@#KODE 1!@#USER_ID 26!@#ACTIVITY_CODE 5
12/12/2022 01:34:19 AM script INFO: SUCCESS!@#KODE 1!@#USER_ID 26!@#ACTIVITY_CODE 5
12/12/2022 01:34:21 AM script INFO: SUCCESS!@#KODE 1!@#USER_ID 26!@#ACTIVITY_CODE 3
12/12/2022 01:34:21 AM script INFO: SUCCESS!@#KODE 1!@#USER_ID 26!@#ACTIVITY_CODE 1
12/12/2022 01:34:21 AM script INFO: SUCCESS!@#KODE 1!@#USER_ID 26!@#ACTIVITY_CODE 4
12/12/2022 01:34:22 AM script INFO: SUCCESS!@#KODE 1!@#USER_ID 26!@#ACTIVITY_CODE 2
12/12/2022 01:34:22 AM script INFO: SUCCESS!@#KODE 1!@#USER_ID 26!@#ACTIVITY_CODE 3
12/12/2022 01:34:22 AM script INFO: SUCCESS!@#KODE 1!@#USER_ID 26!@#ACTIVITY_CODE 5
12/12/2022 01:34:22 AM script INFO: SUCCESS!@#KODE 1!@#USER_ID 26!@#ACTIVITY_CODE 5
12/12/2022 01:34:24 AM script INFO: SUCCESS!@#KODE 1!@#USER_ID 26!@#ACTIVITY_CODE 5
12/12/2022 01:34:24 AM script INFO: SUCCESS!@#KODE 1!@#USER_ID 26!@#ACTIVITY_CODE 5
12/12/2022 01:34:27 AM script INFO: SUCCESS!@#KODE 1!@#USER_ID 26!@#ACTIVITY_CODE 5
12/12/2022 01:34:27 AM script INFO: SUCCESS!@#KODE 1!@#USER_ID 26!@#ACTIVITY_CODE 5
12/12/2022 01:34:29 AM script INFO: SUCCESS!@#KODE 1!@#USER_ID 26!@#ACTIVITY_CODE 1
12/12/2022 01:34:29 AM script INFO: SUCCESS!@#KODE 1!@#USER_ID 26!@#ACTIVITY_CODE 4
12/12/2022 01:34:29 AM script INFO: SUCCESS!@#KODE 1!@#USER_ID 26!@#ACTIVITY_CODE 2
12/12/2022 01:34:29 AM script INFO: SUCCESS!@#KODE 1!@#USER_ID 26!@#ACTIVITY_CODE 3
12/12/2022 01:34:30 AM script INFO: SUCCESS!@#KODE 1!@#USER_ID 26!@#ACTIVITY_CODE 3
12/12/2022 01:34:30 AM script INFO: SUCCESS!@#KODE 1!@#USER_ID 26!@#ACTIVITY_CODE 1
12/12/2022 01:34:30 AM script INFO: SUCCESS!@#KODE 1!@#USER_ID 26!@#ACTIVITY_CODE 1
12/12/2022 01:34:30 AM script INFO: SUCCESS!@#KODE 1!@#USER_ID 26!@#ACTIVITY_CODE 4
12/12/2022 01:34:30 AM script INFO: SUCCESS!@#KODE 1!@#USER_ID 26!@#ACTIVITY_CODE 1
12/12/2022 01:34:30 AM script INFO: SUCCESS!@#KODE 1!@#USER_ID 26!@#ACTIVITY_CODE 1
12/12/2022 01:34:30 AM script INFO: SUCCESS!@#KODE 1!@#USER_ID 26!@#ACTIVITY_CODE 4
12/12/2022 01:34:30 AM script INFO: SUCCESS!@#KODE 1!@#USER_ID 26!@#ACTIVITY_CODE 2
12/12/2022 01:34:30 AM script INFO: SUCCESS!@#KODE 1!@#USER_ID 26!@#ACTIVITY_CODE 4
12/12/2022 01:34:30 AM script INFO: SUCCESS!@#KODE 1!@#USER_ID 26!@#ACTIVITY_CODE 1
12/12/2022 01:34:30 AM script INFO: SUCCESS!@#KODE 1!@#USER_ID 26!@#ACTIVITY_CODE 3
12/12/2022 01:34:30 AM script INFO: SUCCESS!@#KODE 1!@#USER_ID 26!@#ACTIVITY_CODE 3
12/12/2022 01:34:30 AM script INFO: SUCCESS!@#KODE 1!@#USER_ID 26!@#ACTIVITY_CODE 3
12/12/2022 01:34:30 AM script INFO: SUCCESS!@#KODE 1!@#USER_ID 26!@#ACTIVITY_CODE 2
12/12/2022 01:34:30 AM script INFO: SUCCESS!@#KODE 1!@#USER_ID 26!@#ACTIVITY_CODE 3
12/12/2022 01:34:31 AM script INFO: SUCCESS!@#KODE 1!@#USER_ID 26!@#ACTIVITY_CODE 1
12/12/2022 01:34:31 AM script INFO: SUCCESS!@#KODE 1!@#USER_ID 26!@#ACTIVITY_CODE 3
12/12/2022 01:34:31 AM script INFO: SUCCESS!@#KODE 1!@#USER_ID 26!@#ACTIVITY_CODE 4
12/12/2022 01:34:31 AM script INFO: SUCCESS!@#KODE 1!@#USER_ID 26!@#ACTIVITY_CODE 1
12/12/2022 01:34:31 AM script INFO: SUCCESS!@#KODE 1!@#USER_ID 26!@#ACTIVITY_CODE 3
12/12/2022 01:34:31 AM script INFO: SUCCESS!@#KODE 1!@#USER_ID 26!@#ACTIVITY_CODE 4
12/12/2022 01:34:31 AM script INFO: SUCCESS!@#KODE 1!@#USER_ID 26!@#ACTIVITY_CODE 3
12/12/2022 01:34:31 AM script INFO: SUCCESS!@#KODE 1!@#USER_ID 26!@#ACTIVITY_CODE 2
12/12/2022 01:34:31 AM script INFO: SUCCESS!@#KODE 1!@#USER_ID 26!@#ACTIVITY_CODE 2
12/12/2022 01:34:31 AM script INFO: SUCCESS!@#KODE 1!@#USER_ID 26!@#ACTIVITY_CODE 4
12/12/2022 01:34:31 AM script INFO: SUCCESS!@#KODE 1!@#USER_ID 26!@#ACTIVITY_CODE 1
12/12/2022 01:34:31 AM script INFO: SUCCESS!@#KODE 1!@#USER_ID 26!@#ACTIVITY_CODE 2
12/12/2022 01:34:31 AM script INFO: SUCCESS!@#KODE 1!@#USER_ID 26!@#ACTIVITY_CODE 1
12/12/2022 01:34:32 AM script INFO: SUCCESS!@#KODE 1!@#USER_ID 26!@#ACTIVITY_CODE 4
12/12/2022 01:34:32 AM script INFO: SUCCESS!@#KODE 1!@#USER_ID 26!@#ACTIVITY_CODE 1
12/12/2022 01:34:32 AM script INFO: SUCCESS!@#KODE 1!@#USER_ID 26!@#ACTIVITY_CODE 4
12/12/2022 01:34:32 AM script INFO: SUCCESS!@#KODE 1!@#USER_ID 26!@#ACTIVITY_CODE 1
12/12/2022 01:34:32 AM script INFO: SUCCESS!@#KODE 1!@#USER_ID 26!@#ACTIVITY_CODE 2
12/12/2022 01:34:32 AM script INFO: SUCCESS!@#KODE 1!@#USER_ID 26!@#ACTIVITY_CODE 2
12/12/2022 01:34:32 AM script INFO: SUCCESS!@#KODE 1!@#USER_ID 26!@#ACTIVITY_CODE 3
12/12/2022 01:34:32 AM script INFO: SUCCESS!@#KODE 1!@#USER_ID 26!@#ACTIVITY_CODE 4
12/12/2022 01:34:32 AM script INFO: SUCCESS!@#KODE 1!@#USER_ID 26!@#ACTIVITY_CODE 1
12/12/2022 01:34:32 AM script INFO: SUCCESS!@#KODE 1!@#USER_ID 26!@#ACTIVITY_CODE 4
12/12/2022 01:34:32 AM script INFO: SUCCESS!@#KODE 1!@#USER_ID 26!@#ACTIVITY_CODE 3
12/12/2022 01:34:32 AM script INFO: SUCCESS!@#KODE 1!@#USER_ID 26!@#ACTIVITY_CODE 1
12/12/2022 01:34:32 AM script INFO: SUCCESS!@#KODE 1!@#USER_ID 26!@#ACTIVITY_CODE 3
12/12/2022 01:34:32 AM script INFO: SUCCESS!@#KODE 1!@#USER_ID 26!@#ACTIVITY_CODE 1
12/12/2022 01:34:32 AM script INFO: SUCCESS!@#KODE 1!@#USER_ID 26!@#ACTIVITY_CODE 4
12/12/2022 01:34:32 AM script INFO: SUCCESS!@#KODE 1!@#USER_ID 26!@#ACTIVITY_CODE 3
12/12/2022 01:34:32 AM script INFO: SUCCESS!@#KODE 1!@#USER_ID 26!@#ACTIVITY_CODE 3
12/12/2022 01:34:33 AM script INFO: SUCCESS!@#KODE 1!@#USER_ID 26!@#ACTIVITY_CODE 1
12/12/2022 01:34:33 AM script INFO: SUCCESS!@#KODE 1!@#USER_ID 26!@#ACTIVITY_CODE 3
12/12/2022 01:34:33 AM script INFO: SUCCESS!@#KODE 1!@#USER_ID 26!@#ACTIVITY_CODE 2
12/12/2022 01:34:33 AM script INFO: SUCCESS!@#KODE 1!@#USER_ID 26!@#ACTIVITY_CODE 2
12/12/2022 01:34:33 AM script INFO: SUCCESS!@#KODE 1!@#USER_ID 26!@#ACTIVITY_CODE 3
12/12/2022 01:34:33 AM script INFO: SUCCESS!@#KODE 1!@#USER_ID 26!@#ACTIVITY_CODE 1
12/12/2022 01:34:33 AM script INFO: SUCCESS!@#KODE 1!@#USER_ID 26!@#ACTIVITY_CODE 1
12/12/2022 01:34:33 AM script INFO: SUCCESS!@#KODE 1!@#USER_ID 26!@#ACTIVITY_CODE 3
12/12/2022 01:34:33 AM script INFO: SUCCESS!@#KODE 1!@#USER_ID 26!@#ACTIVITY_CODE 2
12/12/2022 01:34:33 AM script INFO: SUCCESS!@#KODE 1!@#USER_ID 26!@#ACTIVITY_CODE 3
12/12/2022 01:34:33 AM script INFO: SUCCESS!@#KODE 1!@#USER_ID 26!@#ACTIVITY_CODE 1
12/12/2022 01:34:33 AM script INFO: SUCCESS!@#KODE 1!@#USER_ID 26!@#ACTIVITY_CODE 2
12/12/2022 01:34:33 AM script INFO: SUCCESS!@#KODE 1!@#USER_ID 26!@#ACTIVITY_CODE 1
12/12/2022 01:34:33 AM script INFO: SUCCESS!@#KODE 1!@#USER_ID 26!@#ACTIVITY_CODE 4
12/12/2022 01:34:33 AM script INFO: SUCCESS!@#KODE 1!@#USER_ID 26!@#ACTIVITY_CODE 1
12/12/2022 01:34:34 AM script INFO: SUCCESS!@#KODE 1!@#USER_ID 26!@#ACTIVITY_CODE 1
12/12/2022 01:34:34 AM script INFO: SUCCESS!@#KODE 1!@#USER_ID 26!@#ACTIVITY_CODE 3
12/12/2022 01:34:34 AM script INFO: SUCCESS!@#KODE 1!@#USER_ID 26!@#ACTIVITY_CODE 3
12/12/2022 01:34:34 AM script INFO: SUCCESS!@#KODE 1!@#USER_ID 26!@#ACTIVITY_CODE 2
12/12/2022 01:34:34 AM script INFO: SUCCESS!@#KODE 1!@#USER_ID 26!@#ACTIVITY_CODE 1
12/12/2022 01:34:34 AM script INFO: SUCCESS!@#KODE 1!@#USER_ID 26!@#ACTIVITY_CODE 3
12/12/2022 01:34:34 AM script INFO: SUCCESS!@#KODE 1!@#USER_ID 26!@#ACTIVITY_CODE 3
12/12/2022 01:34:34 AM script INFO: SUCCESS!@#KODE 1!@#USER_ID 26!@#ACTIVITY_CODE 1
12/12/2022 01:34:34 AM script INFO: SUCCESS!@#KODE 1!@#USER_ID 26!@#ACTIVITY_CODE 4
12/12/2022 01:34:34 AM script INFO: SUCCESS!@#KODE 1!@#USER_ID 26!@#ACTIVITY_CODE 2
12/12/2022 01:34:34 AM script INFO: SUCCESS!@#KODE 1!@#USER_ID 26!@#ACTIVITY_CODE 4
12/12/2022 01:34:34 AM script INFO: SUCCESS!@#KODE 1!@#USER_ID 26!@#ACTIVITY_CODE 1
12/12/2022 01:34:34 AM script INFO: SUCCESS!@#KODE 1!@#USER_ID 26!@#ACTIVITY_CODE 3
12/12/2022 01:34:34 AM script INFO: SUCCESS!@#KODE 1!@#USER_ID 26!@#ACTIVITY_CODE 4
12/12/2022 01:34:34 AM script INFO: SUCCESS!@#KODE 1!@#USER_ID 26!@#ACTIVITY_CODE 1
12/12/2022 01:34:34 AM script INFO: SUCCESS!@#KODE 1!@#USER_ID 26!@#ACTIVITY_CODE 1
12/12/2022 01:34:34 AM script INFO: SUCCESS!@#KODE 1!@#USER_ID 26!@#ACTIVITY_CODE 1
12/12/2022 01:34:34 AM script INFO: SUCCESS!@#KODE 1!@#USER_ID 26!@#ACTIVITY_CODE 1
12/12/2022 01:34:35 AM script INFO: SUCCESS!@#KODE 1!@#USER_ID 26!@#ACTIVITY_CODE 2
12/12/2022 01:34:35 AM script INFO: SUCCESS!@#KODE 1!@#USER_ID 26!@#ACTIVITY_CODE 2
12/12/2022 01:34:35 AM script INFO: SUCCESS!@#KODE 1!@#USER_ID 26!@#ACTIVITY_CODE 1
12/12/2022 01:34:35 AM script INFO: SUCCESS!@#KODE 1!@#USER_ID 26!@#ACTIVITY_CODE 3
12/12/2022 01:34:35 AM script INFO: SUCCESS!@#KODE 1!@#USER_ID 26!@#ACTIVITY_CODE 3
12/12/2022 01:34:35 AM script INFO: SUCCESS!@#KODE 1!@#USER_ID 26!@#ACTIVITY_CODE 1
12/12/2022 01:34:35 AM script INFO: SUCCESS!@#KODE 1!@#USER_ID 26!@#ACTIVITY_CODE 3
12/12/2022 01:34:35 AM script INFO: SUCCESS!@#KODE 1!@#USER_ID 26!@#ACTIVITY_CODE 2
12/12/2022 01:34:35 AM script INFO: SUCCESS!@#KODE 1!@#USER_ID 26!@#ACTIVITY_CODE 3
12/12/2022 01:34:35 AM script INFO: SUCCESS!@#KODE 1!@#USER_ID 26!@#ACTIVITY_CODE 3
12/12/2022 01:34:35 AM script INFO: SUCCESS!@#KODE 1!@#USER_ID 26!@#ACTIVITY_CODE 3
12/12/2022 01:34:35 AM script INFO: SUCCESS!@#KODE 1!@#USER_ID 26!@#ACTIVITY_CODE 2
12/12/2022 01:34:35 AM script INFO: SUCCESS!@#KODE 1!@#USER_ID 26!@#ACTIVITY_CODE 2
12/12/2022 01:34:35 AM script INFO: SUCCESS!@#KODE 1!@#USER_ID 26!@#ACTIVITY_CODE 4
12/12/2022 01:34:35 AM script INFO: SUCCESS!@#KODE 1!@#USER_ID 26!@#ACTIVITY_CODE 3
12/12/2022 01:34:36 AM script INFO: SUCCESS!@#KODE 1!@#USER_ID 26!@#ACTIVITY_CODE 1
12/12/2022 01:34:36 AM script INFO: SUCCESS!@#KODE 1!@#USER_ID 26!@#ACTIVITY_CODE 3
12/12/2022 01:34:36 AM script INFO: SUCCESS!@#KODE 1!@#USER_ID 26!@#ACTIVITY_CODE 3
12/12/2022 01:34:36 AM script INFO: SUCCESS!@#KODE 1!@#USER_ID 26!@#ACTIVITY_CODE 4
12/12/2022 01:34:36 AM script INFO: SUCCESS!@#KODE 1!@#USER_ID 26!@#ACTIVITY_CODE 1
12/12/2022 01:34:36 AM script INFO: SUCCESS!@#KODE 1!@#USER_ID 26!@#ACTIVITY_CODE 2
12/12/2022 01:34:36 AM script INFO: SUCCESS!@#KODE 1!@#USER_ID 26!@#ACTIVITY_CODE 1
12/12/2022 01:34:36 AM script INFO: SUCCESS!@#KODE 1!@#USER_ID 26!@#ACTIVITY_CODE 1
12/12/2022 01:34:36 AM script INFO: SUCCESS!@#KODE 1!@#USER_ID 26!@#ACTIVITY_CODE 3
12/12/2022 01:34:36 AM script INFO: SUCCESS!@#KODE 1!@#USER_ID 26!@#ACTIVITY_CODE 1
12/12/2022 01:34:36 AM script INFO: SUCCESS!@#KODE 1!@#USER_ID 26!@#ACTIVITY_CODE 1
12/12/2022 01:34:36 AM script INFO: SUCCESS!@#KODE 1!@#USER_ID 26!@#ACTIVITY_CODE 3
12/12/2022 01:34:36 AM script INFO: SUCCESS!@#KODE 1!@#USER_ID 26!@#ACTIVITY_CODE 3
12/12/2022 01:34:36 AM script INFO: SUCCESS!@#KODE 1!@#USER_ID 26!@#ACTIVITY_CODE 2
12/12/2022 01:34:36 AM script INFO: SUCCESS!@#KODE 1!@#USER_ID 26!@#ACTIVITY_CODE 1
12/12/2022 01:34:36 AM script INFO: SUCCESS!@#KODE 1!@#USER_ID 26!@#ACTIVITY_CODE 1
12/12/2022 01:34:36 AM script INFO: SUCCESS!@#KODE 1!@#USER_ID 26!@#ACTIVITY_CODE 2
12/12/2022 01:34:37 AM script INFO: SUCCESS!@#KODE 1!@#USER_ID 26!@#ACTIVITY_CODE 3
12/12/2022 01:34:37 AM script INFO: SUCCESS!@#KODE 1!@#USER_ID 26!@#ACTIVITY_CODE 4
12/12/2022 01:34:37 AM script INFO: SUCCESS!@#KODE 1!@#USER_ID 26!@#ACTIVITY_CODE 1
12/12/2022 01:34:37 AM script INFO: SUCCESS!@#KODE 1!@#USER_ID 26!@#ACTIVITY_CODE 2
12/12/2022 01:34:37 AM script INFO: SUCCESS!@#KODE 1!@#USER_ID 26!@#ACTIVITY_CODE 1
12/12/2022 01:34:37 AM script INFO: SUCCESS!@#KODE 1!@#USER_ID 26!@#ACTIVITY_CODE 4
12/12/2022 01:34:37 AM script INFO: SUCCESS!@#KODE 1!@#USER_ID 26!@#ACTIVITY_CODE 3
12/12/2022 01:34:37 AM script INFO: SUCCESS!@#KODE 1!@#USER_ID 26!@#ACTIVITY_CODE 1
12/12/2022 01:34:37 AM script INFO: SUCCESS!@#KODE 1!@#USER_ID 26!@#ACTIVITY_CODE 2
12/12/2022 01:34:37 AM script INFO: SUCCESS!@#KODE 1!@#USER_ID 26!@#ACTIVITY_CODE 1
12/12/2022 01:34:37 AM script INFO: SUCCESS!@#KODE 1!@#USER_ID 26!@#ACTIVITY_CODE 4
12/12/2022 01:34:37 AM script INFO: SUCCESS!@#KODE 1!@#USER_ID 26!@#ACTIVITY_CODE 2
12/12/2022 01:34:37 AM script INFO: SUCCESS!@#KODE 1!@#USER_ID 26!@#ACTIVITY_CODE 1
12/12/2022 01:34:37 AM script INFO: SUCCESS!@#KODE 1!@#USER_ID 26!@#ACTIVITY_CODE 3
12/12/2022 01:34:37 AM script INFO: SUCCESS!@#KODE 1!@#USER_ID 26!@#ACTIVITY_CODE 3
12/12/2022 01:34:37 AM script INFO: SUCCESS!@#KODE 1!@#USER_ID 26!@#ACTIVITY_CODE 4
12/12/2022 01:34:37 AM script INFO: SUCCESS!@#KODE 1!@#USER_ID 26!@#ACTIVITY_CODE 3
12/12/2022 01:34:38 AM script INFO: SUCCESS!@#KODE 1!@#USER_ID 26!@#ACTIVITY_CODE 3
12/12/2022 01:34:38 AM script INFO: SUCCESS!@#KODE 1!@#USER_ID 26!@#ACTIVITY_CODE 2
12/12/2022 01:34:38 AM script INFO: SUCCESS!@#KODE 1!@#USER_ID 26!@#ACTIVITY_CODE 2
12/12/2022 01:34:38 AM script INFO: SUCCESS!@#KODE 1!@#USER_ID 26!@#ACTIVITY_CODE 1
12/12/2022 01:34:38 AM script INFO: SUCCESS!@#KODE 1!@#USER_ID 26!@#ACTIVITY_CODE 2
12/12/2022 01:34:38 AM script INFO: SUCCESS!@#KODE 1!@#USER_ID 26!@#ACTIVITY_CODE 3
12/12/2022 01:34:38 AM script INFO: SUCCESS!@#KODE 1!@#USER_ID 26!@#ACTIVITY_CODE 1
12/12/2022 01:34:38 AM script INFO: SUCCESS!@#KODE 1!@#USER_ID 26!@#ACTIVITY_CODE 3
12/12/2022 01:34:38 AM script INFO: SUCCESS!@#KODE 1!@#USER_ID 26!@#ACTIVITY_CODE 2
12/12/2022 01:34:38 AM script INFO: SUCCESS!@#KODE 1!@#USER_ID 26!@#ACTIVITY_CODE 2
12/12/2022 01:34:38 AM script INFO: SUCCESS!@#KODE 1!@#USER_ID 26!@#ACTIVITY_CODE 2
12/12/2022 01:34:38 AM script INFO: SUCCESS!@#KODE 1!@#USER_ID 26!@#ACTIVITY_CODE 4
12/12/2022 01:34:38 AM script INFO: SUCCESS!@#KODE 1!@#USER_ID 26!@#ACTIVITY_CODE 2
12/12/2022 01:34:39 AM script INFO: SUCCESS!@#KODE 1!@#USER_ID 26!@#ACTIVITY_CODE 1
12/12/2022 01:34:39 AM script INFO: SUCCESS!@#KODE 1!@#USER_ID 26!@#ACTIVITY_CODE 2
12/12/2022 01:34:39 AM script INFO: SUCCESS!@#KODE 1!@#USER_ID 26!@#ACTIVITY_CODE 1
12/12/2022 01:34:39 AM script INFO: SUCCESS!@#KODE 1!@#USER_ID 26!@#ACTIVITY_CODE 4
12/12/2022 01:34:39 AM script INFO: SUCCESS!@#KODE 1!@#USER_ID 26!@#ACTIVITY_CODE 1
12/12/2022 01:34:39 AM script INFO: SUCCESS!@#KODE 1!@#USER_ID 26!@#ACTIVITY_CODE 4
12/12/2022 01:34:39 AM script INFO: SUCCESS!@#KODE 1!@#USER_ID 26!@#ACTIVITY_CODE 1
12/12/2022 01:34:39 AM script INFO: SUCCESS!@#KODE 1!@#USER_ID 26!@#ACTIVITY_CODE 2
12/12/2022 01:34:39 AM script INFO: SUCCESS!@#KODE 1!@#USER_ID 26!@#ACTIVITY_CODE 3
12/12/2022 01:34:39 AM script INFO: SUCCESS!@#KODE 1!@#USER_ID 26!@#ACTIVITY_CODE 1
12/12/2022 01:34:39 AM script INFO: SUCCESS!@#KODE 1!@#USER_ID 26!@#ACTIVITY_CODE 1
12/12/2022 01:34:39 AM script INFO: SUCCESS!@#KODE 1!@#USER_ID 26!@#ACTIVITY_CODE 3
12/12/2022 01:34:39 AM script INFO: SUCCESS!@#KODE 1!@#USER_ID 26!@#ACTIVITY_CODE 1
12/12/2022 01:34:39 AM script INFO: SUCCESS!@#KODE 1!@#USER_ID 26!@#ACTIVITY_CODE 2
12/12/2022 01:34:39 AM script INFO: SUCCESS!@#KODE 1!@#USER_ID 26!@#ACTIVITY_CODE 1
12/12/2022 01:34:39 AM script INFO: SUCCESS!@#KODE 1!@#USER_ID 26!@#ACTIVITY_CODE 1
12/12/2022 01:34:39 AM script INFO: SUCCESS!@#KODE 1!@#USER_ID 26!@#ACTIVITY_CODE 1
12/12/2022 01:34:39 AM script INFO: SUCCESS!@#KODE 1!@#USER_ID 26!@#ACTIVITY_CODE 2
12/12/2022 01:34:39 AM script INFO: SUCCESS!@#KODE 1!@#USER_ID 26!@#ACTIVITY_CODE 1
12/12/2022 01:34:40 AM script INFO: SUCCESS!@#KODE 1!@#USER_ID 26!@#ACTIVITY_CODE 2
12/12/2022 01:34:40 AM script INFO: SUCCESS!@#KODE 1!@#USER_ID 26!@#ACTIVITY_CODE 4
12/12/2022 01:34:40 AM script INFO: SUCCESS!@#KODE 1!@#USER_ID 26!@#ACTIVITY_CODE 1
12/12/2022 01:34:40 AM script INFO: SUCCESS!@#KODE 1!@#USER_ID 26!@#ACTIVITY_CODE 3
12/12/2022 01:34:40 AM script INFO: SUCCESS!@#KODE 1!@#USER_ID 26!@#ACTIVITY_CODE 4
12/12/2022 01:34:40 AM script INFO: SUCCESS!@#KODE 1!@#USER_ID 26!@#ACTIVITY_CODE 1
12/12/2022 01:34:40 AM script INFO: SUCCESS!@#KODE 1!@#USER_ID 26!@#ACTIVITY_CODE 4
12/12/2022 01:34:40 AM script INFO: SUCCESS!@#KODE 1!@#USER_ID 26!@#ACTIVITY_CODE 1
12/12/2022 01:34:40 AM script INFO: SUCCESS!@#KODE 1!@#USER_ID 26!@#ACTIVITY_CODE 2
12/12/2022 01:34:40 AM script INFO: Duration: 56.57295846939087
12/12/2022 01:34:40 AM script INFO: mengakhiri-quiz
12/12/2022 01:34:41 AM script INFO: SUCCESS!@#KODE 1!@#USER_ID 26!@#ACTIVITY_CODE 5
12/12/2022 01:34:41 AM script INFO: berhasil-submit
