12/21/2022 02:29:40 PM script INFO: Prepared chrome options..
12/21/2022 02:29:42 PM script INFO: Initialized chrome browser..
12/21/2022 02:29:42 PM script INFO: mengakses-homepage
12/21/2022 02:30:00 PM script INFO: mengakses-login-page
12/21/2022 02:30:02 PM script INFO: mengakses-site-home
12/21/2022 02:30:03 PM script INFO: mengakses-site-course
12/21/2022 02:30:23 PM script INFO: mengakses-quiz
12/21/2022 02:30:37 PM script INFO: mengakses-start-quiz-page
12/21/2022 02:30:46 PM script INFO: memulai-quiz
12/21/2022 02:30:46 PM script INFO: SUCCESS!@#KODE 1!@#USER_ID 102!@#ACTIVITY_CODE 5
12/21/2022 02:30:57 PM script INFO: SUCCESS!@#KODE 1!@#USER_ID 102!@#ACTIVITY_CODE 1
12/21/2022 02:30:57 PM script INFO: SUCCESS!@#KODE 1!@#USER_ID 102!@#ACTIVITY_CODE 5
12/21/2022 02:30:57 PM script INFO: SUCCESS!@#KODE 1!@#USER_ID 102!@#ACTIVITY_CODE 5
12/21/2022 02:31:00 PM script INFO: SUCCESS!@#KODE 1!@#USER_ID 102!@#ACTIVITY_CODE 1
12/21/2022 02:31:00 PM script INFO: SUCCESS!@#KODE 1!@#USER_ID 102!@#ACTIVITY_CODE 3
12/21/2022 02:31:00 PM script INFO: SUCCESS!@#KODE 1!@#USER_ID 102!@#ACTIVITY_CODE 2
12/21/2022 02:31:00 PM script INFO: SUCCESS!@#KODE 1!@#USER_ID 102!@#ACTIVITY_CODE 3
12/21/2022 02:31:00 PM script INFO: SUCCESS!@#KODE 1!@#USER_ID 102!@#ACTIVITY_CODE 3
12/21/2022 02:31:00 PM script INFO: SUCCESS!@#KODE 1!@#USER_ID 102!@#ACTIVITY_CODE 5
12/21/2022 02:31:00 PM script INFO: SUCCESS!@#KODE 1!@#USER_ID 102!@#ACTIVITY_CODE 5
12/21/2022 02:31:03 PM script INFO: SUCCESS!@#KODE 1!@#USER_ID 102!@#ACTIVITY_CODE 2
12/21/2022 02:31:03 PM script INFO: SUCCESS!@#KODE 1!@#USER_ID 102!@#ACTIVITY_CODE 5
12/21/2022 02:31:03 PM script INFO: SUCCESS!@#KODE 1!@#USER_ID 102!@#ACTIVITY_CODE 5
12/21/2022 02:31:05 PM script INFO: SUCCESS!@#KODE 1!@#USER_ID 102!@#ACTIVITY_CODE 3
12/21/2022 02:31:05 PM script INFO: SUCCESS!@#KODE 1!@#USER_ID 102!@#ACTIVITY_CODE 1
12/21/2022 02:31:05 PM script INFO: SUCCESS!@#KODE 1!@#USER_ID 102!@#ACTIVITY_CODE 5
12/21/2022 02:31:05 PM script INFO: SUCCESS!@#KODE 1!@#USER_ID 102!@#ACTIVITY_CODE 5
12/21/2022 02:31:08 PM script INFO: SUCCESS!@#KODE 1!@#USER_ID 102!@#ACTIVITY_CODE 3
12/21/2022 02:31:08 PM script INFO: SUCCESS!@#KODE 1!@#USER_ID 102!@#ACTIVITY_CODE 5
12/21/2022 02:31:08 PM script INFO: SUCCESS!@#KODE 1!@#USER_ID 102!@#ACTIVITY_CODE 5
12/21/2022 02:31:10 PM script INFO: SUCCESS!@#KODE 1!@#USER_ID 102!@#ACTIVITY_CODE 3
12/21/2022 02:31:10 PM script INFO: SUCCESS!@#KODE 1!@#USER_ID 102!@#ACTIVITY_CODE 2
12/21/2022 02:31:10 PM script INFO: SUCCESS!@#KODE 1!@#USER_ID 102!@#ACTIVITY_CODE 5
12/21/2022 02:31:10 PM script INFO: SUCCESS!@#KODE 1!@#USER_ID 102!@#ACTIVITY_CODE 5
12/21/2022 02:31:13 PM script INFO: SUCCESS!@#KODE 1!@#USER_ID 102!@#ACTIVITY_CODE 1
12/21/2022 02:31:13 PM script INFO: SUCCESS!@#KODE 1!@#USER_ID 102!@#ACTIVITY_CODE 4
12/21/2022 02:31:13 PM script INFO: SUCCESS!@#KODE 1!@#USER_ID 102!@#ACTIVITY_CODE 1
12/21/2022 02:31:13 PM script INFO: SUCCESS!@#KODE 1!@#USER_ID 102!@#ACTIVITY_CODE 1
12/21/2022 02:31:13 PM script INFO: SUCCESS!@#KODE 1!@#USER_ID 102!@#ACTIVITY_CODE 1
12/21/2022 02:31:13 PM script INFO: SUCCESS!@#KODE 1!@#USER_ID 102!@#ACTIVITY_CODE 4
12/21/2022 02:31:13 PM script INFO: SUCCESS!@#KODE 1!@#USER_ID 102!@#ACTIVITY_CODE 2
12/21/2022 02:31:13 PM script INFO: SUCCESS!@#KODE 1!@#USER_ID 102!@#ACTIVITY_CODE 1
12/21/2022 02:31:14 PM script INFO: SUCCESS!@#KODE 1!@#USER_ID 102!@#ACTIVITY_CODE 3
12/21/2022 02:31:14 PM script INFO: SUCCESS!@#KODE 1!@#USER_ID 102!@#ACTIVITY_CODE 1
12/21/2022 02:31:14 PM script INFO: SUCCESS!@#KODE 1!@#USER_ID 102!@#ACTIVITY_CODE 1
12/21/2022 02:31:14 PM script INFO: SUCCESS!@#KODE 1!@#USER_ID 102!@#ACTIVITY_CODE 4
12/21/2022 02:31:14 PM script INFO: SUCCESS!@#KODE 1!@#USER_ID 102!@#ACTIVITY_CODE 3
12/21/2022 02:31:14 PM script INFO: SUCCESS!@#KODE 1!@#USER_ID 102!@#ACTIVITY_CODE 3
12/21/2022 02:31:14 PM script INFO: SUCCESS!@#KODE 1!@#USER_ID 102!@#ACTIVITY_CODE 1
12/21/2022 02:31:14 PM script INFO: SUCCESS!@#KODE 1!@#USER_ID 102!@#ACTIVITY_CODE 4
12/21/2022 02:31:14 PM script INFO: SUCCESS!@#KODE 1!@#USER_ID 102!@#ACTIVITY_CODE 1
12/21/2022 02:31:14 PM script INFO: SUCCESS!@#KODE 1!@#USER_ID 102!@#ACTIVITY_CODE 4
12/21/2022 02:31:14 PM script INFO: SUCCESS!@#KODE 1!@#USER_ID 102!@#ACTIVITY_CODE 2
12/21/2022 02:31:14 PM script INFO: SUCCESS!@#KODE 1!@#USER_ID 102!@#ACTIVITY_CODE 3
12/21/2022 02:31:14 PM script INFO: SUCCESS!@#KODE 1!@#USER_ID 102!@#ACTIVITY_CODE 2
12/21/2022 02:31:14 PM script INFO: SUCCESS!@#KODE 1!@#USER_ID 102!@#ACTIVITY_CODE 3
12/21/2022 02:31:15 PM script INFO: SUCCESS!@#KODE 1!@#USER_ID 102!@#ACTIVITY_CODE 3
12/21/2022 02:31:15 PM script INFO: SUCCESS!@#KODE 1!@#USER_ID 102!@#ACTIVITY_CODE 1
12/21/2022 02:31:15 PM script INFO: Duration: 17.63036012649536
12/21/2022 02:31:15 PM script INFO: mengakhiri-quiz
12/21/2022 02:31:15 PM script INFO: SUCCESS!@#KODE 1!@#USER_ID 102!@#ACTIVITY_CODE 5
12/21/2022 02:31:15 PM script INFO: berhasil-submit
