12/12/2022 01:32:05 AM script INFO: Prepared chrome options..
12/12/2022 01:32:07 AM script INFO: Initialized chrome browser..
12/12/2022 01:32:07 AM script INFO: mengakses-homepage
12/12/2022 01:32:13 AM script INFO: mengakses-login-page
12/12/2022 01:32:14 AM script INFO: mengakses-site-home
12/12/2022 01:32:14 AM script INFO: mengakses-site-course
12/12/2022 01:32:15 AM script INFO: mengakses-quiz
12/12/2022 01:32:16 AM script INFO: mengakses-start-quiz-page
12/12/2022 01:32:17 AM script INFO: memulai-quiz
12/12/2022 01:32:17 AM script INFO: SUCCESS!@#KODE 1!@#USER_ID 69!@#ACTIVITY_CODE 5
12/12/2022 01:32:27 AM script INFO: SUCCESS!@#KODE 1!@#USER_ID 69!@#ACTIVITY_CODE 5
12/12/2022 01:32:27 AM script INFO: SUCCESS!@#KODE 1!@#USER_ID 69!@#ACTIVITY_CODE 5
12/12/2022 01:32:30 AM script INFO: SUCCESS!@#KODE 1!@#USER_ID 69!@#ACTIVITY_CODE 1
12/12/2022 01:32:30 AM script INFO: SUCCESS!@#KODE 1!@#USER_ID 69!@#ACTIVITY_CODE 4
12/12/2022 01:32:30 AM script INFO: SUCCESS!@#KODE 1!@#USER_ID 69!@#ACTIVITY_CODE 1
12/12/2022 01:32:30 AM script INFO: SUCCESS!@#KODE 1!@#USER_ID 69!@#ACTIVITY_CODE 1
12/12/2022 01:32:30 AM script INFO: SUCCESS!@#KODE 1!@#USER_ID 69!@#ACTIVITY_CODE 5
12/12/2022 01:32:30 AM script INFO: SUCCESS!@#KODE 1!@#USER_ID 69!@#ACTIVITY_CODE 5
12/12/2022 01:32:33 AM script INFO: SUCCESS!@#KODE 1!@#USER_ID 69!@#ACTIVITY_CODE 2
12/12/2022 01:32:33 AM script INFO: SUCCESS!@#KODE 1!@#USER_ID 69!@#ACTIVITY_CODE 5
12/12/2022 01:32:33 AM script INFO: SUCCESS!@#KODE 1!@#USER_ID 69!@#ACTIVITY_CODE 5
12/12/2022 01:32:35 AM script INFO: SUCCESS!@#KODE 1!@#USER_ID 69!@#ACTIVITY_CODE 1
12/12/2022 01:32:36 AM script INFO: SUCCESS!@#KODE 1!@#USER_ID 69!@#ACTIVITY_CODE 4
12/12/2022 01:32:36 AM script INFO: SUCCESS!@#KODE 1!@#USER_ID 69!@#ACTIVITY_CODE 1
12/12/2022 01:32:36 AM script INFO: SUCCESS!@#KODE 1!@#USER_ID 69!@#ACTIVITY_CODE 2
12/12/2022 01:32:36 AM script INFO: SUCCESS!@#KODE 1!@#USER_ID 69!@#ACTIVITY_CODE 2
12/12/2022 01:32:36 AM script INFO: SUCCESS!@#KODE 1!@#USER_ID 69!@#ACTIVITY_CODE 1
12/12/2022 01:32:36 AM script INFO: SUCCESS!@#KODE 1!@#USER_ID 69!@#ACTIVITY_CODE 2
12/12/2022 01:32:36 AM script INFO: SUCCESS!@#KODE 1!@#USER_ID 69!@#ACTIVITY_CODE 2
12/12/2022 01:32:36 AM script INFO: SUCCESS!@#KODE 1!@#USER_ID 69!@#ACTIVITY_CODE 2
12/12/2022 01:32:36 AM script INFO: SUCCESS!@#KODE 1!@#USER_ID 69!@#ACTIVITY_CODE 5
12/12/2022 01:32:36 AM script INFO: SUCCESS!@#KODE 1!@#USER_ID 69!@#ACTIVITY_CODE 5
12/12/2022 01:32:39 AM script INFO: SUCCESS!@#KODE 1!@#USER_ID 69!@#ACTIVITY_CODE 3
12/12/2022 01:32:39 AM script INFO: SUCCESS!@#KODE 1!@#USER_ID 69!@#ACTIVITY_CODE 5
12/12/2022 01:32:39 AM script INFO: SUCCESS!@#KODE 1!@#USER_ID 69!@#ACTIVITY_CODE 5
12/12/2022 01:32:42 AM script INFO: SUCCESS!@#KODE 1!@#USER_ID 69!@#ACTIVITY_CODE 3
12/12/2022 01:32:42 AM script INFO: SUCCESS!@#KODE 1!@#USER_ID 69!@#ACTIVITY_CODE 1
12/12/2022 01:32:42 AM script INFO: SUCCESS!@#KODE 1!@#USER_ID 69!@#ACTIVITY_CODE 2
12/12/2022 01:32:42 AM script INFO: SUCCESS!@#KODE 1!@#USER_ID 69!@#ACTIVITY_CODE 1
12/12/2022 01:32:42 AM script INFO: SUCCESS!@#KODE 1!@#USER_ID 69!@#ACTIVITY_CODE 1
12/12/2022 01:32:42 AM script INFO: SUCCESS!@#KODE 1!@#USER_ID 69!@#ACTIVITY_CODE 4
12/12/2022 01:32:42 AM script INFO: SUCCESS!@#KODE 1!@#USER_ID 69!@#ACTIVITY_CODE 5
12/12/2022 01:32:42 AM script INFO: SUCCESS!@#KODE 1!@#USER_ID 69!@#ACTIVITY_CODE 5
12/12/2022 01:32:45 AM script INFO: SUCCESS!@#KODE 1!@#USER_ID 69!@#ACTIVITY_CODE 2
12/12/2022 01:32:45 AM script INFO: SUCCESS!@#KODE 1!@#USER_ID 69!@#ACTIVITY_CODE 4
12/12/2022 01:32:45 AM script INFO: SUCCESS!@#KODE 1!@#USER_ID 69!@#ACTIVITY_CODE 3
12/12/2022 01:32:45 AM script INFO: SUCCESS!@#KODE 1!@#USER_ID 69!@#ACTIVITY_CODE 1
12/12/2022 01:32:45 AM script INFO: SUCCESS!@#KODE 1!@#USER_ID 69!@#ACTIVITY_CODE 3
12/12/2022 01:32:45 AM script INFO: SUCCESS!@#KODE 1!@#USER_ID 69!@#ACTIVITY_CODE 1
12/12/2022 01:32:45 AM script INFO: SUCCESS!@#KODE 1!@#USER_ID 69!@#ACTIVITY_CODE 3
12/12/2022 01:32:45 AM script INFO: SUCCESS!@#KODE 1!@#USER_ID 69!@#ACTIVITY_CODE 1
12/12/2022 01:32:45 AM script INFO: SUCCESS!@#KODE 1!@#USER_ID 69!@#ACTIVITY_CODE 4
12/12/2022 01:32:45 AM script INFO: SUCCESS!@#KODE 1!@#USER_ID 69!@#ACTIVITY_CODE 1
12/12/2022 01:32:45 AM script INFO: SUCCESS!@#KODE 1!@#USER_ID 69!@#ACTIVITY_CODE 2
12/12/2022 01:32:45 AM script INFO: SUCCESS!@#KODE 1!@#USER_ID 69!@#ACTIVITY_CODE 3
12/12/2022 01:32:45 AM script INFO: SUCCESS!@#KODE 1!@#USER_ID 69!@#ACTIVITY_CODE 5
12/12/2022 01:32:45 AM script INFO: SUCCESS!@#KODE 1!@#USER_ID 69!@#ACTIVITY_CODE 5
12/12/2022 01:32:48 AM script INFO: SUCCESS!@#KODE 1!@#USER_ID 69!@#ACTIVITY_CODE 5
12/12/2022 01:32:48 AM script INFO: SUCCESS!@#KODE 1!@#USER_ID 69!@#ACTIVITY_CODE 5
12/12/2022 01:32:50 AM script INFO: SUCCESS!@#KODE 1!@#USER_ID 69!@#ACTIVITY_CODE 2
12/12/2022 01:32:51 AM script INFO: SUCCESS!@#KODE 1!@#USER_ID 69!@#ACTIVITY_CODE 2
12/12/2022 01:32:51 AM script INFO: SUCCESS!@#KODE 1!@#USER_ID 69!@#ACTIVITY_CODE 5
12/12/2022 01:32:51 AM script INFO: SUCCESS!@#KODE 1!@#USER_ID 69!@#ACTIVITY_CODE 5
12/12/2022 01:32:53 AM script INFO: SUCCESS!@#KODE 1!@#USER_ID 69!@#ACTIVITY_CODE 5
12/12/2022 01:32:53 AM script INFO: SUCCESS!@#KODE 1!@#USER_ID 69!@#ACTIVITY_CODE 5
12/12/2022 01:32:56 AM script INFO: SUCCESS!@#KODE 1!@#USER_ID 69!@#ACTIVITY_CODE 2
12/12/2022 01:32:56 AM script INFO: SUCCESS!@#KODE 1!@#USER_ID 69!@#ACTIVITY_CODE 2
12/12/2022 01:32:56 AM script INFO: SUCCESS!@#KODE 1!@#USER_ID 69!@#ACTIVITY_CODE 3
12/12/2022 01:32:56 AM script INFO: SUCCESS!@#KODE 1!@#USER_ID 69!@#ACTIVITY_CODE 5
12/12/2022 01:32:56 AM script INFO: SUCCESS!@#KODE 1!@#USER_ID 69!@#ACTIVITY_CODE 5
12/12/2022 01:32:59 AM script INFO: SUCCESS!@#KODE 1!@#USER_ID 69!@#ACTIVITY_CODE 2
12/12/2022 01:32:59 AM script INFO: SUCCESS!@#KODE 1!@#USER_ID 69!@#ACTIVITY_CODE 5
12/12/2022 01:32:59 AM script INFO: SUCCESS!@#KODE 1!@#USER_ID 69!@#ACTIVITY_CODE 5
12/12/2022 01:33:01 AM script INFO: SUCCESS!@#KODE 1!@#USER_ID 69!@#ACTIVITY_CODE 2
12/12/2022 01:33:01 AM script INFO: SUCCESS!@#KODE 1!@#USER_ID 69!@#ACTIVITY_CODE 3
12/12/2022 01:33:01 AM script INFO: SUCCESS!@#KODE 1!@#USER_ID 69!@#ACTIVITY_CODE 5
12/12/2022 01:33:01 AM script INFO: SUCCESS!@#KODE 1!@#USER_ID 69!@#ACTIVITY_CODE 5
12/12/2022 01:33:04 AM script INFO: SUCCESS!@#KODE 1!@#USER_ID 69!@#ACTIVITY_CODE 1
12/12/2022 01:33:04 AM script INFO: SUCCESS!@#KODE 1!@#USER_ID 69!@#ACTIVITY_CODE 3
12/12/2022 01:33:04 AM script INFO: SUCCESS!@#KODE 1!@#USER_ID 69!@#ACTIVITY_CODE 3
12/12/2022 01:33:04 AM script INFO: SUCCESS!@#KODE 1!@#USER_ID 69!@#ACTIVITY_CODE 4
12/12/2022 01:33:04 AM script INFO: SUCCESS!@#KODE 1!@#USER_ID 69!@#ACTIVITY_CODE 1
12/12/2022 01:33:04 AM script INFO: SUCCESS!@#KODE 1!@#USER_ID 69!@#ACTIVITY_CODE 3
12/12/2022 01:33:04 AM script INFO: SUCCESS!@#KODE 1!@#USER_ID 69!@#ACTIVITY_CODE 3
12/12/2022 01:33:04 AM script INFO: SUCCESS!@#KODE 1!@#USER_ID 69!@#ACTIVITY_CODE 5
12/12/2022 01:33:04 AM script INFO: SUCCESS!@#KODE 1!@#USER_ID 69!@#ACTIVITY_CODE 5
12/12/2022 01:33:07 AM script INFO: SUCCESS!@#KODE 1!@#USER_ID 69!@#ACTIVITY_CODE 4
12/12/2022 01:33:07 AM script INFO: SUCCESS!@#KODE 1!@#USER_ID 69!@#ACTIVITY_CODE 3
12/12/2022 01:33:07 AM script INFO: SUCCESS!@#KODE 1!@#USER_ID 69!@#ACTIVITY_CODE 3
12/12/2022 01:33:07 AM script INFO: SUCCESS!@#KODE 1!@#USER_ID 69!@#ACTIVITY_CODE 5
12/12/2022 01:33:07 AM script INFO: SUCCESS!@#KODE 1!@#USER_ID 69!@#ACTIVITY_CODE 5
12/12/2022 01:33:09 AM script INFO: SUCCESS!@#KODE 1!@#USER_ID 69!@#ACTIVITY_CODE 3
12/12/2022 01:33:10 AM script INFO: SUCCESS!@#KODE 1!@#USER_ID 69!@#ACTIVITY_CODE 2
12/12/2022 01:33:10 AM script INFO: SUCCESS!@#KODE 1!@#USER_ID 69!@#ACTIVITY_CODE 4
12/12/2022 01:33:10 AM script INFO: SUCCESS!@#KODE 1!@#USER_ID 69!@#ACTIVITY_CODE 3
12/12/2022 01:33:10 AM script INFO: SUCCESS!@#KODE 1!@#USER_ID 69!@#ACTIVITY_CODE 5
12/12/2022 01:33:10 AM script INFO: SUCCESS!@#KODE 1!@#USER_ID 69!@#ACTIVITY_CODE 5
12/12/2022 01:33:12 AM script INFO: SUCCESS!@#KODE 1!@#USER_ID 69!@#ACTIVITY_CODE 1
12/12/2022 01:33:12 AM script INFO: SUCCESS!@#KODE 1!@#USER_ID 69!@#ACTIVITY_CODE 1
12/12/2022 01:33:13 AM script INFO: SUCCESS!@#KODE 1!@#USER_ID 69!@#ACTIVITY_CODE 2
12/12/2022 01:33:13 AM script INFO: SUCCESS!@#KODE 1!@#USER_ID 69!@#ACTIVITY_CODE 2
12/12/2022 01:33:13 AM script INFO: SUCCESS!@#KODE 1!@#USER_ID 69!@#ACTIVITY_CODE 1
12/12/2022 01:33:13 AM script INFO: SUCCESS!@#KODE 1!@#USER_ID 69!@#ACTIVITY_CODE 3
12/12/2022 01:33:13 AM script INFO: SUCCESS!@#KODE 1!@#USER_ID 69!@#ACTIVITY_CODE 1
12/12/2022 01:33:13 AM script INFO: SUCCESS!@#KODE 1!@#USER_ID 69!@#ACTIVITY_CODE 3
12/12/2022 01:33:13 AM script INFO: SUCCESS!@#KODE 1!@#USER_ID 69!@#ACTIVITY_CODE 1
12/12/2022 01:33:13 AM script INFO: SUCCESS!@#KODE 1!@#USER_ID 69!@#ACTIVITY_CODE 1
12/12/2022 01:33:13 AM script INFO: SUCCESS!@#KODE 1!@#USER_ID 69!@#ACTIVITY_CODE 4
12/12/2022 01:33:13 AM script INFO: SUCCESS!@#KODE 1!@#USER_ID 69!@#ACTIVITY_CODE 2
12/12/2022 01:33:13 AM script INFO: SUCCESS!@#KODE 1!@#USER_ID 69!@#ACTIVITY_CODE 1
12/12/2022 01:33:13 AM script INFO: SUCCESS!@#KODE 1!@#USER_ID 69!@#ACTIVITY_CODE 3
12/12/2022 01:33:13 AM script INFO: SUCCESS!@#KODE 1!@#USER_ID 69!@#ACTIVITY_CODE 1
12/12/2022 01:33:13 AM script INFO: SUCCESS!@#KODE 1!@#USER_ID 69!@#ACTIVITY_CODE 4
12/12/2022 01:33:14 AM script INFO: SUCCESS!@#KODE 1!@#USER_ID 69!@#ACTIVITY_CODE 2
12/12/2022 01:33:14 AM script INFO: SUCCESS!@#KODE 1!@#USER_ID 69!@#ACTIVITY_CODE 2
12/12/2022 01:33:14 AM script INFO: SUCCESS!@#KODE 1!@#USER_ID 69!@#ACTIVITY_CODE 3
12/12/2022 01:33:14 AM script INFO: SUCCESS!@#KODE 1!@#USER_ID 69!@#ACTIVITY_CODE 3
12/12/2022 01:33:14 AM script INFO: SUCCESS!@#KODE 1!@#USER_ID 69!@#ACTIVITY_CODE 3
12/12/2022 01:33:14 AM script INFO: SUCCESS!@#KODE 1!@#USER_ID 69!@#ACTIVITY_CODE 1
12/12/2022 01:33:14 AM script INFO: SUCCESS!@#KODE 1!@#USER_ID 69!@#ACTIVITY_CODE 3
12/12/2022 01:33:14 AM script INFO: SUCCESS!@#KODE 1!@#USER_ID 69!@#ACTIVITY_CODE 1
12/12/2022 01:33:14 AM script INFO: SUCCESS!@#KODE 1!@#USER_ID 69!@#ACTIVITY_CODE 1
12/12/2022 01:33:14 AM script INFO: SUCCESS!@#KODE 1!@#USER_ID 69!@#ACTIVITY_CODE 3
12/12/2022 01:33:14 AM script INFO: SUCCESS!@#KODE 1!@#USER_ID 69!@#ACTIVITY_CODE 2
12/12/2022 01:33:15 AM script INFO: SUCCESS!@#KODE 1!@#USER_ID 69!@#ACTIVITY_CODE 1
12/12/2022 01:33:15 AM script INFO: SUCCESS!@#KODE 1!@#USER_ID 69!@#ACTIVITY_CODE 4
12/12/2022 01:33:15 AM script INFO: SUCCESS!@#KODE 1!@#USER_ID 69!@#ACTIVITY_CODE 1
12/12/2022 01:33:15 AM script INFO: SUCCESS!@#KODE 1!@#USER_ID 69!@#ACTIVITY_CODE 3
12/12/2022 01:33:15 AM script INFO: SUCCESS!@#KODE 1!@#USER_ID 69!@#ACTIVITY_CODE 3
12/12/2022 01:33:15 AM script INFO: SUCCESS!@#KODE 1!@#USER_ID 69!@#ACTIVITY_CODE 3
12/12/2022 01:33:15 AM script INFO: SUCCESS!@#KODE 1!@#USER_ID 69!@#ACTIVITY_CODE 3
12/12/2022 01:33:15 AM script INFO: SUCCESS!@#KODE 1!@#USER_ID 69!@#ACTIVITY_CODE 1
12/12/2022 01:33:15 AM script INFO: SUCCESS!@#KODE 1!@#USER_ID 69!@#ACTIVITY_CODE 4
12/12/2022 01:33:15 AM script INFO: SUCCESS!@#KODE 1!@#USER_ID 69!@#ACTIVITY_CODE 1
12/12/2022 01:33:15 AM script INFO: SUCCESS!@#KODE 1!@#USER_ID 69!@#ACTIVITY_CODE 4
12/12/2022 01:33:15 AM script INFO: SUCCESS!@#KODE 1!@#USER_ID 69!@#ACTIVITY_CODE 3
12/12/2022 01:33:15 AM script INFO: SUCCESS!@#KODE 1!@#USER_ID 69!@#ACTIVITY_CODE 3
12/12/2022 01:33:15 AM script INFO: SUCCESS!@#KODE 1!@#USER_ID 69!@#ACTIVITY_CODE 3
12/12/2022 01:33:15 AM script INFO: SUCCESS!@#KODE 1!@#USER_ID 69!@#ACTIVITY_CODE 1
12/12/2022 01:33:16 AM script INFO: SUCCESS!@#KODE 1!@#USER_ID 69!@#ACTIVITY_CODE 2
12/12/2022 01:33:16 AM script INFO: SUCCESS!@#KODE 1!@#USER_ID 69!@#ACTIVITY_CODE 2
12/12/2022 01:33:16 AM script INFO: SUCCESS!@#KODE 1!@#USER_ID 69!@#ACTIVITY_CODE 1
12/12/2022 01:33:16 AM script INFO: SUCCESS!@#KODE 1!@#USER_ID 69!@#ACTIVITY_CODE 1
12/12/2022 01:33:16 AM script INFO: SUCCESS!@#KODE 1!@#USER_ID 69!@#ACTIVITY_CODE 1
12/12/2022 01:33:16 AM script INFO: SUCCESS!@#KODE 1!@#USER_ID 69!@#ACTIVITY_CODE 2
12/12/2022 01:33:16 AM script INFO: SUCCESS!@#KODE 1!@#USER_ID 69!@#ACTIVITY_CODE 2
12/12/2022 01:33:16 AM script INFO: SUCCESS!@#KODE 1!@#USER_ID 69!@#ACTIVITY_CODE 4
12/12/2022 01:33:16 AM script INFO: SUCCESS!@#KODE 1!@#USER_ID 69!@#ACTIVITY_CODE 3
12/12/2022 01:33:16 AM script INFO: SUCCESS!@#KODE 1!@#USER_ID 69!@#ACTIVITY_CODE 2
12/12/2022 01:33:17 AM script INFO: SUCCESS!@#KODE 1!@#USER_ID 69!@#ACTIVITY_CODE 3
12/12/2022 01:33:17 AM script INFO: SUCCESS!@#KODE 1!@#USER_ID 69!@#ACTIVITY_CODE 1
12/12/2022 01:33:17 AM script INFO: SUCCESS!@#KODE 1!@#USER_ID 69!@#ACTIVITY_CODE 3
12/12/2022 01:33:17 AM script INFO: SUCCESS!@#KODE 1!@#USER_ID 69!@#ACTIVITY_CODE 4
12/12/2022 01:33:17 AM script INFO: SUCCESS!@#KODE 1!@#USER_ID 69!@#ACTIVITY_CODE 1
12/12/2022 01:33:17 AM script INFO: SUCCESS!@#KODE 1!@#USER_ID 69!@#ACTIVITY_CODE 2
12/12/2022 01:33:17 AM script INFO: SUCCESS!@#KODE 1!@#USER_ID 69!@#ACTIVITY_CODE 2
12/12/2022 01:33:17 AM script INFO: SUCCESS!@#KODE 1!@#USER_ID 69!@#ACTIVITY_CODE 2
12/12/2022 01:33:17 AM script INFO: SUCCESS!@#KODE 1!@#USER_ID 69!@#ACTIVITY_CODE 1
12/12/2022 01:33:18 AM script INFO: SUCCESS!@#KODE 1!@#USER_ID 69!@#ACTIVITY_CODE 2
12/12/2022 01:33:18 AM script INFO: SUCCESS!@#KODE 1!@#USER_ID 69!@#ACTIVITY_CODE 2
12/12/2022 01:33:18 AM script INFO: SUCCESS!@#KODE 1!@#USER_ID 69!@#ACTIVITY_CODE 2
12/12/2022 01:33:18 AM script INFO: SUCCESS!@#KODE 1!@#USER_ID 69!@#ACTIVITY_CODE 3
12/12/2022 01:33:18 AM script INFO: SUCCESS!@#KODE 1!@#USER_ID 69!@#ACTIVITY_CODE 3
12/12/2022 01:33:18 AM script INFO: SUCCESS!@#KODE 1!@#USER_ID 69!@#ACTIVITY_CODE 1
12/12/2022 01:33:18 AM script INFO: SUCCESS!@#KODE 1!@#USER_ID 69!@#ACTIVITY_CODE 3
12/12/2022 01:33:18 AM script INFO: SUCCESS!@#KODE 1!@#USER_ID 69!@#ACTIVITY_CODE 2
12/12/2022 01:33:18 AM script INFO: SUCCESS!@#KODE 1!@#USER_ID 69!@#ACTIVITY_CODE 2
12/12/2022 01:33:19 AM script INFO: SUCCESS!@#KODE 1!@#USER_ID 69!@#ACTIVITY_CODE 2
12/12/2022 01:33:19 AM script INFO: SUCCESS!@#KODE 1!@#USER_ID 69!@#ACTIVITY_CODE 4
12/12/2022 01:33:19 AM script INFO: SUCCESS!@#KODE 1!@#USER_ID 69!@#ACTIVITY_CODE 2
12/12/2022 01:33:19 AM script INFO: SUCCESS!@#KODE 1!@#USER_ID 69!@#ACTIVITY_CODE 1
12/12/2022 01:33:19 AM script INFO: SUCCESS!@#KODE 1!@#USER_ID 69!@#ACTIVITY_CODE 4
12/12/2022 01:33:19 AM script INFO: SUCCESS!@#KODE 1!@#USER_ID 69!@#ACTIVITY_CODE 1
12/12/2022 01:33:19 AM script INFO: SUCCESS!@#KODE 1!@#USER_ID 69!@#ACTIVITY_CODE 4
12/12/2022 01:33:19 AM script INFO: SUCCESS!@#KODE 1!@#USER_ID 69!@#ACTIVITY_CODE 1
12/12/2022 01:33:19 AM script INFO: SUCCESS!@#KODE 1!@#USER_ID 69!@#ACTIVITY_CODE 2
12/12/2022 01:33:19 AM script INFO: SUCCESS!@#KODE 1!@#USER_ID 69!@#ACTIVITY_CODE 3
12/12/2022 01:33:20 AM script INFO: SUCCESS!@#KODE 1!@#USER_ID 69!@#ACTIVITY_CODE 2
12/12/2022 01:33:20 AM script INFO: SUCCESS!@#KODE 1!@#USER_ID 69!@#ACTIVITY_CODE 4
12/12/2022 01:33:20 AM script INFO: SUCCESS!@#KODE 1!@#USER_ID 69!@#ACTIVITY_CODE 3
12/12/2022 01:33:20 AM script INFO: SUCCESS!@#KODE 1!@#USER_ID 69!@#ACTIVITY_CODE 1
12/12/2022 01:33:20 AM script INFO: SUCCESS!@#KODE 1!@#USER_ID 69!@#ACTIVITY_CODE 1
12/12/2022 01:33:20 AM script INFO: SUCCESS!@#KODE 1!@#USER_ID 69!@#ACTIVITY_CODE 4
12/12/2022 01:33:20 AM script INFO: SUCCESS!@#KODE 1!@#USER_ID 69!@#ACTIVITY_CODE 2
12/12/2022 01:33:20 AM script INFO: SUCCESS!@#KODE 1!@#USER_ID 69!@#ACTIVITY_CODE 2
12/12/2022 01:33:20 AM script INFO: SUCCESS!@#KODE 1!@#USER_ID 69!@#ACTIVITY_CODE 2
12/12/2022 01:33:21 AM script INFO: SUCCESS!@#KODE 1!@#USER_ID 69!@#ACTIVITY_CODE 1
12/12/2022 01:33:21 AM script INFO: SUCCESS!@#KODE 1!@#USER_ID 69!@#ACTIVITY_CODE 1
12/12/2022 01:33:21 AM script INFO: SUCCESS!@#KODE 1!@#USER_ID 69!@#ACTIVITY_CODE 2
12/12/2022 01:33:21 AM script INFO: SUCCESS!@#KODE 1!@#USER_ID 69!@#ACTIVITY_CODE 1
12/12/2022 01:33:21 AM script INFO: SUCCESS!@#KODE 1!@#USER_ID 69!@#ACTIVITY_CODE 3
12/12/2022 01:33:21 AM script INFO: SUCCESS!@#KODE 1!@#USER_ID 69!@#ACTIVITY_CODE 2
12/12/2022 01:33:21 AM script INFO: SUCCESS!@#KODE 1!@#USER_ID 69!@#ACTIVITY_CODE 1
12/12/2022 01:33:21 AM script INFO: SUCCESS!@#KODE 1!@#USER_ID 69!@#ACTIVITY_CODE 3
12/12/2022 01:33:21 AM script INFO: SUCCESS!@#KODE 1!@#USER_ID 69!@#ACTIVITY_CODE 4
12/12/2022 01:33:22 AM script INFO: SUCCESS!@#KODE 1!@#USER_ID 69!@#ACTIVITY_CODE 1
12/12/2022 01:33:22 AM script INFO: SUCCESS!@#KODE 1!@#USER_ID 69!@#ACTIVITY_CODE 1
12/12/2022 01:33:22 AM script INFO: SUCCESS!@#KODE 1!@#USER_ID 69!@#ACTIVITY_CODE 3
12/12/2022 01:33:22 AM script INFO: SUCCESS!@#KODE 1!@#USER_ID 69!@#ACTIVITY_CODE 4
12/12/2022 01:33:22 AM script INFO: SUCCESS!@#KODE 1!@#USER_ID 69!@#ACTIVITY_CODE 1
12/12/2022 01:33:22 AM script INFO: SUCCESS!@#KODE 1!@#USER_ID 69!@#ACTIVITY_CODE 3
12/12/2022 01:33:22 AM script INFO: SUCCESS!@#KODE 1!@#USER_ID 69!@#ACTIVITY_CODE 2
12/12/2022 01:33:22 AM script INFO: SUCCESS!@#KODE 1!@#USER_ID 69!@#ACTIVITY_CODE 2
12/12/2022 01:33:22 AM script INFO: SUCCESS!@#KODE 1!@#USER_ID 69!@#ACTIVITY_CODE 1
12/12/2022 01:33:23 AM script INFO: SUCCESS!@#KODE 1!@#USER_ID 69!@#ACTIVITY_CODE 4
12/12/2022 01:33:23 AM script INFO: SUCCESS!@#KODE 1!@#USER_ID 69!@#ACTIVITY_CODE 1
12/12/2022 01:33:23 AM script INFO: SUCCESS!@#KODE 1!@#USER_ID 69!@#ACTIVITY_CODE 4
12/12/2022 01:33:23 AM script INFO: SUCCESS!@#KODE 1!@#USER_ID 69!@#ACTIVITY_CODE 3
12/12/2022 01:33:23 AM script INFO: SUCCESS!@#KODE 1!@#USER_ID 69!@#ACTIVITY_CODE 1
12/12/2022 01:33:23 AM script INFO: SUCCESS!@#KODE 1!@#USER_ID 69!@#ACTIVITY_CODE 3
12/12/2022 01:33:23 AM script INFO: SUCCESS!@#KODE 1!@#USER_ID 69!@#ACTIVITY_CODE 4
12/12/2022 01:33:23 AM script INFO: SUCCESS!@#KODE 1!@#USER_ID 69!@#ACTIVITY_CODE 1
12/12/2022 01:33:23 AM script INFO: SUCCESS!@#KODE 1!@#USER_ID 69!@#ACTIVITY_CODE 4
12/12/2022 01:33:24 AM script INFO: SUCCESS!@#KODE 1!@#USER_ID 69!@#ACTIVITY_CODE 3
12/12/2022 01:33:24 AM script INFO: SUCCESS!@#KODE 1!@#USER_ID 69!@#ACTIVITY_CODE 2
12/12/2022 01:33:24 AM script INFO: SUCCESS!@#KODE 1!@#USER_ID 69!@#ACTIVITY_CODE 2
12/12/2022 01:33:24 AM script INFO: SUCCESS!@#KODE 1!@#USER_ID 69!@#ACTIVITY_CODE 2
12/12/2022 01:33:24 AM script INFO: SUCCESS!@#KODE 1!@#USER_ID 69!@#ACTIVITY_CODE 3
12/12/2022 01:33:25 AM script INFO: SUCCESS!@#KODE 1!@#USER_ID 69!@#ACTIVITY_CODE 2
12/12/2022 01:33:25 AM script INFO: SUCCESS!@#KODE 1!@#USER_ID 69!@#ACTIVITY_CODE 1
12/12/2022 01:33:25 AM script INFO: SUCCESS!@#KODE 1!@#USER_ID 69!@#ACTIVITY_CODE 2
12/12/2022 01:33:25 AM script INFO: SUCCESS!@#KODE 1!@#USER_ID 69!@#ACTIVITY_CODE 1
12/12/2022 01:33:25 AM script INFO: SUCCESS!@#KODE 1!@#USER_ID 69!@#ACTIVITY_CODE 3
12/12/2022 01:33:25 AM script INFO: SUCCESS!@#KODE 1!@#USER_ID 69!@#ACTIVITY_CODE 3
12/12/2022 01:33:25 AM script INFO: SUCCESS!@#KODE 1!@#USER_ID 69!@#ACTIVITY_CODE 3
12/12/2022 01:33:25 AM script INFO: SUCCESS!@#KODE 1!@#USER_ID 69!@#ACTIVITY_CODE 4
12/12/2022 01:33:26 AM script INFO: SUCCESS!@#KODE 1!@#USER_ID 69!@#ACTIVITY_CODE 2
12/12/2022 01:33:26 AM script INFO: SUCCESS!@#KODE 1!@#USER_ID 69!@#ACTIVITY_CODE 1
12/12/2022 01:33:26 AM script INFO: SUCCESS!@#KODE 1!@#USER_ID 69!@#ACTIVITY_CODE 2
12/12/2022 01:33:26 AM script INFO: SUCCESS!@#KODE 1!@#USER_ID 69!@#ACTIVITY_CODE 4
12/12/2022 01:33:26 AM script INFO: SUCCESS!@#KODE 1!@#USER_ID 69!@#ACTIVITY_CODE 2
12/12/2022 01:33:26 AM script INFO: SUCCESS!@#KODE 1!@#USER_ID 69!@#ACTIVITY_CODE 3
12/12/2022 01:33:27 AM script INFO: SUCCESS!@#KODE 1!@#USER_ID 69!@#ACTIVITY_CODE 3
12/12/2022 01:33:27 AM script INFO: SUCCESS!@#KODE 1!@#USER_ID 69!@#ACTIVITY_CODE 3
12/12/2022 01:33:27 AM script INFO: SUCCESS!@#KODE 1!@#USER_ID 69!@#ACTIVITY_CODE 3
12/12/2022 01:33:27 AM script INFO: SUCCESS!@#KODE 1!@#USER_ID 69!@#ACTIVITY_CODE 3
12/12/2022 01:33:27 AM script INFO: SUCCESS!@#KODE 1!@#USER_ID 69!@#ACTIVITY_CODE 3
12/12/2022 01:33:27 AM script INFO: SUCCESS!@#KODE 1!@#USER_ID 69!@#ACTIVITY_CODE 1
12/12/2022 01:33:27 AM script INFO: SUCCESS!@#KODE 1!@#USER_ID 69!@#ACTIVITY_CODE 1
12/12/2022 01:33:27 AM script INFO: SUCCESS!@#KODE 1!@#USER_ID 69!@#ACTIVITY_CODE 1
12/12/2022 01:33:28 AM script INFO: SUCCESS!@#KODE 1!@#USER_ID 69!@#ACTIVITY_CODE 2
12/12/2022 01:33:28 AM script INFO: SUCCESS!@#KODE 1!@#USER_ID 69!@#ACTIVITY_CODE 2
12/12/2022 01:33:28 AM script INFO: SUCCESS!@#KODE 1!@#USER_ID 69!@#ACTIVITY_CODE 3
12/12/2022 01:33:28 AM script INFO: SUCCESS!@#KODE 1!@#USER_ID 69!@#ACTIVITY_CODE 3
12/12/2022 01:33:28 AM script INFO: SUCCESS!@#KODE 1!@#USER_ID 69!@#ACTIVITY_CODE 1
12/12/2022 01:33:28 AM script INFO: SUCCESS!@#KODE 1!@#USER_ID 69!@#ACTIVITY_CODE 3
12/12/2022 01:33:28 AM script INFO: SUCCESS!@#KODE 1!@#USER_ID 69!@#ACTIVITY_CODE 3
12/12/2022 01:33:29 AM script INFO: SUCCESS!@#KODE 1!@#USER_ID 69!@#ACTIVITY_CODE 3
12/12/2022 01:33:29 AM script INFO: SUCCESS!@#KODE 1!@#USER_ID 69!@#ACTIVITY_CODE 2
12/12/2022 01:33:29 AM script INFO: SUCCESS!@#KODE 1!@#USER_ID 69!@#ACTIVITY_CODE 3
12/12/2022 01:33:29 AM script INFO: SUCCESS!@#KODE 1!@#USER_ID 69!@#ACTIVITY_CODE 1
12/12/2022 01:33:29 AM script INFO: SUCCESS!@#KODE 1!@#USER_ID 69!@#ACTIVITY_CODE 4
12/12/2022 01:33:29 AM script INFO: SUCCESS!@#KODE 1!@#USER_ID 69!@#ACTIVITY_CODE 1
12/12/2022 01:33:29 AM script INFO: SUCCESS!@#KODE 1!@#USER_ID 69!@#ACTIVITY_CODE 3
12/12/2022 01:33:30 AM script INFO: SUCCESS!@#KODE 1!@#USER_ID 69!@#ACTIVITY_CODE 3
12/12/2022 01:33:30 AM script INFO: SUCCESS!@#KODE 1!@#USER_ID 69!@#ACTIVITY_CODE 3
12/12/2022 01:33:30 AM script INFO: SUCCESS!@#KODE 1!@#USER_ID 69!@#ACTIVITY_CODE 3
12/12/2022 01:33:30 AM script INFO: SUCCESS!@#KODE 1!@#USER_ID 69!@#ACTIVITY_CODE 1
12/12/2022 01:33:30 AM script INFO: Duration: 62.44646620750427
12/12/2022 01:33:30 AM script INFO: mengakhiri-quiz
12/12/2022 01:33:32 AM script INFO: SUCCESS!@#KODE 1!@#USER_ID 69!@#ACTIVITY_CODE 5
12/12/2022 01:33:32 AM script INFO: berhasil-submit
