12/11/2022 03:05:19 PM script INFO: Prepared chrome options..
12/11/2022 03:05:20 PM script INFO: Initialized chrome browser..
12/11/2022 03:05:20 PM script INFO: mengakses-homepage
12/11/2022 03:05:40 PM script INFO: mengakses-login-page
12/11/2022 03:05:44 PM script INFO: mengakses-site-home
12/11/2022 03:05:45 PM script INFO: mengakses-site-course
12/11/2022 03:05:47 PM script INFO: mengakses-quiz
12/11/2022 03:05:48 PM script INFO: mengakses-start-quiz-page
12/11/2022 03:05:50 PM script INFO: memulai-quiz
12/11/2022 03:05:50 PM script INFO: SUCCESS!@#KODE 1!@#USER_ID 65!@#ACTIVITY_CODE 5
12/11/2022 03:06:01 PM script INFO: SUCCESS!@#KODE 1!@#USER_ID 65!@#ACTIVITY_CODE 2
12/11/2022 03:06:01 PM script INFO: SUCCESS!@#KODE 1!@#USER_ID 65!@#ACTIVITY_CODE 1
12/11/2022 03:06:01 PM script INFO: SUCCESS!@#KODE 1!@#USER_ID 65!@#ACTIVITY_CODE 5
12/11/2022 03:06:01 PM script INFO: SUCCESS!@#KODE 1!@#USER_ID 65!@#ACTIVITY_CODE 5
12/11/2022 03:06:04 PM script INFO: SUCCESS!@#KODE 1!@#USER_ID 65!@#ACTIVITY_CODE 2
12/11/2022 03:06:04 PM script INFO: SUCCESS!@#KODE 1!@#USER_ID 65!@#ACTIVITY_CODE 5
12/11/2022 03:06:04 PM script INFO: SUCCESS!@#KODE 1!@#USER_ID 65!@#ACTIVITY_CODE 5
12/11/2022 03:06:06 PM script INFO: SUCCESS!@#KODE 1!@#USER_ID 65!@#ACTIVITY_CODE 2
12/11/2022 03:06:06 PM script INFO: SUCCESS!@#KODE 1!@#USER_ID 65!@#ACTIVITY_CODE 1
12/11/2022 03:06:06 PM script INFO: SUCCESS!@#KODE 1!@#USER_ID 65!@#ACTIVITY_CODE 3
12/11/2022 03:06:06 PM script INFO: SUCCESS!@#KODE 1!@#USER_ID 65!@#ACTIVITY_CODE 2
12/11/2022 03:06:06 PM script INFO: SUCCESS!@#KODE 1!@#USER_ID 65!@#ACTIVITY_CODE 5
12/11/2022 03:06:06 PM script INFO: SUCCESS!@#KODE 1!@#USER_ID 65!@#ACTIVITY_CODE 5
12/11/2022 03:06:09 PM script INFO: SUCCESS!@#KODE 1!@#USER_ID 65!@#ACTIVITY_CODE 3
12/11/2022 03:06:09 PM script INFO: SUCCESS!@#KODE 1!@#USER_ID 65!@#ACTIVITY_CODE 3
12/11/2022 03:06:09 PM script INFO: SUCCESS!@#KODE 1!@#USER_ID 65!@#ACTIVITY_CODE 2
12/11/2022 03:06:09 PM script INFO: SUCCESS!@#KODE 1!@#USER_ID 65!@#ACTIVITY_CODE 3
12/11/2022 03:06:09 PM script INFO: SUCCESS!@#KODE 1!@#USER_ID 65!@#ACTIVITY_CODE 2
12/11/2022 03:06:09 PM script INFO: SUCCESS!@#KODE 1!@#USER_ID 65!@#ACTIVITY_CODE 5
12/11/2022 03:06:09 PM script INFO: SUCCESS!@#KODE 1!@#USER_ID 65!@#ACTIVITY_CODE 5
12/11/2022 03:06:12 PM script INFO: SUCCESS!@#KODE 1!@#USER_ID 65!@#ACTIVITY_CODE 1
12/11/2022 03:06:12 PM script INFO: SUCCESS!@#KODE 1!@#USER_ID 65!@#ACTIVITY_CODE 5
12/11/2022 03:06:12 PM script INFO: SUCCESS!@#KODE 1!@#USER_ID 65!@#ACTIVITY_CODE 5
12/11/2022 03:06:15 PM script INFO: SUCCESS!@#KODE 1!@#USER_ID 65!@#ACTIVITY_CODE 4
12/11/2022 03:06:15 PM script INFO: SUCCESS!@#KODE 1!@#USER_ID 65!@#ACTIVITY_CODE 2
12/11/2022 03:06:15 PM script INFO: SUCCESS!@#KODE 1!@#USER_ID 65!@#ACTIVITY_CODE 3
12/11/2022 03:06:15 PM script INFO: SUCCESS!@#KODE 1!@#USER_ID 65!@#ACTIVITY_CODE 5
12/11/2022 03:06:15 PM script INFO: SUCCESS!@#KODE 1!@#USER_ID 65!@#ACTIVITY_CODE 5
12/11/2022 03:06:17 PM script INFO: SUCCESS!@#KODE 1!@#USER_ID 65!@#ACTIVITY_CODE 1
12/11/2022 03:06:18 PM script INFO: SUCCESS!@#KODE 1!@#USER_ID 65!@#ACTIVITY_CODE 3
12/11/2022 03:06:18 PM script INFO: SUCCESS!@#KODE 1!@#USER_ID 65!@#ACTIVITY_CODE 1
12/11/2022 03:06:18 PM script INFO: SUCCESS!@#KODE 1!@#USER_ID 65!@#ACTIVITY_CODE 1
12/11/2022 03:06:18 PM script INFO: SUCCESS!@#KODE 1!@#USER_ID 65!@#ACTIVITY_CODE 3
12/11/2022 03:06:18 PM script INFO: SUCCESS!@#KODE 1!@#USER_ID 65!@#ACTIVITY_CODE 2
12/11/2022 03:06:18 PM script INFO: SUCCESS!@#KODE 1!@#USER_ID 65!@#ACTIVITY_CODE 3
12/11/2022 03:06:18 PM script INFO: SUCCESS!@#KODE 1!@#USER_ID 65!@#ACTIVITY_CODE 1
12/11/2022 03:06:18 PM script INFO: SUCCESS!@#KODE 1!@#USER_ID 65!@#ACTIVITY_CODE 2
12/11/2022 03:06:18 PM script INFO: SUCCESS!@#KODE 1!@#USER_ID 65!@#ACTIVITY_CODE 2
12/11/2022 03:06:19 PM script INFO: SUCCESS!@#KODE 1!@#USER_ID 65!@#ACTIVITY_CODE 2
12/11/2022 03:06:19 PM script INFO: SUCCESS!@#KODE 1!@#USER_ID 65!@#ACTIVITY_CODE 2
12/11/2022 03:06:19 PM script INFO: SUCCESS!@#KODE 1!@#USER_ID 65!@#ACTIVITY_CODE 3
12/11/2022 03:06:19 PM script INFO: SUCCESS!@#KODE 1!@#USER_ID 65!@#ACTIVITY_CODE 1
12/11/2022 03:06:19 PM script INFO: SUCCESS!@#KODE 1!@#USER_ID 65!@#ACTIVITY_CODE 4
12/11/2022 03:06:19 PM script INFO: SUCCESS!@#KODE 1!@#USER_ID 65!@#ACTIVITY_CODE 3
12/11/2022 03:06:19 PM script INFO: SUCCESS!@#KODE 1!@#USER_ID 65!@#ACTIVITY_CODE 3
12/11/2022 03:06:19 PM script INFO: SUCCESS!@#KODE 1!@#USER_ID 65!@#ACTIVITY_CODE 3
12/11/2022 03:06:19 PM script INFO: SUCCESS!@#KODE 1!@#USER_ID 65!@#ACTIVITY_CODE 1
12/11/2022 03:06:19 PM script INFO: SUCCESS!@#KODE 1!@#USER_ID 65!@#ACTIVITY_CODE 1
12/11/2022 03:06:19 PM script INFO: Duration: 18.695048809051514
12/11/2022 03:06:19 PM script INFO: mengakhiri-quiz
12/11/2022 03:06:28 PM script INFO: SUCCESS!@#KODE 1!@#USER_ID 65!@#ACTIVITY_CODE 5
12/11/2022 03:06:28 PM script INFO: berhasil-submit
