12/23/2022 05:37:35 AM script INFO: Prepared chrome options..
12/23/2022 05:37:37 AM script INFO: Initialized chrome browser..
12/23/2022 05:37:37 AM script INFO: mengakses-homepage
12/23/2022 05:38:05 AM script INFO: mengakses-login-page
12/23/2022 05:38:56 AM script INFO: mengakses-site-home
12/23/2022 05:39:06 AM script INFO: mengakses-site-course
12/23/2022 05:39:46 AM script INFO: mengakses-quiz
12/23/2022 05:39:57 AM script INFO: mengakses-start-quiz-page
12/23/2022 05:40:14 AM script INFO: memulai-quiz
12/23/2022 05:40:14 AM script INFO: SUCCESS!@#KODE 1!@#USER_ID 31!@#ACTIVITY_CODE 5
12/23/2022 05:40:24 AM script INFO: SUCCESS!@#KODE 1!@#USER_ID 31!@#ACTIVITY_CODE 3
12/23/2022 05:40:24 AM script INFO: SUCCESS!@#KODE 1!@#USER_ID 31!@#ACTIVITY_CODE 2
12/23/2022 05:40:25 AM script INFO: SUCCESS!@#KODE 1!@#USER_ID 31!@#ACTIVITY_CODE 3
12/23/2022 05:40:25 AM script INFO: SUCCESS!@#KODE 1!@#USER_ID 31!@#ACTIVITY_CODE 3
12/23/2022 05:40:25 AM script INFO: SUCCESS!@#KODE 1!@#USER_ID 31!@#ACTIVITY_CODE 3
12/23/2022 05:40:25 AM script INFO: SUCCESS!@#KODE 1!@#USER_ID 31!@#ACTIVITY_CODE 5
12/23/2022 05:40:25 AM script INFO: SUCCESS!@#KODE 1!@#USER_ID 31!@#ACTIVITY_CODE 5
12/23/2022 05:40:27 AM script INFO: SUCCESS!@#KODE 1!@#USER_ID 31!@#ACTIVITY_CODE 2
12/23/2022 05:40:27 AM script INFO: SUCCESS!@#KODE 1!@#USER_ID 31!@#ACTIVITY_CODE 2
12/23/2022 05:40:28 AM script INFO: SUCCESS!@#KODE 1!@#USER_ID 31!@#ACTIVITY_CODE 3
12/23/2022 05:40:28 AM script INFO: SUCCESS!@#KODE 1!@#USER_ID 31!@#ACTIVITY_CODE 1
12/23/2022 05:40:28 AM script INFO: SUCCESS!@#KODE 1!@#USER_ID 31!@#ACTIVITY_CODE 2
12/23/2022 05:40:28 AM script INFO: SUCCESS!@#KODE 1!@#USER_ID 31!@#ACTIVITY_CODE 5
12/23/2022 05:40:28 AM script INFO: SUCCESS!@#KODE 1!@#USER_ID 31!@#ACTIVITY_CODE 5
12/23/2022 05:40:30 AM script INFO: SUCCESS!@#KODE 1!@#USER_ID 31!@#ACTIVITY_CODE 5
12/23/2022 05:40:30 AM script INFO: SUCCESS!@#KODE 1!@#USER_ID 31!@#ACTIVITY_CODE 5
12/23/2022 05:40:33 AM script INFO: SUCCESS!@#KODE 1!@#USER_ID 31!@#ACTIVITY_CODE 3
12/23/2022 05:40:33 AM script INFO: SUCCESS!@#KODE 1!@#USER_ID 31!@#ACTIVITY_CODE 5
12/23/2022 05:40:33 AM script INFO: SUCCESS!@#KODE 1!@#USER_ID 31!@#ACTIVITY_CODE 5
12/23/2022 05:40:36 AM script INFO: SUCCESS!@#KODE 1!@#USER_ID 31!@#ACTIVITY_CODE 2
12/23/2022 05:40:36 AM script INFO: SUCCESS!@#KODE 1!@#USER_ID 31!@#ACTIVITY_CODE 2
12/23/2022 05:40:36 AM script INFO: SUCCESS!@#KODE 1!@#USER_ID 31!@#ACTIVITY_CODE 5
12/23/2022 05:40:36 AM script INFO: SUCCESS!@#KODE 1!@#USER_ID 31!@#ACTIVITY_CODE 5
12/23/2022 05:40:38 AM script INFO: SUCCESS!@#KODE 1!@#USER_ID 31!@#ACTIVITY_CODE 1
12/23/2022 05:40:38 AM script INFO: SUCCESS!@#KODE 1!@#USER_ID 31!@#ACTIVITY_CODE 3
12/23/2022 05:40:38 AM script INFO: SUCCESS!@#KODE 1!@#USER_ID 31!@#ACTIVITY_CODE 5
12/23/2022 05:40:38 AM script INFO: SUCCESS!@#KODE 1!@#USER_ID 31!@#ACTIVITY_CODE 5
12/23/2022 05:40:41 AM script INFO: SUCCESS!@#KODE 1!@#USER_ID 31!@#ACTIVITY_CODE 1
12/23/2022 05:40:41 AM script INFO: SUCCESS!@#KODE 1!@#USER_ID 31!@#ACTIVITY_CODE 1
12/23/2022 05:40:41 AM script INFO: SUCCESS!@#KODE 1!@#USER_ID 31!@#ACTIVITY_CODE 4
12/23/2022 05:40:41 AM script INFO: SUCCESS!@#KODE 1!@#USER_ID 31!@#ACTIVITY_CODE 3
12/23/2022 05:40:41 AM script INFO: SUCCESS!@#KODE 1!@#USER_ID 31!@#ACTIVITY_CODE 1
12/23/2022 05:40:41 AM script INFO: SUCCESS!@#KODE 1!@#USER_ID 31!@#ACTIVITY_CODE 4
12/23/2022 05:40:41 AM script INFO: SUCCESS!@#KODE 1!@#USER_ID 31!@#ACTIVITY_CODE 5
12/23/2022 05:40:41 AM script INFO: SUCCESS!@#KODE 1!@#USER_ID 31!@#ACTIVITY_CODE 5
12/23/2022 05:40:44 AM script INFO: SUCCESS!@#KODE 1!@#USER_ID 31!@#ACTIVITY_CODE 1
12/23/2022 05:40:44 AM script INFO: SUCCESS!@#KODE 1!@#USER_ID 31!@#ACTIVITY_CODE 1
12/23/2022 05:40:44 AM script INFO: SUCCESS!@#KODE 1!@#USER_ID 31!@#ACTIVITY_CODE 5
12/23/2022 05:40:44 AM script INFO: SUCCESS!@#KODE 1!@#USER_ID 31!@#ACTIVITY_CODE 5
12/23/2022 05:40:46 AM script INFO: SUCCESS!@#KODE 1!@#USER_ID 31!@#ACTIVITY_CODE 5
12/23/2022 05:40:46 AM script INFO: SUCCESS!@#KODE 1!@#USER_ID 31!@#ACTIVITY_CODE 5
12/23/2022 05:40:49 AM script INFO: SUCCESS!@#KODE 1!@#USER_ID 31!@#ACTIVITY_CODE 4
12/23/2022 05:40:49 AM script INFO: SUCCESS!@#KODE 1!@#USER_ID 31!@#ACTIVITY_CODE 2
12/23/2022 05:40:49 AM script INFO: SUCCESS!@#KODE 1!@#USER_ID 31!@#ACTIVITY_CODE 2
12/23/2022 05:40:49 AM script INFO: SUCCESS!@#KODE 1!@#USER_ID 31!@#ACTIVITY_CODE 3
12/23/2022 05:40:49 AM script INFO: SUCCESS!@#KODE 1!@#USER_ID 31!@#ACTIVITY_CODE 5
12/23/2022 05:40:49 AM script INFO: SUCCESS!@#KODE 1!@#USER_ID 31!@#ACTIVITY_CODE 5
12/23/2022 05:40:52 AM script INFO: SUCCESS!@#KODE 1!@#USER_ID 31!@#ACTIVITY_CODE 5
12/23/2022 05:40:52 AM script INFO: SUCCESS!@#KODE 1!@#USER_ID 31!@#ACTIVITY_CODE 5
12/23/2022 05:40:54 AM script INFO: SUCCESS!@#KODE 1!@#USER_ID 31!@#ACTIVITY_CODE 5
12/23/2022 05:40:54 AM script INFO: SUCCESS!@#KODE 1!@#USER_ID 31!@#ACTIVITY_CODE 5
12/23/2022 05:40:57 AM script INFO: SUCCESS!@#KODE 1!@#USER_ID 31!@#ACTIVITY_CODE 3
12/23/2022 05:40:57 AM script INFO: SUCCESS!@#KODE 1!@#USER_ID 31!@#ACTIVITY_CODE 5
12/23/2022 05:40:57 AM script INFO: SUCCESS!@#KODE 1!@#USER_ID 31!@#ACTIVITY_CODE 5
12/23/2022 05:41:00 AM script INFO: SUCCESS!@#KODE 1!@#USER_ID 31!@#ACTIVITY_CODE 5
12/23/2022 05:41:00 AM script INFO: SUCCESS!@#KODE 1!@#USER_ID 31!@#ACTIVITY_CODE 5
12/23/2022 05:41:02 AM script INFO: SUCCESS!@#KODE 1!@#USER_ID 31!@#ACTIVITY_CODE 3
12/23/2022 05:41:02 AM script INFO: SUCCESS!@#KODE 1!@#USER_ID 31!@#ACTIVITY_CODE 2
12/23/2022 05:41:03 AM script INFO: SUCCESS!@#KODE 1!@#USER_ID 31!@#ACTIVITY_CODE 2
12/23/2022 05:41:03 AM script INFO: SUCCESS!@#KODE 1!@#USER_ID 31!@#ACTIVITY_CODE 3
12/23/2022 05:41:03 AM script INFO: SUCCESS!@#KODE 1!@#USER_ID 31!@#ACTIVITY_CODE 2
12/23/2022 05:41:03 AM script INFO: SUCCESS!@#KODE 1!@#USER_ID 31!@#ACTIVITY_CODE 1
12/23/2022 05:41:03 AM script INFO: SUCCESS!@#KODE 1!@#USER_ID 31!@#ACTIVITY_CODE 4
12/23/2022 05:41:03 AM script INFO: SUCCESS!@#KODE 1!@#USER_ID 31!@#ACTIVITY_CODE 1
12/23/2022 05:41:03 AM script INFO: SUCCESS!@#KODE 1!@#USER_ID 31!@#ACTIVITY_CODE 1
12/23/2022 05:41:03 AM script INFO: SUCCESS!@#KODE 1!@#USER_ID 31!@#ACTIVITY_CODE 2
12/23/2022 05:41:04 AM script INFO: SUCCESS!@#KODE 1!@#USER_ID 31!@#ACTIVITY_CODE 3
12/23/2022 05:41:04 AM script INFO: SUCCESS!@#KODE 1!@#USER_ID 31!@#ACTIVITY_CODE 5
12/23/2022 05:41:04 AM script INFO: SUCCESS!@#KODE 1!@#USER_ID 31!@#ACTIVITY_CODE 5
12/23/2022 05:41:06 AM script INFO: SUCCESS!@#KODE 1!@#USER_ID 31!@#ACTIVITY_CODE 1
12/23/2022 05:41:06 AM script INFO: SUCCESS!@#KODE 1!@#USER_ID 31!@#ACTIVITY_CODE 5
12/23/2022 05:41:06 AM script INFO: SUCCESS!@#KODE 1!@#USER_ID 31!@#ACTIVITY_CODE 5
12/23/2022 05:41:09 AM script INFO: SUCCESS!@#KODE 1!@#USER_ID 31!@#ACTIVITY_CODE 4
12/23/2022 05:41:09 AM script INFO: SUCCESS!@#KODE 1!@#USER_ID 31!@#ACTIVITY_CODE 1
12/23/2022 05:41:09 AM script INFO: SUCCESS!@#KODE 1!@#USER_ID 31!@#ACTIVITY_CODE 3
12/23/2022 05:41:09 AM script INFO: SUCCESS!@#KODE 1!@#USER_ID 31!@#ACTIVITY_CODE 1
12/23/2022 05:41:09 AM script INFO: SUCCESS!@#KODE 1!@#USER_ID 31!@#ACTIVITY_CODE 4
12/23/2022 05:41:09 AM script INFO: SUCCESS!@#KODE 1!@#USER_ID 31!@#ACTIVITY_CODE 3
12/23/2022 05:41:10 AM script INFO: SUCCESS!@#KODE 1!@#USER_ID 31!@#ACTIVITY_CODE 2
12/23/2022 05:41:10 AM script INFO: SUCCESS!@#KODE 1!@#USER_ID 31!@#ACTIVITY_CODE 1
12/23/2022 05:41:10 AM script INFO: SUCCESS!@#KODE 1!@#USER_ID 31!@#ACTIVITY_CODE 3
12/23/2022 05:41:10 AM script INFO: SUCCESS!@#KODE 1!@#USER_ID 31!@#ACTIVITY_CODE 3
12/23/2022 05:41:10 AM script INFO: SUCCESS!@#KODE 1!@#USER_ID 31!@#ACTIVITY_CODE 4
12/23/2022 05:41:10 AM script INFO: SUCCESS!@#KODE 1!@#USER_ID 31!@#ACTIVITY_CODE 2
12/23/2022 05:41:11 AM script INFO: SUCCESS!@#KODE 1!@#USER_ID 31!@#ACTIVITY_CODE 2
12/23/2022 05:41:11 AM script INFO: SUCCESS!@#KODE 1!@#USER_ID 31!@#ACTIVITY_CODE 3
12/23/2022 05:41:11 AM script INFO: SUCCESS!@#KODE 1!@#USER_ID 31!@#ACTIVITY_CODE 3
12/23/2022 05:41:11 AM script INFO: SUCCESS!@#KODE 1!@#USER_ID 31!@#ACTIVITY_CODE 1
12/23/2022 05:41:11 AM script INFO: SUCCESS!@#KODE 1!@#USER_ID 31!@#ACTIVITY_CODE 2
12/23/2022 05:41:12 AM script INFO: SUCCESS!@#KODE 1!@#USER_ID 31!@#ACTIVITY_CODE 2
12/23/2022 05:41:12 AM script INFO: SUCCESS!@#KODE 1!@#USER_ID 31!@#ACTIVITY_CODE 1
12/23/2022 05:41:12 AM script INFO: SUCCESS!@#KODE 1!@#USER_ID 31!@#ACTIVITY_CODE 1
12/23/2022 05:41:12 AM script INFO: SUCCESS!@#KODE 1!@#USER_ID 31!@#ACTIVITY_CODE 2
12/23/2022 05:41:12 AM script INFO: SUCCESS!@#KODE 1!@#USER_ID 31!@#ACTIVITY_CODE 2
12/23/2022 05:41:12 AM script INFO: SUCCESS!@#KODE 1!@#USER_ID 31!@#ACTIVITY_CODE 3
12/23/2022 05:41:13 AM script INFO: SUCCESS!@#KODE 1!@#USER_ID 31!@#ACTIVITY_CODE 3
12/23/2022 05:41:13 AM script INFO: SUCCESS!@#KODE 1!@#USER_ID 31!@#ACTIVITY_CODE 4
12/23/2022 05:41:13 AM script INFO: SUCCESS!@#KODE 1!@#USER_ID 31!@#ACTIVITY_CODE 2
12/23/2022 05:41:13 AM script INFO: SUCCESS!@#KODE 1!@#USER_ID 31!@#ACTIVITY_CODE 2
12/23/2022 05:41:13 AM script INFO: SUCCESS!@#KODE 1!@#USER_ID 31!@#ACTIVITY_CODE 3
12/23/2022 05:41:14 AM script INFO: SUCCESS!@#KODE 1!@#USER_ID 31!@#ACTIVITY_CODE 2
12/23/2022 05:41:14 AM script INFO: SUCCESS!@#KODE 1!@#USER_ID 31!@#ACTIVITY_CODE 2
12/23/2022 05:41:14 AM script INFO: SUCCESS!@#KODE 1!@#USER_ID 31!@#ACTIVITY_CODE 3
12/23/2022 05:41:14 AM script INFO: SUCCESS!@#KODE 1!@#USER_ID 31!@#ACTIVITY_CODE 3
12/23/2022 05:41:14 AM script INFO: SUCCESS!@#KODE 1!@#USER_ID 31!@#ACTIVITY_CODE 1
12/23/2022 05:41:15 AM script INFO: SUCCESS!@#KODE 1!@#USER_ID 31!@#ACTIVITY_CODE 2
12/23/2022 05:41:15 AM script INFO: SUCCESS!@#KODE 1!@#USER_ID 31!@#ACTIVITY_CODE 2
12/23/2022 05:41:15 AM script INFO: SUCCESS!@#KODE 1!@#USER_ID 31!@#ACTIVITY_CODE 1
12/23/2022 05:41:15 AM script INFO: SUCCESS!@#KODE 1!@#USER_ID 31!@#ACTIVITY_CODE 1
12/23/2022 05:41:15 AM script INFO: SUCCESS!@#KODE 1!@#USER_ID 31!@#ACTIVITY_CODE 1
12/23/2022 05:41:15 AM script INFO: SUCCESS!@#KODE 1!@#USER_ID 31!@#ACTIVITY_CODE 3
12/23/2022 05:41:15 AM script INFO: SUCCESS!@#KODE 1!@#USER_ID 31!@#ACTIVITY_CODE 3
12/23/2022 05:41:16 AM script INFO: SUCCESS!@#KODE 1!@#USER_ID 31!@#ACTIVITY_CODE 2
12/23/2022 05:41:16 AM script INFO: SUCCESS!@#KODE 1!@#USER_ID 31!@#ACTIVITY_CODE 2
12/23/2022 05:41:16 AM script INFO: SUCCESS!@#KODE 1!@#USER_ID 31!@#ACTIVITY_CODE 1
12/23/2022 05:41:16 AM script INFO: SUCCESS!@#KODE 1!@#USER_ID 31!@#ACTIVITY_CODE 1
12/23/2022 05:41:16 AM script INFO: SUCCESS!@#KODE 1!@#USER_ID 31!@#ACTIVITY_CODE 3
12/23/2022 05:41:16 AM script INFO: SUCCESS!@#KODE 1!@#USER_ID 31!@#ACTIVITY_CODE 1
12/23/2022 05:41:16 AM script INFO: SUCCESS!@#KODE 1!@#USER_ID 31!@#ACTIVITY_CODE 1
12/23/2022 05:41:17 AM script INFO: SUCCESS!@#KODE 1!@#USER_ID 31!@#ACTIVITY_CODE 3
12/23/2022 05:41:17 AM script INFO: SUCCESS!@#KODE 1!@#USER_ID 31!@#ACTIVITY_CODE 2
12/23/2022 05:41:17 AM script INFO: SUCCESS!@#KODE 1!@#USER_ID 31!@#ACTIVITY_CODE 3
12/23/2022 05:41:17 AM script INFO: SUCCESS!@#KODE 1!@#USER_ID 31!@#ACTIVITY_CODE 2
12/23/2022 05:41:17 AM script INFO: SUCCESS!@#KODE 1!@#USER_ID 31!@#ACTIVITY_CODE 3
12/23/2022 05:41:18 AM script INFO: SUCCESS!@#KODE 1!@#USER_ID 31!@#ACTIVITY_CODE 4
12/23/2022 05:41:18 AM script INFO: SUCCESS!@#KODE 1!@#USER_ID 31!@#ACTIVITY_CODE 1
12/23/2022 05:41:18 AM script INFO: SUCCESS!@#KODE 1!@#USER_ID 31!@#ACTIVITY_CODE 1
12/23/2022 05:41:18 AM script INFO: SUCCESS!@#KODE 1!@#USER_ID 31!@#ACTIVITY_CODE 4
12/23/2022 05:41:18 AM script INFO: SUCCESS!@#KODE 1!@#USER_ID 31!@#ACTIVITY_CODE 3
12/23/2022 05:41:18 AM script INFO: SUCCESS!@#KODE 1!@#USER_ID 31!@#ACTIVITY_CODE 2
12/23/2022 05:41:18 AM script INFO: SUCCESS!@#KODE 1!@#USER_ID 31!@#ACTIVITY_CODE 1
12/23/2022 05:41:18 AM script INFO: SUCCESS!@#KODE 1!@#USER_ID 31!@#ACTIVITY_CODE 1
12/23/2022 05:41:18 AM script INFO: SUCCESS!@#KODE 1!@#USER_ID 31!@#ACTIVITY_CODE 1
12/23/2022 05:41:19 AM script INFO: SUCCESS!@#KODE 1!@#USER_ID 31!@#ACTIVITY_CODE 2
12/23/2022 05:41:19 AM script INFO: SUCCESS!@#KODE 1!@#USER_ID 31!@#ACTIVITY_CODE 1
12/23/2022 05:41:19 AM script INFO: SUCCESS!@#KODE 1!@#USER_ID 31!@#ACTIVITY_CODE 1
12/23/2022 05:41:19 AM script INFO: SUCCESS!@#KODE 1!@#USER_ID 31!@#ACTIVITY_CODE 3
12/23/2022 05:41:19 AM script INFO: SUCCESS!@#KODE 1!@#USER_ID 31!@#ACTIVITY_CODE 1
12/23/2022 05:41:19 AM script INFO: SUCCESS!@#KODE 1!@#USER_ID 31!@#ACTIVITY_CODE 2
12/23/2022 05:41:20 AM script INFO: SUCCESS!@#KODE 1!@#USER_ID 31!@#ACTIVITY_CODE 3
12/23/2022 05:41:20 AM script INFO: SUCCESS!@#KODE 1!@#USER_ID 31!@#ACTIVITY_CODE 3
12/23/2022 05:41:20 AM script INFO: SUCCESS!@#KODE 1!@#USER_ID 31!@#ACTIVITY_CODE 3
12/23/2022 05:41:20 AM script INFO: SUCCESS!@#KODE 1!@#USER_ID 31!@#ACTIVITY_CODE 1
12/23/2022 05:41:20 AM script INFO: SUCCESS!@#KODE 1!@#USER_ID 31!@#ACTIVITY_CODE 1
12/23/2022 05:41:20 AM script INFO: SUCCESS!@#KODE 1!@#USER_ID 31!@#ACTIVITY_CODE 2
12/23/2022 05:41:20 AM script INFO: SUCCESS!@#KODE 1!@#USER_ID 31!@#ACTIVITY_CODE 3
12/23/2022 05:41:21 AM script INFO: SUCCESS!@#KODE 1!@#USER_ID 31!@#ACTIVITY_CODE 2
12/23/2022 05:41:21 AM script INFO: SUCCESS!@#KODE 1!@#USER_ID 31!@#ACTIVITY_CODE 2
12/23/2022 05:41:21 AM script INFO: SUCCESS!@#KODE 1!@#USER_ID 31!@#ACTIVITY_CODE 1
12/23/2022 05:41:21 AM script INFO: SUCCESS!@#KODE 1!@#USER_ID 31!@#ACTIVITY_CODE 3
12/23/2022 05:41:21 AM script INFO: SUCCESS!@#KODE 1!@#USER_ID 31!@#ACTIVITY_CODE 3
12/23/2022 05:41:21 AM script INFO: SUCCESS!@#KODE 1!@#USER_ID 31!@#ACTIVITY_CODE 1
12/23/2022 05:41:22 AM script INFO: SUCCESS!@#KODE 1!@#USER_ID 31!@#ACTIVITY_CODE 2
12/23/2022 05:41:22 AM script INFO: SUCCESS!@#KODE 1!@#USER_ID 31!@#ACTIVITY_CODE 2
12/23/2022 05:41:22 AM script INFO: SUCCESS!@#KODE 1!@#USER_ID 31!@#ACTIVITY_CODE 1
12/23/2022 05:41:22 AM script INFO: SUCCESS!@#KODE 1!@#USER_ID 31!@#ACTIVITY_CODE 2
12/23/2022 05:41:22 AM script INFO: SUCCESS!@#KODE 1!@#USER_ID 31!@#ACTIVITY_CODE 3
12/23/2022 05:41:23 AM script INFO: SUCCESS!@#KODE 1!@#USER_ID 31!@#ACTIVITY_CODE 3
12/23/2022 05:41:23 AM script INFO: SUCCESS!@#KODE 1!@#USER_ID 31!@#ACTIVITY_CODE 1
12/23/2022 05:41:23 AM script INFO: SUCCESS!@#KODE 1!@#USER_ID 31!@#ACTIVITY_CODE 2
12/23/2022 05:41:23 AM script INFO: SUCCESS!@#KODE 1!@#USER_ID 31!@#ACTIVITY_CODE 3
12/23/2022 05:41:23 AM script INFO: SUCCESS!@#KODE 1!@#USER_ID 31!@#ACTIVITY_CODE 2
12/23/2022 05:41:23 AM script INFO: SUCCESS!@#KODE 1!@#USER_ID 31!@#ACTIVITY_CODE 2
12/23/2022 05:41:23 AM script INFO: SUCCESS!@#KODE 1!@#USER_ID 31!@#ACTIVITY_CODE 1
12/23/2022 05:41:24 AM script INFO: SUCCESS!@#KODE 1!@#USER_ID 31!@#ACTIVITY_CODE 3
12/23/2022 05:41:24 AM script INFO: SUCCESS!@#KODE 1!@#USER_ID 31!@#ACTIVITY_CODE 3
12/23/2022 05:41:24 AM script INFO: SUCCESS!@#KODE 1!@#USER_ID 31!@#ACTIVITY_CODE 4
12/23/2022 05:41:24 AM script INFO: SUCCESS!@#KODE 1!@#USER_ID 31!@#ACTIVITY_CODE 2
12/23/2022 05:41:24 AM script INFO: SUCCESS!@#KODE 1!@#USER_ID 31!@#ACTIVITY_CODE 3
12/23/2022 05:41:24 AM script INFO: SUCCESS!@#KODE 1!@#USER_ID 31!@#ACTIVITY_CODE 1
12/23/2022 05:41:24 AM script INFO: SUCCESS!@#KODE 1!@#USER_ID 31!@#ACTIVITY_CODE 3
12/23/2022 05:41:24 AM script INFO: SUCCESS!@#KODE 1!@#USER_ID 31!@#ACTIVITY_CODE 1
12/23/2022 05:41:25 AM script INFO: SUCCESS!@#KODE 1!@#USER_ID 31!@#ACTIVITY_CODE 4
12/23/2022 05:41:25 AM script INFO: SUCCESS!@#KODE 1!@#USER_ID 31!@#ACTIVITY_CODE 2
12/23/2022 05:41:25 AM script INFO: SUCCESS!@#KODE 1!@#USER_ID 31!@#ACTIVITY_CODE 3
12/23/2022 05:41:25 AM script INFO: SUCCESS!@#KODE 1!@#USER_ID 31!@#ACTIVITY_CODE 2
12/23/2022 05:41:25 AM script INFO: SUCCESS!@#KODE 1!@#USER_ID 31!@#ACTIVITY_CODE 1
12/23/2022 05:41:25 AM script INFO: SUCCESS!@#KODE 1!@#USER_ID 31!@#ACTIVITY_CODE 4
12/23/2022 05:41:25 AM script INFO: SUCCESS!@#KODE 1!@#USER_ID 31!@#ACTIVITY_CODE 3
12/23/2022 05:41:26 AM script INFO: SUCCESS!@#KODE 1!@#USER_ID 31!@#ACTIVITY_CODE 2
12/23/2022 05:41:26 AM script INFO: SUCCESS!@#KODE 1!@#USER_ID 31!@#ACTIVITY_CODE 3
12/23/2022 05:41:26 AM script INFO: SUCCESS!@#KODE 1!@#USER_ID 31!@#ACTIVITY_CODE 3
12/23/2022 05:41:26 AM script INFO: SUCCESS!@#KODE 1!@#USER_ID 31!@#ACTIVITY_CODE 2
12/23/2022 05:41:26 AM script INFO: SUCCESS!@#KODE 1!@#USER_ID 31!@#ACTIVITY_CODE 3
12/23/2022 05:41:26 AM script INFO: SUCCESS!@#KODE 1!@#USER_ID 31!@#ACTIVITY_CODE 3
12/23/2022 05:41:26 AM script INFO: SUCCESS!@#KODE 1!@#USER_ID 31!@#ACTIVITY_CODE 1
12/23/2022 05:41:26 AM script INFO: SUCCESS!@#KODE 1!@#USER_ID 31!@#ACTIVITY_CODE 1
12/23/2022 05:41:26 AM script INFO: SUCCESS!@#KODE 1!@#USER_ID 31!@#ACTIVITY_CODE 3
12/23/2022 05:41:26 AM script INFO: SUCCESS!@#KODE 1!@#USER_ID 31!@#ACTIVITY_CODE 3
12/23/2022 05:41:27 AM script INFO: SUCCESS!@#KODE 1!@#USER_ID 31!@#ACTIVITY_CODE 2
12/23/2022 05:41:27 AM script INFO: SUCCESS!@#KODE 1!@#USER_ID 31!@#ACTIVITY_CODE 2
12/23/2022 05:41:27 AM script INFO: SUCCESS!@#KODE 1!@#USER_ID 31!@#ACTIVITY_CODE 3
12/23/2022 05:41:27 AM script INFO: SUCCESS!@#KODE 1!@#USER_ID 31!@#ACTIVITY_CODE 4
12/23/2022 05:41:27 AM script INFO: SUCCESS!@#KODE 1!@#USER_ID 31!@#ACTIVITY_CODE 3
12/23/2022 05:41:27 AM script INFO: SUCCESS!@#KODE 1!@#USER_ID 31!@#ACTIVITY_CODE 2
12/23/2022 05:41:27 AM script INFO: SUCCESS!@#KODE 1!@#USER_ID 31!@#ACTIVITY_CODE 1
12/23/2022 05:41:28 AM script INFO: SUCCESS!@#KODE 1!@#USER_ID 31!@#ACTIVITY_CODE 3
12/23/2022 05:41:28 AM script INFO: SUCCESS!@#KODE 1!@#USER_ID 31!@#ACTIVITY_CODE 1
12/23/2022 05:41:28 AM script INFO: SUCCESS!@#KODE 1!@#USER_ID 31!@#ACTIVITY_CODE 4
12/23/2022 05:41:28 AM script INFO: SUCCESS!@#KODE 1!@#USER_ID 31!@#ACTIVITY_CODE 2
12/23/2022 05:41:28 AM script INFO: SUCCESS!@#KODE 1!@#USER_ID 31!@#ACTIVITY_CODE 3
12/23/2022 05:41:28 AM script INFO: SUCCESS!@#KODE 1!@#USER_ID 31!@#ACTIVITY_CODE 3
12/23/2022 05:41:28 AM script INFO: SUCCESS!@#KODE 1!@#USER_ID 31!@#ACTIVITY_CODE 1
12/23/2022 05:41:28 AM script INFO: SUCCESS!@#KODE 1!@#USER_ID 31!@#ACTIVITY_CODE 3
12/23/2022 05:41:28 AM script INFO: SUCCESS!@#KODE 1!@#USER_ID 31!@#ACTIVITY_CODE 1
12/23/2022 05:41:28 AM script INFO: SUCCESS!@#KODE 1!@#USER_ID 31!@#ACTIVITY_CODE 3
12/23/2022 05:41:28 AM script INFO: SUCCESS!@#KODE 1!@#USER_ID 31!@#ACTIVITY_CODE 4
12/23/2022 05:41:29 AM script INFO: SUCCESS!@#KODE 1!@#USER_ID 31!@#ACTIVITY_CODE 3
12/23/2022 05:41:29 AM script INFO: SUCCESS!@#KODE 1!@#USER_ID 31!@#ACTIVITY_CODE 3
12/23/2022 05:41:29 AM script INFO: SUCCESS!@#KODE 1!@#USER_ID 31!@#ACTIVITY_CODE 1
12/23/2022 05:41:29 AM script INFO: SUCCESS!@#KODE 1!@#USER_ID 31!@#ACTIVITY_CODE 2
12/23/2022 05:41:29 AM script INFO: SUCCESS!@#KODE 1!@#USER_ID 31!@#ACTIVITY_CODE 2
12/23/2022 05:41:29 AM script INFO: SUCCESS!@#KODE 1!@#USER_ID 31!@#ACTIVITY_CODE 2
12/23/2022 05:41:29 AM script INFO: SUCCESS!@#KODE 1!@#USER_ID 31!@#ACTIVITY_CODE 2
12/23/2022 05:41:29 AM script INFO: SUCCESS!@#KODE 1!@#USER_ID 31!@#ACTIVITY_CODE 3
12/23/2022 05:41:30 AM script INFO: SUCCESS!@#KODE 1!@#USER_ID 31!@#ACTIVITY_CODE 2
12/23/2022 05:41:30 AM script INFO: SUCCESS!@#KODE 1!@#USER_ID 31!@#ACTIVITY_CODE 3
12/23/2022 05:41:30 AM script INFO: SUCCESS!@#KODE 1!@#USER_ID 31!@#ACTIVITY_CODE 1
12/23/2022 05:41:30 AM script INFO: SUCCESS!@#KODE 1!@#USER_ID 31!@#ACTIVITY_CODE 1
12/23/2022 05:41:30 AM script INFO: SUCCESS!@#KODE 1!@#USER_ID 31!@#ACTIVITY_CODE 1
12/23/2022 05:41:30 AM script INFO: SUCCESS!@#KODE 1!@#USER_ID 31!@#ACTIVITY_CODE 1
12/23/2022 05:41:30 AM script INFO: SUCCESS!@#KODE 1!@#USER_ID 31!@#ACTIVITY_CODE 1
12/23/2022 05:41:30 AM script INFO: SUCCESS!@#KODE 1!@#USER_ID 31!@#ACTIVITY_CODE 4
12/23/2022 05:41:30 AM script INFO: SUCCESS!@#KODE 1!@#USER_ID 31!@#ACTIVITY_CODE 2
12/23/2022 05:41:30 AM script INFO: SUCCESS!@#KODE 1!@#USER_ID 31!@#ACTIVITY_CODE 3
12/23/2022 05:41:30 AM script INFO: SUCCESS!@#KODE 1!@#USER_ID 31!@#ACTIVITY_CODE 1
12/23/2022 05:41:31 AM script INFO: SUCCESS!@#KODE 1!@#USER_ID 31!@#ACTIVITY_CODE 2
12/23/2022 05:41:31 AM script INFO: SUCCESS!@#KODE 1!@#USER_ID 31!@#ACTIVITY_CODE 1
12/23/2022 05:41:31 AM script INFO: SUCCESS!@#KODE 1!@#USER_ID 31!@#ACTIVITY_CODE 1
12/23/2022 05:41:31 AM script INFO: SUCCESS!@#KODE 1!@#USER_ID 31!@#ACTIVITY_CODE 2
12/23/2022 05:41:31 AM script INFO: SUCCESS!@#KODE 1!@#USER_ID 31!@#ACTIVITY_CODE 2
12/23/2022 05:41:31 AM script INFO: SUCCESS!@#KODE 1!@#USER_ID 31!@#ACTIVITY_CODE 3
12/23/2022 05:41:31 AM script INFO: SUCCESS!@#KODE 1!@#USER_ID 31!@#ACTIVITY_CODE 3
12/23/2022 05:41:31 AM script INFO: SUCCESS!@#KODE 1!@#USER_ID 31!@#ACTIVITY_CODE 3
12/23/2022 05:41:31 AM script INFO: SUCCESS!@#KODE 1!@#USER_ID 31!@#ACTIVITY_CODE 3
12/23/2022 05:41:31 AM script INFO: SUCCESS!@#KODE 1!@#USER_ID 31!@#ACTIVITY_CODE 1
12/23/2022 05:41:31 AM script INFO: SUCCESS!@#KODE 1!@#USER_ID 31!@#ACTIVITY_CODE 3
12/23/2022 05:41:32 AM script INFO: SUCCESS!@#KODE 1!@#USER_ID 31!@#ACTIVITY_CODE 2
12/23/2022 05:41:32 AM script INFO: SUCCESS!@#KODE 1!@#USER_ID 31!@#ACTIVITY_CODE 1
12/23/2022 05:41:32 AM script INFO: SUCCESS!@#KODE 1!@#USER_ID 31!@#ACTIVITY_CODE 2
12/23/2022 05:41:32 AM script INFO: SUCCESS!@#KODE 1!@#USER_ID 31!@#ACTIVITY_CODE 1
12/23/2022 05:41:32 AM script INFO: SUCCESS!@#KODE 1!@#USER_ID 31!@#ACTIVITY_CODE 3
12/23/2022 05:41:32 AM script INFO: SUCCESS!@#KODE 1!@#USER_ID 31!@#ACTIVITY_CODE 4
12/23/2022 05:41:32 AM script INFO: SUCCESS!@#KODE 1!@#USER_ID 31!@#ACTIVITY_CODE 2
12/23/2022 05:41:32 AM script INFO: SUCCESS!@#KODE 1!@#USER_ID 31!@#ACTIVITY_CODE 4
12/23/2022 05:41:32 AM script INFO: SUCCESS!@#KODE 1!@#USER_ID 31!@#ACTIVITY_CODE 2
12/23/2022 05:41:32 AM script INFO: SUCCESS!@#KODE 1!@#USER_ID 31!@#ACTIVITY_CODE 1
12/23/2022 05:41:33 AM script INFO: SUCCESS!@#KODE 1!@#USER_ID 31!@#ACTIVITY_CODE 4
12/23/2022 05:41:33 AM script INFO: Duration: 68.38311314582825
12/23/2022 05:41:33 AM script INFO: mengakhiri-quiz
12/23/2022 05:41:37 AM script INFO: SUCCESS!@#KODE 1!@#USER_ID 31!@#ACTIVITY_CODE 5
12/23/2022 05:41:37 AM script INFO: berhasil-submit
12/23/2022 05:43:08 AM script ERROR: TIMEOUT EXCEPTION!@#KODE 0!@#LOCATION berhasil-submit
12/23/2022 05:43:08 AM main_worker ERROR: Message: None

