12/11/2022 03:52:31 PM script INFO: Prepared chrome options..
12/11/2022 03:52:33 PM script INFO: Initialized chrome browser..
12/11/2022 03:52:33 PM script INFO: mengakses-homepage
12/11/2022 03:52:57 PM script INFO: mengakses-login-page
12/11/2022 03:52:59 PM script INFO: mengakses-site-home
12/11/2022 03:53:00 PM script INFO: mengakses-site-course
12/11/2022 03:53:15 PM script INFO: mengakses-quiz
12/11/2022 03:53:31 PM script INFO: mengakses-start-quiz-page
12/11/2022 03:53:59 PM script INFO: memulai-quiz
12/11/2022 03:53:59 PM script INFO: SUCCESS!@#KODE 1!@#USER_ID 88!@#ACTIVITY_CODE 5
12/11/2022 03:54:10 PM script INFO: SUCCESS!@#KODE 1!@#USER_ID 88!@#ACTIVITY_CODE 3
12/11/2022 03:54:10 PM script INFO: SUCCESS!@#KODE 1!@#USER_ID 88!@#ACTIVITY_CODE 1
12/11/2022 03:54:10 PM script INFO: SUCCESS!@#KODE 1!@#USER_ID 88!@#ACTIVITY_CODE 5
12/11/2022 03:54:10 PM script INFO: SUCCESS!@#KODE 1!@#USER_ID 88!@#ACTIVITY_CODE 5
12/11/2022 03:54:13 PM script INFO: SUCCESS!@#KODE 1!@#USER_ID 88!@#ACTIVITY_CODE 1
12/11/2022 03:54:13 PM script INFO: SUCCESS!@#KODE 1!@#USER_ID 88!@#ACTIVITY_CODE 4
12/11/2022 03:54:13 PM script INFO: SUCCESS!@#KODE 1!@#USER_ID 88!@#ACTIVITY_CODE 1
12/11/2022 03:54:13 PM script INFO: SUCCESS!@#KODE 1!@#USER_ID 88!@#ACTIVITY_CODE 3
12/11/2022 03:54:13 PM script INFO: SUCCESS!@#KODE 1!@#USER_ID 88!@#ACTIVITY_CODE 5
12/11/2022 03:54:13 PM script INFO: SUCCESS!@#KODE 1!@#USER_ID 88!@#ACTIVITY_CODE 5
12/11/2022 03:54:16 PM script INFO: SUCCESS!@#KODE 1!@#USER_ID 88!@#ACTIVITY_CODE 5
12/11/2022 03:54:16 PM script INFO: SUCCESS!@#KODE 1!@#USER_ID 88!@#ACTIVITY_CODE 5
12/11/2022 03:54:18 PM script INFO: SUCCESS!@#KODE 1!@#USER_ID 88!@#ACTIVITY_CODE 1
12/11/2022 03:54:19 PM script INFO: SUCCESS!@#KODE 1!@#USER_ID 88!@#ACTIVITY_CODE 3
12/11/2022 03:54:19 PM script INFO: SUCCESS!@#KODE 1!@#USER_ID 88!@#ACTIVITY_CODE 4
12/11/2022 03:54:19 PM script INFO: SUCCESS!@#KODE 1!@#USER_ID 88!@#ACTIVITY_CODE 2
12/11/2022 03:54:19 PM script INFO: SUCCESS!@#KODE 1!@#USER_ID 88!@#ACTIVITY_CODE 2
12/11/2022 03:54:19 PM script INFO: SUCCESS!@#KODE 1!@#USER_ID 88!@#ACTIVITY_CODE 5
12/11/2022 03:54:19 PM script INFO: SUCCESS!@#KODE 1!@#USER_ID 88!@#ACTIVITY_CODE 5
12/11/2022 03:54:22 PM script INFO: SUCCESS!@#KODE 1!@#USER_ID 88!@#ACTIVITY_CODE 3
12/11/2022 03:54:22 PM script INFO: SUCCESS!@#KODE 1!@#USER_ID 88!@#ACTIVITY_CODE 2
12/11/2022 03:54:22 PM script INFO: SUCCESS!@#KODE 1!@#USER_ID 88!@#ACTIVITY_CODE 2
12/11/2022 03:54:22 PM script INFO: SUCCESS!@#KODE 1!@#USER_ID 88!@#ACTIVITY_CODE 2
12/11/2022 03:54:22 PM script INFO: SUCCESS!@#KODE 1!@#USER_ID 88!@#ACTIVITY_CODE 5
12/11/2022 03:54:22 PM script INFO: SUCCESS!@#KODE 1!@#USER_ID 88!@#ACTIVITY_CODE 5
12/11/2022 03:54:25 PM script INFO: SUCCESS!@#KODE 1!@#USER_ID 88!@#ACTIVITY_CODE 1
12/11/2022 03:54:25 PM script INFO: SUCCESS!@#KODE 1!@#USER_ID 88!@#ACTIVITY_CODE 1
12/11/2022 03:54:25 PM script INFO: SUCCESS!@#KODE 1!@#USER_ID 88!@#ACTIVITY_CODE 5
12/11/2022 03:54:25 PM script INFO: SUCCESS!@#KODE 1!@#USER_ID 88!@#ACTIVITY_CODE 5
12/11/2022 03:54:27 PM script INFO: SUCCESS!@#KODE 1!@#USER_ID 88!@#ACTIVITY_CODE 1
12/11/2022 03:54:27 PM script INFO: SUCCESS!@#KODE 1!@#USER_ID 88!@#ACTIVITY_CODE 1
12/11/2022 03:54:28 PM script INFO: SUCCESS!@#KODE 1!@#USER_ID 88!@#ACTIVITY_CODE 4
12/11/2022 03:54:28 PM script INFO: SUCCESS!@#KODE 1!@#USER_ID 88!@#ACTIVITY_CODE 2
12/11/2022 03:54:28 PM script INFO: SUCCESS!@#KODE 1!@#USER_ID 88!@#ACTIVITY_CODE 2
12/11/2022 03:54:28 PM script INFO: SUCCESS!@#KODE 1!@#USER_ID 88!@#ACTIVITY_CODE 5
12/11/2022 03:54:28 PM script INFO: SUCCESS!@#KODE 1!@#USER_ID 88!@#ACTIVITY_CODE 5
12/11/2022 03:54:30 PM script INFO: SUCCESS!@#KODE 1!@#USER_ID 88!@#ACTIVITY_CODE 5
12/11/2022 03:54:30 PM script INFO: SUCCESS!@#KODE 1!@#USER_ID 88!@#ACTIVITY_CODE 5
12/11/2022 03:54:33 PM script INFO: SUCCESS!@#KODE 1!@#USER_ID 88!@#ACTIVITY_CODE 1
12/11/2022 03:54:33 PM script INFO: SUCCESS!@#KODE 1!@#USER_ID 88!@#ACTIVITY_CODE 2
12/11/2022 03:54:33 PM script INFO: SUCCESS!@#KODE 1!@#USER_ID 88!@#ACTIVITY_CODE 2
12/11/2022 03:54:33 PM script INFO: SUCCESS!@#KODE 1!@#USER_ID 88!@#ACTIVITY_CODE 5
12/11/2022 03:54:33 PM script INFO: SUCCESS!@#KODE 1!@#USER_ID 88!@#ACTIVITY_CODE 5
12/11/2022 03:54:36 PM script INFO: SUCCESS!@#KODE 1!@#USER_ID 88!@#ACTIVITY_CODE 2
12/11/2022 03:54:36 PM script INFO: SUCCESS!@#KODE 1!@#USER_ID 88!@#ACTIVITY_CODE 2
12/11/2022 03:54:36 PM script INFO: SUCCESS!@#KODE 1!@#USER_ID 88!@#ACTIVITY_CODE 1
12/11/2022 03:54:36 PM script INFO: SUCCESS!@#KODE 1!@#USER_ID 88!@#ACTIVITY_CODE 3
12/11/2022 03:54:36 PM script INFO: SUCCESS!@#KODE 1!@#USER_ID 88!@#ACTIVITY_CODE 4
12/11/2022 03:54:36 PM script INFO: SUCCESS!@#KODE 1!@#USER_ID 88!@#ACTIVITY_CODE 3
12/11/2022 03:54:36 PM script INFO: SUCCESS!@#KODE 1!@#USER_ID 88!@#ACTIVITY_CODE 1
12/11/2022 03:54:36 PM script INFO: SUCCESS!@#KODE 1!@#USER_ID 88!@#ACTIVITY_CODE 3
12/11/2022 03:54:36 PM script INFO: SUCCESS!@#KODE 1!@#USER_ID 88!@#ACTIVITY_CODE 2
12/11/2022 03:54:37 PM script INFO: SUCCESS!@#KODE 1!@#USER_ID 88!@#ACTIVITY_CODE 2
12/11/2022 03:54:37 PM script INFO: SUCCESS!@#KODE 1!@#USER_ID 88!@#ACTIVITY_CODE 3
12/11/2022 03:54:37 PM script INFO: SUCCESS!@#KODE 1!@#USER_ID 88!@#ACTIVITY_CODE 3
12/11/2022 03:54:37 PM script INFO: SUCCESS!@#KODE 1!@#USER_ID 88!@#ACTIVITY_CODE 3
12/11/2022 03:54:37 PM script INFO: SUCCESS!@#KODE 1!@#USER_ID 88!@#ACTIVITY_CODE 2
12/11/2022 03:54:37 PM script INFO: SUCCESS!@#KODE 1!@#USER_ID 88!@#ACTIVITY_CODE 2
12/11/2022 03:54:37 PM script INFO: SUCCESS!@#KODE 1!@#USER_ID 88!@#ACTIVITY_CODE 5
12/11/2022 03:54:37 PM script INFO: SUCCESS!@#KODE 1!@#USER_ID 88!@#ACTIVITY_CODE 5
12/11/2022 03:54:40 PM script INFO: SUCCESS!@#KODE 1!@#USER_ID 88!@#ACTIVITY_CODE 4
12/11/2022 03:54:40 PM script INFO: SUCCESS!@#KODE 1!@#USER_ID 88!@#ACTIVITY_CODE 3
12/11/2022 03:54:40 PM script INFO: SUCCESS!@#KODE 1!@#USER_ID 88!@#ACTIVITY_CODE 3
12/11/2022 03:54:40 PM script INFO: SUCCESS!@#KODE 1!@#USER_ID 88!@#ACTIVITY_CODE 1
12/11/2022 03:54:40 PM script INFO: SUCCESS!@#KODE 1!@#USER_ID 88!@#ACTIVITY_CODE 2
12/11/2022 03:54:40 PM script INFO: SUCCESS!@#KODE 1!@#USER_ID 88!@#ACTIVITY_CODE 5
12/11/2022 03:54:40 PM script INFO: SUCCESS!@#KODE 1!@#USER_ID 88!@#ACTIVITY_CODE 5
12/11/2022 03:54:42 PM script INFO: SUCCESS!@#KODE 1!@#USER_ID 88!@#ACTIVITY_CODE 1
12/11/2022 03:54:42 PM script INFO: SUCCESS!@#KODE 1!@#USER_ID 88!@#ACTIVITY_CODE 5
12/11/2022 03:54:42 PM script INFO: SUCCESS!@#KODE 1!@#USER_ID 88!@#ACTIVITY_CODE 5
12/11/2022 03:54:45 PM script INFO: SUCCESS!@#KODE 1!@#USER_ID 88!@#ACTIVITY_CODE 1
12/11/2022 03:54:45 PM script INFO: SUCCESS!@#KODE 1!@#USER_ID 88!@#ACTIVITY_CODE 1
12/11/2022 03:54:45 PM script INFO: SUCCESS!@#KODE 1!@#USER_ID 88!@#ACTIVITY_CODE 5
12/11/2022 03:54:45 PM script INFO: SUCCESS!@#KODE 1!@#USER_ID 88!@#ACTIVITY_CODE 5
12/11/2022 03:54:48 PM script INFO: SUCCESS!@#KODE 1!@#USER_ID 88!@#ACTIVITY_CODE 4
12/11/2022 03:54:48 PM script INFO: SUCCESS!@#KODE 1!@#USER_ID 88!@#ACTIVITY_CODE 3
12/11/2022 03:54:48 PM script INFO: SUCCESS!@#KODE 1!@#USER_ID 88!@#ACTIVITY_CODE 2
12/11/2022 03:54:48 PM script INFO: SUCCESS!@#KODE 1!@#USER_ID 88!@#ACTIVITY_CODE 1
12/11/2022 03:54:48 PM script INFO: SUCCESS!@#KODE 1!@#USER_ID 88!@#ACTIVITY_CODE 5
12/11/2022 03:54:48 PM script INFO: SUCCESS!@#KODE 1!@#USER_ID 88!@#ACTIVITY_CODE 5
12/11/2022 03:54:51 PM script INFO: SUCCESS!@#KODE 1!@#USER_ID 88!@#ACTIVITY_CODE 2
12/11/2022 03:54:51 PM script INFO: SUCCESS!@#KODE 1!@#USER_ID 88!@#ACTIVITY_CODE 5
12/11/2022 03:54:51 PM script INFO: SUCCESS!@#KODE 1!@#USER_ID 88!@#ACTIVITY_CODE 5
12/11/2022 03:54:53 PM script INFO: SUCCESS!@#KODE 1!@#USER_ID 88!@#ACTIVITY_CODE 1
12/11/2022 03:54:53 PM script INFO: SUCCESS!@#KODE 1!@#USER_ID 88!@#ACTIVITY_CODE 4
12/11/2022 03:54:53 PM script INFO: SUCCESS!@#KODE 1!@#USER_ID 88!@#ACTIVITY_CODE 2
12/11/2022 03:54:53 PM script INFO: SUCCESS!@#KODE 1!@#USER_ID 88!@#ACTIVITY_CODE 5
12/11/2022 03:54:53 PM script INFO: SUCCESS!@#KODE 1!@#USER_ID 88!@#ACTIVITY_CODE 5
12/11/2022 03:54:56 PM script INFO: SUCCESS!@#KODE 1!@#USER_ID 88!@#ACTIVITY_CODE 1
12/11/2022 03:54:56 PM script INFO: SUCCESS!@#KODE 1!@#USER_ID 88!@#ACTIVITY_CODE 1
12/11/2022 03:54:56 PM script INFO: SUCCESS!@#KODE 1!@#USER_ID 88!@#ACTIVITY_CODE 2
12/11/2022 03:54:56 PM script INFO: SUCCESS!@#KODE 1!@#USER_ID 88!@#ACTIVITY_CODE 4
12/11/2022 03:54:56 PM script INFO: SUCCESS!@#KODE 1!@#USER_ID 88!@#ACTIVITY_CODE 3
12/11/2022 03:54:56 PM script INFO: SUCCESS!@#KODE 1!@#USER_ID 88!@#ACTIVITY_CODE 1
12/11/2022 03:54:56 PM script INFO: SUCCESS!@#KODE 1!@#USER_ID 88!@#ACTIVITY_CODE 3
12/11/2022 03:54:56 PM script INFO: SUCCESS!@#KODE 1!@#USER_ID 88!@#ACTIVITY_CODE 1
12/11/2022 03:54:57 PM script INFO: SUCCESS!@#KODE 1!@#USER_ID 88!@#ACTIVITY_CODE 1
12/11/2022 03:54:57 PM script INFO: SUCCESS!@#KODE 1!@#USER_ID 88!@#ACTIVITY_CODE 4
12/11/2022 03:54:57 PM script INFO: SUCCESS!@#KODE 1!@#USER_ID 88!@#ACTIVITY_CODE 2
12/11/2022 03:54:57 PM script INFO: SUCCESS!@#KODE 1!@#USER_ID 88!@#ACTIVITY_CODE 3
12/11/2022 03:54:57 PM script INFO: SUCCESS!@#KODE 1!@#USER_ID 88!@#ACTIVITY_CODE 2
12/11/2022 03:54:57 PM script INFO: SUCCESS!@#KODE 1!@#USER_ID 88!@#ACTIVITY_CODE 4
12/11/2022 03:54:57 PM script INFO: SUCCESS!@#KODE 1!@#USER_ID 88!@#ACTIVITY_CODE 3
12/11/2022 03:54:57 PM script INFO: SUCCESS!@#KODE 1!@#USER_ID 88!@#ACTIVITY_CODE 1
12/11/2022 03:54:57 PM script INFO: SUCCESS!@#KODE 1!@#USER_ID 88!@#ACTIVITY_CODE 3
12/11/2022 03:54:57 PM script INFO: SUCCESS!@#KODE 1!@#USER_ID 88!@#ACTIVITY_CODE 4
12/11/2022 03:54:57 PM script INFO: SUCCESS!@#KODE 1!@#USER_ID 88!@#ACTIVITY_CODE 2
12/11/2022 03:54:58 PM script INFO: SUCCESS!@#KODE 1!@#USER_ID 88!@#ACTIVITY_CODE 2
12/11/2022 03:54:58 PM script INFO: SUCCESS!@#KODE 1!@#USER_ID 88!@#ACTIVITY_CODE 3
12/11/2022 03:54:58 PM script INFO: SUCCESS!@#KODE 1!@#USER_ID 88!@#ACTIVITY_CODE 2
12/11/2022 03:54:58 PM script INFO: SUCCESS!@#KODE 1!@#USER_ID 88!@#ACTIVITY_CODE 3
12/11/2022 03:54:58 PM script INFO: SUCCESS!@#KODE 1!@#USER_ID 88!@#ACTIVITY_CODE 3
12/11/2022 03:54:58 PM script INFO: SUCCESS!@#KODE 1!@#USER_ID 88!@#ACTIVITY_CODE 2
12/11/2022 03:54:58 PM script INFO: SUCCESS!@#KODE 1!@#USER_ID 88!@#ACTIVITY_CODE 2
12/11/2022 03:54:58 PM script INFO: SUCCESS!@#KODE 1!@#USER_ID 88!@#ACTIVITY_CODE 2
12/11/2022 03:54:58 PM script INFO: SUCCESS!@#KODE 1!@#USER_ID 88!@#ACTIVITY_CODE 1
12/11/2022 03:54:58 PM script INFO: SUCCESS!@#KODE 1!@#USER_ID 88!@#ACTIVITY_CODE 1
12/11/2022 03:54:58 PM script INFO: SUCCESS!@#KODE 1!@#USER_ID 88!@#ACTIVITY_CODE 4
12/11/2022 03:54:59 PM script INFO: SUCCESS!@#KODE 1!@#USER_ID 88!@#ACTIVITY_CODE 3
12/11/2022 03:54:59 PM script INFO: SUCCESS!@#KODE 1!@#USER_ID 88!@#ACTIVITY_CODE 3
12/11/2022 03:54:59 PM script INFO: SUCCESS!@#KODE 1!@#USER_ID 88!@#ACTIVITY_CODE 2
12/11/2022 03:54:59 PM script INFO: SUCCESS!@#KODE 1!@#USER_ID 88!@#ACTIVITY_CODE 3
12/11/2022 03:54:59 PM script INFO: SUCCESS!@#KODE 1!@#USER_ID 88!@#ACTIVITY_CODE 1
12/11/2022 03:54:59 PM script INFO: SUCCESS!@#KODE 1!@#USER_ID 88!@#ACTIVITY_CODE 1
12/11/2022 03:54:59 PM script INFO: SUCCESS!@#KODE 1!@#USER_ID 88!@#ACTIVITY_CODE 3
12/11/2022 03:54:59 PM script INFO: SUCCESS!@#KODE 1!@#USER_ID 88!@#ACTIVITY_CODE 2
12/11/2022 03:54:59 PM script INFO: SUCCESS!@#KODE 1!@#USER_ID 88!@#ACTIVITY_CODE 2
12/11/2022 03:54:59 PM script INFO: SUCCESS!@#KODE 1!@#USER_ID 88!@#ACTIVITY_CODE 1
12/11/2022 03:54:59 PM script INFO: SUCCESS!@#KODE 1!@#USER_ID 88!@#ACTIVITY_CODE 2
12/11/2022 03:55:00 PM script INFO: SUCCESS!@#KODE 1!@#USER_ID 88!@#ACTIVITY_CODE 1
12/11/2022 03:55:00 PM script INFO: SUCCESS!@#KODE 1!@#USER_ID 88!@#ACTIVITY_CODE 1
12/11/2022 03:55:00 PM script INFO: SUCCESS!@#KODE 1!@#USER_ID 88!@#ACTIVITY_CODE 2
12/11/2022 03:55:00 PM script INFO: SUCCESS!@#KODE 1!@#USER_ID 88!@#ACTIVITY_CODE 3
12/11/2022 03:55:00 PM script INFO: SUCCESS!@#KODE 1!@#USER_ID 88!@#ACTIVITY_CODE 1
12/11/2022 03:55:00 PM script INFO: SUCCESS!@#KODE 1!@#USER_ID 88!@#ACTIVITY_CODE 2
12/11/2022 03:55:00 PM script INFO: SUCCESS!@#KODE 1!@#USER_ID 88!@#ACTIVITY_CODE 1
12/11/2022 03:55:00 PM script INFO: SUCCESS!@#KODE 1!@#USER_ID 88!@#ACTIVITY_CODE 2
12/11/2022 03:55:00 PM script INFO: SUCCESS!@#KODE 1!@#USER_ID 88!@#ACTIVITY_CODE 1
12/11/2022 03:55:00 PM script INFO: SUCCESS!@#KODE 1!@#USER_ID 88!@#ACTIVITY_CODE 1
12/11/2022 03:55:00 PM script INFO: SUCCESS!@#KODE 1!@#USER_ID 88!@#ACTIVITY_CODE 2
12/11/2022 03:55:00 PM script INFO: SUCCESS!@#KODE 1!@#USER_ID 88!@#ACTIVITY_CODE 1
12/11/2022 03:55:01 PM script INFO: SUCCESS!@#KODE 1!@#USER_ID 88!@#ACTIVITY_CODE 3
12/11/2022 03:55:01 PM script INFO: SUCCESS!@#KODE 1!@#USER_ID 88!@#ACTIVITY_CODE 4
12/11/2022 03:55:01 PM script INFO: SUCCESS!@#KODE 1!@#USER_ID 88!@#ACTIVITY_CODE 2
12/11/2022 03:55:01 PM script INFO: SUCCESS!@#KODE 1!@#USER_ID 88!@#ACTIVITY_CODE 2
12/11/2022 03:55:01 PM script INFO: SUCCESS!@#KODE 1!@#USER_ID 88!@#ACTIVITY_CODE 4
12/11/2022 03:55:01 PM script INFO: SUCCESS!@#KODE 1!@#USER_ID 88!@#ACTIVITY_CODE 3
12/11/2022 03:55:01 PM script INFO: SUCCESS!@#KODE 1!@#USER_ID 88!@#ACTIVITY_CODE 2
12/11/2022 03:55:01 PM script INFO: SUCCESS!@#KODE 1!@#USER_ID 88!@#ACTIVITY_CODE 1
12/11/2022 03:55:01 PM script INFO: SUCCESS!@#KODE 1!@#USER_ID 88!@#ACTIVITY_CODE 4
12/11/2022 03:55:01 PM script INFO: SUCCESS!@#KODE 1!@#USER_ID 88!@#ACTIVITY_CODE 2
12/11/2022 03:55:02 PM script INFO: SUCCESS!@#KODE 1!@#USER_ID 88!@#ACTIVITY_CODE 2
12/11/2022 03:55:02 PM script INFO: SUCCESS!@#KODE 1!@#USER_ID 88!@#ACTIVITY_CODE 4
12/11/2022 03:55:02 PM script INFO: SUCCESS!@#KODE 1!@#USER_ID 88!@#ACTIVITY_CODE 1
12/11/2022 03:55:02 PM script INFO: SUCCESS!@#KODE 1!@#USER_ID 88!@#ACTIVITY_CODE 3
12/11/2022 03:55:02 PM script INFO: SUCCESS!@#KODE 1!@#USER_ID 88!@#ACTIVITY_CODE 2
12/11/2022 03:55:02 PM script INFO: SUCCESS!@#KODE 1!@#USER_ID 88!@#ACTIVITY_CODE 3
12/11/2022 03:55:02 PM script INFO: SUCCESS!@#KODE 1!@#USER_ID 88!@#ACTIVITY_CODE 2
12/11/2022 03:55:02 PM script INFO: SUCCESS!@#KODE 1!@#USER_ID 88!@#ACTIVITY_CODE 3
12/11/2022 03:55:02 PM script INFO: SUCCESS!@#KODE 1!@#USER_ID 88!@#ACTIVITY_CODE 2
12/11/2022 03:55:02 PM script INFO: SUCCESS!@#KODE 1!@#USER_ID 88!@#ACTIVITY_CODE 3
12/11/2022 03:55:03 PM script INFO: SUCCESS!@#KODE 1!@#USER_ID 88!@#ACTIVITY_CODE 3
12/11/2022 03:55:03 PM script INFO: SUCCESS!@#KODE 1!@#USER_ID 88!@#ACTIVITY_CODE 2
12/11/2022 03:55:03 PM script INFO: SUCCESS!@#KODE 1!@#USER_ID 88!@#ACTIVITY_CODE 3
12/11/2022 03:55:03 PM script INFO: SUCCESS!@#KODE 1!@#USER_ID 88!@#ACTIVITY_CODE 2
12/11/2022 03:55:03 PM script INFO: SUCCESS!@#KODE 1!@#USER_ID 88!@#ACTIVITY_CODE 1
12/11/2022 03:55:03 PM script INFO: SUCCESS!@#KODE 1!@#USER_ID 88!@#ACTIVITY_CODE 1
12/11/2022 03:55:03 PM script INFO: SUCCESS!@#KODE 1!@#USER_ID 88!@#ACTIVITY_CODE 3
12/11/2022 03:55:03 PM script INFO: SUCCESS!@#KODE 1!@#USER_ID 88!@#ACTIVITY_CODE 2
12/11/2022 03:55:03 PM script INFO: SUCCESS!@#KODE 1!@#USER_ID 88!@#ACTIVITY_CODE 4
12/11/2022 03:55:03 PM script INFO: SUCCESS!@#KODE 1!@#USER_ID 88!@#ACTIVITY_CODE 3
12/11/2022 03:55:03 PM script INFO: SUCCESS!@#KODE 1!@#USER_ID 88!@#ACTIVITY_CODE 1
12/11/2022 03:55:03 PM script INFO: SUCCESS!@#KODE 1!@#USER_ID 88!@#ACTIVITY_CODE 1
12/11/2022 03:55:03 PM script INFO: SUCCESS!@#KODE 1!@#USER_ID 88!@#ACTIVITY_CODE 3
12/11/2022 03:55:03 PM script INFO: SUCCESS!@#KODE 1!@#USER_ID 88!@#ACTIVITY_CODE 1
12/11/2022 03:55:04 PM script INFO: SUCCESS!@#KODE 1!@#USER_ID 88!@#ACTIVITY_CODE 3
12/11/2022 03:55:04 PM script INFO: SUCCESS!@#KODE 1!@#USER_ID 88!@#ACTIVITY_CODE 4
12/11/2022 03:55:04 PM script INFO: SUCCESS!@#KODE 1!@#USER_ID 88!@#ACTIVITY_CODE 2
12/11/2022 03:55:04 PM script INFO: SUCCESS!@#KODE 1!@#USER_ID 88!@#ACTIVITY_CODE 1
12/11/2022 03:55:04 PM script INFO: SUCCESS!@#KODE 1!@#USER_ID 88!@#ACTIVITY_CODE 3
12/11/2022 03:55:04 PM script INFO: SUCCESS!@#KODE 1!@#USER_ID 88!@#ACTIVITY_CODE 3
12/11/2022 03:55:04 PM script INFO: SUCCESS!@#KODE 1!@#USER_ID 88!@#ACTIVITY_CODE 3
12/11/2022 03:55:04 PM script INFO: SUCCESS!@#KODE 1!@#USER_ID 88!@#ACTIVITY_CODE 3
12/11/2022 03:55:04 PM script INFO: SUCCESS!@#KODE 1!@#USER_ID 88!@#ACTIVITY_CODE 3
12/11/2022 03:55:04 PM script INFO: SUCCESS!@#KODE 1!@#USER_ID 88!@#ACTIVITY_CODE 2
12/11/2022 03:55:04 PM script INFO: SUCCESS!@#KODE 1!@#USER_ID 88!@#ACTIVITY_CODE 1
12/11/2022 03:55:04 PM script INFO: SUCCESS!@#KODE 1!@#USER_ID 88!@#ACTIVITY_CODE 2
12/11/2022 03:55:04 PM script INFO: SUCCESS!@#KODE 1!@#USER_ID 88!@#ACTIVITY_CODE 3
12/11/2022 03:55:05 PM script INFO: SUCCESS!@#KODE 1!@#USER_ID 88!@#ACTIVITY_CODE 1
12/11/2022 03:55:05 PM script INFO: SUCCESS!@#KODE 1!@#USER_ID 88!@#ACTIVITY_CODE 1
12/11/2022 03:55:05 PM script INFO: SUCCESS!@#KODE 1!@#USER_ID 88!@#ACTIVITY_CODE 3
12/11/2022 03:55:05 PM script INFO: SUCCESS!@#KODE 1!@#USER_ID 88!@#ACTIVITY_CODE 3
12/11/2022 03:55:05 PM script INFO: SUCCESS!@#KODE 1!@#USER_ID 88!@#ACTIVITY_CODE 3
12/11/2022 03:55:05 PM script INFO: SUCCESS!@#KODE 1!@#USER_ID 88!@#ACTIVITY_CODE 1
12/11/2022 03:55:05 PM script INFO: SUCCESS!@#KODE 1!@#USER_ID 88!@#ACTIVITY_CODE 3
12/11/2022 03:55:05 PM script INFO: SUCCESS!@#KODE 1!@#USER_ID 88!@#ACTIVITY_CODE 2
12/11/2022 03:55:05 PM script INFO: SUCCESS!@#KODE 1!@#USER_ID 88!@#ACTIVITY_CODE 3
12/11/2022 03:55:05 PM script INFO: SUCCESS!@#KODE 1!@#USER_ID 88!@#ACTIVITY_CODE 4
12/11/2022 03:55:05 PM script INFO: SUCCESS!@#KODE 1!@#USER_ID 88!@#ACTIVITY_CODE 1
12/11/2022 03:55:05 PM script INFO: SUCCESS!@#KODE 1!@#USER_ID 88!@#ACTIVITY_CODE 3
12/11/2022 03:55:05 PM script INFO: SUCCESS!@#KODE 1!@#USER_ID 88!@#ACTIVITY_CODE 4
12/11/2022 03:55:05 PM script INFO: SUCCESS!@#KODE 1!@#USER_ID 88!@#ACTIVITY_CODE 2
12/11/2022 03:55:05 PM script INFO: SUCCESS!@#KODE 1!@#USER_ID 88!@#ACTIVITY_CODE 1
12/11/2022 03:55:06 PM script INFO: SUCCESS!@#KODE 1!@#USER_ID 88!@#ACTIVITY_CODE 3
12/11/2022 03:55:06 PM script INFO: SUCCESS!@#KODE 1!@#USER_ID 88!@#ACTIVITY_CODE 3
12/11/2022 03:55:06 PM script INFO: SUCCESS!@#KODE 1!@#USER_ID 88!@#ACTIVITY_CODE 2
12/11/2022 03:55:06 PM script INFO: SUCCESS!@#KODE 1!@#USER_ID 88!@#ACTIVITY_CODE 3
12/11/2022 03:55:06 PM script INFO: SUCCESS!@#KODE 1!@#USER_ID 88!@#ACTIVITY_CODE 4
12/11/2022 03:55:06 PM script INFO: SUCCESS!@#KODE 1!@#USER_ID 88!@#ACTIVITY_CODE 1
12/11/2022 03:55:06 PM script INFO: SUCCESS!@#KODE 1!@#USER_ID 88!@#ACTIVITY_CODE 4
12/11/2022 03:55:06 PM script INFO: SUCCESS!@#KODE 1!@#USER_ID 88!@#ACTIVITY_CODE 2
12/11/2022 03:55:06 PM script INFO: SUCCESS!@#KODE 1!@#USER_ID 88!@#ACTIVITY_CODE 1
12/11/2022 03:55:06 PM script INFO: SUCCESS!@#KODE 1!@#USER_ID 88!@#ACTIVITY_CODE 1
12/11/2022 03:55:06 PM script INFO: SUCCESS!@#KODE 1!@#USER_ID 88!@#ACTIVITY_CODE 2
12/11/2022 03:55:06 PM script INFO: SUCCESS!@#KODE 1!@#USER_ID 88!@#ACTIVITY_CODE 2
12/11/2022 03:55:07 PM script INFO: SUCCESS!@#KODE 1!@#USER_ID 88!@#ACTIVITY_CODE 2
12/11/2022 03:55:07 PM script INFO: SUCCESS!@#KODE 1!@#USER_ID 88!@#ACTIVITY_CODE 2
12/11/2022 03:55:07 PM script INFO: SUCCESS!@#KODE 1!@#USER_ID 88!@#ACTIVITY_CODE 3
12/11/2022 03:55:07 PM script INFO: SUCCESS!@#KODE 1!@#USER_ID 88!@#ACTIVITY_CODE 3
12/11/2022 03:55:07 PM script INFO: SUCCESS!@#KODE 1!@#USER_ID 88!@#ACTIVITY_CODE 3
12/11/2022 03:55:07 PM script INFO: SUCCESS!@#KODE 1!@#USER_ID 88!@#ACTIVITY_CODE 1
12/11/2022 03:55:07 PM script INFO: SUCCESS!@#KODE 1!@#USER_ID 88!@#ACTIVITY_CODE 2
12/11/2022 03:55:07 PM script INFO: SUCCESS!@#KODE 1!@#USER_ID 88!@#ACTIVITY_CODE 2
12/11/2022 03:55:07 PM script INFO: SUCCESS!@#KODE 1!@#USER_ID 88!@#ACTIVITY_CODE 2
12/11/2022 03:55:07 PM script INFO: SUCCESS!@#KODE 1!@#USER_ID 88!@#ACTIVITY_CODE 1
12/11/2022 03:55:07 PM script INFO: SUCCESS!@#KODE 1!@#USER_ID 88!@#ACTIVITY_CODE 1
12/11/2022 03:55:07 PM script INFO: SUCCESS!@#KODE 1!@#USER_ID 88!@#ACTIVITY_CODE 1
12/11/2022 03:55:08 PM script INFO: SUCCESS!@#KODE 1!@#USER_ID 88!@#ACTIVITY_CODE 2
12/11/2022 03:55:08 PM script INFO: SUCCESS!@#KODE 1!@#USER_ID 88!@#ACTIVITY_CODE 3
12/11/2022 03:55:08 PM script INFO: SUCCESS!@#KODE 1!@#USER_ID 88!@#ACTIVITY_CODE 3
12/11/2022 03:55:08 PM script INFO: SUCCESS!@#KODE 1!@#USER_ID 88!@#ACTIVITY_CODE 3
12/11/2022 03:55:08 PM script INFO: SUCCESS!@#KODE 1!@#USER_ID 88!@#ACTIVITY_CODE 3
12/11/2022 03:55:08 PM script INFO: SUCCESS!@#KODE 1!@#USER_ID 88!@#ACTIVITY_CODE 1
12/11/2022 03:55:08 PM script INFO: SUCCESS!@#KODE 1!@#USER_ID 88!@#ACTIVITY_CODE 2
12/11/2022 03:55:08 PM script INFO: SUCCESS!@#KODE 1!@#USER_ID 88!@#ACTIVITY_CODE 2
12/11/2022 03:55:08 PM script INFO: SUCCESS!@#KODE 1!@#USER_ID 88!@#ACTIVITY_CODE 2
12/11/2022 03:55:08 PM script INFO: SUCCESS!@#KODE 1!@#USER_ID 88!@#ACTIVITY_CODE 3
12/11/2022 03:55:08 PM script INFO: SUCCESS!@#KODE 1!@#USER_ID 88!@#ACTIVITY_CODE 1
12/11/2022 03:55:08 PM script INFO: SUCCESS!@#KODE 1!@#USER_ID 88!@#ACTIVITY_CODE 4
12/11/2022 03:55:09 PM script INFO: SUCCESS!@#KODE 1!@#USER_ID 88!@#ACTIVITY_CODE 2
12/11/2022 03:55:09 PM script INFO: SUCCESS!@#KODE 1!@#USER_ID 88!@#ACTIVITY_CODE 2
12/11/2022 03:55:09 PM script INFO: SUCCESS!@#KODE 1!@#USER_ID 88!@#ACTIVITY_CODE 1
12/11/2022 03:55:09 PM script INFO: SUCCESS!@#KODE 1!@#USER_ID 88!@#ACTIVITY_CODE 2
12/11/2022 03:55:09 PM script INFO: SUCCESS!@#KODE 1!@#USER_ID 88!@#ACTIVITY_CODE 1
12/11/2022 03:55:09 PM script INFO: SUCCESS!@#KODE 1!@#USER_ID 88!@#ACTIVITY_CODE 2
12/11/2022 03:55:09 PM script INFO: SUCCESS!@#KODE 1!@#USER_ID 88!@#ACTIVITY_CODE 1
12/11/2022 03:55:09 PM script INFO: SUCCESS!@#KODE 1!@#USER_ID 88!@#ACTIVITY_CODE 4
12/11/2022 03:55:09 PM script INFO: SUCCESS!@#KODE 1!@#USER_ID 88!@#ACTIVITY_CODE 2
12/11/2022 03:55:09 PM script INFO: Duration: 59.14798021316528
12/11/2022 03:55:09 PM script INFO: mengakhiri-quiz
12/11/2022 03:55:19 PM script INFO: SUCCESS!@#KODE 1!@#USER_ID 88!@#ACTIVITY_CODE 5
12/11/2022 03:55:19 PM script INFO: berhasil-submit
