12/23/2022 03:16:01 AM script INFO: Prepared chrome options..
12/23/2022 03:16:03 AM script INFO: Initialized chrome browser..
12/23/2022 03:16:03 AM script INFO: mengakses-homepage
12/23/2022 03:16:42 AM script INFO: mengakses-login-page
12/23/2022 03:16:53 AM script INFO: mengakses-site-home
12/23/2022 03:16:53 AM script INFO: mengakses-site-course
12/23/2022 03:16:54 AM script INFO: mengakses-quiz
12/23/2022 03:16:54 AM script INFO: mengakses-start-quiz-page
12/23/2022 03:16:55 AM script INFO: memulai-quiz
12/23/2022 03:16:55 AM script INFO: SUCCESS!@#KODE 1!@#USER_ID 12!@#ACTIVITY_CODE 5
12/23/2022 03:17:06 AM script INFO: SUCCESS!@#KODE 1!@#USER_ID 12!@#ACTIVITY_CODE 2
12/23/2022 03:17:06 AM script INFO: SUCCESS!@#KODE 1!@#USER_ID 12!@#ACTIVITY_CODE 3
12/23/2022 03:17:06 AM script INFO: SUCCESS!@#KODE 1!@#USER_ID 12!@#ACTIVITY_CODE 3
12/23/2022 03:17:06 AM script INFO: SUCCESS!@#KODE 1!@#USER_ID 12!@#ACTIVITY_CODE 3
12/23/2022 03:17:06 AM script INFO: SUCCESS!@#KODE 1!@#USER_ID 12!@#ACTIVITY_CODE 3
12/23/2022 03:17:06 AM script INFO: SUCCESS!@#KODE 1!@#USER_ID 12!@#ACTIVITY_CODE 5
12/23/2022 03:17:06 AM script INFO: SUCCESS!@#KODE 1!@#USER_ID 12!@#ACTIVITY_CODE 5
12/23/2022 03:17:09 AM script INFO: SUCCESS!@#KODE 1!@#USER_ID 12!@#ACTIVITY_CODE 2
12/23/2022 03:17:09 AM script INFO: SUCCESS!@#KODE 1!@#USER_ID 12!@#ACTIVITY_CODE 5
12/23/2022 03:17:09 AM script INFO: SUCCESS!@#KODE 1!@#USER_ID 12!@#ACTIVITY_CODE 5
12/23/2022 03:17:11 AM script INFO: SUCCESS!@#KODE 1!@#USER_ID 12!@#ACTIVITY_CODE 2
12/23/2022 03:17:11 AM script INFO: SUCCESS!@#KODE 1!@#USER_ID 12!@#ACTIVITY_CODE 3
12/23/2022 03:17:12 AM script INFO: SUCCESS!@#KODE 1!@#USER_ID 12!@#ACTIVITY_CODE 2
12/23/2022 03:17:12 AM script INFO: SUCCESS!@#KODE 1!@#USER_ID 12!@#ACTIVITY_CODE 5
12/23/2022 03:17:12 AM script INFO: SUCCESS!@#KODE 1!@#USER_ID 12!@#ACTIVITY_CODE 5
12/23/2022 03:17:14 AM script INFO: SUCCESS!@#KODE 1!@#USER_ID 12!@#ACTIVITY_CODE 5
12/23/2022 03:17:14 AM script INFO: SUCCESS!@#KODE 1!@#USER_ID 12!@#ACTIVITY_CODE 5
12/23/2022 03:17:17 AM script INFO: SUCCESS!@#KODE 1!@#USER_ID 12!@#ACTIVITY_CODE 2
12/23/2022 03:17:17 AM script INFO: SUCCESS!@#KODE 1!@#USER_ID 12!@#ACTIVITY_CODE 2
12/23/2022 03:17:17 AM script INFO: SUCCESS!@#KODE 1!@#USER_ID 12!@#ACTIVITY_CODE 3
12/23/2022 03:17:17 AM script INFO: SUCCESS!@#KODE 1!@#USER_ID 12!@#ACTIVITY_CODE 5
12/23/2022 03:17:17 AM script INFO: SUCCESS!@#KODE 1!@#USER_ID 12!@#ACTIVITY_CODE 5
12/23/2022 03:17:20 AM script INFO: SUCCESS!@#KODE 1!@#USER_ID 12!@#ACTIVITY_CODE 2
12/23/2022 03:17:20 AM script INFO: SUCCESS!@#KODE 1!@#USER_ID 12!@#ACTIVITY_CODE 3
12/23/2022 03:17:20 AM script INFO: SUCCESS!@#KODE 1!@#USER_ID 12!@#ACTIVITY_CODE 1
12/23/2022 03:17:20 AM script INFO: SUCCESS!@#KODE 1!@#USER_ID 12!@#ACTIVITY_CODE 3
12/23/2022 03:17:20 AM script INFO: SUCCESS!@#KODE 1!@#USER_ID 12!@#ACTIVITY_CODE 2
12/23/2022 03:17:20 AM script INFO: SUCCESS!@#KODE 1!@#USER_ID 12!@#ACTIVITY_CODE 5
12/23/2022 03:17:20 AM script INFO: SUCCESS!@#KODE 1!@#USER_ID 12!@#ACTIVITY_CODE 5
12/23/2022 03:17:22 AM script INFO: SUCCESS!@#KODE 1!@#USER_ID 12!@#ACTIVITY_CODE 2
12/23/2022 03:17:23 AM script INFO: SUCCESS!@#KODE 1!@#USER_ID 12!@#ACTIVITY_CODE 2
12/23/2022 03:17:23 AM script INFO: SUCCESS!@#KODE 1!@#USER_ID 12!@#ACTIVITY_CODE 1
12/23/2022 03:17:23 AM script INFO: SUCCESS!@#KODE 1!@#USER_ID 12!@#ACTIVITY_CODE 1
12/23/2022 03:17:23 AM script INFO: SUCCESS!@#KODE 1!@#USER_ID 12!@#ACTIVITY_CODE 3
12/23/2022 03:17:23 AM script INFO: SUCCESS!@#KODE 1!@#USER_ID 12!@#ACTIVITY_CODE 2
12/23/2022 03:17:23 AM script INFO: SUCCESS!@#KODE 1!@#USER_ID 12!@#ACTIVITY_CODE 2
12/23/2022 03:17:23 AM script INFO: SUCCESS!@#KODE 1!@#USER_ID 12!@#ACTIVITY_CODE 3
12/23/2022 03:17:23 AM script INFO: SUCCESS!@#KODE 1!@#USER_ID 12!@#ACTIVITY_CODE 2
12/23/2022 03:17:23 AM script INFO: SUCCESS!@#KODE 1!@#USER_ID 12!@#ACTIVITY_CODE 2
12/23/2022 03:17:23 AM script INFO: SUCCESS!@#KODE 1!@#USER_ID 12!@#ACTIVITY_CODE 3
12/23/2022 03:17:23 AM script INFO: SUCCESS!@#KODE 1!@#USER_ID 12!@#ACTIVITY_CODE 3
12/23/2022 03:17:23 AM script INFO: SUCCESS!@#KODE 1!@#USER_ID 12!@#ACTIVITY_CODE 2
12/23/2022 03:17:23 AM script INFO: SUCCESS!@#KODE 1!@#USER_ID 12!@#ACTIVITY_CODE 1
12/23/2022 03:17:24 AM script INFO: SUCCESS!@#KODE 1!@#USER_ID 12!@#ACTIVITY_CODE 2
12/23/2022 03:17:24 AM script INFO: SUCCESS!@#KODE 1!@#USER_ID 12!@#ACTIVITY_CODE 2
12/23/2022 03:17:24 AM script INFO: SUCCESS!@#KODE 1!@#USER_ID 12!@#ACTIVITY_CODE 1
12/23/2022 03:17:24 AM script INFO: SUCCESS!@#KODE 1!@#USER_ID 12!@#ACTIVITY_CODE 2
12/23/2022 03:17:24 AM script INFO: SUCCESS!@#KODE 1!@#USER_ID 12!@#ACTIVITY_CODE 2
12/23/2022 03:17:24 AM script INFO: Duration: 18.1977698802948
12/23/2022 03:17:24 AM script INFO: mengakhiri-quiz
12/23/2022 03:17:24 AM script INFO: SUCCESS!@#KODE 1!@#USER_ID 12!@#ACTIVITY_CODE 5
12/23/2022 03:17:24 AM script INFO: berhasil-submit
12/23/2022 03:18:55 AM script ERROR: TIMEOUT EXCEPTION!@#KODE 0!@#LOCATION berhasil-submit
12/23/2022 03:18:55 AM main_worker ERROR: Message: None

