12/23/2022 05:52:03 AM script INFO: Prepared chrome options..
12/23/2022 05:52:04 AM script INFO: Initialized chrome browser..
12/23/2022 05:52:04 AM script INFO: mengakses-homepage
12/23/2022 05:52:41 AM script INFO: mengakses-login-page
12/23/2022 05:53:33 AM script INFO: mengakses-site-home
12/23/2022 05:53:34 AM main_worker ERROR: Message: element click intercepted: Element <a class="list-group-item list-group-item-action  " href="http://35.238.154.97/?redirect=0" data-key="home" data-isexpandable="0" data-indent="0" data-showdivider="0" data-type="70" data-nodetype="0" data-collapse="0" data-forceopen="0" data-isactive="0" data-hidden="0" data-preceedwithhr="0" data-parent-key="myhome">...</a> is not clickable at point (142, 141). Other element would receive the click: <div class="yui3-widget-mask" style="position: fixed; width: 100%; height: 100%; top: 0px; left: 0px; z-index: 1042;"></div>
  (Session info: headless chrome=107.0.5304.87)
Stacktrace:
#0 0x558251259463 <unknown>
#1 0x55825101d8d8 <unknown>
#2 0x55825106323b <unknown>
#3 0x558251060a79 <unknown>
#4 0x55825105dfe4 <unknown>
#5 0x55825105cb21 <unknown>
#6 0x55825104f421 <unknown>
#7 0x55825107c622 <unknown>
#8 0x55825104eba7 <unknown>
#9 0x55825107c78e <unknown>
#10 0x55825109530f <unknown>
#11 0x55825107c443 <unknown>
#12 0x55825104d3c5 <unknown>
#13 0x55825104e531 <unknown>
#14 0x5582512abdce <unknown>
#15 0x5582512af192 <unknown>
#16 0x55825129093e <unknown>
#17 0x5582512b0103 <unknown>
#18 0x558251283d85 <unknown>
#19 0x5582512d10a8 <unknown>
#20 0x5582512d1239 <unknown>
#21 0x5582512ec492 <unknown>
#22 0x7f062feb3609 start_thread

