12/23/2022 07:04:05 AM script INFO: Prepared chrome options..
12/23/2022 07:04:07 AM script INFO: Initialized chrome browser..
12/23/2022 07:04:07 AM script INFO: mengakses-homepage
12/23/2022 07:04:46 AM script INFO: mengakses-login-page
12/23/2022 07:04:57 AM script INFO: mengakses-site-home
12/23/2022 07:04:57 AM script INFO: mengakses-site-course
12/23/2022 07:05:06 AM script INFO: mengakses-quiz
12/23/2022 07:05:12 AM script INFO: mengakses-start-quiz-page
12/23/2022 07:05:13 AM script INFO: memulai-quiz
12/23/2022 07:05:13 AM script INFO: SUCCESS!@#KODE 1!@#USER_ID 91!@#ACTIVITY_CODE 5
12/23/2022 07:05:23 AM script INFO: SUCCESS!@#KODE 1!@#USER_ID 91!@#ACTIVITY_CODE 1
12/23/2022 07:05:23 AM script INFO: SUCCESS!@#KODE 1!@#USER_ID 91!@#ACTIVITY_CODE 5
12/23/2022 07:05:23 AM script INFO: SUCCESS!@#KODE 1!@#USER_ID 91!@#ACTIVITY_CODE 5
12/23/2022 07:05:26 AM script INFO: SUCCESS!@#KODE 1!@#USER_ID 91!@#ACTIVITY_CODE 3
12/23/2022 07:05:26 AM script INFO: SUCCESS!@#KODE 1!@#USER_ID 91!@#ACTIVITY_CODE 4
12/23/2022 07:05:26 AM script INFO: SUCCESS!@#KODE 1!@#USER_ID 91!@#ACTIVITY_CODE 5
12/23/2022 07:05:26 AM script INFO: SUCCESS!@#KODE 1!@#USER_ID 91!@#ACTIVITY_CODE 5
12/23/2022 07:05:29 AM script INFO: SUCCESS!@#KODE 1!@#USER_ID 91!@#ACTIVITY_CODE 3
12/23/2022 07:05:29 AM script INFO: SUCCESS!@#KODE 1!@#USER_ID 91!@#ACTIVITY_CODE 2
12/23/2022 07:05:29 AM script INFO: SUCCESS!@#KODE 1!@#USER_ID 91!@#ACTIVITY_CODE 2
12/23/2022 07:05:29 AM script INFO: SUCCESS!@#KODE 1!@#USER_ID 91!@#ACTIVITY_CODE 2
12/23/2022 07:05:29 AM script INFO: SUCCESS!@#KODE 1!@#USER_ID 91!@#ACTIVITY_CODE 1
12/23/2022 07:05:29 AM script INFO: SUCCESS!@#KODE 1!@#USER_ID 91!@#ACTIVITY_CODE 3
12/23/2022 07:05:29 AM script INFO: SUCCESS!@#KODE 1!@#USER_ID 91!@#ACTIVITY_CODE 1
12/23/2022 07:05:29 AM script INFO: SUCCESS!@#KODE 1!@#USER_ID 91!@#ACTIVITY_CODE 5
12/23/2022 07:05:29 AM script INFO: SUCCESS!@#KODE 1!@#USER_ID 91!@#ACTIVITY_CODE 5
12/23/2022 07:05:32 AM script INFO: SUCCESS!@#KODE 1!@#USER_ID 91!@#ACTIVITY_CODE 3
12/23/2022 07:05:32 AM script INFO: SUCCESS!@#KODE 1!@#USER_ID 91!@#ACTIVITY_CODE 1
12/23/2022 07:05:32 AM script INFO: SUCCESS!@#KODE 1!@#USER_ID 91!@#ACTIVITY_CODE 2
12/23/2022 07:05:32 AM script INFO: SUCCESS!@#KODE 1!@#USER_ID 91!@#ACTIVITY_CODE 5
12/23/2022 07:05:32 AM script INFO: SUCCESS!@#KODE 1!@#USER_ID 91!@#ACTIVITY_CODE 5
12/23/2022 07:05:35 AM script INFO: SUCCESS!@#KODE 1!@#USER_ID 91!@#ACTIVITY_CODE 2
12/23/2022 07:05:35 AM script INFO: SUCCESS!@#KODE 1!@#USER_ID 91!@#ACTIVITY_CODE 3
12/23/2022 07:05:35 AM script INFO: SUCCESS!@#KODE 1!@#USER_ID 91!@#ACTIVITY_CODE 1
12/23/2022 07:05:35 AM script INFO: SUCCESS!@#KODE 1!@#USER_ID 91!@#ACTIVITY_CODE 1
12/23/2022 07:05:35 AM script INFO: SUCCESS!@#KODE 1!@#USER_ID 91!@#ACTIVITY_CODE 4
12/23/2022 07:05:35 AM script INFO: SUCCESS!@#KODE 1!@#USER_ID 91!@#ACTIVITY_CODE 1
12/23/2022 07:05:35 AM script INFO: SUCCESS!@#KODE 1!@#USER_ID 91!@#ACTIVITY_CODE 4
12/23/2022 07:05:35 AM script INFO: SUCCESS!@#KODE 1!@#USER_ID 91!@#ACTIVITY_CODE 2
12/23/2022 07:05:35 AM script INFO: SUCCESS!@#KODE 1!@#USER_ID 91!@#ACTIVITY_CODE 1
12/23/2022 07:05:35 AM script INFO: SUCCESS!@#KODE 1!@#USER_ID 91!@#ACTIVITY_CODE 1
12/23/2022 07:05:35 AM script INFO: SUCCESS!@#KODE 1!@#USER_ID 91!@#ACTIVITY_CODE 4
12/23/2022 07:05:35 AM script INFO: SUCCESS!@#KODE 1!@#USER_ID 91!@#ACTIVITY_CODE 2
12/23/2022 07:05:35 AM script INFO: SUCCESS!@#KODE 1!@#USER_ID 91!@#ACTIVITY_CODE 2
12/23/2022 07:05:35 AM script INFO: SUCCESS!@#KODE 1!@#USER_ID 91!@#ACTIVITY_CODE 1
12/23/2022 07:05:35 AM script INFO: SUCCESS!@#KODE 1!@#USER_ID 91!@#ACTIVITY_CODE 4
12/23/2022 07:05:35 AM script INFO: SUCCESS!@#KODE 1!@#USER_ID 91!@#ACTIVITY_CODE 5
12/23/2022 07:05:35 AM script INFO: SUCCESS!@#KODE 1!@#USER_ID 91!@#ACTIVITY_CODE 5
12/23/2022 07:05:38 AM script INFO: SUCCESS!@#KODE 1!@#USER_ID 91!@#ACTIVITY_CODE 3
12/23/2022 07:05:38 AM script INFO: SUCCESS!@#KODE 1!@#USER_ID 91!@#ACTIVITY_CODE 5
12/23/2022 07:05:38 AM script INFO: SUCCESS!@#KODE 1!@#USER_ID 91!@#ACTIVITY_CODE 5
12/23/2022 07:05:41 AM script INFO: SUCCESS!@#KODE 1!@#USER_ID 91!@#ACTIVITY_CODE 1
12/23/2022 07:05:41 AM script INFO: SUCCESS!@#KODE 1!@#USER_ID 91!@#ACTIVITY_CODE 4
12/23/2022 07:05:41 AM script INFO: SUCCESS!@#KODE 1!@#USER_ID 91!@#ACTIVITY_CODE 1
12/23/2022 07:05:41 AM script INFO: SUCCESS!@#KODE 1!@#USER_ID 91!@#ACTIVITY_CODE 1
12/23/2022 07:05:41 AM script INFO: SUCCESS!@#KODE 1!@#USER_ID 91!@#ACTIVITY_CODE 3
12/23/2022 07:05:41 AM script INFO: SUCCESS!@#KODE 1!@#USER_ID 91!@#ACTIVITY_CODE 1
12/23/2022 07:05:41 AM script INFO: SUCCESS!@#KODE 1!@#USER_ID 91!@#ACTIVITY_CODE 4
12/23/2022 07:05:41 AM script INFO: Duration: 17.64877486228943
12/23/2022 07:05:41 AM script INFO: mengakhiri-quiz
12/23/2022 07:05:42 AM script INFO: SUCCESS!@#KODE 1!@#USER_ID 91!@#ACTIVITY_CODE 5
12/23/2022 07:05:42 AM script INFO: berhasil-submit
