12/10/2022 08:53:26 AM script INFO: Prepared chrome options..
12/10/2022 08:53:29 AM script INFO: Initialized chrome browser..
12/10/2022 08:53:29 AM script INFO: mengakses-homepage
12/10/2022 08:54:02 AM script INFO: mengakses-login-page
12/10/2022 08:54:29 AM script INFO: mengakses-site-home
12/10/2022 08:54:34 AM script INFO: mengakses-site-course
12/10/2022 08:55:01 AM script INFO: mengakses-quiz
12/10/2022 08:55:03 AM script INFO: mengakses-start-quiz-page
12/10/2022 08:55:06 AM script INFO: memulai-quiz
12/10/2022 08:55:06 AM script INFO: SUCCESS!@#KODE 1!@#USER_ID 83!@#ACTIVITY_CODE 5
12/10/2022 08:55:17 AM script INFO: SUCCESS!@#KODE 1!@#USER_ID 83!@#ACTIVITY_CODE 1
12/10/2022 08:55:17 AM script INFO: SUCCESS!@#KODE 1!@#USER_ID 83!@#ACTIVITY_CODE 5
12/10/2022 08:55:17 AM script INFO: SUCCESS!@#KODE 1!@#USER_ID 83!@#ACTIVITY_CODE 5
12/10/2022 08:55:19 AM script INFO: SUCCESS!@#KODE 1!@#USER_ID 83!@#ACTIVITY_CODE 5
12/10/2022 08:55:19 AM script INFO: SUCCESS!@#KODE 1!@#USER_ID 83!@#ACTIVITY_CODE 5
12/10/2022 08:55:22 AM script INFO: SUCCESS!@#KODE 1!@#USER_ID 83!@#ACTIVITY_CODE 5
12/10/2022 08:55:22 AM script INFO: SUCCESS!@#KODE 1!@#USER_ID 83!@#ACTIVITY_CODE 5
12/10/2022 08:55:24 AM script INFO: SUCCESS!@#KODE 1!@#USER_ID 83!@#ACTIVITY_CODE 5
12/10/2022 08:55:24 AM script INFO: SUCCESS!@#KODE 1!@#USER_ID 83!@#ACTIVITY_CODE 5
12/10/2022 08:55:27 AM script INFO: SUCCESS!@#KODE 1!@#USER_ID 83!@#ACTIVITY_CODE 4
12/10/2022 08:55:27 AM script INFO: SUCCESS!@#KODE 1!@#USER_ID 83!@#ACTIVITY_CODE 5
12/10/2022 08:55:27 AM script INFO: SUCCESS!@#KODE 1!@#USER_ID 83!@#ACTIVITY_CODE 5
12/10/2022 08:55:30 AM script INFO: SUCCESS!@#KODE 1!@#USER_ID 83!@#ACTIVITY_CODE 1
12/10/2022 08:55:30 AM script INFO: SUCCESS!@#KODE 1!@#USER_ID 83!@#ACTIVITY_CODE 5
12/10/2022 08:55:30 AM script INFO: SUCCESS!@#KODE 1!@#USER_ID 83!@#ACTIVITY_CODE 5
12/10/2022 08:55:32 AM script INFO: SUCCESS!@#KODE 1!@#USER_ID 83!@#ACTIVITY_CODE 1
12/10/2022 08:55:32 AM script INFO: SUCCESS!@#KODE 1!@#USER_ID 83!@#ACTIVITY_CODE 1
12/10/2022 08:55:33 AM script INFO: SUCCESS!@#KODE 1!@#USER_ID 83!@#ACTIVITY_CODE 1
12/10/2022 08:55:33 AM script INFO: SUCCESS!@#KODE 1!@#USER_ID 83!@#ACTIVITY_CODE 1
12/10/2022 08:55:33 AM script INFO: SUCCESS!@#KODE 1!@#USER_ID 83!@#ACTIVITY_CODE 2
12/10/2022 08:55:33 AM script INFO: SUCCESS!@#KODE 1!@#USER_ID 83!@#ACTIVITY_CODE 2
12/10/2022 08:55:33 AM script INFO: SUCCESS!@#KODE 1!@#USER_ID 83!@#ACTIVITY_CODE 3
12/10/2022 08:55:34 AM script INFO: SUCCESS!@#KODE 1!@#USER_ID 83!@#ACTIVITY_CODE 1
12/10/2022 08:55:34 AM script INFO: SUCCESS!@#KODE 1!@#USER_ID 83!@#ACTIVITY_CODE 1
12/10/2022 08:55:34 AM script INFO: SUCCESS!@#KODE 1!@#USER_ID 83!@#ACTIVITY_CODE 2
12/10/2022 08:55:34 AM script INFO: SUCCESS!@#KODE 1!@#USER_ID 83!@#ACTIVITY_CODE 2
12/10/2022 08:55:34 AM script INFO: SUCCESS!@#KODE 1!@#USER_ID 83!@#ACTIVITY_CODE 1
12/10/2022 08:55:35 AM script INFO: SUCCESS!@#KODE 1!@#USER_ID 83!@#ACTIVITY_CODE 1
12/10/2022 08:55:35 AM script INFO: SUCCESS!@#KODE 1!@#USER_ID 83!@#ACTIVITY_CODE 3
12/10/2022 08:55:35 AM script INFO: SUCCESS!@#KODE 1!@#USER_ID 83!@#ACTIVITY_CODE 3
12/10/2022 08:55:35 AM script INFO: SUCCESS!@#KODE 1!@#USER_ID 83!@#ACTIVITY_CODE 3
12/10/2022 08:55:35 AM script INFO: SUCCESS!@#KODE 1!@#USER_ID 83!@#ACTIVITY_CODE 3
12/10/2022 08:55:36 AM script INFO: SUCCESS!@#KODE 1!@#USER_ID 83!@#ACTIVITY_CODE 2
12/10/2022 08:55:36 AM script INFO: SUCCESS!@#KODE 1!@#USER_ID 83!@#ACTIVITY_CODE 2
12/10/2022 08:55:36 AM script INFO: SUCCESS!@#KODE 1!@#USER_ID 83!@#ACTIVITY_CODE 2
12/10/2022 08:55:37 AM script INFO: SUCCESS!@#KODE 1!@#USER_ID 83!@#ACTIVITY_CODE 2
12/10/2022 08:55:37 AM script INFO: SUCCESS!@#KODE 1!@#USER_ID 83!@#ACTIVITY_CODE 1
12/10/2022 08:55:37 AM script INFO: SUCCESS!@#KODE 1!@#USER_ID 83!@#ACTIVITY_CODE 3
12/10/2022 08:55:37 AM script INFO: SUCCESS!@#KODE 1!@#USER_ID 83!@#ACTIVITY_CODE 2
12/10/2022 08:55:38 AM script INFO: SUCCESS!@#KODE 1!@#USER_ID 83!@#ACTIVITY_CODE 3
12/10/2022 08:55:38 AM script INFO: SUCCESS!@#KODE 1!@#USER_ID 83!@#ACTIVITY_CODE 2
12/10/2022 08:55:38 AM script INFO: SUCCESS!@#KODE 1!@#USER_ID 83!@#ACTIVITY_CODE 1
12/10/2022 08:55:38 AM script INFO: SUCCESS!@#KODE 1!@#USER_ID 83!@#ACTIVITY_CODE 3
12/10/2022 08:55:39 AM script INFO: SUCCESS!@#KODE 1!@#USER_ID 83!@#ACTIVITY_CODE 4
12/10/2022 08:55:39 AM script INFO: SUCCESS!@#KODE 1!@#USER_ID 83!@#ACTIVITY_CODE 3
12/10/2022 08:55:39 AM script INFO: SUCCESS!@#KODE 1!@#USER_ID 83!@#ACTIVITY_CODE 2
12/10/2022 08:55:40 AM script INFO: SUCCESS!@#KODE 1!@#USER_ID 83!@#ACTIVITY_CODE 2
12/10/2022 08:55:40 AM script INFO: SUCCESS!@#KODE 1!@#USER_ID 83!@#ACTIVITY_CODE 1
12/10/2022 08:55:40 AM script INFO: Duration: 23.56492519378662
12/10/2022 08:55:40 AM script INFO: mengakhiri-quiz
12/10/2022 08:55:49 AM script INFO: SUCCESS!@#KODE 1!@#USER_ID 83!@#ACTIVITY_CODE 5
12/10/2022 08:55:49 AM script INFO: berhasil-submit
12/10/2022 08:57:19 AM script ERROR: TIMEOUT EXCEPTION!@#KODE 0!@#LOCATION berhasil-submit
12/10/2022 08:57:19 AM main_worker ERROR: Message: None

