12/11/2022 03:52:32 PM script INFO: Prepared chrome options..
12/11/2022 03:52:33 PM script INFO: Initialized chrome browser..
12/11/2022 03:52:33 PM script INFO: mengakses-homepage
12/11/2022 03:53:22 PM script INFO: mengakses-login-page
12/11/2022 03:53:23 PM script INFO: mengakses-site-home
12/11/2022 03:53:38 PM script INFO: mengakses-site-course
12/11/2022 03:54:16 PM script INFO: mengakses-quiz
12/11/2022 03:54:16 PM main_worker ERROR: Message: no such element: Unable to locate element: {"method":"xpath","selector":"//*[@data-userid]"}
  (Session info: headless chrome=107.0.5304.87)
Stacktrace:
#0 0x55b2b1dfd463 <unknown>
#1 0x55b2b1bc18d8 <unknown>
#2 0x55b2b1bff43a <unknown>
#3 0x55b2b1bff651 <unknown>
#4 0x55b2b1c3b7a4 <unknown>
#5 0x55b2b1c2064d <unknown>
#6 0x55b2b1c3930f <unknown>
#7 0x55b2b1c20443 <unknown>
#8 0x55b2b1bf13c5 <unknown>
#9 0x55b2b1bf2531 <unknown>
#10 0x55b2b1e4fdce <unknown>
#11 0x55b2b1e53192 <unknown>
#12 0x55b2b1e3493e <unknown>
#13 0x55b2b1e54103 <unknown>
#14 0x55b2b1e27d85 <unknown>
#15 0x55b2b1e750a8 <unknown>
#16 0x55b2b1e75239 <unknown>
#17 0x55b2b1e90492 <unknown>
#18 0x7f2a8b9ae609 start_thread

