12/21/2022 01:36:43 PM script INFO: Prepared chrome options..
12/21/2022 01:36:44 PM script INFO: Initialized chrome browser..
12/21/2022 01:36:44 PM script INFO: mengakses-homepage
12/21/2022 01:37:25 PM script INFO: mengakses-login-page
12/21/2022 01:37:30 PM script INFO: mengakses-site-home
12/21/2022 01:37:46 PM script INFO: mengakses-site-course
12/21/2022 01:38:14 PM script INFO: mengakses-quiz
12/21/2022 01:38:15 PM script INFO: mengakses-start-quiz-page
12/21/2022 01:38:16 PM script INFO: memulai-quiz
12/21/2022 01:38:16 PM script INFO: SUCCESS!@#KODE 1!@#USER_ID 72!@#ACTIVITY_CODE 5
12/21/2022 01:38:27 PM script INFO: SUCCESS!@#KODE 1!@#USER_ID 72!@#ACTIVITY_CODE 2
12/21/2022 01:38:27 PM script INFO: SUCCESS!@#KODE 1!@#USER_ID 72!@#ACTIVITY_CODE 1
12/21/2022 01:38:27 PM script INFO: SUCCESS!@#KODE 1!@#USER_ID 72!@#ACTIVITY_CODE 1
12/21/2022 01:38:27 PM script INFO: SUCCESS!@#KODE 1!@#USER_ID 72!@#ACTIVITY_CODE 2
12/21/2022 01:38:28 PM script INFO: SUCCESS!@#KODE 1!@#USER_ID 72!@#ACTIVITY_CODE 2
12/21/2022 01:38:28 PM script INFO: SUCCESS!@#KODE 1!@#USER_ID 72!@#ACTIVITY_CODE 1
12/21/2022 01:38:28 PM script INFO: SUCCESS!@#KODE 1!@#USER_ID 72!@#ACTIVITY_CODE 4
12/21/2022 01:38:28 PM script INFO: SUCCESS!@#KODE 1!@#USER_ID 72!@#ACTIVITY_CODE 5
12/21/2022 01:38:28 PM script INFO: SUCCESS!@#KODE 1!@#USER_ID 72!@#ACTIVITY_CODE 5
12/21/2022 01:38:30 PM script INFO: SUCCESS!@#KODE 1!@#USER_ID 72!@#ACTIVITY_CODE 2
12/21/2022 01:38:31 PM script INFO: SUCCESS!@#KODE 1!@#USER_ID 72!@#ACTIVITY_CODE 3
12/21/2022 01:38:31 PM script INFO: SUCCESS!@#KODE 1!@#USER_ID 72!@#ACTIVITY_CODE 1
12/21/2022 01:38:31 PM script INFO: SUCCESS!@#KODE 1!@#USER_ID 72!@#ACTIVITY_CODE 1
12/21/2022 01:38:31 PM script INFO: SUCCESS!@#KODE 1!@#USER_ID 72!@#ACTIVITY_CODE 5
12/21/2022 01:38:31 PM script INFO: SUCCESS!@#KODE 1!@#USER_ID 72!@#ACTIVITY_CODE 5
12/21/2022 01:38:33 PM script INFO: SUCCESS!@#KODE 1!@#USER_ID 72!@#ACTIVITY_CODE 1
12/21/2022 01:38:33 PM script INFO: SUCCESS!@#KODE 1!@#USER_ID 72!@#ACTIVITY_CODE 5
12/21/2022 01:38:33 PM script INFO: SUCCESS!@#KODE 1!@#USER_ID 72!@#ACTIVITY_CODE 5
12/21/2022 01:38:36 PM script INFO: SUCCESS!@#KODE 1!@#USER_ID 72!@#ACTIVITY_CODE 3
12/21/2022 01:38:36 PM script INFO: SUCCESS!@#KODE 1!@#USER_ID 72!@#ACTIVITY_CODE 5
12/21/2022 01:38:36 PM script INFO: SUCCESS!@#KODE 1!@#USER_ID 72!@#ACTIVITY_CODE 5
12/21/2022 01:38:38 PM script INFO: SUCCESS!@#KODE 1!@#USER_ID 72!@#ACTIVITY_CODE 2
12/21/2022 01:38:38 PM script INFO: SUCCESS!@#KODE 1!@#USER_ID 72!@#ACTIVITY_CODE 1
12/21/2022 01:38:38 PM script INFO: SUCCESS!@#KODE 1!@#USER_ID 72!@#ACTIVITY_CODE 5
12/21/2022 01:38:38 PM script INFO: SUCCESS!@#KODE 1!@#USER_ID 72!@#ACTIVITY_CODE 5
12/21/2022 01:38:41 PM script INFO: SUCCESS!@#KODE 1!@#USER_ID 72!@#ACTIVITY_CODE 1
12/21/2022 01:38:41 PM script INFO: SUCCESS!@#KODE 1!@#USER_ID 72!@#ACTIVITY_CODE 3
12/21/2022 01:38:41 PM script INFO: SUCCESS!@#KODE 1!@#USER_ID 72!@#ACTIVITY_CODE 1
12/21/2022 01:38:41 PM script INFO: SUCCESS!@#KODE 1!@#USER_ID 72!@#ACTIVITY_CODE 1
12/21/2022 01:38:41 PM script INFO: SUCCESS!@#KODE 1!@#USER_ID 72!@#ACTIVITY_CODE 2
12/21/2022 01:38:41 PM script INFO: SUCCESS!@#KODE 1!@#USER_ID 72!@#ACTIVITY_CODE 1
12/21/2022 01:38:41 PM script INFO: SUCCESS!@#KODE 1!@#USER_ID 72!@#ACTIVITY_CODE 4
12/21/2022 01:38:42 PM script INFO: SUCCESS!@#KODE 1!@#USER_ID 72!@#ACTIVITY_CODE 3
12/21/2022 01:38:42 PM script INFO: SUCCESS!@#KODE 1!@#USER_ID 72!@#ACTIVITY_CODE 5
12/21/2022 01:38:42 PM script INFO: SUCCESS!@#KODE 1!@#USER_ID 72!@#ACTIVITY_CODE 5
12/21/2022 01:38:44 PM script INFO: SUCCESS!@#KODE 1!@#USER_ID 72!@#ACTIVITY_CODE 1
12/21/2022 01:38:44 PM script INFO: SUCCESS!@#KODE 1!@#USER_ID 72!@#ACTIVITY_CODE 1
12/21/2022 01:38:44 PM script INFO: SUCCESS!@#KODE 1!@#USER_ID 72!@#ACTIVITY_CODE 3
12/21/2022 01:38:44 PM script INFO: SUCCESS!@#KODE 1!@#USER_ID 72!@#ACTIVITY_CODE 5
12/21/2022 01:38:44 PM script INFO: SUCCESS!@#KODE 1!@#USER_ID 72!@#ACTIVITY_CODE 5
12/21/2022 01:38:47 PM script INFO: SUCCESS!@#KODE 1!@#USER_ID 72!@#ACTIVITY_CODE 5
12/21/2022 01:38:47 PM script INFO: SUCCESS!@#KODE 1!@#USER_ID 72!@#ACTIVITY_CODE 5
12/21/2022 01:38:49 PM script INFO: SUCCESS!@#KODE 1!@#USER_ID 72!@#ACTIVITY_CODE 3
12/21/2022 01:38:49 PM script INFO: SUCCESS!@#KODE 1!@#USER_ID 72!@#ACTIVITY_CODE 5
12/21/2022 01:38:49 PM script INFO: SUCCESS!@#KODE 1!@#USER_ID 72!@#ACTIVITY_CODE 5
12/21/2022 01:38:52 PM script INFO: SUCCESS!@#KODE 1!@#USER_ID 72!@#ACTIVITY_CODE 1
12/21/2022 01:38:52 PM script INFO: SUCCESS!@#KODE 1!@#USER_ID 72!@#ACTIVITY_CODE 2
12/21/2022 01:38:52 PM script INFO: SUCCESS!@#KODE 1!@#USER_ID 72!@#ACTIVITY_CODE 4
12/21/2022 01:38:52 PM script INFO: SUCCESS!@#KODE 1!@#USER_ID 72!@#ACTIVITY_CODE 2
12/21/2022 01:38:52 PM script INFO: SUCCESS!@#KODE 1!@#USER_ID 72!@#ACTIVITY_CODE 1
12/21/2022 01:38:53 PM script INFO: SUCCESS!@#KODE 1!@#USER_ID 72!@#ACTIVITY_CODE 2
12/21/2022 01:38:53 PM script INFO: SUCCESS!@#KODE 1!@#USER_ID 72!@#ACTIVITY_CODE 3
12/21/2022 01:38:53 PM script INFO: SUCCESS!@#KODE 1!@#USER_ID 72!@#ACTIVITY_CODE 5
12/21/2022 01:38:53 PM script INFO: SUCCESS!@#KODE 1!@#USER_ID 72!@#ACTIVITY_CODE 5
12/21/2022 01:38:55 PM script INFO: SUCCESS!@#KODE 1!@#USER_ID 72!@#ACTIVITY_CODE 4
12/21/2022 01:38:55 PM script INFO: SUCCESS!@#KODE 1!@#USER_ID 72!@#ACTIVITY_CODE 1
12/21/2022 01:38:55 PM script INFO: SUCCESS!@#KODE 1!@#USER_ID 72!@#ACTIVITY_CODE 2
12/21/2022 01:38:55 PM script INFO: SUCCESS!@#KODE 1!@#USER_ID 72!@#ACTIVITY_CODE 5
12/21/2022 01:38:55 PM script INFO: SUCCESS!@#KODE 1!@#USER_ID 72!@#ACTIVITY_CODE 5
12/21/2022 01:38:58 PM script INFO: SUCCESS!@#KODE 1!@#USER_ID 72!@#ACTIVITY_CODE 2
12/21/2022 01:38:58 PM script INFO: SUCCESS!@#KODE 1!@#USER_ID 72!@#ACTIVITY_CODE 3
12/21/2022 01:38:58 PM script INFO: SUCCESS!@#KODE 1!@#USER_ID 72!@#ACTIVITY_CODE 2
12/21/2022 01:38:58 PM script INFO: SUCCESS!@#KODE 1!@#USER_ID 72!@#ACTIVITY_CODE 1
12/21/2022 01:38:59 PM script INFO: SUCCESS!@#KODE 1!@#USER_ID 72!@#ACTIVITY_CODE 1
12/21/2022 01:38:59 PM script INFO: SUCCESS!@#KODE 1!@#USER_ID 72!@#ACTIVITY_CODE 2
12/21/2022 01:38:59 PM script INFO: SUCCESS!@#KODE 1!@#USER_ID 72!@#ACTIVITY_CODE 4
12/21/2022 01:38:59 PM script INFO: SUCCESS!@#KODE 1!@#USER_ID 72!@#ACTIVITY_CODE 1
12/21/2022 01:38:59 PM script INFO: SUCCESS!@#KODE 1!@#USER_ID 72!@#ACTIVITY_CODE 1
12/21/2022 01:38:59 PM script INFO: SUCCESS!@#KODE 1!@#USER_ID 72!@#ACTIVITY_CODE 3
12/21/2022 01:38:59 PM script INFO: SUCCESS!@#KODE 1!@#USER_ID 72!@#ACTIVITY_CODE 3
12/21/2022 01:38:59 PM script INFO: SUCCESS!@#KODE 1!@#USER_ID 72!@#ACTIVITY_CODE 4
12/21/2022 01:38:59 PM script INFO: SUCCESS!@#KODE 1!@#USER_ID 72!@#ACTIVITY_CODE 2
12/21/2022 01:38:59 PM script INFO: SUCCESS!@#KODE 1!@#USER_ID 72!@#ACTIVITY_CODE 3
12/21/2022 01:39:00 PM script INFO: SUCCESS!@#KODE 1!@#USER_ID 72!@#ACTIVITY_CODE 2
12/21/2022 01:39:00 PM script INFO: SUCCESS!@#KODE 1!@#USER_ID 72!@#ACTIVITY_CODE 4
12/21/2022 01:39:00 PM script INFO: SUCCESS!@#KODE 1!@#USER_ID 72!@#ACTIVITY_CODE 1
12/21/2022 01:39:00 PM script INFO: SUCCESS!@#KODE 1!@#USER_ID 72!@#ACTIVITY_CODE 2
12/21/2022 01:39:00 PM script INFO: SUCCESS!@#KODE 1!@#USER_ID 72!@#ACTIVITY_CODE 1
12/21/2022 01:39:00 PM script INFO: SUCCESS!@#KODE 1!@#USER_ID 72!@#ACTIVITY_CODE 2
12/21/2022 01:39:00 PM script INFO: SUCCESS!@#KODE 1!@#USER_ID 72!@#ACTIVITY_CODE 3
12/21/2022 01:39:00 PM script INFO: SUCCESS!@#KODE 1!@#USER_ID 72!@#ACTIVITY_CODE 4
12/21/2022 01:39:00 PM script INFO: SUCCESS!@#KODE 1!@#USER_ID 72!@#ACTIVITY_CODE 3
12/21/2022 01:39:00 PM script INFO: SUCCESS!@#KODE 1!@#USER_ID 72!@#ACTIVITY_CODE 1
12/21/2022 01:39:00 PM script INFO: SUCCESS!@#KODE 1!@#USER_ID 72!@#ACTIVITY_CODE 4
12/21/2022 01:39:00 PM script INFO: SUCCESS!@#KODE 1!@#USER_ID 72!@#ACTIVITY_CODE 1
12/21/2022 01:39:01 PM script INFO: SUCCESS!@#KODE 1!@#USER_ID 72!@#ACTIVITY_CODE 4
12/21/2022 01:39:01 PM script INFO: SUCCESS!@#KODE 1!@#USER_ID 72!@#ACTIVITY_CODE 2
12/21/2022 01:39:01 PM script INFO: SUCCESS!@#KODE 1!@#USER_ID 72!@#ACTIVITY_CODE 3
12/21/2022 01:39:01 PM script INFO: SUCCESS!@#KODE 1!@#USER_ID 72!@#ACTIVITY_CODE 2
12/21/2022 01:39:01 PM script INFO: SUCCESS!@#KODE 1!@#USER_ID 72!@#ACTIVITY_CODE 3
12/21/2022 01:39:01 PM script INFO: SUCCESS!@#KODE 1!@#USER_ID 72!@#ACTIVITY_CODE 4
12/21/2022 01:39:01 PM script INFO: SUCCESS!@#KODE 1!@#USER_ID 72!@#ACTIVITY_CODE 1
12/21/2022 01:39:01 PM script INFO: SUCCESS!@#KODE 1!@#USER_ID 72!@#ACTIVITY_CODE 2
12/21/2022 01:39:01 PM script INFO: SUCCESS!@#KODE 1!@#USER_ID 72!@#ACTIVITY_CODE 2
12/21/2022 01:39:02 PM script INFO: SUCCESS!@#KODE 1!@#USER_ID 72!@#ACTIVITY_CODE 1
12/21/2022 01:39:02 PM script INFO: SUCCESS!@#KODE 1!@#USER_ID 72!@#ACTIVITY_CODE 1
12/21/2022 01:39:02 PM script INFO: SUCCESS!@#KODE 1!@#USER_ID 72!@#ACTIVITY_CODE 3
12/21/2022 01:39:02 PM script INFO: SUCCESS!@#KODE 1!@#USER_ID 72!@#ACTIVITY_CODE 1
12/21/2022 01:39:02 PM script INFO: Duration: 34.61591720581055
12/21/2022 01:39:02 PM script INFO: mengakhiri-quiz
12/21/2022 01:39:02 PM script INFO: SUCCESS!@#KODE 1!@#USER_ID 72!@#ACTIVITY_CODE 5
12/21/2022 01:39:02 PM script INFO: berhasil-submit
12/21/2022 01:40:32 PM script ERROR: TIMEOUT EXCEPTION!@#KODE 0!@#LOCATION berhasil-submit
12/21/2022 01:40:32 PM main_worker ERROR: Message: None

