12/23/2022 07:21:05 AM script INFO: Prepared chrome options..
12/23/2022 07:21:06 AM script INFO: Initialized chrome browser..
12/23/2022 07:21:06 AM script INFO: mengakses-homepage
12/23/2022 07:21:19 AM script INFO: mengakses-login-page
12/23/2022 07:21:20 AM script INFO: mengakses-site-home
12/23/2022 07:21:21 AM script INFO: mengakses-site-course
12/23/2022 07:21:46 AM script INFO: mengakses-quiz
12/23/2022 07:22:02 AM script INFO: mengakses-start-quiz-page
12/23/2022 07:22:23 AM script INFO: memulai-quiz
12/23/2022 07:22:23 AM script INFO: SUCCESS!@#KODE 1!@#USER_ID 74!@#ACTIVITY_CODE 5
12/23/2022 07:22:34 AM script INFO: SUCCESS!@#KODE 1!@#USER_ID 74!@#ACTIVITY_CODE 5
12/23/2022 07:22:34 AM script INFO: SUCCESS!@#KODE 1!@#USER_ID 74!@#ACTIVITY_CODE 5
12/23/2022 07:22:36 AM script INFO: SUCCESS!@#KODE 1!@#USER_ID 74!@#ACTIVITY_CODE 3
12/23/2022 07:22:37 AM script INFO: SUCCESS!@#KODE 1!@#USER_ID 74!@#ACTIVITY_CODE 2
12/23/2022 07:22:37 AM script INFO: SUCCESS!@#KODE 1!@#USER_ID 74!@#ACTIVITY_CODE 2
12/23/2022 07:22:37 AM script INFO: SUCCESS!@#KODE 1!@#USER_ID 74!@#ACTIVITY_CODE 3
12/23/2022 07:22:37 AM script INFO: SUCCESS!@#KODE 1!@#USER_ID 74!@#ACTIVITY_CODE 5
12/23/2022 07:22:37 AM script INFO: SUCCESS!@#KODE 1!@#USER_ID 74!@#ACTIVITY_CODE 5
12/23/2022 07:22:40 AM script INFO: SUCCESS!@#KODE 1!@#USER_ID 74!@#ACTIVITY_CODE 5
12/23/2022 07:22:40 AM script INFO: SUCCESS!@#KODE 1!@#USER_ID 74!@#ACTIVITY_CODE 5
12/23/2022 07:22:42 AM script INFO: SUCCESS!@#KODE 1!@#USER_ID 74!@#ACTIVITY_CODE 5
12/23/2022 07:22:42 AM script INFO: SUCCESS!@#KODE 1!@#USER_ID 74!@#ACTIVITY_CODE 5
12/23/2022 07:22:45 AM script INFO: SUCCESS!@#KODE 1!@#USER_ID 74!@#ACTIVITY_CODE 2
12/23/2022 07:22:45 AM script INFO: SUCCESS!@#KODE 1!@#USER_ID 74!@#ACTIVITY_CODE 5
12/23/2022 07:22:45 AM script INFO: SUCCESS!@#KODE 1!@#USER_ID 74!@#ACTIVITY_CODE 5
12/23/2022 07:22:47 AM script INFO: SUCCESS!@#KODE 1!@#USER_ID 74!@#ACTIVITY_CODE 5
12/23/2022 07:22:47 AM script INFO: SUCCESS!@#KODE 1!@#USER_ID 74!@#ACTIVITY_CODE 5
12/23/2022 07:22:50 AM script INFO: SUCCESS!@#KODE 1!@#USER_ID 74!@#ACTIVITY_CODE 3
12/23/2022 07:22:50 AM script INFO: SUCCESS!@#KODE 1!@#USER_ID 74!@#ACTIVITY_CODE 1
12/23/2022 07:22:50 AM script INFO: SUCCESS!@#KODE 1!@#USER_ID 74!@#ACTIVITY_CODE 1
12/23/2022 07:22:50 AM script INFO: SUCCESS!@#KODE 1!@#USER_ID 74!@#ACTIVITY_CODE 1
12/23/2022 07:22:50 AM script INFO: SUCCESS!@#KODE 1!@#USER_ID 74!@#ACTIVITY_CODE 4
12/23/2022 07:22:50 AM script INFO: SUCCESS!@#KODE 1!@#USER_ID 74!@#ACTIVITY_CODE 2
12/23/2022 07:22:51 AM script INFO: SUCCESS!@#KODE 1!@#USER_ID 74!@#ACTIVITY_CODE 1
12/23/2022 07:22:51 AM script INFO: SUCCESS!@#KODE 1!@#USER_ID 74!@#ACTIVITY_CODE 2
12/23/2022 07:22:51 AM script INFO: SUCCESS!@#KODE 1!@#USER_ID 74!@#ACTIVITY_CODE 3
12/23/2022 07:22:51 AM script INFO: SUCCESS!@#KODE 1!@#USER_ID 74!@#ACTIVITY_CODE 1
12/23/2022 07:22:51 AM script INFO: SUCCESS!@#KODE 1!@#USER_ID 74!@#ACTIVITY_CODE 3
12/23/2022 07:22:51 AM script INFO: SUCCESS!@#KODE 1!@#USER_ID 74!@#ACTIVITY_CODE 3
12/23/2022 07:22:51 AM script INFO: SUCCESS!@#KODE 1!@#USER_ID 74!@#ACTIVITY_CODE 1
12/23/2022 07:22:51 AM script INFO: SUCCESS!@#KODE 1!@#USER_ID 74!@#ACTIVITY_CODE 1
12/23/2022 07:22:51 AM script INFO: SUCCESS!@#KODE 1!@#USER_ID 74!@#ACTIVITY_CODE 4
12/23/2022 07:22:51 AM script INFO: SUCCESS!@#KODE 1!@#USER_ID 74!@#ACTIVITY_CODE 1
12/23/2022 07:22:51 AM script INFO: SUCCESS!@#KODE 1!@#USER_ID 74!@#ACTIVITY_CODE 3
12/23/2022 07:22:52 AM script INFO: SUCCESS!@#KODE 1!@#USER_ID 74!@#ACTIVITY_CODE 2
12/23/2022 07:22:52 AM script INFO: SUCCESS!@#KODE 1!@#USER_ID 74!@#ACTIVITY_CODE 5
12/23/2022 07:22:52 AM script INFO: SUCCESS!@#KODE 1!@#USER_ID 74!@#ACTIVITY_CODE 5
12/23/2022 07:22:54 AM script INFO: SUCCESS!@#KODE 1!@#USER_ID 74!@#ACTIVITY_CODE 5
12/23/2022 07:22:54 AM script INFO: SUCCESS!@#KODE 1!@#USER_ID 74!@#ACTIVITY_CODE 5
12/23/2022 07:22:57 AM script INFO: SUCCESS!@#KODE 1!@#USER_ID 74!@#ACTIVITY_CODE 4
12/23/2022 07:22:57 AM script INFO: SUCCESS!@#KODE 1!@#USER_ID 74!@#ACTIVITY_CODE 5
12/23/2022 07:22:57 AM script INFO: SUCCESS!@#KODE 1!@#USER_ID 74!@#ACTIVITY_CODE 5
12/23/2022 07:22:59 AM script INFO: SUCCESS!@#KODE 1!@#USER_ID 74!@#ACTIVITY_CODE 2
12/23/2022 07:22:59 AM script INFO: SUCCESS!@#KODE 1!@#USER_ID 74!@#ACTIVITY_CODE 5
12/23/2022 07:22:59 AM script INFO: SUCCESS!@#KODE 1!@#USER_ID 74!@#ACTIVITY_CODE 5
12/23/2022 07:23:02 AM script INFO: SUCCESS!@#KODE 1!@#USER_ID 74!@#ACTIVITY_CODE 1
12/23/2022 07:23:02 AM script INFO: SUCCESS!@#KODE 1!@#USER_ID 74!@#ACTIVITY_CODE 2
12/23/2022 07:23:02 AM script INFO: SUCCESS!@#KODE 1!@#USER_ID 74!@#ACTIVITY_CODE 1
12/23/2022 07:23:02 AM script INFO: SUCCESS!@#KODE 1!@#USER_ID 74!@#ACTIVITY_CODE 4
12/23/2022 07:23:02 AM script INFO: SUCCESS!@#KODE 1!@#USER_ID 74!@#ACTIVITY_CODE 5
12/23/2022 07:23:02 AM script INFO: SUCCESS!@#KODE 1!@#USER_ID 74!@#ACTIVITY_CODE 5
12/23/2022 07:23:05 AM script INFO: SUCCESS!@#KODE 1!@#USER_ID 74!@#ACTIVITY_CODE 3
12/23/2022 07:23:05 AM script INFO: SUCCESS!@#KODE 1!@#USER_ID 74!@#ACTIVITY_CODE 1
12/23/2022 07:23:05 AM script INFO: SUCCESS!@#KODE 1!@#USER_ID 74!@#ACTIVITY_CODE 1
12/23/2022 07:23:05 AM script INFO: SUCCESS!@#KODE 1!@#USER_ID 74!@#ACTIVITY_CODE 2
12/23/2022 07:23:05 AM script INFO: SUCCESS!@#KODE 1!@#USER_ID 74!@#ACTIVITY_CODE 3
12/23/2022 07:23:05 AM script INFO: SUCCESS!@#KODE 1!@#USER_ID 74!@#ACTIVITY_CODE 5
12/23/2022 07:23:05 AM script INFO: SUCCESS!@#KODE 1!@#USER_ID 74!@#ACTIVITY_CODE 5
12/23/2022 07:23:07 AM script INFO: SUCCESS!@#KODE 1!@#USER_ID 74!@#ACTIVITY_CODE 3
12/23/2022 07:23:07 AM script INFO: SUCCESS!@#KODE 1!@#USER_ID 74!@#ACTIVITY_CODE 1
12/23/2022 07:23:07 AM script INFO: SUCCESS!@#KODE 1!@#USER_ID 74!@#ACTIVITY_CODE 5
12/23/2022 07:23:07 AM script INFO: SUCCESS!@#KODE 1!@#USER_ID 74!@#ACTIVITY_CODE 5
12/23/2022 07:23:10 AM script INFO: SUCCESS!@#KODE 1!@#USER_ID 74!@#ACTIVITY_CODE 1
12/23/2022 07:23:10 AM script INFO: SUCCESS!@#KODE 1!@#USER_ID 74!@#ACTIVITY_CODE 4
12/23/2022 07:23:10 AM script INFO: SUCCESS!@#KODE 1!@#USER_ID 74!@#ACTIVITY_CODE 5
12/23/2022 07:23:10 AM script INFO: SUCCESS!@#KODE 1!@#USER_ID 74!@#ACTIVITY_CODE 5
12/23/2022 07:23:13 AM script INFO: SUCCESS!@#KODE 1!@#USER_ID 74!@#ACTIVITY_CODE 3
12/23/2022 07:23:13 AM script INFO: SUCCESS!@#KODE 1!@#USER_ID 74!@#ACTIVITY_CODE 3
12/23/2022 07:23:13 AM script INFO: SUCCESS!@#KODE 1!@#USER_ID 74!@#ACTIVITY_CODE 5
12/23/2022 07:23:13 AM script INFO: SUCCESS!@#KODE 1!@#USER_ID 74!@#ACTIVITY_CODE 5
12/23/2022 07:23:15 AM script INFO: SUCCESS!@#KODE 1!@#USER_ID 74!@#ACTIVITY_CODE 5
12/23/2022 07:23:15 AM script INFO: SUCCESS!@#KODE 1!@#USER_ID 74!@#ACTIVITY_CODE 5
12/23/2022 07:23:18 AM script INFO: SUCCESS!@#KODE 1!@#USER_ID 74!@#ACTIVITY_CODE 2
12/23/2022 07:23:18 AM script INFO: SUCCESS!@#KODE 1!@#USER_ID 74!@#ACTIVITY_CODE 1
12/23/2022 07:23:18 AM script INFO: SUCCESS!@#KODE 1!@#USER_ID 74!@#ACTIVITY_CODE 1
12/23/2022 07:23:18 AM script INFO: SUCCESS!@#KODE 1!@#USER_ID 74!@#ACTIVITY_CODE 2
12/23/2022 07:23:18 AM script INFO: SUCCESS!@#KODE 1!@#USER_ID 74!@#ACTIVITY_CODE 1
12/23/2022 07:23:18 AM script INFO: SUCCESS!@#KODE 1!@#USER_ID 74!@#ACTIVITY_CODE 2
12/23/2022 07:23:18 AM script INFO: SUCCESS!@#KODE 1!@#USER_ID 74!@#ACTIVITY_CODE 1
12/23/2022 07:23:18 AM script INFO: SUCCESS!@#KODE 1!@#USER_ID 74!@#ACTIVITY_CODE 1
12/23/2022 07:23:18 AM script INFO: SUCCESS!@#KODE 1!@#USER_ID 74!@#ACTIVITY_CODE 3
12/23/2022 07:23:18 AM script INFO: SUCCESS!@#KODE 1!@#USER_ID 74!@#ACTIVITY_CODE 2
12/23/2022 07:23:18 AM script INFO: SUCCESS!@#KODE 1!@#USER_ID 74!@#ACTIVITY_CODE 4
12/23/2022 07:23:19 AM script INFO: SUCCESS!@#KODE 1!@#USER_ID 74!@#ACTIVITY_CODE 2
12/23/2022 07:23:19 AM script INFO: SUCCESS!@#KODE 1!@#USER_ID 74!@#ACTIVITY_CODE 2
12/23/2022 07:23:19 AM script INFO: SUCCESS!@#KODE 1!@#USER_ID 74!@#ACTIVITY_CODE 2
12/23/2022 07:23:19 AM script INFO: SUCCESS!@#KODE 1!@#USER_ID 74!@#ACTIVITY_CODE 3
12/23/2022 07:23:19 AM script INFO: SUCCESS!@#KODE 1!@#USER_ID 74!@#ACTIVITY_CODE 2
12/23/2022 07:23:19 AM script INFO: SUCCESS!@#KODE 1!@#USER_ID 74!@#ACTIVITY_CODE 2
12/23/2022 07:23:19 AM script INFO: SUCCESS!@#KODE 1!@#USER_ID 74!@#ACTIVITY_CODE 1
12/23/2022 07:23:19 AM script INFO: SUCCESS!@#KODE 1!@#USER_ID 74!@#ACTIVITY_CODE 1
12/23/2022 07:23:19 AM script INFO: SUCCESS!@#KODE 1!@#USER_ID 74!@#ACTIVITY_CODE 2
12/23/2022 07:23:19 AM script INFO: SUCCESS!@#KODE 1!@#USER_ID 74!@#ACTIVITY_CODE 1
12/23/2022 07:23:19 AM script INFO: SUCCESS!@#KODE 1!@#USER_ID 74!@#ACTIVITY_CODE 2
12/23/2022 07:23:20 AM script INFO: SUCCESS!@#KODE 1!@#USER_ID 74!@#ACTIVITY_CODE 2
12/23/2022 07:23:20 AM script INFO: SUCCESS!@#KODE 1!@#USER_ID 74!@#ACTIVITY_CODE 1
12/23/2022 07:23:20 AM script INFO: SUCCESS!@#KODE 1!@#USER_ID 74!@#ACTIVITY_CODE 4
12/23/2022 07:23:20 AM script INFO: SUCCESS!@#KODE 1!@#USER_ID 74!@#ACTIVITY_CODE 1
12/23/2022 07:23:20 AM script INFO: SUCCESS!@#KODE 1!@#USER_ID 74!@#ACTIVITY_CODE 4
12/23/2022 07:23:20 AM script INFO: SUCCESS!@#KODE 1!@#USER_ID 74!@#ACTIVITY_CODE 2
12/23/2022 07:23:20 AM script INFO: SUCCESS!@#KODE 1!@#USER_ID 74!@#ACTIVITY_CODE 3
12/23/2022 07:23:20 AM script INFO: SUCCESS!@#KODE 1!@#USER_ID 74!@#ACTIVITY_CODE 3
12/23/2022 07:23:20 AM script INFO: SUCCESS!@#KODE 1!@#USER_ID 74!@#ACTIVITY_CODE 2
12/23/2022 07:23:20 AM script INFO: SUCCESS!@#KODE 1!@#USER_ID 74!@#ACTIVITY_CODE 4
12/23/2022 07:23:20 AM script INFO: SUCCESS!@#KODE 1!@#USER_ID 74!@#ACTIVITY_CODE 3
12/23/2022 07:23:20 AM script INFO: SUCCESS!@#KODE 1!@#USER_ID 74!@#ACTIVITY_CODE 1
12/23/2022 07:23:20 AM script INFO: SUCCESS!@#KODE 1!@#USER_ID 74!@#ACTIVITY_CODE 3
12/23/2022 07:23:20 AM script INFO: SUCCESS!@#KODE 1!@#USER_ID 74!@#ACTIVITY_CODE 2
12/23/2022 07:23:21 AM script INFO: SUCCESS!@#KODE 1!@#USER_ID 74!@#ACTIVITY_CODE 3
12/23/2022 07:23:21 AM script INFO: SUCCESS!@#KODE 1!@#USER_ID 74!@#ACTIVITY_CODE 3
12/23/2022 07:23:21 AM script INFO: SUCCESS!@#KODE 1!@#USER_ID 74!@#ACTIVITY_CODE 2
12/23/2022 07:23:21 AM script INFO: SUCCESS!@#KODE 1!@#USER_ID 74!@#ACTIVITY_CODE 2
12/23/2022 07:23:21 AM script INFO: SUCCESS!@#KODE 1!@#USER_ID 74!@#ACTIVITY_CODE 1
12/23/2022 07:23:21 AM script INFO: SUCCESS!@#KODE 1!@#USER_ID 74!@#ACTIVITY_CODE 2
12/23/2022 07:23:21 AM script INFO: SUCCESS!@#KODE 1!@#USER_ID 74!@#ACTIVITY_CODE 1
12/23/2022 07:23:21 AM script INFO: SUCCESS!@#KODE 1!@#USER_ID 74!@#ACTIVITY_CODE 1
12/23/2022 07:23:21 AM script INFO: SUCCESS!@#KODE 1!@#USER_ID 74!@#ACTIVITY_CODE 4
12/23/2022 07:23:21 AM script INFO: SUCCESS!@#KODE 1!@#USER_ID 74!@#ACTIVITY_CODE 1
12/23/2022 07:23:21 AM script INFO: SUCCESS!@#KODE 1!@#USER_ID 74!@#ACTIVITY_CODE 4
12/23/2022 07:23:21 AM script INFO: SUCCESS!@#KODE 1!@#USER_ID 74!@#ACTIVITY_CODE 2
12/23/2022 07:23:21 AM script INFO: SUCCESS!@#KODE 1!@#USER_ID 74!@#ACTIVITY_CODE 3
12/23/2022 07:23:21 AM script INFO: SUCCESS!@#KODE 1!@#USER_ID 74!@#ACTIVITY_CODE 3
12/23/2022 07:23:21 AM script INFO: SUCCESS!@#KODE 1!@#USER_ID 74!@#ACTIVITY_CODE 1
12/23/2022 07:23:22 AM script INFO: SUCCESS!@#KODE 1!@#USER_ID 74!@#ACTIVITY_CODE 2
12/23/2022 07:23:22 AM script INFO: SUCCESS!@#KODE 1!@#USER_ID 74!@#ACTIVITY_CODE 3
12/23/2022 07:23:22 AM script INFO: SUCCESS!@#KODE 1!@#USER_ID 74!@#ACTIVITY_CODE 2
12/23/2022 07:23:22 AM script INFO: SUCCESS!@#KODE 1!@#USER_ID 74!@#ACTIVITY_CODE 2
12/23/2022 07:23:22 AM script INFO: SUCCESS!@#KODE 1!@#USER_ID 74!@#ACTIVITY_CODE 3
12/23/2022 07:23:22 AM script INFO: SUCCESS!@#KODE 1!@#USER_ID 74!@#ACTIVITY_CODE 1
12/23/2022 07:23:22 AM script INFO: SUCCESS!@#KODE 1!@#USER_ID 74!@#ACTIVITY_CODE 3
12/23/2022 07:23:22 AM script INFO: SUCCESS!@#KODE 1!@#USER_ID 74!@#ACTIVITY_CODE 1
12/23/2022 07:23:22 AM script INFO: SUCCESS!@#KODE 1!@#USER_ID 74!@#ACTIVITY_CODE 2
12/23/2022 07:23:22 AM script INFO: SUCCESS!@#KODE 1!@#USER_ID 74!@#ACTIVITY_CODE 3
12/23/2022 07:23:22 AM script INFO: SUCCESS!@#KODE 1!@#USER_ID 74!@#ACTIVITY_CODE 2
12/23/2022 07:23:22 AM script INFO: SUCCESS!@#KODE 1!@#USER_ID 74!@#ACTIVITY_CODE 2
12/23/2022 07:23:23 AM script INFO: SUCCESS!@#KODE 1!@#USER_ID 74!@#ACTIVITY_CODE 3
12/23/2022 07:23:23 AM script INFO: SUCCESS!@#KODE 1!@#USER_ID 74!@#ACTIVITY_CODE 3
12/23/2022 07:23:23 AM script INFO: SUCCESS!@#KODE 1!@#USER_ID 74!@#ACTIVITY_CODE 4
12/23/2022 07:23:23 AM script INFO: SUCCESS!@#KODE 1!@#USER_ID 74!@#ACTIVITY_CODE 1
12/23/2022 07:23:23 AM script INFO: SUCCESS!@#KODE 1!@#USER_ID 74!@#ACTIVITY_CODE 1
12/23/2022 07:23:23 AM script INFO: SUCCESS!@#KODE 1!@#USER_ID 74!@#ACTIVITY_CODE 2
12/23/2022 07:23:23 AM script INFO: SUCCESS!@#KODE 1!@#USER_ID 74!@#ACTIVITY_CODE 4
12/23/2022 07:23:23 AM script INFO: SUCCESS!@#KODE 1!@#USER_ID 74!@#ACTIVITY_CODE 2
12/23/2022 07:23:23 AM script INFO: SUCCESS!@#KODE 1!@#USER_ID 74!@#ACTIVITY_CODE 2
12/23/2022 07:23:23 AM script INFO: SUCCESS!@#KODE 1!@#USER_ID 74!@#ACTIVITY_CODE 4
12/23/2022 07:23:23 AM script INFO: SUCCESS!@#KODE 1!@#USER_ID 74!@#ACTIVITY_CODE 1
12/23/2022 07:23:23 AM script INFO: SUCCESS!@#KODE 1!@#USER_ID 74!@#ACTIVITY_CODE 3
12/23/2022 07:23:23 AM script INFO: SUCCESS!@#KODE 1!@#USER_ID 74!@#ACTIVITY_CODE 2
12/23/2022 07:23:23 AM script INFO: SUCCESS!@#KODE 1!@#USER_ID 74!@#ACTIVITY_CODE 2
12/23/2022 07:23:24 AM script INFO: SUCCESS!@#KODE 1!@#USER_ID 74!@#ACTIVITY_CODE 2
12/23/2022 07:23:24 AM script INFO: SUCCESS!@#KODE 1!@#USER_ID 74!@#ACTIVITY_CODE 3
12/23/2022 07:23:24 AM script INFO: SUCCESS!@#KODE 1!@#USER_ID 74!@#ACTIVITY_CODE 3
12/23/2022 07:23:24 AM script INFO: SUCCESS!@#KODE 1!@#USER_ID 74!@#ACTIVITY_CODE 1
12/23/2022 07:23:24 AM script INFO: SUCCESS!@#KODE 1!@#USER_ID 74!@#ACTIVITY_CODE 1
12/23/2022 07:23:24 AM script INFO: SUCCESS!@#KODE 1!@#USER_ID 74!@#ACTIVITY_CODE 2
12/23/2022 07:23:24 AM script INFO: SUCCESS!@#KODE 1!@#USER_ID 74!@#ACTIVITY_CODE 2
12/23/2022 07:23:24 AM script INFO: SUCCESS!@#KODE 1!@#USER_ID 74!@#ACTIVITY_CODE 3
12/23/2022 07:23:24 AM script INFO: SUCCESS!@#KODE 1!@#USER_ID 74!@#ACTIVITY_CODE 2
12/23/2022 07:23:24 AM script INFO: SUCCESS!@#KODE 1!@#USER_ID 74!@#ACTIVITY_CODE 4
12/23/2022 07:23:24 AM script INFO: SUCCESS!@#KODE 1!@#USER_ID 74!@#ACTIVITY_CODE 3
12/23/2022 07:23:24 AM script INFO: SUCCESS!@#KODE 1!@#USER_ID 74!@#ACTIVITY_CODE 2
12/23/2022 07:23:25 AM script INFO: SUCCESS!@#KODE 1!@#USER_ID 74!@#ACTIVITY_CODE 2
12/23/2022 07:23:25 AM script INFO: SUCCESS!@#KODE 1!@#USER_ID 74!@#ACTIVITY_CODE 3
12/23/2022 07:23:25 AM script INFO: SUCCESS!@#KODE 1!@#USER_ID 74!@#ACTIVITY_CODE 3
12/23/2022 07:23:25 AM script INFO: SUCCESS!@#KODE 1!@#USER_ID 74!@#ACTIVITY_CODE 2
12/23/2022 07:23:25 AM script INFO: SUCCESS!@#KODE 1!@#USER_ID 74!@#ACTIVITY_CODE 3
12/23/2022 07:23:25 AM script INFO: SUCCESS!@#KODE 1!@#USER_ID 74!@#ACTIVITY_CODE 2
12/23/2022 07:23:25 AM script INFO: SUCCESS!@#KODE 1!@#USER_ID 74!@#ACTIVITY_CODE 1
12/23/2022 07:23:25 AM script INFO: SUCCESS!@#KODE 1!@#USER_ID 74!@#ACTIVITY_CODE 1
12/23/2022 07:23:25 AM script INFO: SUCCESS!@#KODE 1!@#USER_ID 74!@#ACTIVITY_CODE 2
12/23/2022 07:23:25 AM script INFO: SUCCESS!@#KODE 1!@#USER_ID 74!@#ACTIVITY_CODE 1
12/23/2022 07:23:25 AM script INFO: SUCCESS!@#KODE 1!@#USER_ID 74!@#ACTIVITY_CODE 4
12/23/2022 07:23:25 AM script INFO: SUCCESS!@#KODE 1!@#USER_ID 74!@#ACTIVITY_CODE 2
12/23/2022 07:23:25 AM script INFO: SUCCESS!@#KODE 1!@#USER_ID 74!@#ACTIVITY_CODE 3
12/23/2022 07:23:25 AM script INFO: SUCCESS!@#KODE 1!@#USER_ID 74!@#ACTIVITY_CODE 1
12/23/2022 07:23:25 AM script INFO: SUCCESS!@#KODE 1!@#USER_ID 74!@#ACTIVITY_CODE 3
12/23/2022 07:23:25 AM script INFO: SUCCESS!@#KODE 1!@#USER_ID 74!@#ACTIVITY_CODE 1
12/23/2022 07:23:26 AM script INFO: SUCCESS!@#KODE 1!@#USER_ID 74!@#ACTIVITY_CODE 3
12/23/2022 07:23:26 AM script INFO: SUCCESS!@#KODE 1!@#USER_ID 74!@#ACTIVITY_CODE 2
12/23/2022 07:23:26 AM script INFO: SUCCESS!@#KODE 1!@#USER_ID 74!@#ACTIVITY_CODE 1
12/23/2022 07:23:26 AM script INFO: SUCCESS!@#KODE 1!@#USER_ID 74!@#ACTIVITY_CODE 1
12/23/2022 07:23:26 AM script INFO: SUCCESS!@#KODE 1!@#USER_ID 74!@#ACTIVITY_CODE 1
12/23/2022 07:23:26 AM script INFO: SUCCESS!@#KODE 1!@#USER_ID 74!@#ACTIVITY_CODE 4
12/23/2022 07:23:26 AM script INFO: SUCCESS!@#KODE 1!@#USER_ID 74!@#ACTIVITY_CODE 1
12/23/2022 07:23:26 AM script INFO: SUCCESS!@#KODE 1!@#USER_ID 74!@#ACTIVITY_CODE 1
12/23/2022 07:23:26 AM script INFO: SUCCESS!@#KODE 1!@#USER_ID 74!@#ACTIVITY_CODE 3
12/23/2022 07:23:26 AM script INFO: SUCCESS!@#KODE 1!@#USER_ID 74!@#ACTIVITY_CODE 1
12/23/2022 07:23:26 AM script INFO: SUCCESS!@#KODE 1!@#USER_ID 74!@#ACTIVITY_CODE 3
12/23/2022 07:23:26 AM script INFO: SUCCESS!@#KODE 1!@#USER_ID 74!@#ACTIVITY_CODE 1
12/23/2022 07:23:26 AM script INFO: SUCCESS!@#KODE 1!@#USER_ID 74!@#ACTIVITY_CODE 2
12/23/2022 07:23:26 AM script INFO: SUCCESS!@#KODE 1!@#USER_ID 74!@#ACTIVITY_CODE 2
12/23/2022 07:23:26 AM script INFO: SUCCESS!@#KODE 1!@#USER_ID 74!@#ACTIVITY_CODE 1
12/23/2022 07:23:26 AM script INFO: SUCCESS!@#KODE 1!@#USER_ID 74!@#ACTIVITY_CODE 3
12/23/2022 07:23:26 AM script INFO: SUCCESS!@#KODE 1!@#USER_ID 74!@#ACTIVITY_CODE 1
12/23/2022 07:23:26 AM script INFO: SUCCESS!@#KODE 1!@#USER_ID 74!@#ACTIVITY_CODE 3
12/23/2022 07:23:27 AM script INFO: SUCCESS!@#KODE 1!@#USER_ID 74!@#ACTIVITY_CODE 2
12/23/2022 07:23:27 AM script INFO: SUCCESS!@#KODE 1!@#USER_ID 74!@#ACTIVITY_CODE 4
12/23/2022 07:23:27 AM script INFO: SUCCESS!@#KODE 1!@#USER_ID 74!@#ACTIVITY_CODE 3
12/23/2022 07:23:27 AM script INFO: SUCCESS!@#KODE 1!@#USER_ID 74!@#ACTIVITY_CODE 1
12/23/2022 07:23:27 AM script INFO: SUCCESS!@#KODE 1!@#USER_ID 74!@#ACTIVITY_CODE 1
12/23/2022 07:23:27 AM script INFO: SUCCESS!@#KODE 1!@#USER_ID 74!@#ACTIVITY_CODE 4
12/23/2022 07:23:27 AM script INFO: SUCCESS!@#KODE 1!@#USER_ID 74!@#ACTIVITY_CODE 2
12/23/2022 07:23:27 AM script INFO: SUCCESS!@#KODE 1!@#USER_ID 74!@#ACTIVITY_CODE 2
12/23/2022 07:23:27 AM script INFO: SUCCESS!@#KODE 1!@#USER_ID 74!@#ACTIVITY_CODE 3
12/23/2022 07:23:27 AM script INFO: SUCCESS!@#KODE 1!@#USER_ID 74!@#ACTIVITY_CODE 1
12/23/2022 07:23:27 AM script INFO: SUCCESS!@#KODE 1!@#USER_ID 74!@#ACTIVITY_CODE 2
12/23/2022 07:23:27 AM script INFO: SUCCESS!@#KODE 1!@#USER_ID 74!@#ACTIVITY_CODE 2
12/23/2022 07:23:27 AM script INFO: SUCCESS!@#KODE 1!@#USER_ID 74!@#ACTIVITY_CODE 1
12/23/2022 07:23:27 AM script INFO: SUCCESS!@#KODE 1!@#USER_ID 74!@#ACTIVITY_CODE 2
12/23/2022 07:23:28 AM script INFO: SUCCESS!@#KODE 1!@#USER_ID 74!@#ACTIVITY_CODE 3
12/23/2022 07:23:28 AM script INFO: SUCCESS!@#KODE 1!@#USER_ID 74!@#ACTIVITY_CODE 3
12/23/2022 07:23:28 AM script INFO: SUCCESS!@#KODE 1!@#USER_ID 74!@#ACTIVITY_CODE 3
12/23/2022 07:23:28 AM script INFO: SUCCESS!@#KODE 1!@#USER_ID 74!@#ACTIVITY_CODE 2
12/23/2022 07:23:28 AM script INFO: SUCCESS!@#KODE 1!@#USER_ID 74!@#ACTIVITY_CODE 1
12/23/2022 07:23:28 AM script INFO: SUCCESS!@#KODE 1!@#USER_ID 74!@#ACTIVITY_CODE 1
12/23/2022 07:23:28 AM script INFO: SUCCESS!@#KODE 1!@#USER_ID 74!@#ACTIVITY_CODE 1
12/23/2022 07:23:28 AM script INFO: SUCCESS!@#KODE 1!@#USER_ID 74!@#ACTIVITY_CODE 3
12/23/2022 07:23:28 AM script INFO: SUCCESS!@#KODE 1!@#USER_ID 74!@#ACTIVITY_CODE 1
12/23/2022 07:23:28 AM script INFO: SUCCESS!@#KODE 1!@#USER_ID 74!@#ACTIVITY_CODE 3
12/23/2022 07:23:28 AM script INFO: SUCCESS!@#KODE 1!@#USER_ID 74!@#ACTIVITY_CODE 1
12/23/2022 07:23:28 AM script INFO: SUCCESS!@#KODE 1!@#USER_ID 74!@#ACTIVITY_CODE 1
12/23/2022 07:23:28 AM script INFO: SUCCESS!@#KODE 1!@#USER_ID 74!@#ACTIVITY_CODE 1
12/23/2022 07:23:28 AM script INFO: SUCCESS!@#KODE 1!@#USER_ID 74!@#ACTIVITY_CODE 3
12/23/2022 07:23:28 AM script INFO: SUCCESS!@#KODE 1!@#USER_ID 74!@#ACTIVITY_CODE 2
12/23/2022 07:23:28 AM script INFO: SUCCESS!@#KODE 1!@#USER_ID 74!@#ACTIVITY_CODE 3
12/23/2022 07:23:28 AM script INFO: SUCCESS!@#KODE 1!@#USER_ID 74!@#ACTIVITY_CODE 3
12/23/2022 07:23:28 AM script INFO: SUCCESS!@#KODE 1!@#USER_ID 74!@#ACTIVITY_CODE 3
12/23/2022 07:23:29 AM script INFO: SUCCESS!@#KODE 1!@#USER_ID 74!@#ACTIVITY_CODE 2
12/23/2022 07:23:29 AM script INFO: SUCCESS!@#KODE 1!@#USER_ID 74!@#ACTIVITY_CODE 4
12/23/2022 07:23:29 AM script INFO: SUCCESS!@#KODE 1!@#USER_ID 74!@#ACTIVITY_CODE 3
12/23/2022 07:23:29 AM script INFO: SUCCESS!@#KODE 1!@#USER_ID 74!@#ACTIVITY_CODE 3
12/23/2022 07:23:29 AM script INFO: SUCCESS!@#KODE 1!@#USER_ID 74!@#ACTIVITY_CODE 3
12/23/2022 07:23:29 AM script INFO: SUCCESS!@#KODE 1!@#USER_ID 74!@#ACTIVITY_CODE 1
12/23/2022 07:23:29 AM script INFO: SUCCESS!@#KODE 1!@#USER_ID 74!@#ACTIVITY_CODE 1
12/23/2022 07:23:29 AM script INFO: SUCCESS!@#KODE 1!@#USER_ID 74!@#ACTIVITY_CODE 1
12/23/2022 07:23:29 AM script INFO: SUCCESS!@#KODE 1!@#USER_ID 74!@#ACTIVITY_CODE 1
12/23/2022 07:23:29 AM script INFO: SUCCESS!@#KODE 1!@#USER_ID 74!@#ACTIVITY_CODE 2
12/23/2022 07:23:29 AM script INFO: SUCCESS!@#KODE 1!@#USER_ID 74!@#ACTIVITY_CODE 1
12/23/2022 07:23:29 AM script INFO: SUCCESS!@#KODE 1!@#USER_ID 74!@#ACTIVITY_CODE 4
12/23/2022 07:23:29 AM script INFO: SUCCESS!@#KODE 1!@#USER_ID 74!@#ACTIVITY_CODE 2
12/23/2022 07:23:29 AM script INFO: SUCCESS!@#KODE 1!@#USER_ID 74!@#ACTIVITY_CODE 2
12/23/2022 07:23:29 AM script INFO: SUCCESS!@#KODE 1!@#USER_ID 74!@#ACTIVITY_CODE 2
12/23/2022 07:23:29 AM script INFO: SUCCESS!@#KODE 1!@#USER_ID 74!@#ACTIVITY_CODE 1
12/23/2022 07:23:29 AM script INFO: SUCCESS!@#KODE 1!@#USER_ID 74!@#ACTIVITY_CODE 1
12/23/2022 07:23:29 AM script INFO: SUCCESS!@#KODE 1!@#USER_ID 74!@#ACTIVITY_CODE 1
12/23/2022 07:23:30 AM script INFO: SUCCESS!@#KODE 1!@#USER_ID 74!@#ACTIVITY_CODE 2
12/23/2022 07:23:30 AM script INFO: SUCCESS!@#KODE 1!@#USER_ID 74!@#ACTIVITY_CODE 1
12/23/2022 07:23:30 AM script INFO: SUCCESS!@#KODE 1!@#USER_ID 74!@#ACTIVITY_CODE 2
12/23/2022 07:23:30 AM script INFO: Duration: 56.1659038066864
12/23/2022 07:23:30 AM script INFO: mengakhiri-quiz
12/23/2022 07:23:30 AM script INFO: SUCCESS!@#KODE 1!@#USER_ID 74!@#ACTIVITY_CODE 5
12/23/2022 07:23:30 AM script INFO: berhasil-submit
