12/23/2022 03:21:10 AM script INFO: Prepared chrome options..
12/23/2022 03:21:11 AM script INFO: Initialized chrome browser..
12/23/2022 03:21:11 AM script INFO: mengakses-homepage
12/23/2022 03:22:04 AM script INFO: mengakses-login-page
12/23/2022 03:22:18 AM script INFO: mengakses-site-home
12/23/2022 03:22:19 AM script INFO: mengakses-site-course
12/23/2022 03:22:25 AM script INFO: mengakses-quiz
12/23/2022 03:22:25 AM script INFO: mengakses-start-quiz-page
12/23/2022 03:22:27 AM script INFO: memulai-quiz
12/23/2022 03:22:27 AM script INFO: SUCCESS!@#KODE 1!@#USER_ID 41!@#ACTIVITY_CODE 5
12/23/2022 03:22:37 AM script INFO: SUCCESS!@#KODE 1!@#USER_ID 41!@#ACTIVITY_CODE 3
12/23/2022 03:22:38 AM script INFO: SUCCESS!@#KODE 1!@#USER_ID 41!@#ACTIVITY_CODE 2
12/23/2022 03:22:38 AM script INFO: SUCCESS!@#KODE 1!@#USER_ID 41!@#ACTIVITY_CODE 5
12/23/2022 03:22:38 AM script INFO: SUCCESS!@#KODE 1!@#USER_ID 41!@#ACTIVITY_CODE 5
12/23/2022 03:22:40 AM script INFO: SUCCESS!@#KODE 1!@#USER_ID 41!@#ACTIVITY_CODE 3
12/23/2022 03:22:40 AM script INFO: SUCCESS!@#KODE 1!@#USER_ID 41!@#ACTIVITY_CODE 5
12/23/2022 03:22:40 AM script INFO: SUCCESS!@#KODE 1!@#USER_ID 41!@#ACTIVITY_CODE 5
12/23/2022 03:22:43 AM script INFO: SUCCESS!@#KODE 1!@#USER_ID 41!@#ACTIVITY_CODE 3
12/23/2022 03:22:43 AM script INFO: SUCCESS!@#KODE 1!@#USER_ID 41!@#ACTIVITY_CODE 3
12/23/2022 03:22:43 AM script INFO: SUCCESS!@#KODE 1!@#USER_ID 41!@#ACTIVITY_CODE 3
12/23/2022 03:22:43 AM script INFO: SUCCESS!@#KODE 1!@#USER_ID 41!@#ACTIVITY_CODE 1
12/23/2022 03:22:43 AM script INFO: SUCCESS!@#KODE 1!@#USER_ID 41!@#ACTIVITY_CODE 2
12/23/2022 03:22:43 AM script INFO: SUCCESS!@#KODE 1!@#USER_ID 41!@#ACTIVITY_CODE 3
12/23/2022 03:22:43 AM script INFO: SUCCESS!@#KODE 1!@#USER_ID 41!@#ACTIVITY_CODE 3
12/23/2022 03:22:43 AM script INFO: SUCCESS!@#KODE 1!@#USER_ID 41!@#ACTIVITY_CODE 2
12/23/2022 03:22:43 AM script INFO: SUCCESS!@#KODE 1!@#USER_ID 41!@#ACTIVITY_CODE 2
12/23/2022 03:22:43 AM script INFO: SUCCESS!@#KODE 1!@#USER_ID 41!@#ACTIVITY_CODE 2
12/23/2022 03:22:43 AM script INFO: SUCCESS!@#KODE 1!@#USER_ID 41!@#ACTIVITY_CODE 5
12/23/2022 03:22:43 AM script INFO: SUCCESS!@#KODE 1!@#USER_ID 41!@#ACTIVITY_CODE 5
12/23/2022 03:22:46 AM script INFO: SUCCESS!@#KODE 1!@#USER_ID 41!@#ACTIVITY_CODE 3
12/23/2022 03:22:46 AM script INFO: SUCCESS!@#KODE 1!@#USER_ID 41!@#ACTIVITY_CODE 1
12/23/2022 03:22:46 AM script INFO: SUCCESS!@#KODE 1!@#USER_ID 41!@#ACTIVITY_CODE 2
12/23/2022 03:22:46 AM script INFO: SUCCESS!@#KODE 1!@#USER_ID 41!@#ACTIVITY_CODE 3
12/23/2022 03:22:46 AM script INFO: SUCCESS!@#KODE 1!@#USER_ID 41!@#ACTIVITY_CODE 5
12/23/2022 03:22:46 AM script INFO: SUCCESS!@#KODE 1!@#USER_ID 41!@#ACTIVITY_CODE 5
12/23/2022 03:22:49 AM script INFO: SUCCESS!@#KODE 1!@#USER_ID 41!@#ACTIVITY_CODE 1
12/23/2022 03:22:49 AM script INFO: SUCCESS!@#KODE 1!@#USER_ID 41!@#ACTIVITY_CODE 5
12/23/2022 03:22:49 AM script INFO: SUCCESS!@#KODE 1!@#USER_ID 41!@#ACTIVITY_CODE 5
12/23/2022 03:22:51 AM script INFO: SUCCESS!@#KODE 1!@#USER_ID 41!@#ACTIVITY_CODE 2
12/23/2022 03:22:52 AM script INFO: SUCCESS!@#KODE 1!@#USER_ID 41!@#ACTIVITY_CODE 4
12/23/2022 03:22:52 AM script INFO: SUCCESS!@#KODE 1!@#USER_ID 41!@#ACTIVITY_CODE 5
12/23/2022 03:22:52 AM script INFO: SUCCESS!@#KODE 1!@#USER_ID 41!@#ACTIVITY_CODE 5
12/23/2022 03:22:54 AM script INFO: SUCCESS!@#KODE 1!@#USER_ID 41!@#ACTIVITY_CODE 3
12/23/2022 03:22:54 AM script INFO: SUCCESS!@#KODE 1!@#USER_ID 41!@#ACTIVITY_CODE 2
12/23/2022 03:22:54 AM script INFO: SUCCESS!@#KODE 1!@#USER_ID 41!@#ACTIVITY_CODE 5
12/23/2022 03:22:54 AM script INFO: SUCCESS!@#KODE 1!@#USER_ID 41!@#ACTIVITY_CODE 5
12/23/2022 03:22:57 AM script INFO: SUCCESS!@#KODE 1!@#USER_ID 41!@#ACTIVITY_CODE 1
12/23/2022 03:22:57 AM script INFO: SUCCESS!@#KODE 1!@#USER_ID 41!@#ACTIVITY_CODE 3
12/23/2022 03:22:57 AM script INFO: SUCCESS!@#KODE 1!@#USER_ID 41!@#ACTIVITY_CODE 3
12/23/2022 03:22:57 AM script INFO: SUCCESS!@#KODE 1!@#USER_ID 41!@#ACTIVITY_CODE 1
12/23/2022 03:22:57 AM script INFO: SUCCESS!@#KODE 1!@#USER_ID 41!@#ACTIVITY_CODE 5
12/23/2022 03:22:57 AM script INFO: SUCCESS!@#KODE 1!@#USER_ID 41!@#ACTIVITY_CODE 5
12/23/2022 03:23:00 AM script INFO: SUCCESS!@#KODE 1!@#USER_ID 41!@#ACTIVITY_CODE 2
12/23/2022 03:23:00 AM script INFO: SUCCESS!@#KODE 1!@#USER_ID 41!@#ACTIVITY_CODE 4
12/23/2022 03:23:00 AM script INFO: SUCCESS!@#KODE 1!@#USER_ID 41!@#ACTIVITY_CODE 1
12/23/2022 03:23:00 AM script INFO: SUCCESS!@#KODE 1!@#USER_ID 41!@#ACTIVITY_CODE 2
12/23/2022 03:23:00 AM script INFO: SUCCESS!@#KODE 1!@#USER_ID 41!@#ACTIVITY_CODE 1
12/23/2022 03:23:00 AM script INFO: SUCCESS!@#KODE 1!@#USER_ID 41!@#ACTIVITY_CODE 1
12/23/2022 03:23:00 AM script INFO: SUCCESS!@#KODE 1!@#USER_ID 41!@#ACTIVITY_CODE 3
12/23/2022 03:23:00 AM script INFO: SUCCESS!@#KODE 1!@#USER_ID 41!@#ACTIVITY_CODE 5
12/23/2022 03:23:00 AM script INFO: SUCCESS!@#KODE 1!@#USER_ID 41!@#ACTIVITY_CODE 5
12/23/2022 03:23:03 AM script INFO: SUCCESS!@#KODE 1!@#USER_ID 41!@#ACTIVITY_CODE 1
12/23/2022 03:23:03 AM script INFO: SUCCESS!@#KODE 1!@#USER_ID 41!@#ACTIVITY_CODE 2
12/23/2022 03:23:03 AM script INFO: SUCCESS!@#KODE 1!@#USER_ID 41!@#ACTIVITY_CODE 3
12/23/2022 03:23:03 AM script INFO: SUCCESS!@#KODE 1!@#USER_ID 41!@#ACTIVITY_CODE 3
12/23/2022 03:23:03 AM script INFO: SUCCESS!@#KODE 1!@#USER_ID 41!@#ACTIVITY_CODE 2
12/23/2022 03:23:03 AM script INFO: SUCCESS!@#KODE 1!@#USER_ID 41!@#ACTIVITY_CODE 2
12/23/2022 03:23:03 AM script INFO: SUCCESS!@#KODE 1!@#USER_ID 41!@#ACTIVITY_CODE 5
12/23/2022 03:23:03 AM script INFO: SUCCESS!@#KODE 1!@#USER_ID 41!@#ACTIVITY_CODE 5
12/23/2022 03:23:06 AM script INFO: SUCCESS!@#KODE 1!@#USER_ID 41!@#ACTIVITY_CODE 1
12/23/2022 03:23:06 AM script INFO: SUCCESS!@#KODE 1!@#USER_ID 41!@#ACTIVITY_CODE 2
12/23/2022 03:23:06 AM script INFO: SUCCESS!@#KODE 1!@#USER_ID 41!@#ACTIVITY_CODE 3
12/23/2022 03:23:06 AM script INFO: SUCCESS!@#KODE 1!@#USER_ID 41!@#ACTIVITY_CODE 3
12/23/2022 03:23:06 AM script INFO: SUCCESS!@#KODE 1!@#USER_ID 41!@#ACTIVITY_CODE 2
12/23/2022 03:23:06 AM script INFO: SUCCESS!@#KODE 1!@#USER_ID 41!@#ACTIVITY_CODE 2
12/23/2022 03:23:06 AM script INFO: SUCCESS!@#KODE 1!@#USER_ID 41!@#ACTIVITY_CODE 2
12/23/2022 03:23:06 AM script INFO: SUCCESS!@#KODE 1!@#USER_ID 41!@#ACTIVITY_CODE 4
12/23/2022 03:23:06 AM script INFO: SUCCESS!@#KODE 1!@#USER_ID 41!@#ACTIVITY_CODE 3
12/23/2022 03:23:07 AM script INFO: SUCCESS!@#KODE 1!@#USER_ID 41!@#ACTIVITY_CODE 3
12/23/2022 03:23:07 AM script INFO: SUCCESS!@#KODE 1!@#USER_ID 41!@#ACTIVITY_CODE 3
12/23/2022 03:23:07 AM script INFO: SUCCESS!@#KODE 1!@#USER_ID 41!@#ACTIVITY_CODE 1
12/23/2022 03:23:07 AM script INFO: SUCCESS!@#KODE 1!@#USER_ID 41!@#ACTIVITY_CODE 1
12/23/2022 03:23:07 AM script INFO: SUCCESS!@#KODE 1!@#USER_ID 41!@#ACTIVITY_CODE 4
12/23/2022 03:23:07 AM script INFO: SUCCESS!@#KODE 1!@#USER_ID 41!@#ACTIVITY_CODE 5
12/23/2022 03:23:07 AM script INFO: SUCCESS!@#KODE 1!@#USER_ID 41!@#ACTIVITY_CODE 5
12/23/2022 03:23:09 AM script INFO: SUCCESS!@#KODE 1!@#USER_ID 41!@#ACTIVITY_CODE 3
12/23/2022 03:23:09 AM script INFO: SUCCESS!@#KODE 1!@#USER_ID 41!@#ACTIVITY_CODE 3
12/23/2022 03:23:09 AM script INFO: SUCCESS!@#KODE 1!@#USER_ID 41!@#ACTIVITY_CODE 3
12/23/2022 03:23:10 AM script INFO: SUCCESS!@#KODE 1!@#USER_ID 41!@#ACTIVITY_CODE 2
12/23/2022 03:23:10 AM script INFO: SUCCESS!@#KODE 1!@#USER_ID 41!@#ACTIVITY_CODE 4
12/23/2022 03:23:10 AM script INFO: SUCCESS!@#KODE 1!@#USER_ID 41!@#ACTIVITY_CODE 1
12/23/2022 03:23:10 AM script INFO: SUCCESS!@#KODE 1!@#USER_ID 41!@#ACTIVITY_CODE 1
12/23/2022 03:23:10 AM script INFO: SUCCESS!@#KODE 1!@#USER_ID 41!@#ACTIVITY_CODE 2
12/23/2022 03:23:10 AM script INFO: SUCCESS!@#KODE 1!@#USER_ID 41!@#ACTIVITY_CODE 2
12/23/2022 03:23:10 AM script INFO: SUCCESS!@#KODE 1!@#USER_ID 41!@#ACTIVITY_CODE 1
12/23/2022 03:23:10 AM script INFO: SUCCESS!@#KODE 1!@#USER_ID 41!@#ACTIVITY_CODE 2
12/23/2022 03:23:10 AM script INFO: SUCCESS!@#KODE 1!@#USER_ID 41!@#ACTIVITY_CODE 4
12/23/2022 03:23:10 AM script INFO: SUCCESS!@#KODE 1!@#USER_ID 41!@#ACTIVITY_CODE 1
12/23/2022 03:23:10 AM script INFO: SUCCESS!@#KODE 1!@#USER_ID 41!@#ACTIVITY_CODE 2
12/23/2022 03:23:10 AM script INFO: SUCCESS!@#KODE 1!@#USER_ID 41!@#ACTIVITY_CODE 3
12/23/2022 03:23:10 AM script INFO: SUCCESS!@#KODE 1!@#USER_ID 41!@#ACTIVITY_CODE 2
12/23/2022 03:23:11 AM script INFO: SUCCESS!@#KODE 1!@#USER_ID 41!@#ACTIVITY_CODE 1
12/23/2022 03:23:11 AM script INFO: SUCCESS!@#KODE 1!@#USER_ID 41!@#ACTIVITY_CODE 1
12/23/2022 03:23:11 AM script INFO: SUCCESS!@#KODE 1!@#USER_ID 41!@#ACTIVITY_CODE 3
12/23/2022 03:23:11 AM script INFO: SUCCESS!@#KODE 1!@#USER_ID 41!@#ACTIVITY_CODE 4
12/23/2022 03:23:11 AM script INFO: SUCCESS!@#KODE 1!@#USER_ID 41!@#ACTIVITY_CODE 2
12/23/2022 03:23:11 AM script INFO: SUCCESS!@#KODE 1!@#USER_ID 41!@#ACTIVITY_CODE 3
12/23/2022 03:23:11 AM script INFO: SUCCESS!@#KODE 1!@#USER_ID 41!@#ACTIVITY_CODE 1
12/23/2022 03:23:11 AM script INFO: Duration: 33.63555192947388
12/23/2022 03:23:11 AM script INFO: mengakhiri-quiz
12/23/2022 03:23:12 AM script INFO: SUCCESS!@#KODE 1!@#USER_ID 41!@#ACTIVITY_CODE 5
12/23/2022 03:23:12 AM script INFO: berhasil-submit
