12/23/2022 04:26:05 AM script INFO: Prepared chrome options..
12/23/2022 04:26:06 AM script INFO: Initialized chrome browser..
12/23/2022 04:26:06 AM script INFO: mengakses-homepage
12/23/2022 04:26:48 AM script INFO: mengakses-login-page
12/23/2022 04:27:20 AM script INFO: mengakses-site-home
12/23/2022 04:27:41 AM script INFO: mengakses-site-course
12/23/2022 04:29:12 AM script ERROR: TIMEOUT EXCEPTION!@#KODE 0!@#LOCATION mengakses-site-course
12/23/2022 04:29:12 AM main_worker ERROR: Message: None

