12/23/2022 05:52:03 AM script INFO: Prepared chrome options..
12/23/2022 05:52:05 AM script INFO: Initialized chrome browser..
12/23/2022 05:52:05 AM script INFO: mengakses-homepage
12/23/2022 05:53:28 AM script INFO: mengakses-login-page
12/23/2022 05:53:59 AM script INFO: mengakses-site-home
12/23/2022 05:54:09 AM script INFO: mengakses-site-course
12/23/2022 05:54:37 AM script INFO: mengakses-quiz
12/23/2022 05:54:51 AM script INFO: mengakses-start-quiz-page
12/23/2022 05:56:43 AM script INFO: memulai-quiz
12/23/2022 05:56:43 AM script INFO: SUCCESS!@#KODE 1!@#USER_ID 95!@#ACTIVITY_CODE 5
12/23/2022 05:56:54 AM script INFO: SUCCESS!@#KODE 1!@#USER_ID 95!@#ACTIVITY_CODE 3
12/23/2022 05:56:54 AM script INFO: SUCCESS!@#KODE 1!@#USER_ID 95!@#ACTIVITY_CODE 5
12/23/2022 05:56:54 AM script INFO: SUCCESS!@#KODE 1!@#USER_ID 95!@#ACTIVITY_CODE 5
12/23/2022 05:56:57 AM script INFO: SUCCESS!@#KODE 1!@#USER_ID 95!@#ACTIVITY_CODE 3
12/23/2022 05:56:57 AM script INFO: SUCCESS!@#KODE 1!@#USER_ID 95!@#ACTIVITY_CODE 1
12/23/2022 05:56:57 AM script INFO: SUCCESS!@#KODE 1!@#USER_ID 95!@#ACTIVITY_CODE 4
12/23/2022 05:56:57 AM script INFO: SUCCESS!@#KODE 1!@#USER_ID 95!@#ACTIVITY_CODE 1
12/23/2022 05:56:57 AM script INFO: SUCCESS!@#KODE 1!@#USER_ID 95!@#ACTIVITY_CODE 2
12/23/2022 05:56:57 AM script INFO: SUCCESS!@#KODE 1!@#USER_ID 95!@#ACTIVITY_CODE 1
12/23/2022 05:56:57 AM script INFO: SUCCESS!@#KODE 1!@#USER_ID 95!@#ACTIVITY_CODE 1
12/23/2022 05:56:57 AM script INFO: SUCCESS!@#KODE 1!@#USER_ID 95!@#ACTIVITY_CODE 4
12/23/2022 05:56:57 AM script INFO: SUCCESS!@#KODE 1!@#USER_ID 95!@#ACTIVITY_CODE 5
12/23/2022 05:56:57 AM script INFO: SUCCESS!@#KODE 1!@#USER_ID 95!@#ACTIVITY_CODE 5
12/23/2022 05:57:00 AM script INFO: SUCCESS!@#KODE 1!@#USER_ID 95!@#ACTIVITY_CODE 1
12/23/2022 05:57:00 AM script INFO: SUCCESS!@#KODE 1!@#USER_ID 95!@#ACTIVITY_CODE 4
12/23/2022 05:57:00 AM script INFO: SUCCESS!@#KODE 1!@#USER_ID 95!@#ACTIVITY_CODE 3
12/23/2022 05:57:00 AM script INFO: SUCCESS!@#KODE 1!@#USER_ID 95!@#ACTIVITY_CODE 2
12/23/2022 05:57:00 AM script INFO: SUCCESS!@#KODE 1!@#USER_ID 95!@#ACTIVITY_CODE 2
12/23/2022 05:57:00 AM script INFO: SUCCESS!@#KODE 1!@#USER_ID 95!@#ACTIVITY_CODE 3
12/23/2022 05:57:00 AM script INFO: SUCCESS!@#KODE 1!@#USER_ID 95!@#ACTIVITY_CODE 3
12/23/2022 05:57:00 AM script INFO: SUCCESS!@#KODE 1!@#USER_ID 95!@#ACTIVITY_CODE 3
12/23/2022 05:57:00 AM script INFO: SUCCESS!@#KODE 1!@#USER_ID 95!@#ACTIVITY_CODE 2
12/23/2022 05:57:00 AM script INFO: SUCCESS!@#KODE 1!@#USER_ID 95!@#ACTIVITY_CODE 3
12/23/2022 05:57:00 AM script INFO: SUCCESS!@#KODE 1!@#USER_ID 95!@#ACTIVITY_CODE 2
12/23/2022 05:57:01 AM script INFO: SUCCESS!@#KODE 1!@#USER_ID 95!@#ACTIVITY_CODE 3
12/23/2022 05:57:01 AM script INFO: SUCCESS!@#KODE 1!@#USER_ID 95!@#ACTIVITY_CODE 2
12/23/2022 05:57:01 AM script INFO: SUCCESS!@#KODE 1!@#USER_ID 95!@#ACTIVITY_CODE 5
12/23/2022 05:57:01 AM script INFO: SUCCESS!@#KODE 1!@#USER_ID 95!@#ACTIVITY_CODE 5
12/23/2022 05:57:03 AM script INFO: SUCCESS!@#KODE 1!@#USER_ID 95!@#ACTIVITY_CODE 1
12/23/2022 05:57:03 AM script INFO: SUCCESS!@#KODE 1!@#USER_ID 95!@#ACTIVITY_CODE 3
12/23/2022 05:57:03 AM script INFO: SUCCESS!@#KODE 1!@#USER_ID 95!@#ACTIVITY_CODE 3
12/23/2022 05:57:03 AM script INFO: SUCCESS!@#KODE 1!@#USER_ID 95!@#ACTIVITY_CODE 4
12/23/2022 05:57:04 AM script INFO: SUCCESS!@#KODE 1!@#USER_ID 95!@#ACTIVITY_CODE 2
12/23/2022 05:57:04 AM script INFO: SUCCESS!@#KODE 1!@#USER_ID 95!@#ACTIVITY_CODE 3
12/23/2022 05:57:04 AM script INFO: SUCCESS!@#KODE 1!@#USER_ID 95!@#ACTIVITY_CODE 5
12/23/2022 05:57:04 AM script INFO: SUCCESS!@#KODE 1!@#USER_ID 95!@#ACTIVITY_CODE 5
12/23/2022 05:57:06 AM script INFO: SUCCESS!@#KODE 1!@#USER_ID 95!@#ACTIVITY_CODE 5
12/23/2022 05:57:06 AM script INFO: SUCCESS!@#KODE 1!@#USER_ID 95!@#ACTIVITY_CODE 5
12/23/2022 05:57:09 AM script INFO: SUCCESS!@#KODE 1!@#USER_ID 95!@#ACTIVITY_CODE 3
12/23/2022 05:57:09 AM script INFO: SUCCESS!@#KODE 1!@#USER_ID 95!@#ACTIVITY_CODE 3
12/23/2022 05:57:09 AM script INFO: SUCCESS!@#KODE 1!@#USER_ID 95!@#ACTIVITY_CODE 1
12/23/2022 05:57:09 AM script INFO: SUCCESS!@#KODE 1!@#USER_ID 95!@#ACTIVITY_CODE 1
12/23/2022 05:57:09 AM script INFO: SUCCESS!@#KODE 1!@#USER_ID 95!@#ACTIVITY_CODE 3
12/23/2022 05:57:09 AM script INFO: SUCCESS!@#KODE 1!@#USER_ID 95!@#ACTIVITY_CODE 5
12/23/2022 05:57:09 AM script INFO: SUCCESS!@#KODE 1!@#USER_ID 95!@#ACTIVITY_CODE 5
12/23/2022 05:57:11 AM script INFO: SUCCESS!@#KODE 1!@#USER_ID 95!@#ACTIVITY_CODE 4
12/23/2022 05:57:11 AM script INFO: SUCCESS!@#KODE 1!@#USER_ID 95!@#ACTIVITY_CODE 2
12/23/2022 05:57:12 AM script INFO: SUCCESS!@#KODE 1!@#USER_ID 95!@#ACTIVITY_CODE 1
12/23/2022 05:57:12 AM script INFO: SUCCESS!@#KODE 1!@#USER_ID 95!@#ACTIVITY_CODE 2
12/23/2022 05:57:12 AM script INFO: SUCCESS!@#KODE 1!@#USER_ID 95!@#ACTIVITY_CODE 1
12/23/2022 05:57:12 AM script INFO: SUCCESS!@#KODE 1!@#USER_ID 95!@#ACTIVITY_CODE 4
12/23/2022 05:57:12 AM script INFO: SUCCESS!@#KODE 1!@#USER_ID 95!@#ACTIVITY_CODE 5
12/23/2022 05:57:12 AM script INFO: SUCCESS!@#KODE 1!@#USER_ID 95!@#ACTIVITY_CODE 5
12/23/2022 05:57:14 AM script INFO: SUCCESS!@#KODE 1!@#USER_ID 95!@#ACTIVITY_CODE 2
12/23/2022 05:57:14 AM script INFO: SUCCESS!@#KODE 1!@#USER_ID 95!@#ACTIVITY_CODE 1
12/23/2022 05:57:14 AM script INFO: SUCCESS!@#KODE 1!@#USER_ID 95!@#ACTIVITY_CODE 4
12/23/2022 05:57:14 AM script INFO: SUCCESS!@#KODE 1!@#USER_ID 95!@#ACTIVITY_CODE 5
12/23/2022 05:57:14 AM script INFO: SUCCESS!@#KODE 1!@#USER_ID 95!@#ACTIVITY_CODE 5
12/23/2022 05:57:17 AM script INFO: SUCCESS!@#KODE 1!@#USER_ID 95!@#ACTIVITY_CODE 5
12/23/2022 05:57:17 AM script INFO: SUCCESS!@#KODE 1!@#USER_ID 95!@#ACTIVITY_CODE 5
12/23/2022 05:57:19 AM script INFO: SUCCESS!@#KODE 1!@#USER_ID 95!@#ACTIVITY_CODE 3
12/23/2022 05:57:20 AM script INFO: SUCCESS!@#KODE 1!@#USER_ID 95!@#ACTIVITY_CODE 2
12/23/2022 05:57:20 AM script INFO: SUCCESS!@#KODE 1!@#USER_ID 95!@#ACTIVITY_CODE 2
12/23/2022 05:57:20 AM script INFO: SUCCESS!@#KODE 1!@#USER_ID 95!@#ACTIVITY_CODE 2
12/23/2022 05:57:20 AM script INFO: SUCCESS!@#KODE 1!@#USER_ID 95!@#ACTIVITY_CODE 3
12/23/2022 05:57:20 AM script INFO: SUCCESS!@#KODE 1!@#USER_ID 95!@#ACTIVITY_CODE 5
12/23/2022 05:57:20 AM script INFO: SUCCESS!@#KODE 1!@#USER_ID 95!@#ACTIVITY_CODE 5
12/23/2022 05:57:22 AM script INFO: SUCCESS!@#KODE 1!@#USER_ID 95!@#ACTIVITY_CODE 3
12/23/2022 05:57:22 AM script INFO: SUCCESS!@#KODE 1!@#USER_ID 95!@#ACTIVITY_CODE 5
12/23/2022 05:57:22 AM script INFO: SUCCESS!@#KODE 1!@#USER_ID 95!@#ACTIVITY_CODE 5
12/23/2022 05:57:25 AM script INFO: SUCCESS!@#KODE 1!@#USER_ID 95!@#ACTIVITY_CODE 1
12/23/2022 05:57:25 AM script INFO: SUCCESS!@#KODE 1!@#USER_ID 95!@#ACTIVITY_CODE 3
12/23/2022 05:57:25 AM script INFO: SUCCESS!@#KODE 1!@#USER_ID 95!@#ACTIVITY_CODE 2
12/23/2022 05:57:25 AM script INFO: SUCCESS!@#KODE 1!@#USER_ID 95!@#ACTIVITY_CODE 3
12/23/2022 05:57:25 AM script INFO: SUCCESS!@#KODE 1!@#USER_ID 95!@#ACTIVITY_CODE 5
12/23/2022 05:57:25 AM script INFO: SUCCESS!@#KODE 1!@#USER_ID 95!@#ACTIVITY_CODE 5
12/23/2022 05:57:28 AM script INFO: SUCCESS!@#KODE 1!@#USER_ID 95!@#ACTIVITY_CODE 3
12/23/2022 05:57:28 AM script INFO: SUCCESS!@#KODE 1!@#USER_ID 95!@#ACTIVITY_CODE 2
12/23/2022 05:57:28 AM script INFO: SUCCESS!@#KODE 1!@#USER_ID 95!@#ACTIVITY_CODE 1
12/23/2022 05:57:28 AM script INFO: SUCCESS!@#KODE 1!@#USER_ID 95!@#ACTIVITY_CODE 2
12/23/2022 05:57:28 AM script INFO: SUCCESS!@#KODE 1!@#USER_ID 95!@#ACTIVITY_CODE 3
12/23/2022 05:57:28 AM script INFO: SUCCESS!@#KODE 1!@#USER_ID 95!@#ACTIVITY_CODE 5
12/23/2022 05:57:28 AM script INFO: SUCCESS!@#KODE 1!@#USER_ID 95!@#ACTIVITY_CODE 5
12/23/2022 05:57:31 AM script INFO: SUCCESS!@#KODE 1!@#USER_ID 95!@#ACTIVITY_CODE 2
12/23/2022 05:57:31 AM script INFO: SUCCESS!@#KODE 1!@#USER_ID 95!@#ACTIVITY_CODE 1
12/23/2022 05:57:31 AM script INFO: SUCCESS!@#KODE 1!@#USER_ID 95!@#ACTIVITY_CODE 2
12/23/2022 05:57:31 AM script INFO: SUCCESS!@#KODE 1!@#USER_ID 95!@#ACTIVITY_CODE 4
12/23/2022 05:57:31 AM script INFO: SUCCESS!@#KODE 1!@#USER_ID 95!@#ACTIVITY_CODE 5
12/23/2022 05:57:31 AM script INFO: SUCCESS!@#KODE 1!@#USER_ID 95!@#ACTIVITY_CODE 5
12/23/2022 05:57:33 AM script INFO: SUCCESS!@#KODE 1!@#USER_ID 95!@#ACTIVITY_CODE 3
12/23/2022 05:57:33 AM script INFO: SUCCESS!@#KODE 1!@#USER_ID 95!@#ACTIVITY_CODE 3
12/23/2022 05:57:33 AM script INFO: SUCCESS!@#KODE 1!@#USER_ID 95!@#ACTIVITY_CODE 3
12/23/2022 05:57:33 AM script INFO: SUCCESS!@#KODE 1!@#USER_ID 95!@#ACTIVITY_CODE 5
12/23/2022 05:57:33 AM script INFO: SUCCESS!@#KODE 1!@#USER_ID 95!@#ACTIVITY_CODE 5
12/23/2022 05:57:36 AM script INFO: SUCCESS!@#KODE 1!@#USER_ID 95!@#ACTIVITY_CODE 3
12/23/2022 05:57:36 AM script INFO: SUCCESS!@#KODE 1!@#USER_ID 95!@#ACTIVITY_CODE 2
12/23/2022 05:57:36 AM script INFO: SUCCESS!@#KODE 1!@#USER_ID 95!@#ACTIVITY_CODE 3
12/23/2022 05:57:36 AM script INFO: SUCCESS!@#KODE 1!@#USER_ID 95!@#ACTIVITY_CODE 5
12/23/2022 05:57:36 AM script INFO: SUCCESS!@#KODE 1!@#USER_ID 95!@#ACTIVITY_CODE 5
12/23/2022 05:57:39 AM script INFO: SUCCESS!@#KODE 1!@#USER_ID 95!@#ACTIVITY_CODE 2
12/23/2022 05:57:39 AM script INFO: SUCCESS!@#KODE 1!@#USER_ID 95!@#ACTIVITY_CODE 5
12/23/2022 05:57:39 AM script INFO: SUCCESS!@#KODE 1!@#USER_ID 95!@#ACTIVITY_CODE 5
12/23/2022 05:57:41 AM script INFO: SUCCESS!@#KODE 1!@#USER_ID 95!@#ACTIVITY_CODE 5
12/23/2022 05:57:41 AM script INFO: SUCCESS!@#KODE 1!@#USER_ID 95!@#ACTIVITY_CODE 5
12/23/2022 05:57:44 AM script INFO: SUCCESS!@#KODE 1!@#USER_ID 95!@#ACTIVITY_CODE 3
12/23/2022 05:57:44 AM script INFO: SUCCESS!@#KODE 1!@#USER_ID 95!@#ACTIVITY_CODE 1
12/23/2022 05:57:44 AM script INFO: SUCCESS!@#KODE 1!@#USER_ID 95!@#ACTIVITY_CODE 2
12/23/2022 05:57:44 AM script INFO: SUCCESS!@#KODE 1!@#USER_ID 95!@#ACTIVITY_CODE 5
12/23/2022 05:57:44 AM script INFO: SUCCESS!@#KODE 1!@#USER_ID 95!@#ACTIVITY_CODE 5
12/23/2022 05:57:47 AM script INFO: SUCCESS!@#KODE 1!@#USER_ID 95!@#ACTIVITY_CODE 3
12/23/2022 05:57:47 AM script INFO: SUCCESS!@#KODE 1!@#USER_ID 95!@#ACTIVITY_CODE 5
12/23/2022 05:57:47 AM script INFO: SUCCESS!@#KODE 1!@#USER_ID 95!@#ACTIVITY_CODE 5
12/23/2022 05:57:49 AM script INFO: SUCCESS!@#KODE 1!@#USER_ID 95!@#ACTIVITY_CODE 5
12/23/2022 05:57:49 AM script INFO: SUCCESS!@#KODE 1!@#USER_ID 95!@#ACTIVITY_CODE 5
12/23/2022 05:57:52 AM script INFO: SUCCESS!@#KODE 1!@#USER_ID 95!@#ACTIVITY_CODE 1
12/23/2022 05:57:52 AM script INFO: SUCCESS!@#KODE 1!@#USER_ID 95!@#ACTIVITY_CODE 3
12/23/2022 05:57:52 AM script INFO: SUCCESS!@#KODE 1!@#USER_ID 95!@#ACTIVITY_CODE 1
12/23/2022 05:57:52 AM script INFO: SUCCESS!@#KODE 1!@#USER_ID 95!@#ACTIVITY_CODE 2
12/23/2022 05:57:52 AM script INFO: SUCCESS!@#KODE 1!@#USER_ID 95!@#ACTIVITY_CODE 1
12/23/2022 05:57:52 AM script INFO: SUCCESS!@#KODE 1!@#USER_ID 95!@#ACTIVITY_CODE 2
12/23/2022 05:57:52 AM script INFO: SUCCESS!@#KODE 1!@#USER_ID 95!@#ACTIVITY_CODE 1
12/23/2022 05:57:52 AM script INFO: SUCCESS!@#KODE 1!@#USER_ID 95!@#ACTIVITY_CODE 2
12/23/2022 05:57:52 AM script INFO: SUCCESS!@#KODE 1!@#USER_ID 95!@#ACTIVITY_CODE 3
12/23/2022 05:57:52 AM script INFO: SUCCESS!@#KODE 1!@#USER_ID 95!@#ACTIVITY_CODE 1
12/23/2022 05:57:52 AM script INFO: SUCCESS!@#KODE 1!@#USER_ID 95!@#ACTIVITY_CODE 2
12/23/2022 05:57:52 AM script INFO: SUCCESS!@#KODE 1!@#USER_ID 95!@#ACTIVITY_CODE 3
12/23/2022 05:57:52 AM script INFO: SUCCESS!@#KODE 1!@#USER_ID 95!@#ACTIVITY_CODE 1
12/23/2022 05:57:52 AM script INFO: SUCCESS!@#KODE 1!@#USER_ID 95!@#ACTIVITY_CODE 1
12/23/2022 05:57:52 AM script INFO: SUCCESS!@#KODE 1!@#USER_ID 95!@#ACTIVITY_CODE 1
12/23/2022 05:57:53 AM script INFO: SUCCESS!@#KODE 1!@#USER_ID 95!@#ACTIVITY_CODE 2
12/23/2022 05:57:53 AM script INFO: SUCCESS!@#KODE 1!@#USER_ID 95!@#ACTIVITY_CODE 4
12/23/2022 05:57:53 AM script INFO: SUCCESS!@#KODE 1!@#USER_ID 95!@#ACTIVITY_CODE 1
12/23/2022 05:57:53 AM script INFO: SUCCESS!@#KODE 1!@#USER_ID 95!@#ACTIVITY_CODE 4
12/23/2022 05:57:53 AM script INFO: SUCCESS!@#KODE 1!@#USER_ID 95!@#ACTIVITY_CODE 1
12/23/2022 05:57:53 AM script INFO: SUCCESS!@#KODE 1!@#USER_ID 95!@#ACTIVITY_CODE 3
12/23/2022 05:57:53 AM script INFO: SUCCESS!@#KODE 1!@#USER_ID 95!@#ACTIVITY_CODE 3
12/23/2022 05:57:53 AM script INFO: SUCCESS!@#KODE 1!@#USER_ID 95!@#ACTIVITY_CODE 1
12/23/2022 05:57:53 AM script INFO: SUCCESS!@#KODE 1!@#USER_ID 95!@#ACTIVITY_CODE 1
12/23/2022 05:57:53 AM script INFO: SUCCESS!@#KODE 1!@#USER_ID 95!@#ACTIVITY_CODE 4
12/23/2022 05:57:53 AM script INFO: SUCCESS!@#KODE 1!@#USER_ID 95!@#ACTIVITY_CODE 3
12/23/2022 05:57:53 AM script INFO: SUCCESS!@#KODE 1!@#USER_ID 95!@#ACTIVITY_CODE 1
12/23/2022 05:57:53 AM script INFO: SUCCESS!@#KODE 1!@#USER_ID 95!@#ACTIVITY_CODE 3
12/23/2022 05:57:53 AM script INFO: SUCCESS!@#KODE 1!@#USER_ID 95!@#ACTIVITY_CODE 2
12/23/2022 05:57:53 AM script INFO: SUCCESS!@#KODE 1!@#USER_ID 95!@#ACTIVITY_CODE 1
12/23/2022 05:57:53 AM script INFO: SUCCESS!@#KODE 1!@#USER_ID 95!@#ACTIVITY_CODE 2
12/23/2022 05:57:53 AM script INFO: SUCCESS!@#KODE 1!@#USER_ID 95!@#ACTIVITY_CODE 3
12/23/2022 05:57:54 AM script INFO: SUCCESS!@#KODE 1!@#USER_ID 95!@#ACTIVITY_CODE 4
12/23/2022 05:57:54 AM script INFO: SUCCESS!@#KODE 1!@#USER_ID 95!@#ACTIVITY_CODE 1
12/23/2022 05:57:54 AM script INFO: SUCCESS!@#KODE 1!@#USER_ID 95!@#ACTIVITY_CODE 2
12/23/2022 05:57:54 AM script INFO: SUCCESS!@#KODE 1!@#USER_ID 95!@#ACTIVITY_CODE 3
12/23/2022 05:57:54 AM script INFO: SUCCESS!@#KODE 1!@#USER_ID 95!@#ACTIVITY_CODE 1
12/23/2022 05:57:54 AM script INFO: SUCCESS!@#KODE 1!@#USER_ID 95!@#ACTIVITY_CODE 3
12/23/2022 05:57:54 AM script INFO: SUCCESS!@#KODE 1!@#USER_ID 95!@#ACTIVITY_CODE 3
12/23/2022 05:57:54 AM script INFO: SUCCESS!@#KODE 1!@#USER_ID 95!@#ACTIVITY_CODE 3
12/23/2022 05:57:54 AM script INFO: SUCCESS!@#KODE 1!@#USER_ID 95!@#ACTIVITY_CODE 3
12/23/2022 05:57:54 AM script INFO: SUCCESS!@#KODE 1!@#USER_ID 95!@#ACTIVITY_CODE 1
12/23/2022 05:57:54 AM script INFO: SUCCESS!@#KODE 1!@#USER_ID 95!@#ACTIVITY_CODE 2
12/23/2022 05:57:54 AM script INFO: SUCCESS!@#KODE 1!@#USER_ID 95!@#ACTIVITY_CODE 1
12/23/2022 05:57:54 AM script INFO: SUCCESS!@#KODE 1!@#USER_ID 95!@#ACTIVITY_CODE 3
12/23/2022 05:57:54 AM script INFO: SUCCESS!@#KODE 1!@#USER_ID 95!@#ACTIVITY_CODE 3
12/23/2022 05:57:54 AM script INFO: SUCCESS!@#KODE 1!@#USER_ID 95!@#ACTIVITY_CODE 4
12/23/2022 05:57:54 AM script INFO: SUCCESS!@#KODE 1!@#USER_ID 95!@#ACTIVITY_CODE 2
12/23/2022 05:57:54 AM script INFO: SUCCESS!@#KODE 1!@#USER_ID 95!@#ACTIVITY_CODE 1
12/23/2022 05:57:55 AM script INFO: SUCCESS!@#KODE 1!@#USER_ID 95!@#ACTIVITY_CODE 4
12/23/2022 05:57:55 AM script INFO: SUCCESS!@#KODE 1!@#USER_ID 95!@#ACTIVITY_CODE 3
12/23/2022 05:57:55 AM script INFO: SUCCESS!@#KODE 1!@#USER_ID 95!@#ACTIVITY_CODE 3
12/23/2022 05:57:55 AM script INFO: SUCCESS!@#KODE 1!@#USER_ID 95!@#ACTIVITY_CODE 3
12/23/2022 05:57:55 AM script INFO: SUCCESS!@#KODE 1!@#USER_ID 95!@#ACTIVITY_CODE 3
12/23/2022 05:57:55 AM script INFO: SUCCESS!@#KODE 1!@#USER_ID 95!@#ACTIVITY_CODE 3
12/23/2022 05:57:55 AM script INFO: SUCCESS!@#KODE 1!@#USER_ID 95!@#ACTIVITY_CODE 1
12/23/2022 05:57:55 AM script INFO: SUCCESS!@#KODE 1!@#USER_ID 95!@#ACTIVITY_CODE 1
12/23/2022 05:57:55 AM script INFO: SUCCESS!@#KODE 1!@#USER_ID 95!@#ACTIVITY_CODE 3
12/23/2022 05:57:55 AM script INFO: SUCCESS!@#KODE 1!@#USER_ID 95!@#ACTIVITY_CODE 4
12/23/2022 05:57:55 AM script INFO: SUCCESS!@#KODE 1!@#USER_ID 95!@#ACTIVITY_CODE 3
12/23/2022 05:57:55 AM script INFO: SUCCESS!@#KODE 1!@#USER_ID 95!@#ACTIVITY_CODE 1
12/23/2022 05:57:55 AM script INFO: SUCCESS!@#KODE 1!@#USER_ID 95!@#ACTIVITY_CODE 1
12/23/2022 05:57:55 AM script INFO: SUCCESS!@#KODE 1!@#USER_ID 95!@#ACTIVITY_CODE 3
12/23/2022 05:57:55 AM script INFO: SUCCESS!@#KODE 1!@#USER_ID 95!@#ACTIVITY_CODE 3
12/23/2022 05:57:55 AM script INFO: SUCCESS!@#KODE 1!@#USER_ID 95!@#ACTIVITY_CODE 4
12/23/2022 05:57:55 AM script INFO: SUCCESS!@#KODE 1!@#USER_ID 95!@#ACTIVITY_CODE 1
12/23/2022 05:57:55 AM script INFO: SUCCESS!@#KODE 1!@#USER_ID 95!@#ACTIVITY_CODE 4
12/23/2022 05:57:55 AM script INFO: SUCCESS!@#KODE 1!@#USER_ID 95!@#ACTIVITY_CODE 2
12/23/2022 05:57:56 AM script INFO: SUCCESS!@#KODE 1!@#USER_ID 95!@#ACTIVITY_CODE 2
12/23/2022 05:57:56 AM script INFO: SUCCESS!@#KODE 1!@#USER_ID 95!@#ACTIVITY_CODE 3
12/23/2022 05:57:56 AM script INFO: SUCCESS!@#KODE 1!@#USER_ID 95!@#ACTIVITY_CODE 1
12/23/2022 05:57:56 AM script INFO: SUCCESS!@#KODE 1!@#USER_ID 95!@#ACTIVITY_CODE 3
12/23/2022 05:57:56 AM script INFO: SUCCESS!@#KODE 1!@#USER_ID 95!@#ACTIVITY_CODE 1
12/23/2022 05:57:56 AM script INFO: SUCCESS!@#KODE 1!@#USER_ID 95!@#ACTIVITY_CODE 2
12/23/2022 05:57:56 AM script INFO: SUCCESS!@#KODE 1!@#USER_ID 95!@#ACTIVITY_CODE 1
12/23/2022 05:57:56 AM script INFO: SUCCESS!@#KODE 1!@#USER_ID 95!@#ACTIVITY_CODE 3
12/23/2022 05:57:56 AM script INFO: SUCCESS!@#KODE 1!@#USER_ID 95!@#ACTIVITY_CODE 4
12/23/2022 05:57:56 AM script INFO: SUCCESS!@#KODE 1!@#USER_ID 95!@#ACTIVITY_CODE 2
12/23/2022 05:57:56 AM script INFO: SUCCESS!@#KODE 1!@#USER_ID 95!@#ACTIVITY_CODE 1
12/23/2022 05:57:56 AM script INFO: SUCCESS!@#KODE 1!@#USER_ID 95!@#ACTIVITY_CODE 3
12/23/2022 05:57:56 AM script INFO: SUCCESS!@#KODE 1!@#USER_ID 95!@#ACTIVITY_CODE 4
12/23/2022 05:57:56 AM script INFO: SUCCESS!@#KODE 1!@#USER_ID 95!@#ACTIVITY_CODE 3
12/23/2022 05:57:56 AM script INFO: SUCCESS!@#KODE 1!@#USER_ID 95!@#ACTIVITY_CODE 3
12/23/2022 05:57:56 AM script INFO: SUCCESS!@#KODE 1!@#USER_ID 95!@#ACTIVITY_CODE 2
12/23/2022 05:57:57 AM script INFO: SUCCESS!@#KODE 1!@#USER_ID 95!@#ACTIVITY_CODE 2
12/23/2022 05:57:57 AM script INFO: SUCCESS!@#KODE 1!@#USER_ID 95!@#ACTIVITY_CODE 3
12/23/2022 05:57:57 AM script INFO: SUCCESS!@#KODE 1!@#USER_ID 95!@#ACTIVITY_CODE 2
12/23/2022 05:57:57 AM script INFO: SUCCESS!@#KODE 1!@#USER_ID 95!@#ACTIVITY_CODE 3
12/23/2022 05:57:57 AM script INFO: SUCCESS!@#KODE 1!@#USER_ID 95!@#ACTIVITY_CODE 1
12/23/2022 05:57:57 AM script INFO: SUCCESS!@#KODE 1!@#USER_ID 95!@#ACTIVITY_CODE 1
12/23/2022 05:57:57 AM script INFO: SUCCESS!@#KODE 1!@#USER_ID 95!@#ACTIVITY_CODE 2
12/23/2022 05:57:57 AM script INFO: SUCCESS!@#KODE 1!@#USER_ID 95!@#ACTIVITY_CODE 2
12/23/2022 05:57:57 AM script INFO: SUCCESS!@#KODE 1!@#USER_ID 95!@#ACTIVITY_CODE 1
12/23/2022 05:57:57 AM script INFO: SUCCESS!@#KODE 1!@#USER_ID 95!@#ACTIVITY_CODE 1
12/23/2022 05:57:57 AM script INFO: SUCCESS!@#KODE 1!@#USER_ID 95!@#ACTIVITY_CODE 2
12/23/2022 05:57:57 AM script INFO: SUCCESS!@#KODE 1!@#USER_ID 95!@#ACTIVITY_CODE 2
12/23/2022 05:57:57 AM script INFO: SUCCESS!@#KODE 1!@#USER_ID 95!@#ACTIVITY_CODE 3
12/23/2022 05:57:57 AM script INFO: SUCCESS!@#KODE 1!@#USER_ID 95!@#ACTIVITY_CODE 1
12/23/2022 05:57:58 AM script INFO: SUCCESS!@#KODE 1!@#USER_ID 95!@#ACTIVITY_CODE 3
12/23/2022 05:57:58 AM script INFO: SUCCESS!@#KODE 1!@#USER_ID 95!@#ACTIVITY_CODE 3
12/23/2022 05:57:58 AM script INFO: SUCCESS!@#KODE 1!@#USER_ID 95!@#ACTIVITY_CODE 3
12/23/2022 05:57:58 AM script INFO: SUCCESS!@#KODE 1!@#USER_ID 95!@#ACTIVITY_CODE 2
12/23/2022 05:57:58 AM script INFO: SUCCESS!@#KODE 1!@#USER_ID 95!@#ACTIVITY_CODE 3
12/23/2022 05:57:58 AM script INFO: SUCCESS!@#KODE 1!@#USER_ID 95!@#ACTIVITY_CODE 3
12/23/2022 05:57:58 AM script INFO: SUCCESS!@#KODE 1!@#USER_ID 95!@#ACTIVITY_CODE 1
12/23/2022 05:57:58 AM script INFO: SUCCESS!@#KODE 1!@#USER_ID 95!@#ACTIVITY_CODE 2
12/23/2022 05:57:58 AM script INFO: SUCCESS!@#KODE 1!@#USER_ID 95!@#ACTIVITY_CODE 1
12/23/2022 05:57:58 AM script INFO: SUCCESS!@#KODE 1!@#USER_ID 95!@#ACTIVITY_CODE 4
12/23/2022 05:57:58 AM script INFO: SUCCESS!@#KODE 1!@#USER_ID 95!@#ACTIVITY_CODE 3
12/23/2022 05:57:58 AM script INFO: SUCCESS!@#KODE 1!@#USER_ID 95!@#ACTIVITY_CODE 2
12/23/2022 05:57:58 AM script INFO: SUCCESS!@#KODE 1!@#USER_ID 95!@#ACTIVITY_CODE 3
12/23/2022 05:57:58 AM script INFO: SUCCESS!@#KODE 1!@#USER_ID 95!@#ACTIVITY_CODE 3
12/23/2022 05:57:58 AM script INFO: SUCCESS!@#KODE 1!@#USER_ID 95!@#ACTIVITY_CODE 3
12/23/2022 05:57:58 AM script INFO: SUCCESS!@#KODE 1!@#USER_ID 95!@#ACTIVITY_CODE 1
12/23/2022 05:57:58 AM script INFO: SUCCESS!@#KODE 1!@#USER_ID 95!@#ACTIVITY_CODE 1
12/23/2022 05:57:59 AM script INFO: SUCCESS!@#KODE 1!@#USER_ID 95!@#ACTIVITY_CODE 2
12/23/2022 05:57:59 AM script INFO: SUCCESS!@#KODE 1!@#USER_ID 95!@#ACTIVITY_CODE 3
12/23/2022 05:57:59 AM script INFO: SUCCESS!@#KODE 1!@#USER_ID 95!@#ACTIVITY_CODE 3
12/23/2022 05:57:59 AM script INFO: SUCCESS!@#KODE 1!@#USER_ID 95!@#ACTIVITY_CODE 3
12/23/2022 05:57:59 AM script INFO: SUCCESS!@#KODE 1!@#USER_ID 95!@#ACTIVITY_CODE 2
12/23/2022 05:57:59 AM script INFO: SUCCESS!@#KODE 1!@#USER_ID 95!@#ACTIVITY_CODE 2
12/23/2022 05:57:59 AM script INFO: SUCCESS!@#KODE 1!@#USER_ID 95!@#ACTIVITY_CODE 4
12/23/2022 05:57:59 AM script INFO: SUCCESS!@#KODE 1!@#USER_ID 95!@#ACTIVITY_CODE 2
12/23/2022 05:57:59 AM script INFO: SUCCESS!@#KODE 1!@#USER_ID 95!@#ACTIVITY_CODE 3
12/23/2022 05:57:59 AM script INFO: SUCCESS!@#KODE 1!@#USER_ID 95!@#ACTIVITY_CODE 1
12/23/2022 05:57:59 AM script INFO: SUCCESS!@#KODE 1!@#USER_ID 95!@#ACTIVITY_CODE 1
12/23/2022 05:57:59 AM script INFO: SUCCESS!@#KODE 1!@#USER_ID 95!@#ACTIVITY_CODE 3
12/23/2022 05:57:59 AM script INFO: SUCCESS!@#KODE 1!@#USER_ID 95!@#ACTIVITY_CODE 2
12/23/2022 05:58:00 AM script INFO: SUCCESS!@#KODE 1!@#USER_ID 95!@#ACTIVITY_CODE 3
12/23/2022 05:58:00 AM script INFO: SUCCESS!@#KODE 1!@#USER_ID 95!@#ACTIVITY_CODE 3
12/23/2022 05:58:00 AM script INFO: SUCCESS!@#KODE 1!@#USER_ID 95!@#ACTIVITY_CODE 2
12/23/2022 05:58:00 AM script INFO: SUCCESS!@#KODE 1!@#USER_ID 95!@#ACTIVITY_CODE 2
12/23/2022 05:58:00 AM script INFO: SUCCESS!@#KODE 1!@#USER_ID 95!@#ACTIVITY_CODE 1
12/23/2022 05:58:00 AM script INFO: SUCCESS!@#KODE 1!@#USER_ID 95!@#ACTIVITY_CODE 3
12/23/2022 05:58:00 AM script INFO: SUCCESS!@#KODE 1!@#USER_ID 95!@#ACTIVITY_CODE 1
12/23/2022 05:58:00 AM script INFO: SUCCESS!@#KODE 1!@#USER_ID 95!@#ACTIVITY_CODE 2
12/23/2022 05:58:00 AM script INFO: SUCCESS!@#KODE 1!@#USER_ID 95!@#ACTIVITY_CODE 3
12/23/2022 05:58:00 AM script INFO: SUCCESS!@#KODE 1!@#USER_ID 95!@#ACTIVITY_CODE 3
12/23/2022 05:58:00 AM script INFO: SUCCESS!@#KODE 1!@#USER_ID 95!@#ACTIVITY_CODE 3
12/23/2022 05:58:00 AM script INFO: SUCCESS!@#KODE 1!@#USER_ID 95!@#ACTIVITY_CODE 1
12/23/2022 05:58:00 AM script INFO: SUCCESS!@#KODE 1!@#USER_ID 95!@#ACTIVITY_CODE 2
12/23/2022 05:58:00 AM script INFO: SUCCESS!@#KODE 1!@#USER_ID 95!@#ACTIVITY_CODE 1
12/23/2022 05:58:00 AM script INFO: SUCCESS!@#KODE 1!@#USER_ID 95!@#ACTIVITY_CODE 2
12/23/2022 05:58:01 AM script INFO: SUCCESS!@#KODE 1!@#USER_ID 95!@#ACTIVITY_CODE 4
12/23/2022 05:58:01 AM script INFO: SUCCESS!@#KODE 1!@#USER_ID 95!@#ACTIVITY_CODE 2
12/23/2022 05:58:01 AM script INFO: SUCCESS!@#KODE 1!@#USER_ID 95!@#ACTIVITY_CODE 1
12/23/2022 05:58:01 AM script INFO: SUCCESS!@#KODE 1!@#USER_ID 95!@#ACTIVITY_CODE 2
12/23/2022 05:58:01 AM script INFO: SUCCESS!@#KODE 1!@#USER_ID 95!@#ACTIVITY_CODE 4
12/23/2022 05:58:01 AM script INFO: SUCCESS!@#KODE 1!@#USER_ID 95!@#ACTIVITY_CODE 2
12/23/2022 05:58:01 AM script INFO: SUCCESS!@#KODE 1!@#USER_ID 95!@#ACTIVITY_CODE 4
12/23/2022 05:58:01 AM script INFO: SUCCESS!@#KODE 1!@#USER_ID 95!@#ACTIVITY_CODE 3
12/23/2022 05:58:01 AM script INFO: SUCCESS!@#KODE 1!@#USER_ID 95!@#ACTIVITY_CODE 1
12/23/2022 05:58:01 AM script INFO: SUCCESS!@#KODE 1!@#USER_ID 95!@#ACTIVITY_CODE 4
12/23/2022 05:58:01 AM script INFO: SUCCESS!@#KODE 1!@#USER_ID 95!@#ACTIVITY_CODE 3
12/23/2022 05:58:01 AM script INFO: SUCCESS!@#KODE 1!@#USER_ID 95!@#ACTIVITY_CODE 1
12/23/2022 05:58:01 AM script INFO: SUCCESS!@#KODE 1!@#USER_ID 95!@#ACTIVITY_CODE 4
12/23/2022 05:58:01 AM script INFO: SUCCESS!@#KODE 1!@#USER_ID 95!@#ACTIVITY_CODE 2
12/23/2022 05:58:01 AM script INFO: SUCCESS!@#KODE 1!@#USER_ID 95!@#ACTIVITY_CODE 1
12/23/2022 05:58:02 AM script INFO: SUCCESS!@#KODE 1!@#USER_ID 95!@#ACTIVITY_CODE 1
12/23/2022 05:58:02 AM script INFO: SUCCESS!@#KODE 1!@#USER_ID 95!@#ACTIVITY_CODE 2
12/23/2022 05:58:02 AM script INFO: SUCCESS!@#KODE 1!@#USER_ID 95!@#ACTIVITY_CODE 3
12/23/2022 05:58:02 AM script INFO: SUCCESS!@#KODE 1!@#USER_ID 95!@#ACTIVITY_CODE 2
12/23/2022 05:58:02 AM script INFO: SUCCESS!@#KODE 1!@#USER_ID 95!@#ACTIVITY_CODE 2
12/23/2022 05:58:02 AM script INFO: SUCCESS!@#KODE 1!@#USER_ID 95!@#ACTIVITY_CODE 2
12/23/2022 05:58:02 AM script INFO: SUCCESS!@#KODE 1!@#USER_ID 95!@#ACTIVITY_CODE 1
12/23/2022 05:58:02 AM script INFO: SUCCESS!@#KODE 1!@#USER_ID 95!@#ACTIVITY_CODE 1
12/23/2022 05:58:02 AM script INFO: SUCCESS!@#KODE 1!@#USER_ID 95!@#ACTIVITY_CODE 3
12/23/2022 05:58:02 AM script INFO: SUCCESS!@#KODE 1!@#USER_ID 95!@#ACTIVITY_CODE 3
12/23/2022 05:58:02 AM script INFO: SUCCESS!@#KODE 1!@#USER_ID 95!@#ACTIVITY_CODE 2
12/23/2022 05:58:02 AM script INFO: SUCCESS!@#KODE 1!@#USER_ID 95!@#ACTIVITY_CODE 1
12/23/2022 05:58:02 AM script INFO: SUCCESS!@#KODE 1!@#USER_ID 95!@#ACTIVITY_CODE 3
12/23/2022 05:58:03 AM script INFO: SUCCESS!@#KODE 1!@#USER_ID 95!@#ACTIVITY_CODE 2
12/23/2022 05:58:03 AM script INFO: SUCCESS!@#KODE 1!@#USER_ID 95!@#ACTIVITY_CODE 1
12/23/2022 05:58:03 AM script INFO: SUCCESS!@#KODE 1!@#USER_ID 95!@#ACTIVITY_CODE 3
12/23/2022 05:58:03 AM script INFO: SUCCESS!@#KODE 1!@#USER_ID 95!@#ACTIVITY_CODE 1
12/23/2022 05:58:03 AM script INFO: SUCCESS!@#KODE 1!@#USER_ID 95!@#ACTIVITY_CODE 1
12/23/2022 05:58:03 AM script INFO: SUCCESS!@#KODE 1!@#USER_ID 95!@#ACTIVITY_CODE 3
12/23/2022 05:58:03 AM script INFO: SUCCESS!@#KODE 1!@#USER_ID 95!@#ACTIVITY_CODE 3
12/23/2022 05:58:03 AM script INFO: SUCCESS!@#KODE 1!@#USER_ID 95!@#ACTIVITY_CODE 3
12/23/2022 05:58:03 AM script INFO: SUCCESS!@#KODE 1!@#USER_ID 95!@#ACTIVITY_CODE 1
12/23/2022 05:58:03 AM script INFO: SUCCESS!@#KODE 1!@#USER_ID 95!@#ACTIVITY_CODE 4
12/23/2022 05:58:03 AM script INFO: SUCCESS!@#KODE 1!@#USER_ID 95!@#ACTIVITY_CODE 1
12/23/2022 05:58:03 AM script INFO: SUCCESS!@#KODE 1!@#USER_ID 95!@#ACTIVITY_CODE 3
12/23/2022 05:58:03 AM script INFO: SUCCESS!@#KODE 1!@#USER_ID 95!@#ACTIVITY_CODE 1
12/23/2022 05:58:03 AM script INFO: SUCCESS!@#KODE 1!@#USER_ID 95!@#ACTIVITY_CODE 1
12/23/2022 05:58:03 AM script INFO: SUCCESS!@#KODE 1!@#USER_ID 95!@#ACTIVITY_CODE 4
12/23/2022 05:58:03 AM script INFO: SUCCESS!@#KODE 1!@#USER_ID 95!@#ACTIVITY_CODE 3
12/23/2022 05:58:03 AM script INFO: SUCCESS!@#KODE 1!@#USER_ID 95!@#ACTIVITY_CODE 3
12/23/2022 05:58:03 AM script INFO: SUCCESS!@#KODE 1!@#USER_ID 95!@#ACTIVITY_CODE 3
12/23/2022 05:58:03 AM script INFO: SUCCESS!@#KODE 1!@#USER_ID 95!@#ACTIVITY_CODE 3
12/23/2022 05:58:04 AM script INFO: SUCCESS!@#KODE 1!@#USER_ID 95!@#ACTIVITY_CODE 2
12/23/2022 05:58:04 AM script INFO: SUCCESS!@#KODE 1!@#USER_ID 95!@#ACTIVITY_CODE 1
12/23/2022 05:58:04 AM script INFO: SUCCESS!@#KODE 1!@#USER_ID 95!@#ACTIVITY_CODE 1
12/23/2022 05:58:04 AM script INFO: SUCCESS!@#KODE 1!@#USER_ID 95!@#ACTIVITY_CODE 3
12/23/2022 05:58:04 AM script INFO: SUCCESS!@#KODE 1!@#USER_ID 95!@#ACTIVITY_CODE 1
12/23/2022 05:58:04 AM script INFO: SUCCESS!@#KODE 1!@#USER_ID 95!@#ACTIVITY_CODE 2
12/23/2022 05:58:04 AM script INFO: SUCCESS!@#KODE 1!@#USER_ID 95!@#ACTIVITY_CODE 4
12/23/2022 05:58:04 AM script INFO: SUCCESS!@#KODE 1!@#USER_ID 95!@#ACTIVITY_CODE 1
12/23/2022 05:58:04 AM script INFO: SUCCESS!@#KODE 1!@#USER_ID 95!@#ACTIVITY_CODE 4
12/23/2022 05:58:04 AM script INFO: SUCCESS!@#KODE 1!@#USER_ID 95!@#ACTIVITY_CODE 1
12/23/2022 05:58:04 AM script INFO: SUCCESS!@#KODE 1!@#USER_ID 95!@#ACTIVITY_CODE 1
12/23/2022 05:58:04 AM script INFO: SUCCESS!@#KODE 1!@#USER_ID 95!@#ACTIVITY_CODE 1
12/23/2022 05:58:04 AM script INFO: SUCCESS!@#KODE 1!@#USER_ID 95!@#ACTIVITY_CODE 3
12/23/2022 05:58:04 AM script INFO: SUCCESS!@#KODE 1!@#USER_ID 95!@#ACTIVITY_CODE 2
12/23/2022 05:58:04 AM script INFO: SUCCESS!@#KODE 1!@#USER_ID 95!@#ACTIVITY_CODE 2
12/23/2022 05:58:04 AM script INFO: SUCCESS!@#KODE 1!@#USER_ID 95!@#ACTIVITY_CODE 1
12/23/2022 05:58:04 AM script INFO: SUCCESS!@#KODE 1!@#USER_ID 95!@#ACTIVITY_CODE 3
12/23/2022 05:58:05 AM script INFO: SUCCESS!@#KODE 1!@#USER_ID 95!@#ACTIVITY_CODE 3
12/23/2022 05:58:05 AM script INFO: SUCCESS!@#KODE 1!@#USER_ID 95!@#ACTIVITY_CODE 1
12/23/2022 05:58:05 AM script INFO: SUCCESS!@#KODE 1!@#USER_ID 95!@#ACTIVITY_CODE 1
12/23/2022 05:58:05 AM script INFO: SUCCESS!@#KODE 1!@#USER_ID 95!@#ACTIVITY_CODE 1
12/23/2022 05:58:05 AM script INFO: SUCCESS!@#KODE 1!@#USER_ID 95!@#ACTIVITY_CODE 2
12/23/2022 05:58:05 AM script INFO: SUCCESS!@#KODE 1!@#USER_ID 95!@#ACTIVITY_CODE 2
12/23/2022 05:58:05 AM script INFO: SUCCESS!@#KODE 1!@#USER_ID 95!@#ACTIVITY_CODE 2
12/23/2022 05:58:05 AM script INFO: SUCCESS!@#KODE 1!@#USER_ID 95!@#ACTIVITY_CODE 2
12/23/2022 05:58:05 AM script INFO: SUCCESS!@#KODE 1!@#USER_ID 95!@#ACTIVITY_CODE 3
12/23/2022 05:58:05 AM script INFO: SUCCESS!@#KODE 1!@#USER_ID 95!@#ACTIVITY_CODE 1
12/23/2022 05:58:05 AM script INFO: SUCCESS!@#KODE 1!@#USER_ID 95!@#ACTIVITY_CODE 3
12/23/2022 05:58:05 AM script INFO: SUCCESS!@#KODE 1!@#USER_ID 95!@#ACTIVITY_CODE 2
12/23/2022 05:58:05 AM script INFO: SUCCESS!@#KODE 1!@#USER_ID 95!@#ACTIVITY_CODE 3
12/23/2022 05:58:05 AM script INFO: SUCCESS!@#KODE 1!@#USER_ID 95!@#ACTIVITY_CODE 1
12/23/2022 05:58:05 AM script INFO: SUCCESS!@#KODE 1!@#USER_ID 95!@#ACTIVITY_CODE 4
12/23/2022 05:58:06 AM script INFO: SUCCESS!@#KODE 1!@#USER_ID 95!@#ACTIVITY_CODE 1
12/23/2022 05:58:06 AM script INFO: SUCCESS!@#KODE 1!@#USER_ID 95!@#ACTIVITY_CODE 4
12/23/2022 05:58:06 AM script INFO: SUCCESS!@#KODE 1!@#USER_ID 95!@#ACTIVITY_CODE 1
12/23/2022 05:58:06 AM script INFO: SUCCESS!@#KODE 1!@#USER_ID 95!@#ACTIVITY_CODE 4
12/23/2022 05:58:06 AM script INFO: SUCCESS!@#KODE 1!@#USER_ID 95!@#ACTIVITY_CODE 3
12/23/2022 05:58:06 AM script INFO: SUCCESS!@#KODE 1!@#USER_ID 95!@#ACTIVITY_CODE 1
12/23/2022 05:58:06 AM script INFO: SUCCESS!@#KODE 1!@#USER_ID 95!@#ACTIVITY_CODE 4
12/23/2022 05:58:06 AM script INFO: SUCCESS!@#KODE 1!@#USER_ID 95!@#ACTIVITY_CODE 2
12/23/2022 05:58:06 AM script INFO: SUCCESS!@#KODE 1!@#USER_ID 95!@#ACTIVITY_CODE 3
12/23/2022 05:58:06 AM script INFO: SUCCESS!@#KODE 1!@#USER_ID 95!@#ACTIVITY_CODE 3
12/23/2022 05:58:06 AM script INFO: SUCCESS!@#KODE 1!@#USER_ID 95!@#ACTIVITY_CODE 4
12/23/2022 05:58:06 AM script INFO: SUCCESS!@#KODE 1!@#USER_ID 95!@#ACTIVITY_CODE 1
12/23/2022 05:58:06 AM script INFO: SUCCESS!@#KODE 1!@#USER_ID 95!@#ACTIVITY_CODE 4
12/23/2022 05:58:06 AM script INFO: SUCCESS!@#KODE 1!@#USER_ID 95!@#ACTIVITY_CODE 1
12/23/2022 05:58:06 AM script INFO: SUCCESS!@#KODE 1!@#USER_ID 95!@#ACTIVITY_CODE 3
12/23/2022 05:58:06 AM script INFO: SUCCESS!@#KODE 1!@#USER_ID 95!@#ACTIVITY_CODE 4
12/23/2022 05:58:06 AM script INFO: SUCCESS!@#KODE 1!@#USER_ID 95!@#ACTIVITY_CODE 3
12/23/2022 05:58:06 AM script INFO: SUCCESS!@#KODE 1!@#USER_ID 95!@#ACTIVITY_CODE 3
12/23/2022 05:58:06 AM script INFO: SUCCESS!@#KODE 1!@#USER_ID 95!@#ACTIVITY_CODE 3
12/23/2022 05:58:06 AM script INFO: SUCCESS!@#KODE 1!@#USER_ID 95!@#ACTIVITY_CODE 1
12/23/2022 05:58:07 AM script INFO: SUCCESS!@#KODE 1!@#USER_ID 95!@#ACTIVITY_CODE 2
12/23/2022 05:58:07 AM script INFO: SUCCESS!@#KODE 1!@#USER_ID 95!@#ACTIVITY_CODE 3
12/23/2022 05:58:07 AM script INFO: SUCCESS!@#KODE 1!@#USER_ID 95!@#ACTIVITY_CODE 1
12/23/2022 05:58:07 AM script INFO: SUCCESS!@#KODE 1!@#USER_ID 95!@#ACTIVITY_CODE 3
12/23/2022 05:58:07 AM script INFO: SUCCESS!@#KODE 1!@#USER_ID 95!@#ACTIVITY_CODE 2
12/23/2022 05:58:07 AM script INFO: SUCCESS!@#KODE 1!@#USER_ID 95!@#ACTIVITY_CODE 1
12/23/2022 05:58:07 AM script INFO: SUCCESS!@#KODE 1!@#USER_ID 95!@#ACTIVITY_CODE 2
12/23/2022 05:58:07 AM script INFO: SUCCESS!@#KODE 1!@#USER_ID 95!@#ACTIVITY_CODE 1
12/23/2022 05:58:07 AM script INFO: SUCCESS!@#KODE 1!@#USER_ID 95!@#ACTIVITY_CODE 3
12/23/2022 05:58:07 AM script INFO: SUCCESS!@#KODE 1!@#USER_ID 95!@#ACTIVITY_CODE 4
12/23/2022 05:58:07 AM script INFO: SUCCESS!@#KODE 1!@#USER_ID 95!@#ACTIVITY_CODE 3
12/23/2022 05:58:07 AM script INFO: SUCCESS!@#KODE 1!@#USER_ID 95!@#ACTIVITY_CODE 3
12/23/2022 05:58:07 AM script INFO: SUCCESS!@#KODE 1!@#USER_ID 95!@#ACTIVITY_CODE 1
12/23/2022 05:58:07 AM script INFO: SUCCESS!@#KODE 1!@#USER_ID 95!@#ACTIVITY_CODE 2
12/23/2022 05:58:07 AM script INFO: SUCCESS!@#KODE 1!@#USER_ID 95!@#ACTIVITY_CODE 3
12/23/2022 05:58:07 AM script INFO: SUCCESS!@#KODE 1!@#USER_ID 95!@#ACTIVITY_CODE 3
12/23/2022 05:58:08 AM script INFO: SUCCESS!@#KODE 1!@#USER_ID 95!@#ACTIVITY_CODE 3
12/23/2022 05:58:08 AM script INFO: SUCCESS!@#KODE 1!@#USER_ID 95!@#ACTIVITY_CODE 2
12/23/2022 05:58:08 AM script INFO: SUCCESS!@#KODE 1!@#USER_ID 95!@#ACTIVITY_CODE 2
12/23/2022 05:58:08 AM script INFO: SUCCESS!@#KODE 1!@#USER_ID 95!@#ACTIVITY_CODE 1
12/23/2022 05:58:08 AM script INFO: SUCCESS!@#KODE 1!@#USER_ID 95!@#ACTIVITY_CODE 3
12/23/2022 05:58:08 AM script INFO: SUCCESS!@#KODE 1!@#USER_ID 95!@#ACTIVITY_CODE 4
12/23/2022 05:58:08 AM script INFO: SUCCESS!@#KODE 1!@#USER_ID 95!@#ACTIVITY_CODE 1
12/23/2022 05:58:08 AM script INFO: SUCCESS!@#KODE 1!@#USER_ID 95!@#ACTIVITY_CODE 4
12/23/2022 05:58:08 AM script INFO: SUCCESS!@#KODE 1!@#USER_ID 95!@#ACTIVITY_CODE 2
12/23/2022 05:58:08 AM script INFO: SUCCESS!@#KODE 1!@#USER_ID 95!@#ACTIVITY_CODE 1
12/23/2022 05:58:08 AM script INFO: SUCCESS!@#KODE 1!@#USER_ID 95!@#ACTIVITY_CODE 3
12/23/2022 05:58:08 AM script INFO: SUCCESS!@#KODE 1!@#USER_ID 95!@#ACTIVITY_CODE 3
12/23/2022 05:58:08 AM script INFO: SUCCESS!@#KODE 1!@#USER_ID 95!@#ACTIVITY_CODE 1
12/23/2022 05:58:08 AM script INFO: SUCCESS!@#KODE 1!@#USER_ID 95!@#ACTIVITY_CODE 1
12/23/2022 05:58:08 AM script INFO: SUCCESS!@#KODE 1!@#USER_ID 95!@#ACTIVITY_CODE 4
12/23/2022 05:58:08 AM script INFO: SUCCESS!@#KODE 1!@#USER_ID 95!@#ACTIVITY_CODE 1
12/23/2022 05:58:08 AM script INFO: SUCCESS!@#KODE 1!@#USER_ID 95!@#ACTIVITY_CODE 1
12/23/2022 05:58:09 AM script INFO: SUCCESS!@#KODE 1!@#USER_ID 95!@#ACTIVITY_CODE 2
12/23/2022 05:58:09 AM script INFO: SUCCESS!@#KODE 1!@#USER_ID 95!@#ACTIVITY_CODE 2
12/23/2022 05:58:09 AM script INFO: SUCCESS!@#KODE 1!@#USER_ID 95!@#ACTIVITY_CODE 4
12/23/2022 05:58:09 AM script INFO: SUCCESS!@#KODE 1!@#USER_ID 95!@#ACTIVITY_CODE 2
12/23/2022 05:58:09 AM script INFO: SUCCESS!@#KODE 1!@#USER_ID 95!@#ACTIVITY_CODE 1
12/23/2022 05:58:09 AM script INFO: SUCCESS!@#KODE 1!@#USER_ID 95!@#ACTIVITY_CODE 4
12/23/2022 05:58:09 AM script INFO: SUCCESS!@#KODE 1!@#USER_ID 95!@#ACTIVITY_CODE 1
12/23/2022 05:58:09 AM script INFO: SUCCESS!@#KODE 1!@#USER_ID 95!@#ACTIVITY_CODE 4
12/23/2022 05:58:09 AM script INFO: SUCCESS!@#KODE 1!@#USER_ID 95!@#ACTIVITY_CODE 3
12/23/2022 05:58:09 AM script INFO: SUCCESS!@#KODE 1!@#USER_ID 95!@#ACTIVITY_CODE 2
12/23/2022 05:58:09 AM script INFO: SUCCESS!@#KODE 1!@#USER_ID 95!@#ACTIVITY_CODE 2
12/23/2022 05:58:09 AM script INFO: SUCCESS!@#KODE 1!@#USER_ID 95!@#ACTIVITY_CODE 3
12/23/2022 05:58:09 AM script INFO: SUCCESS!@#KODE 1!@#USER_ID 95!@#ACTIVITY_CODE 1
12/23/2022 05:58:09 AM script INFO: SUCCESS!@#KODE 1!@#USER_ID 95!@#ACTIVITY_CODE 2
12/23/2022 05:58:10 AM script INFO: SUCCESS!@#KODE 1!@#USER_ID 95!@#ACTIVITY_CODE 2
12/23/2022 05:58:10 AM script INFO: SUCCESS!@#KODE 1!@#USER_ID 95!@#ACTIVITY_CODE 3
12/23/2022 05:58:10 AM script INFO: SUCCESS!@#KODE 1!@#USER_ID 95!@#ACTIVITY_CODE 2
12/23/2022 05:58:10 AM script INFO: SUCCESS!@#KODE 1!@#USER_ID 95!@#ACTIVITY_CODE 1
12/23/2022 05:58:10 AM script INFO: SUCCESS!@#KODE 1!@#USER_ID 95!@#ACTIVITY_CODE 4
12/23/2022 05:58:10 AM script INFO: SUCCESS!@#KODE 1!@#USER_ID 95!@#ACTIVITY_CODE 2
12/23/2022 05:58:10 AM script INFO: SUCCESS!@#KODE 1!@#USER_ID 95!@#ACTIVITY_CODE 3
12/23/2022 05:58:10 AM script INFO: SUCCESS!@#KODE 1!@#USER_ID 95!@#ACTIVITY_CODE 3
12/23/2022 05:58:10 AM script INFO: SUCCESS!@#KODE 1!@#USER_ID 95!@#ACTIVITY_CODE 1
12/23/2022 05:58:10 AM script INFO: SUCCESS!@#KODE 1!@#USER_ID 95!@#ACTIVITY_CODE 3
12/23/2022 05:58:10 AM script INFO: SUCCESS!@#KODE 1!@#USER_ID 95!@#ACTIVITY_CODE 2
12/23/2022 05:58:10 AM script INFO: SUCCESS!@#KODE 1!@#USER_ID 95!@#ACTIVITY_CODE 1
12/23/2022 05:58:10 AM script INFO: SUCCESS!@#KODE 1!@#USER_ID 95!@#ACTIVITY_CODE 1
12/23/2022 05:58:10 AM script INFO: SUCCESS!@#KODE 1!@#USER_ID 95!@#ACTIVITY_CODE 2
12/23/2022 05:58:10 AM script INFO: SUCCESS!@#KODE 1!@#USER_ID 95!@#ACTIVITY_CODE 1
12/23/2022 05:58:10 AM script INFO: SUCCESS!@#KODE 1!@#USER_ID 95!@#ACTIVITY_CODE 1
12/23/2022 05:58:11 AM script INFO: SUCCESS!@#KODE 1!@#USER_ID 95!@#ACTIVITY_CODE 3
12/23/2022 05:58:11 AM script INFO: SUCCESS!@#KODE 1!@#USER_ID 95!@#ACTIVITY_CODE 4
12/23/2022 05:58:11 AM script INFO: SUCCESS!@#KODE 1!@#USER_ID 95!@#ACTIVITY_CODE 3
12/23/2022 05:58:11 AM script INFO: SUCCESS!@#KODE 1!@#USER_ID 95!@#ACTIVITY_CODE 3
12/23/2022 05:58:11 AM script INFO: SUCCESS!@#KODE 1!@#USER_ID 95!@#ACTIVITY_CODE 2
12/23/2022 05:58:11 AM script INFO: SUCCESS!@#KODE 1!@#USER_ID 95!@#ACTIVITY_CODE 3
12/23/2022 05:58:11 AM script INFO: SUCCESS!@#KODE 1!@#USER_ID 95!@#ACTIVITY_CODE 1
12/23/2022 05:58:11 AM script INFO: SUCCESS!@#KODE 1!@#USER_ID 95!@#ACTIVITY_CODE 2
12/23/2022 05:58:11 AM script INFO: SUCCESS!@#KODE 1!@#USER_ID 95!@#ACTIVITY_CODE 2
12/23/2022 05:58:11 AM script INFO: SUCCESS!@#KODE 1!@#USER_ID 95!@#ACTIVITY_CODE 4
12/23/2022 05:58:11 AM script INFO: SUCCESS!@#KODE 1!@#USER_ID 95!@#ACTIVITY_CODE 1
12/23/2022 05:58:11 AM script INFO: SUCCESS!@#KODE 1!@#USER_ID 95!@#ACTIVITY_CODE 2
12/23/2022 05:58:11 AM script INFO: SUCCESS!@#KODE 1!@#USER_ID 95!@#ACTIVITY_CODE 2
12/23/2022 05:58:11 AM script INFO: SUCCESS!@#KODE 1!@#USER_ID 95!@#ACTIVITY_CODE 3
12/23/2022 05:58:11 AM script INFO: SUCCESS!@#KODE 1!@#USER_ID 95!@#ACTIVITY_CODE 2
12/23/2022 05:58:12 AM script INFO: SUCCESS!@#KODE 1!@#USER_ID 95!@#ACTIVITY_CODE 4
12/23/2022 05:58:12 AM script INFO: SUCCESS!@#KODE 1!@#USER_ID 95!@#ACTIVITY_CODE 1
12/23/2022 05:58:12 AM script INFO: SUCCESS!@#KODE 1!@#USER_ID 95!@#ACTIVITY_CODE 1
12/23/2022 05:58:12 AM script INFO: SUCCESS!@#KODE 1!@#USER_ID 95!@#ACTIVITY_CODE 3
12/23/2022 05:58:12 AM script INFO: SUCCESS!@#KODE 1!@#USER_ID 95!@#ACTIVITY_CODE 3
12/23/2022 05:58:12 AM script INFO: SUCCESS!@#KODE 1!@#USER_ID 95!@#ACTIVITY_CODE 4
12/23/2022 05:58:12 AM script INFO: SUCCESS!@#KODE 1!@#USER_ID 95!@#ACTIVITY_CODE 1
12/23/2022 05:58:12 AM script INFO: SUCCESS!@#KODE 1!@#USER_ID 95!@#ACTIVITY_CODE 2
12/23/2022 05:58:12 AM script INFO: SUCCESS!@#KODE 1!@#USER_ID 95!@#ACTIVITY_CODE 4
12/23/2022 05:58:12 AM script INFO: SUCCESS!@#KODE 1!@#USER_ID 95!@#ACTIVITY_CODE 1
12/23/2022 05:58:12 AM script INFO: SUCCESS!@#KODE 1!@#USER_ID 95!@#ACTIVITY_CODE 1
12/23/2022 05:58:12 AM script INFO: SUCCESS!@#KODE 1!@#USER_ID 95!@#ACTIVITY_CODE 1
12/23/2022 05:58:12 AM script INFO: SUCCESS!@#KODE 1!@#USER_ID 95!@#ACTIVITY_CODE 1
12/23/2022 05:58:12 AM script INFO: SUCCESS!@#KODE 1!@#USER_ID 95!@#ACTIVITY_CODE 3
12/23/2022 05:58:12 AM script INFO: SUCCESS!@#KODE 1!@#USER_ID 95!@#ACTIVITY_CODE 4
12/23/2022 05:58:12 AM script INFO: SUCCESS!@#KODE 1!@#USER_ID 95!@#ACTIVITY_CODE 1
12/23/2022 05:58:12 AM script INFO: SUCCESS!@#KODE 1!@#USER_ID 95!@#ACTIVITY_CODE 3
12/23/2022 05:58:12 AM script INFO: SUCCESS!@#KODE 1!@#USER_ID 95!@#ACTIVITY_CODE 3
12/23/2022 05:58:12 AM script INFO: SUCCESS!@#KODE 1!@#USER_ID 95!@#ACTIVITY_CODE 3
12/23/2022 05:58:12 AM script INFO: SUCCESS!@#KODE 1!@#USER_ID 95!@#ACTIVITY_CODE 1
12/23/2022 05:58:13 AM script INFO: SUCCESS!@#KODE 1!@#USER_ID 95!@#ACTIVITY_CODE 2
12/23/2022 05:58:13 AM script INFO: SUCCESS!@#KODE 1!@#USER_ID 95!@#ACTIVITY_CODE 1
12/23/2022 05:58:13 AM script INFO: SUCCESS!@#KODE 1!@#USER_ID 95!@#ACTIVITY_CODE 3
12/23/2022 05:58:13 AM script INFO: SUCCESS!@#KODE 1!@#USER_ID 95!@#ACTIVITY_CODE 1
12/23/2022 05:58:13 AM script INFO: SUCCESS!@#KODE 1!@#USER_ID 95!@#ACTIVITY_CODE 2
12/23/2022 05:58:13 AM script INFO: SUCCESS!@#KODE 1!@#USER_ID 95!@#ACTIVITY_CODE 1
12/23/2022 05:58:13 AM script INFO: SUCCESS!@#KODE 1!@#USER_ID 95!@#ACTIVITY_CODE 2
12/23/2022 05:58:13 AM script INFO: SUCCESS!@#KODE 1!@#USER_ID 95!@#ACTIVITY_CODE 2
12/23/2022 05:58:13 AM script INFO: SUCCESS!@#KODE 1!@#USER_ID 95!@#ACTIVITY_CODE 3
12/23/2022 05:58:13 AM script INFO: SUCCESS!@#KODE 1!@#USER_ID 95!@#ACTIVITY_CODE 1
12/23/2022 05:58:13 AM script INFO: SUCCESS!@#KODE 1!@#USER_ID 95!@#ACTIVITY_CODE 4
12/23/2022 05:58:13 AM script INFO: SUCCESS!@#KODE 1!@#USER_ID 95!@#ACTIVITY_CODE 2
12/23/2022 05:58:13 AM script INFO: SUCCESS!@#KODE 1!@#USER_ID 95!@#ACTIVITY_CODE 2
12/23/2022 05:58:13 AM script INFO: SUCCESS!@#KODE 1!@#USER_ID 95!@#ACTIVITY_CODE 1
12/23/2022 05:58:13 AM script INFO: SUCCESS!@#KODE 1!@#USER_ID 95!@#ACTIVITY_CODE 2
12/23/2022 05:58:14 AM script INFO: SUCCESS!@#KODE 1!@#USER_ID 95!@#ACTIVITY_CODE 2
12/23/2022 05:58:14 AM script INFO: SUCCESS!@#KODE 1!@#USER_ID 95!@#ACTIVITY_CODE 2
12/23/2022 05:58:14 AM script INFO: SUCCESS!@#KODE 1!@#USER_ID 95!@#ACTIVITY_CODE 4
12/23/2022 05:58:14 AM script INFO: SUCCESS!@#KODE 1!@#USER_ID 95!@#ACTIVITY_CODE 2
12/23/2022 05:58:14 AM script INFO: SUCCESS!@#KODE 1!@#USER_ID 95!@#ACTIVITY_CODE 4
12/23/2022 05:58:14 AM script INFO: SUCCESS!@#KODE 1!@#USER_ID 95!@#ACTIVITY_CODE 1
12/23/2022 05:58:14 AM script INFO: SUCCESS!@#KODE 1!@#USER_ID 95!@#ACTIVITY_CODE 4
12/23/2022 05:58:14 AM script INFO: SUCCESS!@#KODE 1!@#USER_ID 95!@#ACTIVITY_CODE 3
12/23/2022 05:58:14 AM script INFO: SUCCESS!@#KODE 1!@#USER_ID 95!@#ACTIVITY_CODE 3
12/23/2022 05:58:14 AM script INFO: SUCCESS!@#KODE 1!@#USER_ID 95!@#ACTIVITY_CODE 1
12/23/2022 05:58:14 AM script INFO: SUCCESS!@#KODE 1!@#USER_ID 95!@#ACTIVITY_CODE 3
12/23/2022 05:58:14 AM script INFO: SUCCESS!@#KODE 1!@#USER_ID 95!@#ACTIVITY_CODE 1
12/23/2022 05:58:14 AM script INFO: SUCCESS!@#KODE 1!@#USER_ID 95!@#ACTIVITY_CODE 4
12/23/2022 05:58:14 AM script INFO: SUCCESS!@#KODE 1!@#USER_ID 95!@#ACTIVITY_CODE 3
12/23/2022 05:58:14 AM script INFO: SUCCESS!@#KODE 1!@#USER_ID 95!@#ACTIVITY_CODE 2
12/23/2022 05:58:14 AM script INFO: SUCCESS!@#KODE 1!@#USER_ID 95!@#ACTIVITY_CODE 2
12/23/2022 05:58:15 AM script INFO: SUCCESS!@#KODE 1!@#USER_ID 95!@#ACTIVITY_CODE 2
12/23/2022 05:58:15 AM script INFO: SUCCESS!@#KODE 1!@#USER_ID 95!@#ACTIVITY_CODE 2
12/23/2022 05:58:15 AM script INFO: SUCCESS!@#KODE 1!@#USER_ID 95!@#ACTIVITY_CODE 1
12/23/2022 05:58:15 AM script INFO: SUCCESS!@#KODE 1!@#USER_ID 95!@#ACTIVITY_CODE 1
12/23/2022 05:58:15 AM script INFO: SUCCESS!@#KODE 1!@#USER_ID 95!@#ACTIVITY_CODE 3
12/23/2022 05:58:15 AM script INFO: SUCCESS!@#KODE 1!@#USER_ID 95!@#ACTIVITY_CODE 1
12/23/2022 05:58:15 AM script INFO: SUCCESS!@#KODE 1!@#USER_ID 95!@#ACTIVITY_CODE 3
12/23/2022 05:58:15 AM script INFO: SUCCESS!@#KODE 1!@#USER_ID 95!@#ACTIVITY_CODE 3
12/23/2022 05:58:15 AM script INFO: SUCCESS!@#KODE 1!@#USER_ID 95!@#ACTIVITY_CODE 2
12/23/2022 05:58:15 AM script INFO: SUCCESS!@#KODE 1!@#USER_ID 95!@#ACTIVITY_CODE 1
12/23/2022 05:58:15 AM script INFO: SUCCESS!@#KODE 1!@#USER_ID 95!@#ACTIVITY_CODE 3
12/23/2022 05:58:15 AM script INFO: SUCCESS!@#KODE 1!@#USER_ID 95!@#ACTIVITY_CODE 1
12/23/2022 05:58:15 AM script INFO: SUCCESS!@#KODE 1!@#USER_ID 95!@#ACTIVITY_CODE 3
12/23/2022 05:58:15 AM script INFO: Duration: 81.20544123649597
12/23/2022 05:58:15 AM script INFO: mengakhiri-quiz
12/23/2022 05:58:17 AM script INFO: SUCCESS!@#KODE 1!@#USER_ID 95!@#ACTIVITY_CODE 5
12/23/2022 05:58:17 AM script INFO: berhasil-submit
