12/10/2022 09:21:39 AM script INFO: Prepared chrome options..
12/10/2022 09:21:40 AM script INFO: Initialized chrome browser..
12/10/2022 09:21:40 AM script INFO: mengakses-homepage
12/10/2022 09:21:46 AM script INFO: mengakses-login-page
12/10/2022 09:21:51 AM script INFO: mengakses-site-home
12/10/2022 09:22:24 AM script INFO: mengakses-site-course
12/10/2022 09:22:48 AM script INFO: mengakses-quiz
12/10/2022 09:22:54 AM script INFO: mengakses-start-quiz-page
12/10/2022 09:23:24 AM script INFO: memulai-quiz
12/10/2022 09:23:24 AM script INFO: SUCCESS!@#KODE 1!@#USER_ID 8!@#ACTIVITY_CODE 5
12/10/2022 09:23:35 AM script INFO: SUCCESS!@#KODE 1!@#USER_ID 8!@#ACTIVITY_CODE 2
12/10/2022 09:23:35 AM script INFO: SUCCESS!@#KODE 1!@#USER_ID 8!@#ACTIVITY_CODE 5
12/10/2022 09:23:35 AM script INFO: SUCCESS!@#KODE 1!@#USER_ID 8!@#ACTIVITY_CODE 5
12/10/2022 09:23:38 AM script INFO: SUCCESS!@#KODE 1!@#USER_ID 8!@#ACTIVITY_CODE 1
12/10/2022 09:23:38 AM script INFO: SUCCESS!@#KODE 1!@#USER_ID 8!@#ACTIVITY_CODE 3
12/10/2022 09:23:38 AM script INFO: SUCCESS!@#KODE 1!@#USER_ID 8!@#ACTIVITY_CODE 5
12/10/2022 09:23:38 AM script INFO: SUCCESS!@#KODE 1!@#USER_ID 8!@#ACTIVITY_CODE 5
12/10/2022 09:23:40 AM script INFO: SUCCESS!@#KODE 1!@#USER_ID 8!@#ACTIVITY_CODE 3
12/10/2022 09:23:40 AM script INFO: SUCCESS!@#KODE 1!@#USER_ID 8!@#ACTIVITY_CODE 5
12/10/2022 09:23:40 AM script INFO: SUCCESS!@#KODE 1!@#USER_ID 8!@#ACTIVITY_CODE 5
12/10/2022 09:23:43 AM script INFO: SUCCESS!@#KODE 1!@#USER_ID 8!@#ACTIVITY_CODE 1
12/10/2022 09:23:43 AM script INFO: SUCCESS!@#KODE 1!@#USER_ID 8!@#ACTIVITY_CODE 2
12/10/2022 09:23:43 AM script INFO: SUCCESS!@#KODE 1!@#USER_ID 8!@#ACTIVITY_CODE 5
12/10/2022 09:23:43 AM script INFO: SUCCESS!@#KODE 1!@#USER_ID 8!@#ACTIVITY_CODE 5
12/10/2022 09:23:45 AM script INFO: SUCCESS!@#KODE 1!@#USER_ID 8!@#ACTIVITY_CODE 3
12/10/2022 09:23:45 AM script INFO: SUCCESS!@#KODE 1!@#USER_ID 8!@#ACTIVITY_CODE 5
12/10/2022 09:23:45 AM script INFO: SUCCESS!@#KODE 1!@#USER_ID 8!@#ACTIVITY_CODE 5
12/10/2022 09:23:48 AM script INFO: SUCCESS!@#KODE 1!@#USER_ID 8!@#ACTIVITY_CODE 1
12/10/2022 09:23:48 AM script INFO: SUCCESS!@#KODE 1!@#USER_ID 8!@#ACTIVITY_CODE 2
12/10/2022 09:23:48 AM script INFO: SUCCESS!@#KODE 1!@#USER_ID 8!@#ACTIVITY_CODE 1
12/10/2022 09:23:48 AM script INFO: SUCCESS!@#KODE 1!@#USER_ID 8!@#ACTIVITY_CODE 5
12/10/2022 09:23:48 AM script INFO: SUCCESS!@#KODE 1!@#USER_ID 8!@#ACTIVITY_CODE 5
12/10/2022 09:23:51 AM script INFO: SUCCESS!@#KODE 1!@#USER_ID 8!@#ACTIVITY_CODE 3
12/10/2022 09:23:51 AM script INFO: SUCCESS!@#KODE 1!@#USER_ID 8!@#ACTIVITY_CODE 2
12/10/2022 09:23:51 AM script INFO: SUCCESS!@#KODE 1!@#USER_ID 8!@#ACTIVITY_CODE 1
12/10/2022 09:23:51 AM script INFO: SUCCESS!@#KODE 1!@#USER_ID 8!@#ACTIVITY_CODE 3
12/10/2022 09:23:51 AM script INFO: SUCCESS!@#KODE 1!@#USER_ID 8!@#ACTIVITY_CODE 2
12/10/2022 09:23:51 AM script INFO: SUCCESS!@#KODE 1!@#USER_ID 8!@#ACTIVITY_CODE 1
12/10/2022 09:23:51 AM script INFO: SUCCESS!@#KODE 1!@#USER_ID 8!@#ACTIVITY_CODE 2
12/10/2022 09:23:51 AM script INFO: SUCCESS!@#KODE 1!@#USER_ID 8!@#ACTIVITY_CODE 4
12/10/2022 09:23:51 AM script INFO: SUCCESS!@#KODE 1!@#USER_ID 8!@#ACTIVITY_CODE 2
12/10/2022 09:23:51 AM script INFO: SUCCESS!@#KODE 1!@#USER_ID 8!@#ACTIVITY_CODE 3
12/10/2022 09:23:52 AM script INFO: SUCCESS!@#KODE 1!@#USER_ID 8!@#ACTIVITY_CODE 2
12/10/2022 09:23:52 AM script INFO: SUCCESS!@#KODE 1!@#USER_ID 8!@#ACTIVITY_CODE 1
12/10/2022 09:23:52 AM script INFO: SUCCESS!@#KODE 1!@#USER_ID 8!@#ACTIVITY_CODE 1
12/10/2022 09:23:52 AM script INFO: SUCCESS!@#KODE 1!@#USER_ID 8!@#ACTIVITY_CODE 2
12/10/2022 09:23:52 AM script INFO: SUCCESS!@#KODE 1!@#USER_ID 8!@#ACTIVITY_CODE 2
12/10/2022 09:23:52 AM script INFO: SUCCESS!@#KODE 1!@#USER_ID 8!@#ACTIVITY_CODE 1
12/10/2022 09:23:52 AM script INFO: SUCCESS!@#KODE 1!@#USER_ID 8!@#ACTIVITY_CODE 5
12/10/2022 09:23:52 AM script INFO: SUCCESS!@#KODE 1!@#USER_ID 8!@#ACTIVITY_CODE 5
12/10/2022 09:23:54 AM script INFO: SUCCESS!@#KODE 1!@#USER_ID 8!@#ACTIVITY_CODE 4
12/10/2022 09:23:54 AM script INFO: SUCCESS!@#KODE 1!@#USER_ID 8!@#ACTIVITY_CODE 1
12/10/2022 09:23:55 AM script INFO: SUCCESS!@#KODE 1!@#USER_ID 8!@#ACTIVITY_CODE 2
12/10/2022 09:23:55 AM script INFO: SUCCESS!@#KODE 1!@#USER_ID 8!@#ACTIVITY_CODE 5
12/10/2022 09:23:55 AM script INFO: SUCCESS!@#KODE 1!@#USER_ID 8!@#ACTIVITY_CODE 5
12/10/2022 09:23:57 AM script INFO: SUCCESS!@#KODE 1!@#USER_ID 8!@#ACTIVITY_CODE 5
12/10/2022 09:23:57 AM script INFO: SUCCESS!@#KODE 1!@#USER_ID 8!@#ACTIVITY_CODE 5
12/10/2022 09:24:00 AM script INFO: SUCCESS!@#KODE 1!@#USER_ID 8!@#ACTIVITY_CODE 2
12/10/2022 09:24:00 AM script INFO: SUCCESS!@#KODE 1!@#USER_ID 8!@#ACTIVITY_CODE 1
12/10/2022 09:24:00 AM script INFO: SUCCESS!@#KODE 1!@#USER_ID 8!@#ACTIVITY_CODE 5
12/10/2022 09:24:00 AM script INFO: SUCCESS!@#KODE 1!@#USER_ID 8!@#ACTIVITY_CODE 5
12/10/2022 09:24:02 AM script INFO: SUCCESS!@#KODE 1!@#USER_ID 8!@#ACTIVITY_CODE 3
12/10/2022 09:24:02 AM script INFO: SUCCESS!@#KODE 1!@#USER_ID 8!@#ACTIVITY_CODE 1
12/10/2022 09:24:02 AM script INFO: SUCCESS!@#KODE 1!@#USER_ID 8!@#ACTIVITY_CODE 3
12/10/2022 09:24:03 AM script INFO: SUCCESS!@#KODE 1!@#USER_ID 8!@#ACTIVITY_CODE 2
12/10/2022 09:24:03 AM script INFO: SUCCESS!@#KODE 1!@#USER_ID 8!@#ACTIVITY_CODE 3
12/10/2022 09:24:03 AM script INFO: SUCCESS!@#KODE 1!@#USER_ID 8!@#ACTIVITY_CODE 1
12/10/2022 09:24:03 AM script INFO: SUCCESS!@#KODE 1!@#USER_ID 8!@#ACTIVITY_CODE 1
12/10/2022 09:24:03 AM script INFO: SUCCESS!@#KODE 1!@#USER_ID 8!@#ACTIVITY_CODE 3
12/10/2022 09:24:03 AM script INFO: SUCCESS!@#KODE 1!@#USER_ID 8!@#ACTIVITY_CODE 1
12/10/2022 09:24:03 AM script INFO: SUCCESS!@#KODE 1!@#USER_ID 8!@#ACTIVITY_CODE 3
12/10/2022 09:24:03 AM script INFO: SUCCESS!@#KODE 1!@#USER_ID 8!@#ACTIVITY_CODE 5
12/10/2022 09:24:03 AM script INFO: SUCCESS!@#KODE 1!@#USER_ID 8!@#ACTIVITY_CODE 5
12/10/2022 09:24:05 AM script INFO: SUCCESS!@#KODE 1!@#USER_ID 8!@#ACTIVITY_CODE 3
12/10/2022 09:24:05 AM script INFO: SUCCESS!@#KODE 1!@#USER_ID 8!@#ACTIVITY_CODE 4
12/10/2022 09:24:06 AM script INFO: SUCCESS!@#KODE 1!@#USER_ID 8!@#ACTIVITY_CODE 2
12/10/2022 09:24:06 AM script INFO: SUCCESS!@#KODE 1!@#USER_ID 8!@#ACTIVITY_CODE 2
12/10/2022 09:24:06 AM script INFO: SUCCESS!@#KODE 1!@#USER_ID 8!@#ACTIVITY_CODE 3
12/10/2022 09:24:06 AM script INFO: SUCCESS!@#KODE 1!@#USER_ID 8!@#ACTIVITY_CODE 1
12/10/2022 09:24:06 AM script INFO: SUCCESS!@#KODE 1!@#USER_ID 8!@#ACTIVITY_CODE 2
12/10/2022 09:24:06 AM script INFO: SUCCESS!@#KODE 1!@#USER_ID 8!@#ACTIVITY_CODE 2
12/10/2022 09:24:06 AM script INFO: SUCCESS!@#KODE 1!@#USER_ID 8!@#ACTIVITY_CODE 5
12/10/2022 09:24:06 AM script INFO: SUCCESS!@#KODE 1!@#USER_ID 8!@#ACTIVITY_CODE 5
12/10/2022 09:24:09 AM script INFO: SUCCESS!@#KODE 1!@#USER_ID 8!@#ACTIVITY_CODE 2
12/10/2022 09:24:09 AM script INFO: SUCCESS!@#KODE 1!@#USER_ID 8!@#ACTIVITY_CODE 2
12/10/2022 09:24:09 AM script INFO: SUCCESS!@#KODE 1!@#USER_ID 8!@#ACTIVITY_CODE 2
12/10/2022 09:24:09 AM script INFO: SUCCESS!@#KODE 1!@#USER_ID 8!@#ACTIVITY_CODE 5
12/10/2022 09:24:09 AM script INFO: SUCCESS!@#KODE 1!@#USER_ID 8!@#ACTIVITY_CODE 5
12/10/2022 09:24:11 AM script INFO: SUCCESS!@#KODE 1!@#USER_ID 8!@#ACTIVITY_CODE 2
12/10/2022 09:24:11 AM script INFO: SUCCESS!@#KODE 1!@#USER_ID 8!@#ACTIVITY_CODE 1
12/10/2022 09:24:11 AM script INFO: SUCCESS!@#KODE 1!@#USER_ID 8!@#ACTIVITY_CODE 1
12/10/2022 09:24:12 AM script INFO: SUCCESS!@#KODE 1!@#USER_ID 8!@#ACTIVITY_CODE 2
12/10/2022 09:24:12 AM script INFO: SUCCESS!@#KODE 1!@#USER_ID 8!@#ACTIVITY_CODE 2
12/10/2022 09:24:12 AM script INFO: SUCCESS!@#KODE 1!@#USER_ID 8!@#ACTIVITY_CODE 2
12/10/2022 09:24:12 AM script INFO: SUCCESS!@#KODE 1!@#USER_ID 8!@#ACTIVITY_CODE 5
12/10/2022 09:24:12 AM script INFO: SUCCESS!@#KODE 1!@#USER_ID 8!@#ACTIVITY_CODE 5
12/10/2022 09:24:14 AM script INFO: SUCCESS!@#KODE 1!@#USER_ID 8!@#ACTIVITY_CODE 2
12/10/2022 09:24:14 AM script INFO: SUCCESS!@#KODE 1!@#USER_ID 8!@#ACTIVITY_CODE 5
12/10/2022 09:24:14 AM script INFO: SUCCESS!@#KODE 1!@#USER_ID 8!@#ACTIVITY_CODE 5
12/10/2022 09:24:17 AM script INFO: SUCCESS!@#KODE 1!@#USER_ID 8!@#ACTIVITY_CODE 2
12/10/2022 09:24:17 AM script INFO: SUCCESS!@#KODE 1!@#USER_ID 8!@#ACTIVITY_CODE 4
12/10/2022 09:24:17 AM script INFO: SUCCESS!@#KODE 1!@#USER_ID 8!@#ACTIVITY_CODE 3
12/10/2022 09:24:17 AM script INFO: SUCCESS!@#KODE 1!@#USER_ID 8!@#ACTIVITY_CODE 3
12/10/2022 09:24:17 AM script INFO: SUCCESS!@#KODE 1!@#USER_ID 8!@#ACTIVITY_CODE 3
12/10/2022 09:24:17 AM script INFO: SUCCESS!@#KODE 1!@#USER_ID 8!@#ACTIVITY_CODE 5
12/10/2022 09:24:17 AM script INFO: SUCCESS!@#KODE 1!@#USER_ID 8!@#ACTIVITY_CODE 5
12/10/2022 09:24:20 AM script INFO: SUCCESS!@#KODE 1!@#USER_ID 8!@#ACTIVITY_CODE 3
12/10/2022 09:24:20 AM script INFO: SUCCESS!@#KODE 1!@#USER_ID 8!@#ACTIVITY_CODE 2
12/10/2022 09:24:20 AM script INFO: SUCCESS!@#KODE 1!@#USER_ID 8!@#ACTIVITY_CODE 1
12/10/2022 09:24:20 AM script INFO: SUCCESS!@#KODE 1!@#USER_ID 8!@#ACTIVITY_CODE 5
12/10/2022 09:24:20 AM script INFO: SUCCESS!@#KODE 1!@#USER_ID 8!@#ACTIVITY_CODE 5
12/10/2022 09:24:22 AM script INFO: SUCCESS!@#KODE 1!@#USER_ID 8!@#ACTIVITY_CODE 4
12/10/2022 09:24:23 AM script INFO: SUCCESS!@#KODE 1!@#USER_ID 8!@#ACTIVITY_CODE 2
12/10/2022 09:24:23 AM script INFO: SUCCESS!@#KODE 1!@#USER_ID 8!@#ACTIVITY_CODE 3
12/10/2022 09:24:23 AM script INFO: SUCCESS!@#KODE 1!@#USER_ID 8!@#ACTIVITY_CODE 4
12/10/2022 09:24:23 AM script INFO: SUCCESS!@#KODE 1!@#USER_ID 8!@#ACTIVITY_CODE 3
12/10/2022 09:24:23 AM script INFO: SUCCESS!@#KODE 1!@#USER_ID 8!@#ACTIVITY_CODE 5
12/10/2022 09:24:23 AM script INFO: SUCCESS!@#KODE 1!@#USER_ID 8!@#ACTIVITY_CODE 5
12/10/2022 09:24:25 AM script INFO: SUCCESS!@#KODE 1!@#USER_ID 8!@#ACTIVITY_CODE 1
12/10/2022 09:24:25 AM script INFO: SUCCESS!@#KODE 1!@#USER_ID 8!@#ACTIVITY_CODE 2
12/10/2022 09:24:25 AM script INFO: SUCCESS!@#KODE 1!@#USER_ID 8!@#ACTIVITY_CODE 1
12/10/2022 09:24:26 AM script INFO: SUCCESS!@#KODE 1!@#USER_ID 8!@#ACTIVITY_CODE 2
12/10/2022 09:24:26 AM script INFO: SUCCESS!@#KODE 1!@#USER_ID 8!@#ACTIVITY_CODE 5
12/10/2022 09:24:26 AM script INFO: SUCCESS!@#KODE 1!@#USER_ID 8!@#ACTIVITY_CODE 5
12/10/2022 09:24:28 AM script INFO: SUCCESS!@#KODE 1!@#USER_ID 8!@#ACTIVITY_CODE 1
12/10/2022 09:24:28 AM script INFO: SUCCESS!@#KODE 1!@#USER_ID 8!@#ACTIVITY_CODE 4
12/10/2022 09:24:28 AM script INFO: SUCCESS!@#KODE 1!@#USER_ID 8!@#ACTIVITY_CODE 3
12/10/2022 09:24:28 AM script INFO: SUCCESS!@#KODE 1!@#USER_ID 8!@#ACTIVITY_CODE 2
12/10/2022 09:24:28 AM script INFO: SUCCESS!@#KODE 1!@#USER_ID 8!@#ACTIVITY_CODE 4
12/10/2022 09:24:28 AM script INFO: SUCCESS!@#KODE 1!@#USER_ID 8!@#ACTIVITY_CODE 5
12/10/2022 09:24:28 AM script INFO: SUCCESS!@#KODE 1!@#USER_ID 8!@#ACTIVITY_CODE 5
12/10/2022 09:24:31 AM script INFO: SUCCESS!@#KODE 1!@#USER_ID 8!@#ACTIVITY_CODE 5
12/10/2022 09:24:31 AM script INFO: SUCCESS!@#KODE 1!@#USER_ID 8!@#ACTIVITY_CODE 5
12/10/2022 09:24:33 AM script INFO: SUCCESS!@#KODE 1!@#USER_ID 8!@#ACTIVITY_CODE 3
12/10/2022 09:24:33 AM script INFO: SUCCESS!@#KODE 1!@#USER_ID 8!@#ACTIVITY_CODE 3
12/10/2022 09:24:34 AM script INFO: SUCCESS!@#KODE 1!@#USER_ID 8!@#ACTIVITY_CODE 1
12/10/2022 09:24:34 AM script INFO: SUCCESS!@#KODE 1!@#USER_ID 8!@#ACTIVITY_CODE 2
12/10/2022 09:24:34 AM script INFO: SUCCESS!@#KODE 1!@#USER_ID 8!@#ACTIVITY_CODE 3
12/10/2022 09:24:34 AM script INFO: SUCCESS!@#KODE 1!@#USER_ID 8!@#ACTIVITY_CODE 1
12/10/2022 09:24:34 AM script INFO: SUCCESS!@#KODE 1!@#USER_ID 8!@#ACTIVITY_CODE 1
12/10/2022 09:24:34 AM script INFO: SUCCESS!@#KODE 1!@#USER_ID 8!@#ACTIVITY_CODE 3
12/10/2022 09:24:34 AM script INFO: SUCCESS!@#KODE 1!@#USER_ID 8!@#ACTIVITY_CODE 3
12/10/2022 09:24:34 AM script INFO: SUCCESS!@#KODE 1!@#USER_ID 8!@#ACTIVITY_CODE 2
12/10/2022 09:24:34 AM script INFO: SUCCESS!@#KODE 1!@#USER_ID 8!@#ACTIVITY_CODE 3
12/10/2022 09:24:34 AM script INFO: SUCCESS!@#KODE 1!@#USER_ID 8!@#ACTIVITY_CODE 2
12/10/2022 09:24:34 AM script INFO: SUCCESS!@#KODE 1!@#USER_ID 8!@#ACTIVITY_CODE 1
12/10/2022 09:24:34 AM script INFO: SUCCESS!@#KODE 1!@#USER_ID 8!@#ACTIVITY_CODE 3
12/10/2022 09:24:34 AM script INFO: SUCCESS!@#KODE 1!@#USER_ID 8!@#ACTIVITY_CODE 1
12/10/2022 09:24:34 AM script INFO: SUCCESS!@#KODE 1!@#USER_ID 8!@#ACTIVITY_CODE 1
12/10/2022 09:24:34 AM script INFO: SUCCESS!@#KODE 1!@#USER_ID 8!@#ACTIVITY_CODE 1
12/10/2022 09:24:34 AM script INFO: SUCCESS!@#KODE 1!@#USER_ID 8!@#ACTIVITY_CODE 3
12/10/2022 09:24:34 AM script INFO: SUCCESS!@#KODE 1!@#USER_ID 8!@#ACTIVITY_CODE 2
12/10/2022 09:24:35 AM script INFO: SUCCESS!@#KODE 1!@#USER_ID 8!@#ACTIVITY_CODE 3
12/10/2022 09:24:35 AM script INFO: SUCCESS!@#KODE 1!@#USER_ID 8!@#ACTIVITY_CODE 3
12/10/2022 09:24:35 AM script INFO: SUCCESS!@#KODE 1!@#USER_ID 8!@#ACTIVITY_CODE 3
12/10/2022 09:24:35 AM script INFO: SUCCESS!@#KODE 1!@#USER_ID 8!@#ACTIVITY_CODE 2
12/10/2022 09:24:35 AM script INFO: SUCCESS!@#KODE 1!@#USER_ID 8!@#ACTIVITY_CODE 4
12/10/2022 09:24:35 AM script INFO: SUCCESS!@#KODE 1!@#USER_ID 8!@#ACTIVITY_CODE 3
12/10/2022 09:24:35 AM script INFO: SUCCESS!@#KODE 1!@#USER_ID 8!@#ACTIVITY_CODE 2
12/10/2022 09:24:35 AM script INFO: SUCCESS!@#KODE 1!@#USER_ID 8!@#ACTIVITY_CODE 1
12/10/2022 09:24:35 AM script INFO: SUCCESS!@#KODE 1!@#USER_ID 8!@#ACTIVITY_CODE 1
12/10/2022 09:24:35 AM script INFO: SUCCESS!@#KODE 1!@#USER_ID 8!@#ACTIVITY_CODE 4
12/10/2022 09:24:35 AM script INFO: SUCCESS!@#KODE 1!@#USER_ID 8!@#ACTIVITY_CODE 3
12/10/2022 09:24:35 AM script INFO: SUCCESS!@#KODE 1!@#USER_ID 8!@#ACTIVITY_CODE 2
12/10/2022 09:24:35 AM script INFO: SUCCESS!@#KODE 1!@#USER_ID 8!@#ACTIVITY_CODE 1
12/10/2022 09:24:35 AM script INFO: SUCCESS!@#KODE 1!@#USER_ID 8!@#ACTIVITY_CODE 2
12/10/2022 09:24:36 AM script INFO: SUCCESS!@#KODE 1!@#USER_ID 8!@#ACTIVITY_CODE 3
12/10/2022 09:24:36 AM script INFO: SUCCESS!@#KODE 1!@#USER_ID 8!@#ACTIVITY_CODE 2
12/10/2022 09:24:36 AM script INFO: SUCCESS!@#KODE 1!@#USER_ID 8!@#ACTIVITY_CODE 3
12/10/2022 09:24:36 AM script INFO: SUCCESS!@#KODE 1!@#USER_ID 8!@#ACTIVITY_CODE 1
12/10/2022 09:24:36 AM script INFO: SUCCESS!@#KODE 1!@#USER_ID 8!@#ACTIVITY_CODE 2
12/10/2022 09:24:36 AM script INFO: SUCCESS!@#KODE 1!@#USER_ID 8!@#ACTIVITY_CODE 3
12/10/2022 09:24:36 AM script INFO: SUCCESS!@#KODE 1!@#USER_ID 8!@#ACTIVITY_CODE 1
12/10/2022 09:24:36 AM script INFO: SUCCESS!@#KODE 1!@#USER_ID 8!@#ACTIVITY_CODE 1
12/10/2022 09:24:36 AM script INFO: SUCCESS!@#KODE 1!@#USER_ID 8!@#ACTIVITY_CODE 3
12/10/2022 09:24:36 AM script INFO: SUCCESS!@#KODE 1!@#USER_ID 8!@#ACTIVITY_CODE 1
12/10/2022 09:24:36 AM script INFO: SUCCESS!@#KODE 1!@#USER_ID 8!@#ACTIVITY_CODE 2
12/10/2022 09:24:36 AM script INFO: SUCCESS!@#KODE 1!@#USER_ID 8!@#ACTIVITY_CODE 2
12/10/2022 09:24:36 AM script INFO: SUCCESS!@#KODE 1!@#USER_ID 8!@#ACTIVITY_CODE 2
12/10/2022 09:24:36 AM script INFO: SUCCESS!@#KODE 1!@#USER_ID 8!@#ACTIVITY_CODE 2
12/10/2022 09:24:37 AM script INFO: SUCCESS!@#KODE 1!@#USER_ID 8!@#ACTIVITY_CODE 3
12/10/2022 09:24:37 AM script INFO: SUCCESS!@#KODE 1!@#USER_ID 8!@#ACTIVITY_CODE 1
12/10/2022 09:24:37 AM script INFO: SUCCESS!@#KODE 1!@#USER_ID 8!@#ACTIVITY_CODE 3
12/10/2022 09:24:37 AM script INFO: SUCCESS!@#KODE 1!@#USER_ID 8!@#ACTIVITY_CODE 2
12/10/2022 09:24:37 AM script INFO: SUCCESS!@#KODE 1!@#USER_ID 8!@#ACTIVITY_CODE 2
12/10/2022 09:24:37 AM script INFO: SUCCESS!@#KODE 1!@#USER_ID 8!@#ACTIVITY_CODE 4
12/10/2022 09:24:37 AM script INFO: SUCCESS!@#KODE 1!@#USER_ID 8!@#ACTIVITY_CODE 3
12/10/2022 09:24:37 AM script INFO: SUCCESS!@#KODE 1!@#USER_ID 8!@#ACTIVITY_CODE 1
12/10/2022 09:24:37 AM script INFO: SUCCESS!@#KODE 1!@#USER_ID 8!@#ACTIVITY_CODE 4
12/10/2022 09:24:37 AM script INFO: SUCCESS!@#KODE 1!@#USER_ID 8!@#ACTIVITY_CODE 1
12/10/2022 09:24:37 AM script INFO: SUCCESS!@#KODE 1!@#USER_ID 8!@#ACTIVITY_CODE 4
12/10/2022 09:24:37 AM script INFO: SUCCESS!@#KODE 1!@#USER_ID 8!@#ACTIVITY_CODE 1
12/10/2022 09:24:37 AM script INFO: SUCCESS!@#KODE 1!@#USER_ID 8!@#ACTIVITY_CODE 1
12/10/2022 09:24:37 AM script INFO: SUCCESS!@#KODE 1!@#USER_ID 8!@#ACTIVITY_CODE 3
12/10/2022 09:24:37 AM script INFO: SUCCESS!@#KODE 1!@#USER_ID 8!@#ACTIVITY_CODE 3
12/10/2022 09:24:37 AM script INFO: SUCCESS!@#KODE 1!@#USER_ID 8!@#ACTIVITY_CODE 1
12/10/2022 09:24:37 AM script INFO: SUCCESS!@#KODE 1!@#USER_ID 8!@#ACTIVITY_CODE 1
12/10/2022 09:24:37 AM script INFO: SUCCESS!@#KODE 1!@#USER_ID 8!@#ACTIVITY_CODE 2
12/10/2022 09:24:38 AM script INFO: SUCCESS!@#KODE 1!@#USER_ID 8!@#ACTIVITY_CODE 4
12/10/2022 09:24:38 AM script INFO: SUCCESS!@#KODE 1!@#USER_ID 8!@#ACTIVITY_CODE 3
12/10/2022 09:24:38 AM script INFO: SUCCESS!@#KODE 1!@#USER_ID 8!@#ACTIVITY_CODE 3
12/10/2022 09:24:38 AM script INFO: SUCCESS!@#KODE 1!@#USER_ID 8!@#ACTIVITY_CODE 1
12/10/2022 09:24:38 AM script INFO: SUCCESS!@#KODE 1!@#USER_ID 8!@#ACTIVITY_CODE 3
12/10/2022 09:24:38 AM script INFO: SUCCESS!@#KODE 1!@#USER_ID 8!@#ACTIVITY_CODE 2
12/10/2022 09:24:38 AM script INFO: SUCCESS!@#KODE 1!@#USER_ID 8!@#ACTIVITY_CODE 2
12/10/2022 09:24:38 AM script INFO: SUCCESS!@#KODE 1!@#USER_ID 8!@#ACTIVITY_CODE 2
12/10/2022 09:24:38 AM script INFO: SUCCESS!@#KODE 1!@#USER_ID 8!@#ACTIVITY_CODE 3
12/10/2022 09:24:38 AM script INFO: SUCCESS!@#KODE 1!@#USER_ID 8!@#ACTIVITY_CODE 1
12/10/2022 09:24:38 AM script INFO: SUCCESS!@#KODE 1!@#USER_ID 8!@#ACTIVITY_CODE 1
12/10/2022 09:24:38 AM script INFO: SUCCESS!@#KODE 1!@#USER_ID 8!@#ACTIVITY_CODE 4
12/10/2022 09:24:38 AM script INFO: SUCCESS!@#KODE 1!@#USER_ID 8!@#ACTIVITY_CODE 2
12/10/2022 09:24:38 AM script INFO: SUCCESS!@#KODE 1!@#USER_ID 8!@#ACTIVITY_CODE 2
12/10/2022 09:24:38 AM script INFO: SUCCESS!@#KODE 1!@#USER_ID 8!@#ACTIVITY_CODE 1
12/10/2022 09:24:38 AM script INFO: SUCCESS!@#KODE 1!@#USER_ID 8!@#ACTIVITY_CODE 1
12/10/2022 09:24:39 AM script INFO: SUCCESS!@#KODE 1!@#USER_ID 8!@#ACTIVITY_CODE 1
12/10/2022 09:24:39 AM script INFO: SUCCESS!@#KODE 1!@#USER_ID 8!@#ACTIVITY_CODE 1
12/10/2022 09:24:39 AM script INFO: SUCCESS!@#KODE 1!@#USER_ID 8!@#ACTIVITY_CODE 3
12/10/2022 09:24:39 AM script INFO: SUCCESS!@#KODE 1!@#USER_ID 8!@#ACTIVITY_CODE 3
12/10/2022 09:24:39 AM script INFO: SUCCESS!@#KODE 1!@#USER_ID 8!@#ACTIVITY_CODE 1
12/10/2022 09:24:39 AM script INFO: SUCCESS!@#KODE 1!@#USER_ID 8!@#ACTIVITY_CODE 3
12/10/2022 09:24:39 AM script INFO: SUCCESS!@#KODE 1!@#USER_ID 8!@#ACTIVITY_CODE 3
12/10/2022 09:24:39 AM script INFO: SUCCESS!@#KODE 1!@#USER_ID 8!@#ACTIVITY_CODE 3
12/10/2022 09:24:39 AM script INFO: SUCCESS!@#KODE 1!@#USER_ID 8!@#ACTIVITY_CODE 2
12/10/2022 09:24:39 AM script INFO: SUCCESS!@#KODE 1!@#USER_ID 8!@#ACTIVITY_CODE 2
12/10/2022 09:24:39 AM script INFO: SUCCESS!@#KODE 1!@#USER_ID 8!@#ACTIVITY_CODE 3
12/10/2022 09:24:39 AM script INFO: SUCCESS!@#KODE 1!@#USER_ID 8!@#ACTIVITY_CODE 2
12/10/2022 09:24:39 AM script INFO: SUCCESS!@#KODE 1!@#USER_ID 8!@#ACTIVITY_CODE 2
12/10/2022 09:24:39 AM script INFO: SUCCESS!@#KODE 1!@#USER_ID 8!@#ACTIVITY_CODE 1
12/10/2022 09:24:39 AM script INFO: SUCCESS!@#KODE 1!@#USER_ID 8!@#ACTIVITY_CODE 4
12/10/2022 09:24:40 AM script INFO: SUCCESS!@#KODE 1!@#USER_ID 8!@#ACTIVITY_CODE 1
12/10/2022 09:24:40 AM script INFO: SUCCESS!@#KODE 1!@#USER_ID 8!@#ACTIVITY_CODE 2
12/10/2022 09:24:40 AM script INFO: SUCCESS!@#KODE 1!@#USER_ID 8!@#ACTIVITY_CODE 3
12/10/2022 09:24:40 AM script INFO: SUCCESS!@#KODE 1!@#USER_ID 8!@#ACTIVITY_CODE 1
12/10/2022 09:24:40 AM script INFO: SUCCESS!@#KODE 1!@#USER_ID 8!@#ACTIVITY_CODE 1
12/10/2022 09:24:40 AM script INFO: SUCCESS!@#KODE 1!@#USER_ID 8!@#ACTIVITY_CODE 3
12/10/2022 09:24:40 AM script INFO: SUCCESS!@#KODE 1!@#USER_ID 8!@#ACTIVITY_CODE 3
12/10/2022 09:24:40 AM script INFO: SUCCESS!@#KODE 1!@#USER_ID 8!@#ACTIVITY_CODE 1
12/10/2022 09:24:40 AM script INFO: SUCCESS!@#KODE 1!@#USER_ID 8!@#ACTIVITY_CODE 2
12/10/2022 09:24:40 AM script INFO: SUCCESS!@#KODE 1!@#USER_ID 8!@#ACTIVITY_CODE 1
12/10/2022 09:24:40 AM script INFO: SUCCESS!@#KODE 1!@#USER_ID 8!@#ACTIVITY_CODE 4
12/10/2022 09:24:40 AM script INFO: SUCCESS!@#KODE 1!@#USER_ID 8!@#ACTIVITY_CODE 3
12/10/2022 09:24:40 AM script INFO: SUCCESS!@#KODE 1!@#USER_ID 8!@#ACTIVITY_CODE 1
12/10/2022 09:24:40 AM script INFO: SUCCESS!@#KODE 1!@#USER_ID 8!@#ACTIVITY_CODE 1
12/10/2022 09:24:40 AM script INFO: SUCCESS!@#KODE 1!@#USER_ID 8!@#ACTIVITY_CODE 4
12/10/2022 09:24:40 AM script INFO: SUCCESS!@#KODE 1!@#USER_ID 8!@#ACTIVITY_CODE 1
12/10/2022 09:24:40 AM script INFO: SUCCESS!@#KODE 1!@#USER_ID 8!@#ACTIVITY_CODE 4
12/10/2022 09:24:40 AM script INFO: SUCCESS!@#KODE 1!@#USER_ID 8!@#ACTIVITY_CODE 2
12/10/2022 09:24:41 AM script INFO: SUCCESS!@#KODE 1!@#USER_ID 8!@#ACTIVITY_CODE 4
12/10/2022 09:24:41 AM script INFO: SUCCESS!@#KODE 1!@#USER_ID 8!@#ACTIVITY_CODE 1
12/10/2022 09:24:41 AM script INFO: SUCCESS!@#KODE 1!@#USER_ID 8!@#ACTIVITY_CODE 2
12/10/2022 09:24:41 AM script INFO: SUCCESS!@#KODE 1!@#USER_ID 8!@#ACTIVITY_CODE 2
12/10/2022 09:24:41 AM script INFO: SUCCESS!@#KODE 1!@#USER_ID 8!@#ACTIVITY_CODE 3
12/10/2022 09:24:41 AM script INFO: SUCCESS!@#KODE 1!@#USER_ID 8!@#ACTIVITY_CODE 1
12/10/2022 09:24:41 AM script INFO: SUCCESS!@#KODE 1!@#USER_ID 8!@#ACTIVITY_CODE 2
12/10/2022 09:24:41 AM script INFO: SUCCESS!@#KODE 1!@#USER_ID 8!@#ACTIVITY_CODE 1
12/10/2022 09:24:41 AM script INFO: SUCCESS!@#KODE 1!@#USER_ID 8!@#ACTIVITY_CODE 3
12/10/2022 09:24:41 AM script INFO: SUCCESS!@#KODE 1!@#USER_ID 8!@#ACTIVITY_CODE 2
12/10/2022 09:24:41 AM script INFO: SUCCESS!@#KODE 1!@#USER_ID 8!@#ACTIVITY_CODE 1
12/10/2022 09:24:41 AM script INFO: SUCCESS!@#KODE 1!@#USER_ID 8!@#ACTIVITY_CODE 3
12/10/2022 09:24:41 AM script INFO: SUCCESS!@#KODE 1!@#USER_ID 8!@#ACTIVITY_CODE 4
12/10/2022 09:24:41 AM script INFO: SUCCESS!@#KODE 1!@#USER_ID 8!@#ACTIVITY_CODE 2
12/10/2022 09:24:41 AM script INFO: SUCCESS!@#KODE 1!@#USER_ID 8!@#ACTIVITY_CODE 1
12/10/2022 09:24:42 AM script INFO: SUCCESS!@#KODE 1!@#USER_ID 8!@#ACTIVITY_CODE 2
12/10/2022 09:24:42 AM script INFO: SUCCESS!@#KODE 1!@#USER_ID 8!@#ACTIVITY_CODE 2
12/10/2022 09:24:42 AM script INFO: SUCCESS!@#KODE 1!@#USER_ID 8!@#ACTIVITY_CODE 3
12/10/2022 09:24:42 AM script INFO: SUCCESS!@#KODE 1!@#USER_ID 8!@#ACTIVITY_CODE 2
12/10/2022 09:24:42 AM script INFO: SUCCESS!@#KODE 1!@#USER_ID 8!@#ACTIVITY_CODE 4
12/10/2022 09:24:42 AM script INFO: SUCCESS!@#KODE 1!@#USER_ID 8!@#ACTIVITY_CODE 3
12/10/2022 09:24:42 AM script INFO: SUCCESS!@#KODE 1!@#USER_ID 8!@#ACTIVITY_CODE 1
12/10/2022 09:24:42 AM script INFO: SUCCESS!@#KODE 1!@#USER_ID 8!@#ACTIVITY_CODE 3
12/10/2022 09:24:42 AM script INFO: SUCCESS!@#KODE 1!@#USER_ID 8!@#ACTIVITY_CODE 2
12/10/2022 09:24:42 AM script INFO: SUCCESS!@#KODE 1!@#USER_ID 8!@#ACTIVITY_CODE 3
12/10/2022 09:24:42 AM script INFO: SUCCESS!@#KODE 1!@#USER_ID 8!@#ACTIVITY_CODE 4
12/10/2022 09:24:42 AM script INFO: SUCCESS!@#KODE 1!@#USER_ID 8!@#ACTIVITY_CODE 1
12/10/2022 09:24:42 AM script INFO: SUCCESS!@#KODE 1!@#USER_ID 8!@#ACTIVITY_CODE 2
12/10/2022 09:24:42 AM script INFO: SUCCESS!@#KODE 1!@#USER_ID 8!@#ACTIVITY_CODE 3
12/10/2022 09:24:42 AM script INFO: SUCCESS!@#KODE 1!@#USER_ID 8!@#ACTIVITY_CODE 3
12/10/2022 09:24:43 AM script INFO: SUCCESS!@#KODE 1!@#USER_ID 8!@#ACTIVITY_CODE 3
12/10/2022 09:24:43 AM script INFO: SUCCESS!@#KODE 1!@#USER_ID 8!@#ACTIVITY_CODE 1
12/10/2022 09:24:43 AM script INFO: SUCCESS!@#KODE 1!@#USER_ID 8!@#ACTIVITY_CODE 4
12/10/2022 09:24:43 AM script INFO: SUCCESS!@#KODE 1!@#USER_ID 8!@#ACTIVITY_CODE 3
12/10/2022 09:24:43 AM script INFO: SUCCESS!@#KODE 1!@#USER_ID 8!@#ACTIVITY_CODE 2
12/10/2022 09:24:43 AM script INFO: SUCCESS!@#KODE 1!@#USER_ID 8!@#ACTIVITY_CODE 3
12/10/2022 09:24:43 AM script INFO: SUCCESS!@#KODE 1!@#USER_ID 8!@#ACTIVITY_CODE 4
12/10/2022 09:24:43 AM script INFO: SUCCESS!@#KODE 1!@#USER_ID 8!@#ACTIVITY_CODE 2
12/10/2022 09:24:43 AM script INFO: SUCCESS!@#KODE 1!@#USER_ID 8!@#ACTIVITY_CODE 2
12/10/2022 09:24:43 AM script INFO: SUCCESS!@#KODE 1!@#USER_ID 8!@#ACTIVITY_CODE 1
12/10/2022 09:24:43 AM script INFO: SUCCESS!@#KODE 1!@#USER_ID 8!@#ACTIVITY_CODE 1
12/10/2022 09:24:43 AM script INFO: SUCCESS!@#KODE 1!@#USER_ID 8!@#ACTIVITY_CODE 2
12/10/2022 09:24:43 AM script INFO: SUCCESS!@#KODE 1!@#USER_ID 8!@#ACTIVITY_CODE 1
12/10/2022 09:24:43 AM script INFO: SUCCESS!@#KODE 1!@#USER_ID 8!@#ACTIVITY_CODE 3
12/10/2022 09:24:43 AM script INFO: SUCCESS!@#KODE 1!@#USER_ID 8!@#ACTIVITY_CODE 4
12/10/2022 09:24:43 AM script INFO: SUCCESS!@#KODE 1!@#USER_ID 8!@#ACTIVITY_CODE 3
12/10/2022 09:24:43 AM script INFO: SUCCESS!@#KODE 1!@#USER_ID 8!@#ACTIVITY_CODE 1
12/10/2022 09:24:44 AM script INFO: SUCCESS!@#KODE 1!@#USER_ID 8!@#ACTIVITY_CODE 3
12/10/2022 09:24:44 AM script INFO: SUCCESS!@#KODE 1!@#USER_ID 8!@#ACTIVITY_CODE 1
12/10/2022 09:24:44 AM script INFO: SUCCESS!@#KODE 1!@#USER_ID 8!@#ACTIVITY_CODE 3
12/10/2022 09:24:44 AM script INFO: SUCCESS!@#KODE 1!@#USER_ID 8!@#ACTIVITY_CODE 2
12/10/2022 09:24:44 AM script INFO: SUCCESS!@#KODE 1!@#USER_ID 8!@#ACTIVITY_CODE 2
12/10/2022 09:24:44 AM script INFO: SUCCESS!@#KODE 1!@#USER_ID 8!@#ACTIVITY_CODE 2
12/10/2022 09:24:44 AM script INFO: SUCCESS!@#KODE 1!@#USER_ID 8!@#ACTIVITY_CODE 4
12/10/2022 09:24:44 AM script INFO: SUCCESS!@#KODE 1!@#USER_ID 8!@#ACTIVITY_CODE 1
12/10/2022 09:24:44 AM script INFO: SUCCESS!@#KODE 1!@#USER_ID 8!@#ACTIVITY_CODE 2
12/10/2022 09:24:44 AM script INFO: SUCCESS!@#KODE 1!@#USER_ID 8!@#ACTIVITY_CODE 2
12/10/2022 09:24:44 AM script INFO: SUCCESS!@#KODE 1!@#USER_ID 8!@#ACTIVITY_CODE 1
12/10/2022 09:24:44 AM script INFO: SUCCESS!@#KODE 1!@#USER_ID 8!@#ACTIVITY_CODE 2
12/10/2022 09:24:44 AM script INFO: SUCCESS!@#KODE 1!@#USER_ID 8!@#ACTIVITY_CODE 2
12/10/2022 09:24:45 AM script INFO: SUCCESS!@#KODE 1!@#USER_ID 8!@#ACTIVITY_CODE 2
12/10/2022 09:24:45 AM script INFO: SUCCESS!@#KODE 1!@#USER_ID 8!@#ACTIVITY_CODE 3
12/10/2022 09:24:45 AM script INFO: SUCCESS!@#KODE 1!@#USER_ID 8!@#ACTIVITY_CODE 1
12/10/2022 09:24:45 AM script INFO: SUCCESS!@#KODE 1!@#USER_ID 8!@#ACTIVITY_CODE 3
12/10/2022 09:24:45 AM script INFO: SUCCESS!@#KODE 1!@#USER_ID 8!@#ACTIVITY_CODE 3
12/10/2022 09:24:45 AM script INFO: SUCCESS!@#KODE 1!@#USER_ID 8!@#ACTIVITY_CODE 2
12/10/2022 09:24:45 AM script INFO: SUCCESS!@#KODE 1!@#USER_ID 8!@#ACTIVITY_CODE 3
12/10/2022 09:24:45 AM script INFO: SUCCESS!@#KODE 1!@#USER_ID 8!@#ACTIVITY_CODE 1
12/10/2022 09:24:45 AM script INFO: SUCCESS!@#KODE 1!@#USER_ID 8!@#ACTIVITY_CODE 2
12/10/2022 09:24:45 AM script INFO: SUCCESS!@#KODE 1!@#USER_ID 8!@#ACTIVITY_CODE 2
12/10/2022 09:24:45 AM script INFO: SUCCESS!@#KODE 1!@#USER_ID 8!@#ACTIVITY_CODE 3
12/10/2022 09:24:45 AM script INFO: SUCCESS!@#KODE 1!@#USER_ID 8!@#ACTIVITY_CODE 3
12/10/2022 09:24:45 AM script INFO: SUCCESS!@#KODE 1!@#USER_ID 8!@#ACTIVITY_CODE 3
12/10/2022 09:24:45 AM script INFO: SUCCESS!@#KODE 1!@#USER_ID 8!@#ACTIVITY_CODE 2
12/10/2022 09:24:45 AM script INFO: SUCCESS!@#KODE 1!@#USER_ID 8!@#ACTIVITY_CODE 3
12/10/2022 09:24:45 AM script INFO: SUCCESS!@#KODE 1!@#USER_ID 8!@#ACTIVITY_CODE 3
12/10/2022 09:24:46 AM script INFO: SUCCESS!@#KODE 1!@#USER_ID 8!@#ACTIVITY_CODE 1
12/10/2022 09:24:46 AM script INFO: SUCCESS!@#KODE 1!@#USER_ID 8!@#ACTIVITY_CODE 3
12/10/2022 09:24:46 AM script INFO: SUCCESS!@#KODE 1!@#USER_ID 8!@#ACTIVITY_CODE 1
12/10/2022 09:24:46 AM script INFO: SUCCESS!@#KODE 1!@#USER_ID 8!@#ACTIVITY_CODE 4
12/10/2022 09:24:46 AM script INFO: SUCCESS!@#KODE 1!@#USER_ID 8!@#ACTIVITY_CODE 1
12/10/2022 09:24:46 AM script INFO: SUCCESS!@#KODE 1!@#USER_ID 8!@#ACTIVITY_CODE 3
12/10/2022 09:24:46 AM script INFO: SUCCESS!@#KODE 1!@#USER_ID 8!@#ACTIVITY_CODE 3
12/10/2022 09:24:46 AM script INFO: SUCCESS!@#KODE 1!@#USER_ID 8!@#ACTIVITY_CODE 2
12/10/2022 09:24:46 AM script INFO: SUCCESS!@#KODE 1!@#USER_ID 8!@#ACTIVITY_CODE 4
12/10/2022 09:24:46 AM script INFO: SUCCESS!@#KODE 1!@#USER_ID 8!@#ACTIVITY_CODE 3
12/10/2022 09:24:46 AM script INFO: SUCCESS!@#KODE 1!@#USER_ID 8!@#ACTIVITY_CODE 3
12/10/2022 09:24:46 AM script INFO: SUCCESS!@#KODE 1!@#USER_ID 8!@#ACTIVITY_CODE 3
12/10/2022 09:24:46 AM script INFO: SUCCESS!@#KODE 1!@#USER_ID 8!@#ACTIVITY_CODE 3
12/10/2022 09:24:46 AM script INFO: SUCCESS!@#KODE 1!@#USER_ID 8!@#ACTIVITY_CODE 2
12/10/2022 09:24:46 AM script INFO: SUCCESS!@#KODE 1!@#USER_ID 8!@#ACTIVITY_CODE 3
12/10/2022 09:24:46 AM script INFO: SUCCESS!@#KODE 1!@#USER_ID 8!@#ACTIVITY_CODE 2
12/10/2022 09:24:47 AM script INFO: SUCCESS!@#KODE 1!@#USER_ID 8!@#ACTIVITY_CODE 2
12/10/2022 09:24:47 AM script INFO: SUCCESS!@#KODE 1!@#USER_ID 8!@#ACTIVITY_CODE 3
12/10/2022 09:24:47 AM script INFO: SUCCESS!@#KODE 1!@#USER_ID 8!@#ACTIVITY_CODE 3
12/10/2022 09:24:47 AM script INFO: SUCCESS!@#KODE 1!@#USER_ID 8!@#ACTIVITY_CODE 4
12/10/2022 09:24:47 AM script INFO: SUCCESS!@#KODE 1!@#USER_ID 8!@#ACTIVITY_CODE 2
12/10/2022 09:24:47 AM script INFO: SUCCESS!@#KODE 1!@#USER_ID 8!@#ACTIVITY_CODE 2
12/10/2022 09:24:47 AM script INFO: SUCCESS!@#KODE 1!@#USER_ID 8!@#ACTIVITY_CODE 2
12/10/2022 09:24:47 AM script INFO: SUCCESS!@#KODE 1!@#USER_ID 8!@#ACTIVITY_CODE 2
12/10/2022 09:24:47 AM script INFO: SUCCESS!@#KODE 1!@#USER_ID 8!@#ACTIVITY_CODE 3
12/10/2022 09:24:47 AM script INFO: SUCCESS!@#KODE 1!@#USER_ID 8!@#ACTIVITY_CODE 2
12/10/2022 09:24:47 AM script INFO: SUCCESS!@#KODE 1!@#USER_ID 8!@#ACTIVITY_CODE 3
12/10/2022 09:24:47 AM script INFO: SUCCESS!@#KODE 1!@#USER_ID 8!@#ACTIVITY_CODE 2
12/10/2022 09:24:47 AM script INFO: SUCCESS!@#KODE 1!@#USER_ID 8!@#ACTIVITY_CODE 1
12/10/2022 09:24:47 AM script INFO: SUCCESS!@#KODE 1!@#USER_ID 8!@#ACTIVITY_CODE 3
12/10/2022 09:24:48 AM script INFO: SUCCESS!@#KODE 1!@#USER_ID 8!@#ACTIVITY_CODE 4
12/10/2022 09:24:48 AM script INFO: SUCCESS!@#KODE 1!@#USER_ID 8!@#ACTIVITY_CODE 3
12/10/2022 09:24:48 AM script INFO: SUCCESS!@#KODE 1!@#USER_ID 8!@#ACTIVITY_CODE 2
12/10/2022 09:24:48 AM script INFO: SUCCESS!@#KODE 1!@#USER_ID 8!@#ACTIVITY_CODE 2
12/10/2022 09:24:48 AM script INFO: SUCCESS!@#KODE 1!@#USER_ID 8!@#ACTIVITY_CODE 3
12/10/2022 09:24:48 AM script INFO: SUCCESS!@#KODE 1!@#USER_ID 8!@#ACTIVITY_CODE 3
12/10/2022 09:24:48 AM script INFO: SUCCESS!@#KODE 1!@#USER_ID 8!@#ACTIVITY_CODE 2
12/10/2022 09:24:48 AM script INFO: SUCCESS!@#KODE 1!@#USER_ID 8!@#ACTIVITY_CODE 1
12/10/2022 09:24:48 AM script INFO: SUCCESS!@#KODE 1!@#USER_ID 8!@#ACTIVITY_CODE 2
12/10/2022 09:24:48 AM script INFO: SUCCESS!@#KODE 1!@#USER_ID 8!@#ACTIVITY_CODE 2
12/10/2022 09:24:48 AM script INFO: SUCCESS!@#KODE 1!@#USER_ID 8!@#ACTIVITY_CODE 2
12/10/2022 09:24:48 AM script INFO: SUCCESS!@#KODE 1!@#USER_ID 8!@#ACTIVITY_CODE 3
12/10/2022 09:24:48 AM script INFO: SUCCESS!@#KODE 1!@#USER_ID 8!@#ACTIVITY_CODE 2
12/10/2022 09:24:49 AM script INFO: SUCCESS!@#KODE 1!@#USER_ID 8!@#ACTIVITY_CODE 4
12/10/2022 09:24:49 AM script INFO: SUCCESS!@#KODE 1!@#USER_ID 8!@#ACTIVITY_CODE 1
12/10/2022 09:24:49 AM script INFO: SUCCESS!@#KODE 1!@#USER_ID 8!@#ACTIVITY_CODE 2
12/10/2022 09:24:49 AM script INFO: SUCCESS!@#KODE 1!@#USER_ID 8!@#ACTIVITY_CODE 3
12/10/2022 09:24:49 AM script INFO: SUCCESS!@#KODE 1!@#USER_ID 8!@#ACTIVITY_CODE 3
12/10/2022 09:24:49 AM script INFO: SUCCESS!@#KODE 1!@#USER_ID 8!@#ACTIVITY_CODE 2
12/10/2022 09:24:49 AM script INFO: SUCCESS!@#KODE 1!@#USER_ID 8!@#ACTIVITY_CODE 3
12/10/2022 09:24:49 AM script INFO: SUCCESS!@#KODE 1!@#USER_ID 8!@#ACTIVITY_CODE 2
12/10/2022 09:24:49 AM script INFO: SUCCESS!@#KODE 1!@#USER_ID 8!@#ACTIVITY_CODE 2
12/10/2022 09:24:49 AM script INFO: SUCCESS!@#KODE 1!@#USER_ID 8!@#ACTIVITY_CODE 1
12/10/2022 09:24:49 AM script INFO: SUCCESS!@#KODE 1!@#USER_ID 8!@#ACTIVITY_CODE 3
12/10/2022 09:24:49 AM script INFO: SUCCESS!@#KODE 1!@#USER_ID 8!@#ACTIVITY_CODE 3
12/10/2022 09:24:49 AM script INFO: SUCCESS!@#KODE 1!@#USER_ID 8!@#ACTIVITY_CODE 2
12/10/2022 09:24:49 AM script INFO: SUCCESS!@#KODE 1!@#USER_ID 8!@#ACTIVITY_CODE 2
12/10/2022 09:24:50 AM script INFO: SUCCESS!@#KODE 1!@#USER_ID 8!@#ACTIVITY_CODE 2
12/10/2022 09:24:50 AM script INFO: SUCCESS!@#KODE 1!@#USER_ID 8!@#ACTIVITY_CODE 2
12/10/2022 09:24:50 AM script INFO: SUCCESS!@#KODE 1!@#USER_ID 8!@#ACTIVITY_CODE 4
12/10/2022 09:24:50 AM script INFO: SUCCESS!@#KODE 1!@#USER_ID 8!@#ACTIVITY_CODE 2
12/10/2022 09:24:50 AM script INFO: SUCCESS!@#KODE 1!@#USER_ID 8!@#ACTIVITY_CODE 3
12/10/2022 09:24:50 AM script INFO: SUCCESS!@#KODE 1!@#USER_ID 8!@#ACTIVITY_CODE 3
12/10/2022 09:24:50 AM script INFO: SUCCESS!@#KODE 1!@#USER_ID 8!@#ACTIVITY_CODE 2
12/10/2022 09:24:50 AM script INFO: SUCCESS!@#KODE 1!@#USER_ID 8!@#ACTIVITY_CODE 2
12/10/2022 09:24:50 AM script INFO: SUCCESS!@#KODE 1!@#USER_ID 8!@#ACTIVITY_CODE 4
12/10/2022 09:24:50 AM script INFO: SUCCESS!@#KODE 1!@#USER_ID 8!@#ACTIVITY_CODE 2
12/10/2022 09:24:50 AM script INFO: SUCCESS!@#KODE 1!@#USER_ID 8!@#ACTIVITY_CODE 2
12/10/2022 09:24:51 AM script INFO: SUCCESS!@#KODE 1!@#USER_ID 8!@#ACTIVITY_CODE 1
12/10/2022 09:24:51 AM script INFO: SUCCESS!@#KODE 1!@#USER_ID 8!@#ACTIVITY_CODE 3
12/10/2022 09:24:51 AM script INFO: SUCCESS!@#KODE 1!@#USER_ID 8!@#ACTIVITY_CODE 4
12/10/2022 09:24:51 AM script INFO: SUCCESS!@#KODE 1!@#USER_ID 8!@#ACTIVITY_CODE 2
12/10/2022 09:24:51 AM script INFO: SUCCESS!@#KODE 1!@#USER_ID 8!@#ACTIVITY_CODE 3
12/10/2022 09:24:51 AM script INFO: SUCCESS!@#KODE 1!@#USER_ID 8!@#ACTIVITY_CODE 3
12/10/2022 09:24:51 AM script INFO: SUCCESS!@#KODE 1!@#USER_ID 8!@#ACTIVITY_CODE 2
12/10/2022 09:24:51 AM script INFO: SUCCESS!@#KODE 1!@#USER_ID 8!@#ACTIVITY_CODE 2
12/10/2022 09:24:51 AM script INFO: SUCCESS!@#KODE 1!@#USER_ID 8!@#ACTIVITY_CODE 2
12/10/2022 09:24:51 AM script INFO: SUCCESS!@#KODE 1!@#USER_ID 8!@#ACTIVITY_CODE 2
12/10/2022 09:24:51 AM script INFO: SUCCESS!@#KODE 1!@#USER_ID 8!@#ACTIVITY_CODE 2
12/10/2022 09:24:51 AM script INFO: SUCCESS!@#KODE 1!@#USER_ID 8!@#ACTIVITY_CODE 2
12/10/2022 09:24:52 AM script INFO: SUCCESS!@#KODE 1!@#USER_ID 8!@#ACTIVITY_CODE 2
12/10/2022 09:24:52 AM script INFO: SUCCESS!@#KODE 1!@#USER_ID 8!@#ACTIVITY_CODE 3
12/10/2022 09:24:52 AM script INFO: SUCCESS!@#KODE 1!@#USER_ID 8!@#ACTIVITY_CODE 1
12/10/2022 09:24:52 AM script INFO: SUCCESS!@#KODE 1!@#USER_ID 8!@#ACTIVITY_CODE 1
12/10/2022 09:24:52 AM script INFO: SUCCESS!@#KODE 1!@#USER_ID 8!@#ACTIVITY_CODE 2
12/10/2022 09:24:52 AM script INFO: SUCCESS!@#KODE 1!@#USER_ID 8!@#ACTIVITY_CODE 1
12/10/2022 09:24:52 AM script INFO: SUCCESS!@#KODE 1!@#USER_ID 8!@#ACTIVITY_CODE 1
12/10/2022 09:24:52 AM script INFO: SUCCESS!@#KODE 1!@#USER_ID 8!@#ACTIVITY_CODE 4
12/10/2022 09:24:52 AM script INFO: SUCCESS!@#KODE 1!@#USER_ID 8!@#ACTIVITY_CODE 1
12/10/2022 09:24:52 AM script INFO: SUCCESS!@#KODE 1!@#USER_ID 8!@#ACTIVITY_CODE 4
12/10/2022 09:24:52 AM script INFO: SUCCESS!@#KODE 1!@#USER_ID 8!@#ACTIVITY_CODE 1
12/10/2022 09:24:52 AM script INFO: SUCCESS!@#KODE 1!@#USER_ID 8!@#ACTIVITY_CODE 2
12/10/2022 09:24:52 AM script INFO: SUCCESS!@#KODE 1!@#USER_ID 8!@#ACTIVITY_CODE 1
12/10/2022 09:24:52 AM script INFO: SUCCESS!@#KODE 1!@#USER_ID 8!@#ACTIVITY_CODE 3
12/10/2022 09:24:52 AM script INFO: SUCCESS!@#KODE 1!@#USER_ID 8!@#ACTIVITY_CODE 1
12/10/2022 09:24:52 AM script INFO: SUCCESS!@#KODE 1!@#USER_ID 8!@#ACTIVITY_CODE 2
12/10/2022 09:24:52 AM script INFO: SUCCESS!@#KODE 1!@#USER_ID 8!@#ACTIVITY_CODE 3
12/10/2022 09:24:53 AM script INFO: SUCCESS!@#KODE 1!@#USER_ID 8!@#ACTIVITY_CODE 2
12/10/2022 09:24:53 AM script INFO: SUCCESS!@#KODE 1!@#USER_ID 8!@#ACTIVITY_CODE 2
12/10/2022 09:24:53 AM script INFO: SUCCESS!@#KODE 1!@#USER_ID 8!@#ACTIVITY_CODE 1
12/10/2022 09:24:53 AM script INFO: SUCCESS!@#KODE 1!@#USER_ID 8!@#ACTIVITY_CODE 4
12/10/2022 09:24:53 AM script INFO: SUCCESS!@#KODE 1!@#USER_ID 8!@#ACTIVITY_CODE 1
12/10/2022 09:24:53 AM script INFO: SUCCESS!@#KODE 1!@#USER_ID 8!@#ACTIVITY_CODE 2
12/10/2022 09:24:53 AM script INFO: SUCCESS!@#KODE 1!@#USER_ID 8!@#ACTIVITY_CODE 2
12/10/2022 09:24:53 AM script INFO: SUCCESS!@#KODE 1!@#USER_ID 8!@#ACTIVITY_CODE 1
12/10/2022 09:24:53 AM script INFO: SUCCESS!@#KODE 1!@#USER_ID 8!@#ACTIVITY_CODE 3
12/10/2022 09:24:53 AM script INFO: SUCCESS!@#KODE 1!@#USER_ID 8!@#ACTIVITY_CODE 1
12/10/2022 09:24:53 AM script INFO: SUCCESS!@#KODE 1!@#USER_ID 8!@#ACTIVITY_CODE 4
12/10/2022 09:24:53 AM script INFO: SUCCESS!@#KODE 1!@#USER_ID 8!@#ACTIVITY_CODE 3
12/10/2022 09:24:53 AM script INFO: SUCCESS!@#KODE 1!@#USER_ID 8!@#ACTIVITY_CODE 2
12/10/2022 09:24:53 AM script INFO: SUCCESS!@#KODE 1!@#USER_ID 8!@#ACTIVITY_CODE 1
12/10/2022 09:24:53 AM script INFO: SUCCESS!@#KODE 1!@#USER_ID 8!@#ACTIVITY_CODE 4
12/10/2022 09:24:54 AM script INFO: SUCCESS!@#KODE 1!@#USER_ID 8!@#ACTIVITY_CODE 3
12/10/2022 09:24:54 AM script INFO: SUCCESS!@#KODE 1!@#USER_ID 8!@#ACTIVITY_CODE 2
12/10/2022 09:24:54 AM script INFO: SUCCESS!@#KODE 1!@#USER_ID 8!@#ACTIVITY_CODE 3
12/10/2022 09:24:54 AM script INFO: SUCCESS!@#KODE 1!@#USER_ID 8!@#ACTIVITY_CODE 4
12/10/2022 09:24:54 AM script INFO: SUCCESS!@#KODE 1!@#USER_ID 8!@#ACTIVITY_CODE 3
12/10/2022 09:24:54 AM script INFO: SUCCESS!@#KODE 1!@#USER_ID 8!@#ACTIVITY_CODE 3
12/10/2022 09:24:54 AM script INFO: SUCCESS!@#KODE 1!@#USER_ID 8!@#ACTIVITY_CODE 3
12/10/2022 09:24:54 AM script INFO: SUCCESS!@#KODE 1!@#USER_ID 8!@#ACTIVITY_CODE 3
12/10/2022 09:24:54 AM script INFO: SUCCESS!@#KODE 1!@#USER_ID 8!@#ACTIVITY_CODE 2
12/10/2022 09:24:54 AM script INFO: SUCCESS!@#KODE 1!@#USER_ID 8!@#ACTIVITY_CODE 1
12/10/2022 09:24:54 AM script INFO: SUCCESS!@#KODE 1!@#USER_ID 8!@#ACTIVITY_CODE 3
12/10/2022 09:24:54 AM script INFO: SUCCESS!@#KODE 1!@#USER_ID 8!@#ACTIVITY_CODE 1
12/10/2022 09:24:54 AM script INFO: SUCCESS!@#KODE 1!@#USER_ID 8!@#ACTIVITY_CODE 1
12/10/2022 09:24:54 AM script INFO: SUCCESS!@#KODE 1!@#USER_ID 8!@#ACTIVITY_CODE 2
12/10/2022 09:24:54 AM script INFO: SUCCESS!@#KODE 1!@#USER_ID 8!@#ACTIVITY_CODE 1
12/10/2022 09:24:54 AM script INFO: SUCCESS!@#KODE 1!@#USER_ID 8!@#ACTIVITY_CODE 2
12/10/2022 09:24:54 AM script INFO: SUCCESS!@#KODE 1!@#USER_ID 8!@#ACTIVITY_CODE 3
12/10/2022 09:24:55 AM script INFO: SUCCESS!@#KODE 1!@#USER_ID 8!@#ACTIVITY_CODE 2
12/10/2022 09:24:55 AM script INFO: SUCCESS!@#KODE 1!@#USER_ID 8!@#ACTIVITY_CODE 3
12/10/2022 09:24:55 AM script INFO: SUCCESS!@#KODE 1!@#USER_ID 8!@#ACTIVITY_CODE 1
12/10/2022 09:24:55 AM script INFO: SUCCESS!@#KODE 1!@#USER_ID 8!@#ACTIVITY_CODE 3
12/10/2022 09:24:55 AM script INFO: SUCCESS!@#KODE 1!@#USER_ID 8!@#ACTIVITY_CODE 2
12/10/2022 09:24:55 AM script INFO: SUCCESS!@#KODE 1!@#USER_ID 8!@#ACTIVITY_CODE 3
12/10/2022 09:24:55 AM script INFO: SUCCESS!@#KODE 1!@#USER_ID 8!@#ACTIVITY_CODE 3
12/10/2022 09:24:55 AM script INFO: SUCCESS!@#KODE 1!@#USER_ID 8!@#ACTIVITY_CODE 3
12/10/2022 09:24:55 AM script INFO: SUCCESS!@#KODE 1!@#USER_ID 8!@#ACTIVITY_CODE 4
12/10/2022 09:24:55 AM script INFO: SUCCESS!@#KODE 1!@#USER_ID 8!@#ACTIVITY_CODE 3
12/10/2022 09:24:55 AM script INFO: SUCCESS!@#KODE 1!@#USER_ID 8!@#ACTIVITY_CODE 2
12/10/2022 09:24:55 AM script INFO: SUCCESS!@#KODE 1!@#USER_ID 8!@#ACTIVITY_CODE 1
12/10/2022 09:24:55 AM script INFO: SUCCESS!@#KODE 1!@#USER_ID 8!@#ACTIVITY_CODE 3
12/10/2022 09:24:55 AM script INFO: SUCCESS!@#KODE 1!@#USER_ID 8!@#ACTIVITY_CODE 3
12/10/2022 09:24:55 AM script INFO: SUCCESS!@#KODE 1!@#USER_ID 8!@#ACTIVITY_CODE 3
12/10/2022 09:24:55 AM script INFO: SUCCESS!@#KODE 1!@#USER_ID 8!@#ACTIVITY_CODE 2
12/10/2022 09:24:56 AM script INFO: SUCCESS!@#KODE 1!@#USER_ID 8!@#ACTIVITY_CODE 2
12/10/2022 09:24:56 AM script INFO: SUCCESS!@#KODE 1!@#USER_ID 8!@#ACTIVITY_CODE 1
12/10/2022 09:24:56 AM script INFO: SUCCESS!@#KODE 1!@#USER_ID 8!@#ACTIVITY_CODE 1
12/10/2022 09:24:56 AM script INFO: SUCCESS!@#KODE 1!@#USER_ID 8!@#ACTIVITY_CODE 3
12/10/2022 09:24:56 AM script INFO: SUCCESS!@#KODE 1!@#USER_ID 8!@#ACTIVITY_CODE 1
12/10/2022 09:24:56 AM script INFO: SUCCESS!@#KODE 1!@#USER_ID 8!@#ACTIVITY_CODE 1
12/10/2022 09:24:56 AM script INFO: SUCCESS!@#KODE 1!@#USER_ID 8!@#ACTIVITY_CODE 2
12/10/2022 09:24:56 AM script INFO: SUCCESS!@#KODE 1!@#USER_ID 8!@#ACTIVITY_CODE 2
12/10/2022 09:24:56 AM script INFO: SUCCESS!@#KODE 1!@#USER_ID 8!@#ACTIVITY_CODE 1
12/10/2022 09:24:56 AM script INFO: SUCCESS!@#KODE 1!@#USER_ID 8!@#ACTIVITY_CODE 3
12/10/2022 09:24:56 AM script INFO: SUCCESS!@#KODE 1!@#USER_ID 8!@#ACTIVITY_CODE 2
12/10/2022 09:24:56 AM script INFO: SUCCESS!@#KODE 1!@#USER_ID 8!@#ACTIVITY_CODE 3
12/10/2022 09:24:56 AM script INFO: SUCCESS!@#KODE 1!@#USER_ID 8!@#ACTIVITY_CODE 3
12/10/2022 09:24:56 AM script INFO: SUCCESS!@#KODE 1!@#USER_ID 8!@#ACTIVITY_CODE 2
12/10/2022 09:24:56 AM script INFO: SUCCESS!@#KODE 1!@#USER_ID 8!@#ACTIVITY_CODE 4
12/10/2022 09:24:57 AM script INFO: SUCCESS!@#KODE 1!@#USER_ID 8!@#ACTIVITY_CODE 2
12/10/2022 09:24:57 AM script INFO: SUCCESS!@#KODE 1!@#USER_ID 8!@#ACTIVITY_CODE 1
12/10/2022 09:24:57 AM script INFO: SUCCESS!@#KODE 1!@#USER_ID 8!@#ACTIVITY_CODE 3
12/10/2022 09:24:57 AM script INFO: SUCCESS!@#KODE 1!@#USER_ID 8!@#ACTIVITY_CODE 1
12/10/2022 09:24:57 AM script INFO: SUCCESS!@#KODE 1!@#USER_ID 8!@#ACTIVITY_CODE 1
12/10/2022 09:24:57 AM script INFO: SUCCESS!@#KODE 1!@#USER_ID 8!@#ACTIVITY_CODE 1
12/10/2022 09:24:57 AM script INFO: SUCCESS!@#KODE 1!@#USER_ID 8!@#ACTIVITY_CODE 2
12/10/2022 09:24:57 AM script INFO: SUCCESS!@#KODE 1!@#USER_ID 8!@#ACTIVITY_CODE 1
12/10/2022 09:24:57 AM script INFO: SUCCESS!@#KODE 1!@#USER_ID 8!@#ACTIVITY_CODE 4
12/10/2022 09:24:57 AM script INFO: SUCCESS!@#KODE 1!@#USER_ID 8!@#ACTIVITY_CODE 1
12/10/2022 09:24:57 AM script INFO: SUCCESS!@#KODE 1!@#USER_ID 8!@#ACTIVITY_CODE 4
12/10/2022 09:24:57 AM script INFO: SUCCESS!@#KODE 1!@#USER_ID 8!@#ACTIVITY_CODE 1
12/10/2022 09:24:57 AM script INFO: SUCCESS!@#KODE 1!@#USER_ID 8!@#ACTIVITY_CODE 1
12/10/2022 09:24:57 AM script INFO: SUCCESS!@#KODE 1!@#USER_ID 8!@#ACTIVITY_CODE 2
12/10/2022 09:24:57 AM script INFO: SUCCESS!@#KODE 1!@#USER_ID 8!@#ACTIVITY_CODE 2
12/10/2022 09:24:57 AM script INFO: SUCCESS!@#KODE 1!@#USER_ID 8!@#ACTIVITY_CODE 1
12/10/2022 09:24:57 AM script INFO: SUCCESS!@#KODE 1!@#USER_ID 8!@#ACTIVITY_CODE 1
12/10/2022 09:24:57 AM script INFO: SUCCESS!@#KODE 1!@#USER_ID 8!@#ACTIVITY_CODE 3
12/10/2022 09:24:57 AM script INFO: SUCCESS!@#KODE 1!@#USER_ID 8!@#ACTIVITY_CODE 1
12/10/2022 09:24:58 AM script INFO: SUCCESS!@#KODE 1!@#USER_ID 8!@#ACTIVITY_CODE 2
12/10/2022 09:24:58 AM script INFO: SUCCESS!@#KODE 1!@#USER_ID 8!@#ACTIVITY_CODE 2
12/10/2022 09:24:58 AM script INFO: SUCCESS!@#KODE 1!@#USER_ID 8!@#ACTIVITY_CODE 2
12/10/2022 09:24:58 AM script INFO: SUCCESS!@#KODE 1!@#USER_ID 8!@#ACTIVITY_CODE 3
12/10/2022 09:24:58 AM script INFO: SUCCESS!@#KODE 1!@#USER_ID 8!@#ACTIVITY_CODE 3
12/10/2022 09:24:58 AM script INFO: SUCCESS!@#KODE 1!@#USER_ID 8!@#ACTIVITY_CODE 3
12/10/2022 09:24:58 AM script INFO: Duration: 83.09573149681091
12/10/2022 09:24:58 AM script INFO: mengakhiri-quiz
12/10/2022 09:28:10 AM script INFO: SUCCESS!@#KODE 1!@#USER_ID 8!@#ACTIVITY_CODE 5
12/10/2022 09:28:10 AM script INFO: berhasil-submit
