12/11/2022 03:11:15 PM script INFO: Prepared chrome options..
12/11/2022 03:11:16 PM script INFO: Initialized chrome browser..
12/11/2022 03:11:16 PM script INFO: mengakses-homepage
12/11/2022 03:11:25 PM script INFO: mengakses-login-page
12/11/2022 03:11:27 PM script INFO: mengakses-site-home
12/11/2022 03:11:27 PM script INFO: mengakses-site-course
12/11/2022 03:11:54 PM script INFO: mengakses-quiz
12/11/2022 03:12:11 PM script INFO: mengakses-start-quiz-page
12/11/2022 03:12:33 PM script INFO: memulai-quiz
12/11/2022 03:12:33 PM script INFO: SUCCESS!@#KODE 1!@#USER_ID 16!@#ACTIVITY_CODE 5
12/11/2022 03:12:44 PM script INFO: SUCCESS!@#KODE 1!@#USER_ID 16!@#ACTIVITY_CODE 3
12/11/2022 03:12:44 PM script INFO: SUCCESS!@#KODE 1!@#USER_ID 16!@#ACTIVITY_CODE 5
12/11/2022 03:12:44 PM script INFO: SUCCESS!@#KODE 1!@#USER_ID 16!@#ACTIVITY_CODE 5
12/11/2022 03:12:47 PM script INFO: SUCCESS!@#KODE 1!@#USER_ID 16!@#ACTIVITY_CODE 3
12/11/2022 03:12:47 PM script INFO: SUCCESS!@#KODE 1!@#USER_ID 16!@#ACTIVITY_CODE 1
12/11/2022 03:12:47 PM script INFO: SUCCESS!@#KODE 1!@#USER_ID 16!@#ACTIVITY_CODE 2
12/11/2022 03:12:47 PM script INFO: SUCCESS!@#KODE 1!@#USER_ID 16!@#ACTIVITY_CODE 3
12/11/2022 03:12:47 PM script INFO: SUCCESS!@#KODE 1!@#USER_ID 16!@#ACTIVITY_CODE 5
12/11/2022 03:12:47 PM script INFO: SUCCESS!@#KODE 1!@#USER_ID 16!@#ACTIVITY_CODE 5
12/11/2022 03:12:49 PM script INFO: SUCCESS!@#KODE 1!@#USER_ID 16!@#ACTIVITY_CODE 5
12/11/2022 03:12:49 PM script INFO: SUCCESS!@#KODE 1!@#USER_ID 16!@#ACTIVITY_CODE 5
12/11/2022 03:12:52 PM script INFO: SUCCESS!@#KODE 1!@#USER_ID 16!@#ACTIVITY_CODE 5
12/11/2022 03:12:52 PM script INFO: SUCCESS!@#KODE 1!@#USER_ID 16!@#ACTIVITY_CODE 5
12/11/2022 03:12:54 PM script INFO: SUCCESS!@#KODE 1!@#USER_ID 16!@#ACTIVITY_CODE 5
12/11/2022 03:12:54 PM script INFO: SUCCESS!@#KODE 1!@#USER_ID 16!@#ACTIVITY_CODE 5
12/11/2022 03:12:57 PM script INFO: SUCCESS!@#KODE 1!@#USER_ID 16!@#ACTIVITY_CODE 1
12/11/2022 03:12:57 PM script INFO: SUCCESS!@#KODE 1!@#USER_ID 16!@#ACTIVITY_CODE 3
12/11/2022 03:12:57 PM script INFO: SUCCESS!@#KODE 1!@#USER_ID 16!@#ACTIVITY_CODE 3
12/11/2022 03:12:57 PM script INFO: SUCCESS!@#KODE 1!@#USER_ID 16!@#ACTIVITY_CODE 5
12/11/2022 03:12:57 PM script INFO: SUCCESS!@#KODE 1!@#USER_ID 16!@#ACTIVITY_CODE 5
12/11/2022 03:13:00 PM script INFO: SUCCESS!@#KODE 1!@#USER_ID 16!@#ACTIVITY_CODE 1
12/11/2022 03:13:00 PM script INFO: SUCCESS!@#KODE 1!@#USER_ID 16!@#ACTIVITY_CODE 3
12/11/2022 03:13:00 PM script INFO: SUCCESS!@#KODE 1!@#USER_ID 16!@#ACTIVITY_CODE 2
12/11/2022 03:13:00 PM script INFO: SUCCESS!@#KODE 1!@#USER_ID 16!@#ACTIVITY_CODE 5
12/11/2022 03:13:00 PM script INFO: SUCCESS!@#KODE 1!@#USER_ID 16!@#ACTIVITY_CODE 5
12/11/2022 03:13:02 PM script INFO: SUCCESS!@#KODE 1!@#USER_ID 16!@#ACTIVITY_CODE 3
12/11/2022 03:13:02 PM script INFO: SUCCESS!@#KODE 1!@#USER_ID 16!@#ACTIVITY_CODE 1
12/11/2022 03:13:02 PM script INFO: SUCCESS!@#KODE 1!@#USER_ID 16!@#ACTIVITY_CODE 5
12/11/2022 03:13:02 PM script INFO: SUCCESS!@#KODE 1!@#USER_ID 16!@#ACTIVITY_CODE 5
12/11/2022 03:13:05 PM script INFO: SUCCESS!@#KODE 1!@#USER_ID 16!@#ACTIVITY_CODE 4
12/11/2022 03:13:05 PM script INFO: SUCCESS!@#KODE 1!@#USER_ID 16!@#ACTIVITY_CODE 3
12/11/2022 03:13:05 PM script INFO: SUCCESS!@#KODE 1!@#USER_ID 16!@#ACTIVITY_CODE 3
12/11/2022 03:13:05 PM script INFO: SUCCESS!@#KODE 1!@#USER_ID 16!@#ACTIVITY_CODE 2
12/11/2022 03:13:05 PM script INFO: SUCCESS!@#KODE 1!@#USER_ID 16!@#ACTIVITY_CODE 2
12/11/2022 03:13:05 PM script INFO: SUCCESS!@#KODE 1!@#USER_ID 16!@#ACTIVITY_CODE 5
12/11/2022 03:13:05 PM script INFO: SUCCESS!@#KODE 1!@#USER_ID 16!@#ACTIVITY_CODE 5
12/11/2022 03:13:08 PM script INFO: SUCCESS!@#KODE 1!@#USER_ID 16!@#ACTIVITY_CODE 5
12/11/2022 03:13:08 PM script INFO: SUCCESS!@#KODE 1!@#USER_ID 16!@#ACTIVITY_CODE 5
12/11/2022 03:13:11 PM script INFO: SUCCESS!@#KODE 1!@#USER_ID 16!@#ACTIVITY_CODE 2
12/11/2022 03:13:11 PM script INFO: SUCCESS!@#KODE 1!@#USER_ID 16!@#ACTIVITY_CODE 5
12/11/2022 03:13:11 PM script INFO: SUCCESS!@#KODE 1!@#USER_ID 16!@#ACTIVITY_CODE 5
12/11/2022 03:13:13 PM script INFO: SUCCESS!@#KODE 1!@#USER_ID 16!@#ACTIVITY_CODE 3
12/11/2022 03:13:13 PM script INFO: SUCCESS!@#KODE 1!@#USER_ID 16!@#ACTIVITY_CODE 1
12/11/2022 03:13:13 PM script INFO: SUCCESS!@#KODE 1!@#USER_ID 16!@#ACTIVITY_CODE 3
12/11/2022 03:13:13 PM script INFO: SUCCESS!@#KODE 1!@#USER_ID 16!@#ACTIVITY_CODE 3
12/11/2022 03:13:13 PM script INFO: SUCCESS!@#KODE 1!@#USER_ID 16!@#ACTIVITY_CODE 1
12/11/2022 03:13:13 PM script INFO: SUCCESS!@#KODE 1!@#USER_ID 16!@#ACTIVITY_CODE 3
12/11/2022 03:13:13 PM script INFO: SUCCESS!@#KODE 1!@#USER_ID 16!@#ACTIVITY_CODE 2
12/11/2022 03:13:14 PM script INFO: SUCCESS!@#KODE 1!@#USER_ID 16!@#ACTIVITY_CODE 4
12/11/2022 03:13:14 PM script INFO: SUCCESS!@#KODE 1!@#USER_ID 16!@#ACTIVITY_CODE 3
12/11/2022 03:13:14 PM script INFO: SUCCESS!@#KODE 1!@#USER_ID 16!@#ACTIVITY_CODE 1
12/11/2022 03:13:14 PM script INFO: SUCCESS!@#KODE 1!@#USER_ID 16!@#ACTIVITY_CODE 1
12/11/2022 03:13:14 PM script INFO: SUCCESS!@#KODE 1!@#USER_ID 16!@#ACTIVITY_CODE 1
12/11/2022 03:13:14 PM script INFO: SUCCESS!@#KODE 1!@#USER_ID 16!@#ACTIVITY_CODE 2
12/11/2022 03:13:14 PM script INFO: SUCCESS!@#KODE 1!@#USER_ID 16!@#ACTIVITY_CODE 1
12/11/2022 03:13:14 PM script INFO: SUCCESS!@#KODE 1!@#USER_ID 16!@#ACTIVITY_CODE 4
12/11/2022 03:13:14 PM script INFO: SUCCESS!@#KODE 1!@#USER_ID 16!@#ACTIVITY_CODE 1
12/11/2022 03:13:14 PM script INFO: SUCCESS!@#KODE 1!@#USER_ID 16!@#ACTIVITY_CODE 4
12/11/2022 03:13:14 PM script INFO: SUCCESS!@#KODE 1!@#USER_ID 16!@#ACTIVITY_CODE 3
12/11/2022 03:13:14 PM script INFO: SUCCESS!@#KODE 1!@#USER_ID 16!@#ACTIVITY_CODE 2
12/11/2022 03:13:14 PM script INFO: SUCCESS!@#KODE 1!@#USER_ID 16!@#ACTIVITY_CODE 1
12/11/2022 03:13:14 PM script INFO: SUCCESS!@#KODE 1!@#USER_ID 16!@#ACTIVITY_CODE 3
12/11/2022 03:13:14 PM script INFO: SUCCESS!@#KODE 1!@#USER_ID 16!@#ACTIVITY_CODE 2
12/11/2022 03:13:14 PM script INFO: SUCCESS!@#KODE 1!@#USER_ID 16!@#ACTIVITY_CODE 3
12/11/2022 03:13:15 PM script INFO: SUCCESS!@#KODE 1!@#USER_ID 16!@#ACTIVITY_CODE 2
12/11/2022 03:13:15 PM script INFO: SUCCESS!@#KODE 1!@#USER_ID 16!@#ACTIVITY_CODE 2
12/11/2022 03:13:15 PM script INFO: SUCCESS!@#KODE 1!@#USER_ID 16!@#ACTIVITY_CODE 1
12/11/2022 03:13:15 PM script INFO: SUCCESS!@#KODE 1!@#USER_ID 16!@#ACTIVITY_CODE 1
12/11/2022 03:13:15 PM script INFO: SUCCESS!@#KODE 1!@#USER_ID 16!@#ACTIVITY_CODE 2
12/11/2022 03:13:15 PM script INFO: SUCCESS!@#KODE 1!@#USER_ID 16!@#ACTIVITY_CODE 2
12/11/2022 03:13:15 PM script INFO: SUCCESS!@#KODE 1!@#USER_ID 16!@#ACTIVITY_CODE 1
12/11/2022 03:13:15 PM script INFO: SUCCESS!@#KODE 1!@#USER_ID 16!@#ACTIVITY_CODE 4
12/11/2022 03:13:15 PM script INFO: SUCCESS!@#KODE 1!@#USER_ID 16!@#ACTIVITY_CODE 3
12/11/2022 03:13:15 PM script INFO: SUCCESS!@#KODE 1!@#USER_ID 16!@#ACTIVITY_CODE 3
12/11/2022 03:13:15 PM script INFO: SUCCESS!@#KODE 1!@#USER_ID 16!@#ACTIVITY_CODE 1
12/11/2022 03:13:15 PM script INFO: SUCCESS!@#KODE 1!@#USER_ID 16!@#ACTIVITY_CODE 2
12/11/2022 03:13:16 PM script INFO: SUCCESS!@#KODE 1!@#USER_ID 16!@#ACTIVITY_CODE 2
12/11/2022 03:13:16 PM script INFO: SUCCESS!@#KODE 1!@#USER_ID 16!@#ACTIVITY_CODE 3
12/11/2022 03:13:16 PM script INFO: SUCCESS!@#KODE 1!@#USER_ID 16!@#ACTIVITY_CODE 3
12/11/2022 03:13:16 PM script INFO: SUCCESS!@#KODE 1!@#USER_ID 16!@#ACTIVITY_CODE 3
12/11/2022 03:13:16 PM script INFO: SUCCESS!@#KODE 1!@#USER_ID 16!@#ACTIVITY_CODE 1
12/11/2022 03:13:16 PM script INFO: SUCCESS!@#KODE 1!@#USER_ID 16!@#ACTIVITY_CODE 4
12/11/2022 03:13:16 PM script INFO: SUCCESS!@#KODE 1!@#USER_ID 16!@#ACTIVITY_CODE 3
12/11/2022 03:13:16 PM script INFO: SUCCESS!@#KODE 1!@#USER_ID 16!@#ACTIVITY_CODE 1
12/11/2022 03:13:16 PM script INFO: SUCCESS!@#KODE 1!@#USER_ID 16!@#ACTIVITY_CODE 3
12/11/2022 03:13:16 PM script INFO: SUCCESS!@#KODE 1!@#USER_ID 16!@#ACTIVITY_CODE 1
12/11/2022 03:13:16 PM script INFO: SUCCESS!@#KODE 1!@#USER_ID 16!@#ACTIVITY_CODE 4
12/11/2022 03:13:16 PM script INFO: SUCCESS!@#KODE 1!@#USER_ID 16!@#ACTIVITY_CODE 2
12/11/2022 03:13:16 PM script INFO: SUCCESS!@#KODE 1!@#USER_ID 16!@#ACTIVITY_CODE 3
12/11/2022 03:13:16 PM script INFO: SUCCESS!@#KODE 1!@#USER_ID 16!@#ACTIVITY_CODE 4
12/11/2022 03:13:16 PM script INFO: SUCCESS!@#KODE 1!@#USER_ID 16!@#ACTIVITY_CODE 3
12/11/2022 03:13:17 PM script INFO: SUCCESS!@#KODE 1!@#USER_ID 16!@#ACTIVITY_CODE 1
12/11/2022 03:13:17 PM script INFO: SUCCESS!@#KODE 1!@#USER_ID 16!@#ACTIVITY_CODE 3
12/11/2022 03:13:17 PM script INFO: SUCCESS!@#KODE 1!@#USER_ID 16!@#ACTIVITY_CODE 4
12/11/2022 03:13:17 PM script INFO: SUCCESS!@#KODE 1!@#USER_ID 16!@#ACTIVITY_CODE 3
12/11/2022 03:13:17 PM script INFO: SUCCESS!@#KODE 1!@#USER_ID 16!@#ACTIVITY_CODE 2
12/11/2022 03:13:17 PM script INFO: SUCCESS!@#KODE 1!@#USER_ID 16!@#ACTIVITY_CODE 4
12/11/2022 03:13:17 PM script INFO: SUCCESS!@#KODE 1!@#USER_ID 16!@#ACTIVITY_CODE 3
12/11/2022 03:13:17 PM script INFO: Duration: 32.98485064506531
12/11/2022 03:13:17 PM script INFO: mengakhiri-quiz
12/11/2022 03:13:21 PM script INFO: SUCCESS!@#KODE 1!@#USER_ID 16!@#ACTIVITY_CODE 5
12/11/2022 03:13:21 PM script INFO: berhasil-submit
