12/23/2022 04:20:19 AM script INFO: Prepared chrome options..
12/23/2022 04:20:21 AM script INFO: Initialized chrome browser..
12/23/2022 04:20:21 AM script INFO: mengakses-homepage
12/23/2022 04:20:54 AM script INFO: mengakses-login-page
12/23/2022 04:21:31 AM script INFO: mengakses-site-home
12/23/2022 04:23:02 AM script ERROR: TIMEOUT EXCEPTION!@#KODE 0!@#LOCATION mengakses-site-home
12/23/2022 04:23:02 AM main_worker ERROR: Message: None

