12/11/2022 04:01:09 PM script INFO: Prepared chrome options..
12/11/2022 04:01:10 PM script INFO: Initialized chrome browser..
12/11/2022 04:01:10 PM script INFO: mengakses-homepage
12/11/2022 04:01:50 PM script INFO: mengakses-login-page
12/11/2022 04:02:07 PM script INFO: mengakses-site-home
12/11/2022 04:02:08 PM script INFO: mengakses-site-course
12/11/2022 04:02:26 PM script INFO: mengakses-quiz
12/11/2022 04:02:27 PM script INFO: mengakses-start-quiz-page
12/11/2022 04:02:28 PM script INFO: memulai-quiz
12/11/2022 04:02:28 PM script INFO: SUCCESS!@#KODE 1!@#USER_ID 21!@#ACTIVITY_CODE 5
12/11/2022 04:02:39 PM script INFO: SUCCESS!@#KODE 1!@#USER_ID 21!@#ACTIVITY_CODE 3
12/11/2022 04:02:39 PM script INFO: SUCCESS!@#KODE 1!@#USER_ID 21!@#ACTIVITY_CODE 3
12/11/2022 04:02:39 PM script INFO: SUCCESS!@#KODE 1!@#USER_ID 21!@#ACTIVITY_CODE 1
12/11/2022 04:02:39 PM script INFO: SUCCESS!@#KODE 1!@#USER_ID 21!@#ACTIVITY_CODE 3
12/11/2022 04:02:39 PM script INFO: SUCCESS!@#KODE 1!@#USER_ID 21!@#ACTIVITY_CODE 3
12/11/2022 04:02:39 PM script INFO: SUCCESS!@#KODE 1!@#USER_ID 21!@#ACTIVITY_CODE 2
12/11/2022 04:02:39 PM script INFO: SUCCESS!@#KODE 1!@#USER_ID 21!@#ACTIVITY_CODE 5
12/11/2022 04:02:39 PM script INFO: SUCCESS!@#KODE 1!@#USER_ID 21!@#ACTIVITY_CODE 5
12/11/2022 04:02:42 PM script INFO: SUCCESS!@#KODE 1!@#USER_ID 21!@#ACTIVITY_CODE 5
12/11/2022 04:02:42 PM script INFO: SUCCESS!@#KODE 1!@#USER_ID 21!@#ACTIVITY_CODE 5
12/11/2022 04:02:45 PM script INFO: SUCCESS!@#KODE 1!@#USER_ID 21!@#ACTIVITY_CODE 2
12/11/2022 04:02:45 PM script INFO: SUCCESS!@#KODE 1!@#USER_ID 21!@#ACTIVITY_CODE 1
12/11/2022 04:02:45 PM script INFO: SUCCESS!@#KODE 1!@#USER_ID 21!@#ACTIVITY_CODE 3
12/11/2022 04:02:45 PM script INFO: SUCCESS!@#KODE 1!@#USER_ID 21!@#ACTIVITY_CODE 3
12/11/2022 04:02:45 PM script INFO: SUCCESS!@#KODE 1!@#USER_ID 21!@#ACTIVITY_CODE 5
12/11/2022 04:02:45 PM script INFO: SUCCESS!@#KODE 1!@#USER_ID 21!@#ACTIVITY_CODE 5
12/11/2022 04:02:48 PM script INFO: SUCCESS!@#KODE 1!@#USER_ID 21!@#ACTIVITY_CODE 4
12/11/2022 04:02:48 PM script INFO: SUCCESS!@#KODE 1!@#USER_ID 21!@#ACTIVITY_CODE 5
12/11/2022 04:02:48 PM script INFO: SUCCESS!@#KODE 1!@#USER_ID 21!@#ACTIVITY_CODE 5
12/11/2022 04:02:50 PM script INFO: SUCCESS!@#KODE 1!@#USER_ID 21!@#ACTIVITY_CODE 5
12/11/2022 04:02:50 PM script INFO: SUCCESS!@#KODE 1!@#USER_ID 21!@#ACTIVITY_CODE 5
12/11/2022 04:02:53 PM script INFO: SUCCESS!@#KODE 1!@#USER_ID 21!@#ACTIVITY_CODE 2
12/11/2022 04:02:53 PM script INFO: SUCCESS!@#KODE 1!@#USER_ID 21!@#ACTIVITY_CODE 1
12/11/2022 04:02:53 PM script INFO: SUCCESS!@#KODE 1!@#USER_ID 21!@#ACTIVITY_CODE 1
12/11/2022 04:02:54 PM script INFO: SUCCESS!@#KODE 1!@#USER_ID 21!@#ACTIVITY_CODE 4
12/11/2022 04:02:54 PM script INFO: SUCCESS!@#KODE 1!@#USER_ID 21!@#ACTIVITY_CODE 3
12/11/2022 04:02:54 PM script INFO: SUCCESS!@#KODE 1!@#USER_ID 21!@#ACTIVITY_CODE 3
12/11/2022 04:02:54 PM script INFO: SUCCESS!@#KODE 1!@#USER_ID 21!@#ACTIVITY_CODE 5
12/11/2022 04:02:54 PM script INFO: SUCCESS!@#KODE 1!@#USER_ID 21!@#ACTIVITY_CODE 5
12/11/2022 04:02:56 PM script INFO: SUCCESS!@#KODE 1!@#USER_ID 21!@#ACTIVITY_CODE 5
12/11/2022 04:02:56 PM script INFO: SUCCESS!@#KODE 1!@#USER_ID 21!@#ACTIVITY_CODE 5
12/11/2022 04:02:59 PM script INFO: SUCCESS!@#KODE 1!@#USER_ID 21!@#ACTIVITY_CODE 3
12/11/2022 04:02:59 PM script INFO: SUCCESS!@#KODE 1!@#USER_ID 21!@#ACTIVITY_CODE 2
12/11/2022 04:02:59 PM script INFO: SUCCESS!@#KODE 1!@#USER_ID 21!@#ACTIVITY_CODE 1
12/11/2022 04:02:59 PM script INFO: SUCCESS!@#KODE 1!@#USER_ID 21!@#ACTIVITY_CODE 5
12/11/2022 04:02:59 PM script INFO: SUCCESS!@#KODE 1!@#USER_ID 21!@#ACTIVITY_CODE 5
12/11/2022 04:03:02 PM script INFO: SUCCESS!@#KODE 1!@#USER_ID 21!@#ACTIVITY_CODE 3
12/11/2022 04:03:02 PM script INFO: SUCCESS!@#KODE 1!@#USER_ID 21!@#ACTIVITY_CODE 1
12/11/2022 04:03:03 PM script INFO: SUCCESS!@#KODE 1!@#USER_ID 21!@#ACTIVITY_CODE 2
12/11/2022 04:03:03 PM script INFO: SUCCESS!@#KODE 1!@#USER_ID 21!@#ACTIVITY_CODE 3
12/11/2022 04:03:03 PM script INFO: SUCCESS!@#KODE 1!@#USER_ID 21!@#ACTIVITY_CODE 3
12/11/2022 04:03:03 PM script INFO: SUCCESS!@#KODE 1!@#USER_ID 21!@#ACTIVITY_CODE 5
12/11/2022 04:03:03 PM script INFO: SUCCESS!@#KODE 1!@#USER_ID 21!@#ACTIVITY_CODE 5
12/11/2022 04:03:06 PM script INFO: SUCCESS!@#KODE 1!@#USER_ID 21!@#ACTIVITY_CODE 2
12/11/2022 04:03:06 PM script INFO: SUCCESS!@#KODE 1!@#USER_ID 21!@#ACTIVITY_CODE 2
12/11/2022 04:03:06 PM script INFO: SUCCESS!@#KODE 1!@#USER_ID 21!@#ACTIVITY_CODE 5
12/11/2022 04:03:06 PM script INFO: SUCCESS!@#KODE 1!@#USER_ID 21!@#ACTIVITY_CODE 5
12/11/2022 04:03:09 PM script INFO: SUCCESS!@#KODE 1!@#USER_ID 21!@#ACTIVITY_CODE 3
12/11/2022 04:03:09 PM script INFO: SUCCESS!@#KODE 1!@#USER_ID 21!@#ACTIVITY_CODE 5
12/11/2022 04:03:09 PM script INFO: SUCCESS!@#KODE 1!@#USER_ID 21!@#ACTIVITY_CODE 5
12/11/2022 04:03:11 PM script INFO: SUCCESS!@#KODE 1!@#USER_ID 21!@#ACTIVITY_CODE 1
12/11/2022 04:03:11 PM script INFO: SUCCESS!@#KODE 1!@#USER_ID 21!@#ACTIVITY_CODE 5
12/11/2022 04:03:11 PM script INFO: SUCCESS!@#KODE 1!@#USER_ID 21!@#ACTIVITY_CODE 5
12/11/2022 04:03:14 PM script INFO: SUCCESS!@#KODE 1!@#USER_ID 21!@#ACTIVITY_CODE 1
12/11/2022 04:03:14 PM script INFO: SUCCESS!@#KODE 1!@#USER_ID 21!@#ACTIVITY_CODE 1
12/11/2022 04:03:14 PM script INFO: SUCCESS!@#KODE 1!@#USER_ID 21!@#ACTIVITY_CODE 2
12/11/2022 04:03:15 PM script INFO: SUCCESS!@#KODE 1!@#USER_ID 21!@#ACTIVITY_CODE 2
12/11/2022 04:03:15 PM script INFO: SUCCESS!@#KODE 1!@#USER_ID 21!@#ACTIVITY_CODE 5
12/11/2022 04:03:15 PM script INFO: SUCCESS!@#KODE 1!@#USER_ID 21!@#ACTIVITY_CODE 5
12/11/2022 04:03:18 PM script INFO: SUCCESS!@#KODE 1!@#USER_ID 21!@#ACTIVITY_CODE 2
12/11/2022 04:03:18 PM script INFO: SUCCESS!@#KODE 1!@#USER_ID 21!@#ACTIVITY_CODE 5
12/11/2022 04:03:18 PM script INFO: SUCCESS!@#KODE 1!@#USER_ID 21!@#ACTIVITY_CODE 5
12/11/2022 04:03:20 PM script INFO: SUCCESS!@#KODE 1!@#USER_ID 21!@#ACTIVITY_CODE 3
12/11/2022 04:03:20 PM script INFO: SUCCESS!@#KODE 1!@#USER_ID 21!@#ACTIVITY_CODE 5
12/11/2022 04:03:20 PM script INFO: SUCCESS!@#KODE 1!@#USER_ID 21!@#ACTIVITY_CODE 5
12/11/2022 04:03:23 PM script INFO: SUCCESS!@#KODE 1!@#USER_ID 21!@#ACTIVITY_CODE 1
12/11/2022 04:03:23 PM script INFO: SUCCESS!@#KODE 1!@#USER_ID 21!@#ACTIVITY_CODE 3
12/11/2022 04:03:23 PM script INFO: SUCCESS!@#KODE 1!@#USER_ID 21!@#ACTIVITY_CODE 1
12/11/2022 04:03:24 PM script INFO: SUCCESS!@#KODE 1!@#USER_ID 21!@#ACTIVITY_CODE 2
12/11/2022 04:03:24 PM script INFO: SUCCESS!@#KODE 1!@#USER_ID 21!@#ACTIVITY_CODE 5
12/11/2022 04:03:24 PM script INFO: SUCCESS!@#KODE 1!@#USER_ID 21!@#ACTIVITY_CODE 5
12/11/2022 04:03:26 PM script INFO: SUCCESS!@#KODE 1!@#USER_ID 21!@#ACTIVITY_CODE 3
12/11/2022 04:03:27 PM script INFO: SUCCESS!@#KODE 1!@#USER_ID 21!@#ACTIVITY_CODE 4
12/11/2022 04:03:27 PM script INFO: SUCCESS!@#KODE 1!@#USER_ID 21!@#ACTIVITY_CODE 2
12/11/2022 04:03:27 PM script INFO: SUCCESS!@#KODE 1!@#USER_ID 21!@#ACTIVITY_CODE 1
12/11/2022 04:03:27 PM script INFO: SUCCESS!@#KODE 1!@#USER_ID 21!@#ACTIVITY_CODE 1
12/11/2022 04:03:27 PM script INFO: SUCCESS!@#KODE 1!@#USER_ID 21!@#ACTIVITY_CODE 1
12/11/2022 04:03:28 PM script INFO: SUCCESS!@#KODE 1!@#USER_ID 21!@#ACTIVITY_CODE 2
12/11/2022 04:03:28 PM script INFO: SUCCESS!@#KODE 1!@#USER_ID 21!@#ACTIVITY_CODE 2
12/11/2022 04:03:28 PM script INFO: SUCCESS!@#KODE 1!@#USER_ID 21!@#ACTIVITY_CODE 3
12/11/2022 04:03:28 PM script INFO: SUCCESS!@#KODE 1!@#USER_ID 21!@#ACTIVITY_CODE 4
12/11/2022 04:03:28 PM script INFO: SUCCESS!@#KODE 1!@#USER_ID 21!@#ACTIVITY_CODE 5
12/11/2022 04:03:28 PM script INFO: SUCCESS!@#KODE 1!@#USER_ID 21!@#ACTIVITY_CODE 5
12/11/2022 04:03:31 PM script INFO: SUCCESS!@#KODE 1!@#USER_ID 21!@#ACTIVITY_CODE 2
12/11/2022 04:03:31 PM script INFO: SUCCESS!@#KODE 1!@#USER_ID 21!@#ACTIVITY_CODE 2
12/11/2022 04:03:31 PM script INFO: SUCCESS!@#KODE 1!@#USER_ID 21!@#ACTIVITY_CODE 5
12/11/2022 04:03:31 PM script INFO: SUCCESS!@#KODE 1!@#USER_ID 21!@#ACTIVITY_CODE 5
12/11/2022 04:03:34 PM script INFO: SUCCESS!@#KODE 1!@#USER_ID 21!@#ACTIVITY_CODE 3
12/11/2022 04:03:34 PM script INFO: SUCCESS!@#KODE 1!@#USER_ID 21!@#ACTIVITY_CODE 3
12/11/2022 04:03:35 PM script INFO: SUCCESS!@#KODE 1!@#USER_ID 21!@#ACTIVITY_CODE 1
12/11/2022 04:03:35 PM script INFO: SUCCESS!@#KODE 1!@#USER_ID 21!@#ACTIVITY_CODE 5
12/11/2022 04:03:35 PM script INFO: SUCCESS!@#KODE 1!@#USER_ID 21!@#ACTIVITY_CODE 5
12/11/2022 04:03:37 PM script INFO: SUCCESS!@#KODE 1!@#USER_ID 21!@#ACTIVITY_CODE 3
12/11/2022 04:03:38 PM script INFO: SUCCESS!@#KODE 1!@#USER_ID 21!@#ACTIVITY_CODE 3
12/11/2022 04:03:38 PM script INFO: SUCCESS!@#KODE 1!@#USER_ID 21!@#ACTIVITY_CODE 4
12/11/2022 04:03:38 PM script INFO: SUCCESS!@#KODE 1!@#USER_ID 21!@#ACTIVITY_CODE 3
12/11/2022 04:03:38 PM script INFO: SUCCESS!@#KODE 1!@#USER_ID 21!@#ACTIVITY_CODE 5
12/11/2022 04:03:38 PM script INFO: SUCCESS!@#KODE 1!@#USER_ID 21!@#ACTIVITY_CODE 5
12/11/2022 04:03:41 PM script INFO: SUCCESS!@#KODE 1!@#USER_ID 21!@#ACTIVITY_CODE 3
12/11/2022 04:03:41 PM script INFO: SUCCESS!@#KODE 1!@#USER_ID 21!@#ACTIVITY_CODE 1
12/11/2022 04:03:41 PM script INFO: SUCCESS!@#KODE 1!@#USER_ID 21!@#ACTIVITY_CODE 3
12/11/2022 04:03:41 PM script INFO: SUCCESS!@#KODE 1!@#USER_ID 21!@#ACTIVITY_CODE 4
12/11/2022 04:03:41 PM script INFO: SUCCESS!@#KODE 1!@#USER_ID 21!@#ACTIVITY_CODE 2
12/11/2022 04:03:41 PM script INFO: SUCCESS!@#KODE 1!@#USER_ID 21!@#ACTIVITY_CODE 3
12/11/2022 04:03:42 PM script INFO: SUCCESS!@#KODE 1!@#USER_ID 21!@#ACTIVITY_CODE 2
12/11/2022 04:03:42 PM script INFO: SUCCESS!@#KODE 1!@#USER_ID 21!@#ACTIVITY_CODE 1
12/11/2022 04:03:42 PM script INFO: SUCCESS!@#KODE 1!@#USER_ID 21!@#ACTIVITY_CODE 1
12/11/2022 04:03:42 PM script INFO: SUCCESS!@#KODE 1!@#USER_ID 21!@#ACTIVITY_CODE 3
12/11/2022 04:03:42 PM script INFO: SUCCESS!@#KODE 1!@#USER_ID 21!@#ACTIVITY_CODE 3
12/11/2022 04:03:42 PM script INFO: SUCCESS!@#KODE 1!@#USER_ID 21!@#ACTIVITY_CODE 1
12/11/2022 04:03:43 PM script INFO: SUCCESS!@#KODE 1!@#USER_ID 21!@#ACTIVITY_CODE 3
12/11/2022 04:03:43 PM script INFO: SUCCESS!@#KODE 1!@#USER_ID 21!@#ACTIVITY_CODE 1
12/11/2022 04:03:43 PM script INFO: SUCCESS!@#KODE 1!@#USER_ID 21!@#ACTIVITY_CODE 3
12/11/2022 04:03:43 PM script INFO: SUCCESS!@#KODE 1!@#USER_ID 21!@#ACTIVITY_CODE 1
12/11/2022 04:03:43 PM script INFO: SUCCESS!@#KODE 1!@#USER_ID 21!@#ACTIVITY_CODE 1
12/11/2022 04:03:43 PM script INFO: SUCCESS!@#KODE 1!@#USER_ID 21!@#ACTIVITY_CODE 3
12/11/2022 04:03:43 PM script INFO: SUCCESS!@#KODE 1!@#USER_ID 21!@#ACTIVITY_CODE 5
12/11/2022 04:03:43 PM script INFO: SUCCESS!@#KODE 1!@#USER_ID 21!@#ACTIVITY_CODE 5
12/11/2022 04:03:46 PM script INFO: SUCCESS!@#KODE 1!@#USER_ID 21!@#ACTIVITY_CODE 2
12/11/2022 04:03:46 PM script INFO: SUCCESS!@#KODE 1!@#USER_ID 21!@#ACTIVITY_CODE 1
12/11/2022 04:03:46 PM script INFO: SUCCESS!@#KODE 1!@#USER_ID 21!@#ACTIVITY_CODE 3
12/11/2022 04:03:47 PM script INFO: SUCCESS!@#KODE 1!@#USER_ID 21!@#ACTIVITY_CODE 3
12/11/2022 04:03:47 PM script INFO: SUCCESS!@#KODE 1!@#USER_ID 21!@#ACTIVITY_CODE 2
12/11/2022 04:03:47 PM script INFO: SUCCESS!@#KODE 1!@#USER_ID 21!@#ACTIVITY_CODE 1
12/11/2022 04:03:47 PM script INFO: SUCCESS!@#KODE 1!@#USER_ID 21!@#ACTIVITY_CODE 2
12/11/2022 04:03:47 PM script INFO: SUCCESS!@#KODE 1!@#USER_ID 21!@#ACTIVITY_CODE 1
12/11/2022 04:03:48 PM script INFO: SUCCESS!@#KODE 1!@#USER_ID 21!@#ACTIVITY_CODE 4
12/11/2022 04:03:48 PM script INFO: SUCCESS!@#KODE 1!@#USER_ID 21!@#ACTIVITY_CODE 2
12/11/2022 04:03:48 PM script INFO: SUCCESS!@#KODE 1!@#USER_ID 21!@#ACTIVITY_CODE 3
12/11/2022 04:03:48 PM script INFO: SUCCESS!@#KODE 1!@#USER_ID 21!@#ACTIVITY_CODE 3
12/11/2022 04:03:49 PM script INFO: SUCCESS!@#KODE 1!@#USER_ID 21!@#ACTIVITY_CODE 1
12/11/2022 04:03:49 PM script INFO: SUCCESS!@#KODE 1!@#USER_ID 21!@#ACTIVITY_CODE 4
12/11/2022 04:03:49 PM script INFO: SUCCESS!@#KODE 1!@#USER_ID 21!@#ACTIVITY_CODE 3
12/11/2022 04:03:49 PM script INFO: SUCCESS!@#KODE 1!@#USER_ID 21!@#ACTIVITY_CODE 2
12/11/2022 04:03:49 PM script INFO: SUCCESS!@#KODE 1!@#USER_ID 21!@#ACTIVITY_CODE 2
12/11/2022 04:03:50 PM script INFO: SUCCESS!@#KODE 1!@#USER_ID 21!@#ACTIVITY_CODE 3
12/11/2022 04:03:50 PM script INFO: SUCCESS!@#KODE 1!@#USER_ID 21!@#ACTIVITY_CODE 1
12/11/2022 04:03:50 PM script INFO: SUCCESS!@#KODE 1!@#USER_ID 21!@#ACTIVITY_CODE 1
12/11/2022 04:03:50 PM script INFO: SUCCESS!@#KODE 1!@#USER_ID 21!@#ACTIVITY_CODE 2
12/11/2022 04:03:50 PM script INFO: SUCCESS!@#KODE 1!@#USER_ID 21!@#ACTIVITY_CODE 3
12/11/2022 04:03:51 PM script INFO: SUCCESS!@#KODE 1!@#USER_ID 21!@#ACTIVITY_CODE 2
12/11/2022 04:03:51 PM script INFO: SUCCESS!@#KODE 1!@#USER_ID 21!@#ACTIVITY_CODE 2
12/11/2022 04:03:51 PM script INFO: SUCCESS!@#KODE 1!@#USER_ID 21!@#ACTIVITY_CODE 1
12/11/2022 04:03:51 PM script INFO: SUCCESS!@#KODE 1!@#USER_ID 21!@#ACTIVITY_CODE 1
12/11/2022 04:03:51 PM script INFO: SUCCESS!@#KODE 1!@#USER_ID 21!@#ACTIVITY_CODE 1
12/11/2022 04:03:52 PM script INFO: SUCCESS!@#KODE 1!@#USER_ID 21!@#ACTIVITY_CODE 2
12/11/2022 04:03:52 PM script INFO: SUCCESS!@#KODE 1!@#USER_ID 21!@#ACTIVITY_CODE 2
12/11/2022 04:03:52 PM script INFO: SUCCESS!@#KODE 1!@#USER_ID 21!@#ACTIVITY_CODE 2
12/11/2022 04:03:53 PM script INFO: SUCCESS!@#KODE 1!@#USER_ID 21!@#ACTIVITY_CODE 2
12/11/2022 04:03:53 PM script INFO: SUCCESS!@#KODE 1!@#USER_ID 21!@#ACTIVITY_CODE 3
12/11/2022 04:03:53 PM script INFO: SUCCESS!@#KODE 1!@#USER_ID 21!@#ACTIVITY_CODE 1
12/11/2022 04:03:53 PM script INFO: SUCCESS!@#KODE 1!@#USER_ID 21!@#ACTIVITY_CODE 3
12/11/2022 04:03:53 PM script INFO: SUCCESS!@#KODE 1!@#USER_ID 21!@#ACTIVITY_CODE 4
12/11/2022 04:03:53 PM script INFO: SUCCESS!@#KODE 1!@#USER_ID 21!@#ACTIVITY_CODE 3
12/11/2022 04:03:54 PM script INFO: SUCCESS!@#KODE 1!@#USER_ID 21!@#ACTIVITY_CODE 2
12/11/2022 04:03:54 PM script INFO: SUCCESS!@#KODE 1!@#USER_ID 21!@#ACTIVITY_CODE 3
12/11/2022 04:03:54 PM script INFO: SUCCESS!@#KODE 1!@#USER_ID 21!@#ACTIVITY_CODE 3
12/11/2022 04:03:54 PM script INFO: SUCCESS!@#KODE 1!@#USER_ID 21!@#ACTIVITY_CODE 4
12/11/2022 04:03:54 PM script INFO: SUCCESS!@#KODE 1!@#USER_ID 21!@#ACTIVITY_CODE 3
12/11/2022 04:03:54 PM script INFO: SUCCESS!@#KODE 1!@#USER_ID 21!@#ACTIVITY_CODE 3
12/11/2022 04:03:55 PM script INFO: SUCCESS!@#KODE 1!@#USER_ID 21!@#ACTIVITY_CODE 2
12/11/2022 04:03:55 PM script INFO: SUCCESS!@#KODE 1!@#USER_ID 21!@#ACTIVITY_CODE 2
12/11/2022 04:03:55 PM script INFO: SUCCESS!@#KODE 1!@#USER_ID 21!@#ACTIVITY_CODE 3
12/11/2022 04:03:56 PM script INFO: SUCCESS!@#KODE 1!@#USER_ID 21!@#ACTIVITY_CODE 2
12/11/2022 04:03:56 PM script INFO: SUCCESS!@#KODE 1!@#USER_ID 21!@#ACTIVITY_CODE 3
12/11/2022 04:03:56 PM script INFO: SUCCESS!@#KODE 1!@#USER_ID 21!@#ACTIVITY_CODE 1
12/11/2022 04:03:56 PM script INFO: SUCCESS!@#KODE 1!@#USER_ID 21!@#ACTIVITY_CODE 3
12/11/2022 04:03:56 PM script INFO: SUCCESS!@#KODE 1!@#USER_ID 21!@#ACTIVITY_CODE 3
12/11/2022 04:03:56 PM script INFO: SUCCESS!@#KODE 1!@#USER_ID 21!@#ACTIVITY_CODE 2
12/11/2022 04:03:57 PM script INFO: SUCCESS!@#KODE 1!@#USER_ID 21!@#ACTIVITY_CODE 3
12/11/2022 04:03:57 PM script INFO: SUCCESS!@#KODE 1!@#USER_ID 21!@#ACTIVITY_CODE 2
12/11/2022 04:03:57 PM script INFO: SUCCESS!@#KODE 1!@#USER_ID 21!@#ACTIVITY_CODE 2
12/11/2022 04:03:57 PM script INFO: SUCCESS!@#KODE 1!@#USER_ID 21!@#ACTIVITY_CODE 3
12/11/2022 04:03:58 PM script INFO: SUCCESS!@#KODE 1!@#USER_ID 21!@#ACTIVITY_CODE 3
12/11/2022 04:03:58 PM script INFO: SUCCESS!@#KODE 1!@#USER_ID 21!@#ACTIVITY_CODE 1
12/11/2022 04:03:58 PM script INFO: SUCCESS!@#KODE 1!@#USER_ID 21!@#ACTIVITY_CODE 3
12/11/2022 04:03:58 PM script INFO: SUCCESS!@#KODE 1!@#USER_ID 21!@#ACTIVITY_CODE 2
12/11/2022 04:03:58 PM script INFO: SUCCESS!@#KODE 1!@#USER_ID 21!@#ACTIVITY_CODE 1
12/11/2022 04:03:59 PM script INFO: SUCCESS!@#KODE 1!@#USER_ID 21!@#ACTIVITY_CODE 4
12/11/2022 04:03:59 PM script INFO: SUCCESS!@#KODE 1!@#USER_ID 21!@#ACTIVITY_CODE 1
12/11/2022 04:03:59 PM script INFO: SUCCESS!@#KODE 1!@#USER_ID 21!@#ACTIVITY_CODE 2
12/11/2022 04:03:59 PM script INFO: SUCCESS!@#KODE 1!@#USER_ID 21!@#ACTIVITY_CODE 2
12/11/2022 04:03:59 PM script INFO: SUCCESS!@#KODE 1!@#USER_ID 21!@#ACTIVITY_CODE 4
12/11/2022 04:04:00 PM script INFO: SUCCESS!@#KODE 1!@#USER_ID 21!@#ACTIVITY_CODE 2
12/11/2022 04:04:00 PM script INFO: SUCCESS!@#KODE 1!@#USER_ID 21!@#ACTIVITY_CODE 1
12/11/2022 04:04:00 PM script INFO: SUCCESS!@#KODE 1!@#USER_ID 21!@#ACTIVITY_CODE 2
12/11/2022 04:04:00 PM script INFO: SUCCESS!@#KODE 1!@#USER_ID 21!@#ACTIVITY_CODE 1
12/11/2022 04:04:00 PM script INFO: SUCCESS!@#KODE 1!@#USER_ID 21!@#ACTIVITY_CODE 1
12/11/2022 04:04:00 PM script INFO: SUCCESS!@#KODE 1!@#USER_ID 21!@#ACTIVITY_CODE 3
12/11/2022 04:04:00 PM script INFO: SUCCESS!@#KODE 1!@#USER_ID 21!@#ACTIVITY_CODE 1
12/11/2022 04:04:01 PM script INFO: SUCCESS!@#KODE 1!@#USER_ID 21!@#ACTIVITY_CODE 4
12/11/2022 04:04:01 PM script INFO: SUCCESS!@#KODE 1!@#USER_ID 21!@#ACTIVITY_CODE 1
12/11/2022 04:04:01 PM script INFO: SUCCESS!@#KODE 1!@#USER_ID 21!@#ACTIVITY_CODE 3
12/11/2022 04:04:01 PM script INFO: SUCCESS!@#KODE 1!@#USER_ID 21!@#ACTIVITY_CODE 2
12/11/2022 04:04:01 PM script INFO: SUCCESS!@#KODE 1!@#USER_ID 21!@#ACTIVITY_CODE 3
12/11/2022 04:04:01 PM script INFO: SUCCESS!@#KODE 1!@#USER_ID 21!@#ACTIVITY_CODE 1
12/11/2022 04:04:02 PM script INFO: SUCCESS!@#KODE 1!@#USER_ID 21!@#ACTIVITY_CODE 2
12/11/2022 04:04:02 PM script INFO: SUCCESS!@#KODE 1!@#USER_ID 21!@#ACTIVITY_CODE 3
12/11/2022 04:04:02 PM script INFO: SUCCESS!@#KODE 1!@#USER_ID 21!@#ACTIVITY_CODE 3
12/11/2022 04:04:02 PM script INFO: SUCCESS!@#KODE 1!@#USER_ID 21!@#ACTIVITY_CODE 4
12/11/2022 04:04:02 PM script INFO: SUCCESS!@#KODE 1!@#USER_ID 21!@#ACTIVITY_CODE 2
12/11/2022 04:04:02 PM script INFO: SUCCESS!@#KODE 1!@#USER_ID 21!@#ACTIVITY_CODE 2
12/11/2022 04:04:03 PM script INFO: SUCCESS!@#KODE 1!@#USER_ID 21!@#ACTIVITY_CODE 1
12/11/2022 04:04:03 PM script INFO: SUCCESS!@#KODE 1!@#USER_ID 21!@#ACTIVITY_CODE 3
12/11/2022 04:04:03 PM script INFO: SUCCESS!@#KODE 1!@#USER_ID 21!@#ACTIVITY_CODE 3
12/11/2022 04:04:03 PM script INFO: SUCCESS!@#KODE 1!@#USER_ID 21!@#ACTIVITY_CODE 3
12/11/2022 04:04:03 PM script INFO: SUCCESS!@#KODE 1!@#USER_ID 21!@#ACTIVITY_CODE 1
12/11/2022 04:04:03 PM script INFO: SUCCESS!@#KODE 1!@#USER_ID 21!@#ACTIVITY_CODE 3
12/11/2022 04:04:03 PM script INFO: SUCCESS!@#KODE 1!@#USER_ID 21!@#ACTIVITY_CODE 4
12/11/2022 04:04:03 PM script INFO: SUCCESS!@#KODE 1!@#USER_ID 21!@#ACTIVITY_CODE 3
12/11/2022 04:04:04 PM script INFO: SUCCESS!@#KODE 1!@#USER_ID 21!@#ACTIVITY_CODE 2
12/11/2022 04:04:04 PM script INFO: SUCCESS!@#KODE 1!@#USER_ID 21!@#ACTIVITY_CODE 3
12/11/2022 04:04:04 PM script INFO: SUCCESS!@#KODE 1!@#USER_ID 21!@#ACTIVITY_CODE 1
12/11/2022 04:04:04 PM script INFO: SUCCESS!@#KODE 1!@#USER_ID 21!@#ACTIVITY_CODE 2
12/11/2022 04:04:04 PM script INFO: SUCCESS!@#KODE 1!@#USER_ID 21!@#ACTIVITY_CODE 1
12/11/2022 04:04:04 PM script INFO: SUCCESS!@#KODE 1!@#USER_ID 21!@#ACTIVITY_CODE 1
12/11/2022 04:04:04 PM script INFO: SUCCESS!@#KODE 1!@#USER_ID 21!@#ACTIVITY_CODE 2
12/11/2022 04:04:05 PM script INFO: SUCCESS!@#KODE 1!@#USER_ID 21!@#ACTIVITY_CODE 2
12/11/2022 04:04:05 PM script INFO: SUCCESS!@#KODE 1!@#USER_ID 21!@#ACTIVITY_CODE 1
12/11/2022 04:04:05 PM script INFO: SUCCESS!@#KODE 1!@#USER_ID 21!@#ACTIVITY_CODE 4
12/11/2022 04:04:05 PM script INFO: SUCCESS!@#KODE 1!@#USER_ID 21!@#ACTIVITY_CODE 1
12/11/2022 04:04:05 PM script INFO: SUCCESS!@#KODE 1!@#USER_ID 21!@#ACTIVITY_CODE 2
12/11/2022 04:04:05 PM script INFO: SUCCESS!@#KODE 1!@#USER_ID 21!@#ACTIVITY_CODE 2
12/11/2022 04:04:05 PM script INFO: SUCCESS!@#KODE 1!@#USER_ID 21!@#ACTIVITY_CODE 1
12/11/2022 04:04:06 PM script INFO: SUCCESS!@#KODE 1!@#USER_ID 21!@#ACTIVITY_CODE 4
12/11/2022 04:04:06 PM script INFO: SUCCESS!@#KODE 1!@#USER_ID 21!@#ACTIVITY_CODE 1
12/11/2022 04:04:06 PM script INFO: SUCCESS!@#KODE 1!@#USER_ID 21!@#ACTIVITY_CODE 2
12/11/2022 04:04:06 PM script INFO: SUCCESS!@#KODE 1!@#USER_ID 21!@#ACTIVITY_CODE 1
12/11/2022 04:04:06 PM script INFO: SUCCESS!@#KODE 1!@#USER_ID 21!@#ACTIVITY_CODE 4
12/11/2022 04:04:06 PM script INFO: SUCCESS!@#KODE 1!@#USER_ID 21!@#ACTIVITY_CODE 2
12/11/2022 04:04:07 PM script INFO: SUCCESS!@#KODE 1!@#USER_ID 21!@#ACTIVITY_CODE 3
12/11/2022 04:04:07 PM script INFO: SUCCESS!@#KODE 1!@#USER_ID 21!@#ACTIVITY_CODE 4
12/11/2022 04:04:07 PM script INFO: SUCCESS!@#KODE 1!@#USER_ID 21!@#ACTIVITY_CODE 2
12/11/2022 04:04:07 PM script INFO: SUCCESS!@#KODE 1!@#USER_ID 21!@#ACTIVITY_CODE 1
12/11/2022 04:04:07 PM script INFO: SUCCESS!@#KODE 1!@#USER_ID 21!@#ACTIVITY_CODE 2
12/11/2022 04:04:07 PM script INFO: SUCCESS!@#KODE 1!@#USER_ID 21!@#ACTIVITY_CODE 1
12/11/2022 04:04:07 PM script INFO: SUCCESS!@#KODE 1!@#USER_ID 21!@#ACTIVITY_CODE 1
12/11/2022 04:04:08 PM script INFO: SUCCESS!@#KODE 1!@#USER_ID 21!@#ACTIVITY_CODE 3
12/11/2022 04:04:08 PM script INFO: SUCCESS!@#KODE 1!@#USER_ID 21!@#ACTIVITY_CODE 2
12/11/2022 04:04:08 PM script INFO: SUCCESS!@#KODE 1!@#USER_ID 21!@#ACTIVITY_CODE 3
12/11/2022 04:04:08 PM script INFO: SUCCESS!@#KODE 1!@#USER_ID 21!@#ACTIVITY_CODE 3
12/11/2022 04:04:08 PM script INFO: SUCCESS!@#KODE 1!@#USER_ID 21!@#ACTIVITY_CODE 3
12/11/2022 04:04:08 PM script INFO: SUCCESS!@#KODE 1!@#USER_ID 21!@#ACTIVITY_CODE 1
12/11/2022 04:04:08 PM script INFO: SUCCESS!@#KODE 1!@#USER_ID 21!@#ACTIVITY_CODE 1
12/11/2022 04:04:08 PM script INFO: SUCCESS!@#KODE 1!@#USER_ID 21!@#ACTIVITY_CODE 3
12/11/2022 04:04:09 PM script INFO: SUCCESS!@#KODE 1!@#USER_ID 21!@#ACTIVITY_CODE 2
12/11/2022 04:04:09 PM script INFO: SUCCESS!@#KODE 1!@#USER_ID 21!@#ACTIVITY_CODE 1
12/11/2022 04:04:09 PM script INFO: SUCCESS!@#KODE 1!@#USER_ID 21!@#ACTIVITY_CODE 4
12/11/2022 04:04:09 PM script INFO: SUCCESS!@#KODE 1!@#USER_ID 21!@#ACTIVITY_CODE 2
12/11/2022 04:04:09 PM script INFO: SUCCESS!@#KODE 1!@#USER_ID 21!@#ACTIVITY_CODE 3
12/11/2022 04:04:09 PM script INFO: SUCCESS!@#KODE 1!@#USER_ID 21!@#ACTIVITY_CODE 1
12/11/2022 04:04:09 PM script INFO: SUCCESS!@#KODE 1!@#USER_ID 21!@#ACTIVITY_CODE 2
12/11/2022 04:04:09 PM script INFO: SUCCESS!@#KODE 1!@#USER_ID 21!@#ACTIVITY_CODE 3
12/11/2022 04:04:10 PM script INFO: SUCCESS!@#KODE 1!@#USER_ID 21!@#ACTIVITY_CODE 2
12/11/2022 04:04:10 PM script INFO: SUCCESS!@#KODE 1!@#USER_ID 21!@#ACTIVITY_CODE 3
12/11/2022 04:04:10 PM script INFO: SUCCESS!@#KODE 1!@#USER_ID 21!@#ACTIVITY_CODE 1
12/11/2022 04:04:10 PM script INFO: SUCCESS!@#KODE 1!@#USER_ID 21!@#ACTIVITY_CODE 4
12/11/2022 04:04:10 PM script INFO: SUCCESS!@#KODE 1!@#USER_ID 21!@#ACTIVITY_CODE 3
12/11/2022 04:04:10 PM script INFO: SUCCESS!@#KODE 1!@#USER_ID 21!@#ACTIVITY_CODE 2
12/11/2022 04:04:10 PM script INFO: SUCCESS!@#KODE 1!@#USER_ID 21!@#ACTIVITY_CODE 3
12/11/2022 04:04:10 PM script INFO: SUCCESS!@#KODE 1!@#USER_ID 21!@#ACTIVITY_CODE 2
12/11/2022 04:04:11 PM script INFO: SUCCESS!@#KODE 1!@#USER_ID 21!@#ACTIVITY_CODE 2
12/11/2022 04:04:11 PM script INFO: SUCCESS!@#KODE 1!@#USER_ID 21!@#ACTIVITY_CODE 1
12/11/2022 04:04:11 PM script INFO: SUCCESS!@#KODE 1!@#USER_ID 21!@#ACTIVITY_CODE 1
12/11/2022 04:04:11 PM script INFO: SUCCESS!@#KODE 1!@#USER_ID 21!@#ACTIVITY_CODE 4
12/11/2022 04:04:11 PM script INFO: SUCCESS!@#KODE 1!@#USER_ID 21!@#ACTIVITY_CODE 2
12/11/2022 04:04:11 PM script INFO: SUCCESS!@#KODE 1!@#USER_ID 21!@#ACTIVITY_CODE 1
12/11/2022 04:04:11 PM script INFO: SUCCESS!@#KODE 1!@#USER_ID 21!@#ACTIVITY_CODE 1
12/11/2022 04:04:11 PM script INFO: SUCCESS!@#KODE 1!@#USER_ID 21!@#ACTIVITY_CODE 2
12/11/2022 04:04:11 PM script INFO: SUCCESS!@#KODE 1!@#USER_ID 21!@#ACTIVITY_CODE 3
12/11/2022 04:04:11 PM script INFO: SUCCESS!@#KODE 1!@#USER_ID 21!@#ACTIVITY_CODE 1
12/11/2022 04:04:12 PM script INFO: SUCCESS!@#KODE 1!@#USER_ID 21!@#ACTIVITY_CODE 4
12/11/2022 04:04:12 PM script INFO: SUCCESS!@#KODE 1!@#USER_ID 21!@#ACTIVITY_CODE 3
12/11/2022 04:04:12 PM script INFO: SUCCESS!@#KODE 1!@#USER_ID 21!@#ACTIVITY_CODE 2
12/11/2022 04:04:12 PM script INFO: SUCCESS!@#KODE 1!@#USER_ID 21!@#ACTIVITY_CODE 2
12/11/2022 04:04:12 PM script INFO: SUCCESS!@#KODE 1!@#USER_ID 21!@#ACTIVITY_CODE 2
12/11/2022 04:04:12 PM script INFO: SUCCESS!@#KODE 1!@#USER_ID 21!@#ACTIVITY_CODE 4
12/11/2022 04:04:12 PM script INFO: SUCCESS!@#KODE 1!@#USER_ID 21!@#ACTIVITY_CODE 1
12/11/2022 04:04:12 PM script INFO: SUCCESS!@#KODE 1!@#USER_ID 21!@#ACTIVITY_CODE 1
12/11/2022 04:04:13 PM script INFO: SUCCESS!@#KODE 1!@#USER_ID 21!@#ACTIVITY_CODE 1
12/11/2022 04:04:13 PM script INFO: SUCCESS!@#KODE 1!@#USER_ID 21!@#ACTIVITY_CODE 2
12/11/2022 04:04:13 PM script INFO: SUCCESS!@#KODE 1!@#USER_ID 21!@#ACTIVITY_CODE 3
12/11/2022 04:04:13 PM script INFO: SUCCESS!@#KODE 1!@#USER_ID 21!@#ACTIVITY_CODE 1
12/11/2022 04:04:13 PM script INFO: SUCCESS!@#KODE 1!@#USER_ID 21!@#ACTIVITY_CODE 4
12/11/2022 04:04:13 PM script INFO: SUCCESS!@#KODE 1!@#USER_ID 21!@#ACTIVITY_CODE 2
12/11/2022 04:04:13 PM script INFO: SUCCESS!@#KODE 1!@#USER_ID 21!@#ACTIVITY_CODE 3
12/11/2022 04:04:13 PM script INFO: SUCCESS!@#KODE 1!@#USER_ID 21!@#ACTIVITY_CODE 1
12/11/2022 04:04:13 PM script INFO: SUCCESS!@#KODE 1!@#USER_ID 21!@#ACTIVITY_CODE 3
12/11/2022 04:04:14 PM script INFO: SUCCESS!@#KODE 1!@#USER_ID 21!@#ACTIVITY_CODE 1
12/11/2022 04:04:14 PM script INFO: SUCCESS!@#KODE 1!@#USER_ID 21!@#ACTIVITY_CODE 1
12/11/2022 04:04:14 PM script INFO: SUCCESS!@#KODE 1!@#USER_ID 21!@#ACTIVITY_CODE 1
12/11/2022 04:04:14 PM script INFO: SUCCESS!@#KODE 1!@#USER_ID 21!@#ACTIVITY_CODE 4
12/11/2022 04:04:14 PM script INFO: SUCCESS!@#KODE 1!@#USER_ID 21!@#ACTIVITY_CODE 1
12/11/2022 04:04:14 PM script INFO: SUCCESS!@#KODE 1!@#USER_ID 21!@#ACTIVITY_CODE 1
12/11/2022 04:04:14 PM script INFO: SUCCESS!@#KODE 1!@#USER_ID 21!@#ACTIVITY_CODE 1
12/11/2022 04:04:14 PM script INFO: SUCCESS!@#KODE 1!@#USER_ID 21!@#ACTIVITY_CODE 4
12/11/2022 04:04:14 PM script INFO: SUCCESS!@#KODE 1!@#USER_ID 21!@#ACTIVITY_CODE 2
12/11/2022 04:04:14 PM script INFO: SUCCESS!@#KODE 1!@#USER_ID 21!@#ACTIVITY_CODE 2
12/11/2022 04:04:15 PM script INFO: SUCCESS!@#KODE 1!@#USER_ID 21!@#ACTIVITY_CODE 1
12/11/2022 04:04:15 PM script INFO: SUCCESS!@#KODE 1!@#USER_ID 21!@#ACTIVITY_CODE 3
12/11/2022 04:04:15 PM script INFO: SUCCESS!@#KODE 1!@#USER_ID 21!@#ACTIVITY_CODE 2
12/11/2022 04:04:15 PM script INFO: SUCCESS!@#KODE 1!@#USER_ID 21!@#ACTIVITY_CODE 4
12/11/2022 04:04:15 PM script INFO: SUCCESS!@#KODE 1!@#USER_ID 21!@#ACTIVITY_CODE 2
12/11/2022 04:04:15 PM script INFO: SUCCESS!@#KODE 1!@#USER_ID 21!@#ACTIVITY_CODE 2
12/11/2022 04:04:15 PM script INFO: SUCCESS!@#KODE 1!@#USER_ID 21!@#ACTIVITY_CODE 1
12/11/2022 04:04:15 PM script INFO: SUCCESS!@#KODE 1!@#USER_ID 21!@#ACTIVITY_CODE 1
12/11/2022 04:04:15 PM script INFO: SUCCESS!@#KODE 1!@#USER_ID 21!@#ACTIVITY_CODE 3
12/11/2022 04:04:16 PM script INFO: SUCCESS!@#KODE 1!@#USER_ID 21!@#ACTIVITY_CODE 3
12/11/2022 04:04:16 PM script INFO: SUCCESS!@#KODE 1!@#USER_ID 21!@#ACTIVITY_CODE 2
12/11/2022 04:04:16 PM script INFO: SUCCESS!@#KODE 1!@#USER_ID 21!@#ACTIVITY_CODE 1
12/11/2022 04:04:16 PM script INFO: SUCCESS!@#KODE 1!@#USER_ID 21!@#ACTIVITY_CODE 3
12/11/2022 04:04:16 PM script INFO: SUCCESS!@#KODE 1!@#USER_ID 21!@#ACTIVITY_CODE 3
12/11/2022 04:04:16 PM script INFO: SUCCESS!@#KODE 1!@#USER_ID 21!@#ACTIVITY_CODE 3
12/11/2022 04:04:16 PM script INFO: SUCCESS!@#KODE 1!@#USER_ID 21!@#ACTIVITY_CODE 2
12/11/2022 04:04:16 PM script INFO: SUCCESS!@#KODE 1!@#USER_ID 21!@#ACTIVITY_CODE 1
12/11/2022 04:04:16 PM script INFO: SUCCESS!@#KODE 1!@#USER_ID 21!@#ACTIVITY_CODE 4
12/11/2022 04:04:17 PM script INFO: SUCCESS!@#KODE 1!@#USER_ID 21!@#ACTIVITY_CODE 1
12/11/2022 04:04:17 PM script INFO: SUCCESS!@#KODE 1!@#USER_ID 21!@#ACTIVITY_CODE 3
12/11/2022 04:04:17 PM script INFO: SUCCESS!@#KODE 1!@#USER_ID 21!@#ACTIVITY_CODE 2
12/11/2022 04:04:17 PM script INFO: SUCCESS!@#KODE 1!@#USER_ID 21!@#ACTIVITY_CODE 1
12/11/2022 04:04:17 PM script INFO: SUCCESS!@#KODE 1!@#USER_ID 21!@#ACTIVITY_CODE 2
12/11/2022 04:04:17 PM script INFO: SUCCESS!@#KODE 1!@#USER_ID 21!@#ACTIVITY_CODE 3
12/11/2022 04:04:17 PM script INFO: SUCCESS!@#KODE 1!@#USER_ID 21!@#ACTIVITY_CODE 3
12/11/2022 04:04:17 PM script INFO: SUCCESS!@#KODE 1!@#USER_ID 21!@#ACTIVITY_CODE 4
12/11/2022 04:04:18 PM script INFO: SUCCESS!@#KODE 1!@#USER_ID 21!@#ACTIVITY_CODE 2
12/11/2022 04:04:18 PM script INFO: SUCCESS!@#KODE 1!@#USER_ID 21!@#ACTIVITY_CODE 1
12/11/2022 04:04:18 PM script INFO: SUCCESS!@#KODE 1!@#USER_ID 21!@#ACTIVITY_CODE 2
12/11/2022 04:04:18 PM script INFO: SUCCESS!@#KODE 1!@#USER_ID 21!@#ACTIVITY_CODE 2
12/11/2022 04:04:18 PM script INFO: SUCCESS!@#KODE 1!@#USER_ID 21!@#ACTIVITY_CODE 3
12/11/2022 04:04:18 PM script INFO: SUCCESS!@#KODE 1!@#USER_ID 21!@#ACTIVITY_CODE 3
12/11/2022 04:04:18 PM script INFO: SUCCESS!@#KODE 1!@#USER_ID 21!@#ACTIVITY_CODE 3
12/11/2022 04:04:18 PM script INFO: SUCCESS!@#KODE 1!@#USER_ID 21!@#ACTIVITY_CODE 3
12/11/2022 04:04:18 PM script INFO: SUCCESS!@#KODE 1!@#USER_ID 21!@#ACTIVITY_CODE 3
12/11/2022 04:04:19 PM script INFO: SUCCESS!@#KODE 1!@#USER_ID 21!@#ACTIVITY_CODE 2
12/11/2022 04:04:19 PM script INFO: SUCCESS!@#KODE 1!@#USER_ID 21!@#ACTIVITY_CODE 2
12/11/2022 04:04:19 PM script INFO: SUCCESS!@#KODE 1!@#USER_ID 21!@#ACTIVITY_CODE 4
12/11/2022 04:04:19 PM script INFO: SUCCESS!@#KODE 1!@#USER_ID 21!@#ACTIVITY_CODE 3
12/11/2022 04:04:19 PM script INFO: SUCCESS!@#KODE 1!@#USER_ID 21!@#ACTIVITY_CODE 3
12/11/2022 04:04:19 PM script INFO: SUCCESS!@#KODE 1!@#USER_ID 21!@#ACTIVITY_CODE 1
12/11/2022 04:04:19 PM script INFO: SUCCESS!@#KODE 1!@#USER_ID 21!@#ACTIVITY_CODE 1
12/11/2022 04:04:19 PM script INFO: SUCCESS!@#KODE 1!@#USER_ID 21!@#ACTIVITY_CODE 1
12/11/2022 04:04:19 PM script INFO: SUCCESS!@#KODE 1!@#USER_ID 21!@#ACTIVITY_CODE 1
12/11/2022 04:04:19 PM script INFO: SUCCESS!@#KODE 1!@#USER_ID 21!@#ACTIVITY_CODE 4
12/11/2022 04:04:19 PM script INFO: SUCCESS!@#KODE 1!@#USER_ID 21!@#ACTIVITY_CODE 1
12/11/2022 04:04:20 PM script INFO: SUCCESS!@#KODE 1!@#USER_ID 21!@#ACTIVITY_CODE 2
12/11/2022 04:04:20 PM script INFO: SUCCESS!@#KODE 1!@#USER_ID 21!@#ACTIVITY_CODE 3
12/11/2022 04:04:20 PM script INFO: SUCCESS!@#KODE 1!@#USER_ID 21!@#ACTIVITY_CODE 2
12/11/2022 04:04:20 PM script INFO: SUCCESS!@#KODE 1!@#USER_ID 21!@#ACTIVITY_CODE 1
12/11/2022 04:04:20 PM script INFO: SUCCESS!@#KODE 1!@#USER_ID 21!@#ACTIVITY_CODE 3
12/11/2022 04:04:20 PM script INFO: SUCCESS!@#KODE 1!@#USER_ID 21!@#ACTIVITY_CODE 1
12/11/2022 04:04:20 PM script INFO: SUCCESS!@#KODE 1!@#USER_ID 21!@#ACTIVITY_CODE 2
12/11/2022 04:04:20 PM script INFO: SUCCESS!@#KODE 1!@#USER_ID 21!@#ACTIVITY_CODE 4
12/11/2022 04:04:20 PM script INFO: SUCCESS!@#KODE 1!@#USER_ID 21!@#ACTIVITY_CODE 3
12/11/2022 04:04:20 PM script INFO: SUCCESS!@#KODE 1!@#USER_ID 21!@#ACTIVITY_CODE 1
12/11/2022 04:04:21 PM script INFO: SUCCESS!@#KODE 1!@#USER_ID 21!@#ACTIVITY_CODE 3
12/11/2022 04:04:21 PM script INFO: SUCCESS!@#KODE 1!@#USER_ID 21!@#ACTIVITY_CODE 4
12/11/2022 04:04:21 PM script INFO: SUCCESS!@#KODE 1!@#USER_ID 21!@#ACTIVITY_CODE 1
12/11/2022 04:04:21 PM script INFO: SUCCESS!@#KODE 1!@#USER_ID 21!@#ACTIVITY_CODE 3
12/11/2022 04:04:21 PM script INFO: SUCCESS!@#KODE 1!@#USER_ID 21!@#ACTIVITY_CODE 4
12/11/2022 04:04:21 PM script INFO: SUCCESS!@#KODE 1!@#USER_ID 21!@#ACTIVITY_CODE 3
12/11/2022 04:04:21 PM script INFO: SUCCESS!@#KODE 1!@#USER_ID 21!@#ACTIVITY_CODE 2
12/11/2022 04:04:21 PM script INFO: SUCCESS!@#KODE 1!@#USER_ID 21!@#ACTIVITY_CODE 2
12/11/2022 04:04:21 PM script INFO: SUCCESS!@#KODE 1!@#USER_ID 21!@#ACTIVITY_CODE 3
12/11/2022 04:04:22 PM script INFO: SUCCESS!@#KODE 1!@#USER_ID 21!@#ACTIVITY_CODE 2
12/11/2022 04:04:22 PM script INFO: SUCCESS!@#KODE 1!@#USER_ID 21!@#ACTIVITY_CODE 1
12/11/2022 04:04:22 PM script INFO: SUCCESS!@#KODE 1!@#USER_ID 21!@#ACTIVITY_CODE 2
12/11/2022 04:04:22 PM script INFO: SUCCESS!@#KODE 1!@#USER_ID 21!@#ACTIVITY_CODE 1
12/11/2022 04:04:22 PM script INFO: SUCCESS!@#KODE 1!@#USER_ID 21!@#ACTIVITY_CODE 1
12/11/2022 04:04:22 PM script INFO: SUCCESS!@#KODE 1!@#USER_ID 21!@#ACTIVITY_CODE 2
12/11/2022 04:04:22 PM script INFO: SUCCESS!@#KODE 1!@#USER_ID 21!@#ACTIVITY_CODE 2
12/11/2022 04:04:22 PM script INFO: SUCCESS!@#KODE 1!@#USER_ID 21!@#ACTIVITY_CODE 2
12/11/2022 04:04:22 PM script INFO: SUCCESS!@#KODE 1!@#USER_ID 21!@#ACTIVITY_CODE 1
12/11/2022 04:04:22 PM script INFO: SUCCESS!@#KODE 1!@#USER_ID 21!@#ACTIVITY_CODE 1
12/11/2022 04:04:23 PM script INFO: SUCCESS!@#KODE 1!@#USER_ID 21!@#ACTIVITY_CODE 1
12/11/2022 04:04:23 PM script INFO: SUCCESS!@#KODE 1!@#USER_ID 21!@#ACTIVITY_CODE 3
12/11/2022 04:04:23 PM script INFO: SUCCESS!@#KODE 1!@#USER_ID 21!@#ACTIVITY_CODE 3
12/11/2022 04:04:23 PM script INFO: SUCCESS!@#KODE 1!@#USER_ID 21!@#ACTIVITY_CODE 3
12/11/2022 04:04:23 PM script INFO: SUCCESS!@#KODE 1!@#USER_ID 21!@#ACTIVITY_CODE 1
12/11/2022 04:04:23 PM script INFO: SUCCESS!@#KODE 1!@#USER_ID 21!@#ACTIVITY_CODE 1
12/11/2022 04:04:23 PM script INFO: SUCCESS!@#KODE 1!@#USER_ID 21!@#ACTIVITY_CODE 1
12/11/2022 04:04:23 PM script INFO: SUCCESS!@#KODE 1!@#USER_ID 21!@#ACTIVITY_CODE 3
12/11/2022 04:04:23 PM script INFO: SUCCESS!@#KODE 1!@#USER_ID 21!@#ACTIVITY_CODE 3
12/11/2022 04:04:23 PM script INFO: SUCCESS!@#KODE 1!@#USER_ID 21!@#ACTIVITY_CODE 1
12/11/2022 04:04:23 PM script INFO: SUCCESS!@#KODE 1!@#USER_ID 21!@#ACTIVITY_CODE 2
12/11/2022 04:04:23 PM script INFO: SUCCESS!@#KODE 1!@#USER_ID 21!@#ACTIVITY_CODE 3
12/11/2022 04:04:24 PM script INFO: SUCCESS!@#KODE 1!@#USER_ID 21!@#ACTIVITY_CODE 3
12/11/2022 04:04:24 PM script INFO: SUCCESS!@#KODE 1!@#USER_ID 21!@#ACTIVITY_CODE 1
12/11/2022 04:04:24 PM script INFO: SUCCESS!@#KODE 1!@#USER_ID 21!@#ACTIVITY_CODE 3
12/11/2022 04:04:24 PM script INFO: SUCCESS!@#KODE 1!@#USER_ID 21!@#ACTIVITY_CODE 1
12/11/2022 04:04:24 PM script INFO: SUCCESS!@#KODE 1!@#USER_ID 21!@#ACTIVITY_CODE 1
12/11/2022 04:04:24 PM script INFO: SUCCESS!@#KODE 1!@#USER_ID 21!@#ACTIVITY_CODE 4
12/11/2022 04:04:24 PM script INFO: SUCCESS!@#KODE 1!@#USER_ID 21!@#ACTIVITY_CODE 1
12/11/2022 04:04:24 PM script INFO: SUCCESS!@#KODE 1!@#USER_ID 21!@#ACTIVITY_CODE 4
12/11/2022 04:04:24 PM script INFO: SUCCESS!@#KODE 1!@#USER_ID 21!@#ACTIVITY_CODE 1
12/11/2022 04:04:24 PM script INFO: SUCCESS!@#KODE 1!@#USER_ID 21!@#ACTIVITY_CODE 1
12/11/2022 04:04:24 PM script INFO: SUCCESS!@#KODE 1!@#USER_ID 21!@#ACTIVITY_CODE 4
12/11/2022 04:04:24 PM script INFO: SUCCESS!@#KODE 1!@#USER_ID 21!@#ACTIVITY_CODE 3
12/11/2022 04:04:24 PM script INFO: SUCCESS!@#KODE 1!@#USER_ID 21!@#ACTIVITY_CODE 3
12/11/2022 04:04:24 PM script INFO: SUCCESS!@#KODE 1!@#USER_ID 21!@#ACTIVITY_CODE 3
12/11/2022 04:04:24 PM script INFO: SUCCESS!@#KODE 1!@#USER_ID 21!@#ACTIVITY_CODE 3
12/11/2022 04:04:25 PM script INFO: SUCCESS!@#KODE 1!@#USER_ID 21!@#ACTIVITY_CODE 3
12/11/2022 04:04:25 PM script INFO: SUCCESS!@#KODE 1!@#USER_ID 21!@#ACTIVITY_CODE 3
12/11/2022 04:04:25 PM script INFO: SUCCESS!@#KODE 1!@#USER_ID 21!@#ACTIVITY_CODE 3
12/11/2022 04:04:25 PM script INFO: SUCCESS!@#KODE 1!@#USER_ID 21!@#ACTIVITY_CODE 1
12/11/2022 04:04:25 PM script INFO: SUCCESS!@#KODE 1!@#USER_ID 21!@#ACTIVITY_CODE 1
12/11/2022 04:04:25 PM script INFO: SUCCESS!@#KODE 1!@#USER_ID 21!@#ACTIVITY_CODE 3
12/11/2022 04:04:25 PM script INFO: SUCCESS!@#KODE 1!@#USER_ID 21!@#ACTIVITY_CODE 2
12/11/2022 04:04:25 PM script INFO: SUCCESS!@#KODE 1!@#USER_ID 21!@#ACTIVITY_CODE 1
12/11/2022 04:04:25 PM script INFO: SUCCESS!@#KODE 1!@#USER_ID 21!@#ACTIVITY_CODE 3
12/11/2022 04:04:25 PM script INFO: SUCCESS!@#KODE 1!@#USER_ID 21!@#ACTIVITY_CODE 4
12/11/2022 04:04:25 PM script INFO: SUCCESS!@#KODE 1!@#USER_ID 21!@#ACTIVITY_CODE 1
12/11/2022 04:04:25 PM script INFO: SUCCESS!@#KODE 1!@#USER_ID 21!@#ACTIVITY_CODE 3
12/11/2022 04:04:25 PM script INFO: SUCCESS!@#KODE 1!@#USER_ID 21!@#ACTIVITY_CODE 2
12/11/2022 04:04:26 PM script INFO: SUCCESS!@#KODE 1!@#USER_ID 21!@#ACTIVITY_CODE 3
12/11/2022 04:04:26 PM script INFO: SUCCESS!@#KODE 1!@#USER_ID 21!@#ACTIVITY_CODE 1
12/11/2022 04:04:26 PM script INFO: SUCCESS!@#KODE 1!@#USER_ID 21!@#ACTIVITY_CODE 2
12/11/2022 04:04:26 PM script INFO: SUCCESS!@#KODE 1!@#USER_ID 21!@#ACTIVITY_CODE 1
12/11/2022 04:04:26 PM script INFO: SUCCESS!@#KODE 1!@#USER_ID 21!@#ACTIVITY_CODE 1
12/11/2022 04:04:26 PM script INFO: SUCCESS!@#KODE 1!@#USER_ID 21!@#ACTIVITY_CODE 3
12/11/2022 04:04:26 PM script INFO: SUCCESS!@#KODE 1!@#USER_ID 21!@#ACTIVITY_CODE 3
12/11/2022 04:04:26 PM script INFO: SUCCESS!@#KODE 1!@#USER_ID 21!@#ACTIVITY_CODE 1
12/11/2022 04:04:26 PM script INFO: SUCCESS!@#KODE 1!@#USER_ID 21!@#ACTIVITY_CODE 1
12/11/2022 04:04:26 PM script INFO: SUCCESS!@#KODE 1!@#USER_ID 21!@#ACTIVITY_CODE 1
12/11/2022 04:04:26 PM script INFO: SUCCESS!@#KODE 1!@#USER_ID 21!@#ACTIVITY_CODE 4
12/11/2022 04:04:26 PM script INFO: SUCCESS!@#KODE 1!@#USER_ID 21!@#ACTIVITY_CODE 1
12/11/2022 04:04:26 PM script INFO: SUCCESS!@#KODE 1!@#USER_ID 21!@#ACTIVITY_CODE 4
12/11/2022 04:04:26 PM script INFO: SUCCESS!@#KODE 1!@#USER_ID 21!@#ACTIVITY_CODE 3
12/11/2022 04:04:27 PM script INFO: SUCCESS!@#KODE 1!@#USER_ID 21!@#ACTIVITY_CODE 2
12/11/2022 04:04:27 PM script INFO: SUCCESS!@#KODE 1!@#USER_ID 21!@#ACTIVITY_CODE 3
12/11/2022 04:04:27 PM script INFO: SUCCESS!@#KODE 1!@#USER_ID 21!@#ACTIVITY_CODE 3
12/11/2022 04:04:27 PM script INFO: SUCCESS!@#KODE 1!@#USER_ID 21!@#ACTIVITY_CODE 2
12/11/2022 04:04:27 PM script INFO: SUCCESS!@#KODE 1!@#USER_ID 21!@#ACTIVITY_CODE 1
12/11/2022 04:04:27 PM script INFO: SUCCESS!@#KODE 1!@#USER_ID 21!@#ACTIVITY_CODE 3
12/11/2022 04:04:27 PM script INFO: SUCCESS!@#KODE 1!@#USER_ID 21!@#ACTIVITY_CODE 2
12/11/2022 04:04:27 PM script INFO: SUCCESS!@#KODE 1!@#USER_ID 21!@#ACTIVITY_CODE 1
12/11/2022 04:04:27 PM script INFO: SUCCESS!@#KODE 1!@#USER_ID 21!@#ACTIVITY_CODE 3
12/11/2022 04:04:27 PM script INFO: SUCCESS!@#KODE 1!@#USER_ID 21!@#ACTIVITY_CODE 3
12/11/2022 04:04:27 PM script INFO: SUCCESS!@#KODE 1!@#USER_ID 21!@#ACTIVITY_CODE 1
12/11/2022 04:04:27 PM script INFO: SUCCESS!@#KODE 1!@#USER_ID 21!@#ACTIVITY_CODE 2
12/11/2022 04:04:28 PM script INFO: SUCCESS!@#KODE 1!@#USER_ID 21!@#ACTIVITY_CODE 3
12/11/2022 04:04:28 PM script INFO: SUCCESS!@#KODE 1!@#USER_ID 21!@#ACTIVITY_CODE 3
12/11/2022 04:04:28 PM script INFO: SUCCESS!@#KODE 1!@#USER_ID 21!@#ACTIVITY_CODE 3
12/11/2022 04:04:28 PM script INFO: SUCCESS!@#KODE 1!@#USER_ID 21!@#ACTIVITY_CODE 3
12/11/2022 04:04:28 PM script INFO: SUCCESS!@#KODE 1!@#USER_ID 21!@#ACTIVITY_CODE 2
12/11/2022 04:04:28 PM script INFO: SUCCESS!@#KODE 1!@#USER_ID 21!@#ACTIVITY_CODE 2
12/11/2022 04:04:28 PM script INFO: SUCCESS!@#KODE 1!@#USER_ID 21!@#ACTIVITY_CODE 2
12/11/2022 04:04:28 PM script INFO: SUCCESS!@#KODE 1!@#USER_ID 21!@#ACTIVITY_CODE 1
12/11/2022 04:04:28 PM script INFO: SUCCESS!@#KODE 1!@#USER_ID 21!@#ACTIVITY_CODE 2
12/11/2022 04:04:28 PM script INFO: SUCCESS!@#KODE 1!@#USER_ID 21!@#ACTIVITY_CODE 2
12/11/2022 04:04:29 PM script INFO: SUCCESS!@#KODE 1!@#USER_ID 21!@#ACTIVITY_CODE 4
12/11/2022 04:04:29 PM script INFO: SUCCESS!@#KODE 1!@#USER_ID 21!@#ACTIVITY_CODE 3
12/11/2022 04:04:29 PM script INFO: SUCCESS!@#KODE 1!@#USER_ID 21!@#ACTIVITY_CODE 2
12/11/2022 04:04:29 PM script INFO: SUCCESS!@#KODE 1!@#USER_ID 21!@#ACTIVITY_CODE 2
12/11/2022 04:04:29 PM script INFO: SUCCESS!@#KODE 1!@#USER_ID 21!@#ACTIVITY_CODE 2
12/11/2022 04:04:29 PM script INFO: SUCCESS!@#KODE 1!@#USER_ID 21!@#ACTIVITY_CODE 3
12/11/2022 04:04:29 PM script INFO: SUCCESS!@#KODE 1!@#USER_ID 21!@#ACTIVITY_CODE 4
12/11/2022 04:04:29 PM script INFO: SUCCESS!@#KODE 1!@#USER_ID 21!@#ACTIVITY_CODE 2
12/11/2022 04:04:29 PM script INFO: SUCCESS!@#KODE 1!@#USER_ID 21!@#ACTIVITY_CODE 1
12/11/2022 04:04:30 PM script INFO: SUCCESS!@#KODE 1!@#USER_ID 21!@#ACTIVITY_CODE 1
12/11/2022 04:04:30 PM script INFO: SUCCESS!@#KODE 1!@#USER_ID 21!@#ACTIVITY_CODE 4
12/11/2022 04:04:30 PM script INFO: SUCCESS!@#KODE 1!@#USER_ID 21!@#ACTIVITY_CODE 2
12/11/2022 04:04:30 PM script INFO: SUCCESS!@#KODE 1!@#USER_ID 21!@#ACTIVITY_CODE 3
12/11/2022 04:04:30 PM script INFO: SUCCESS!@#KODE 1!@#USER_ID 21!@#ACTIVITY_CODE 1
12/11/2022 04:04:30 PM script INFO: SUCCESS!@#KODE 1!@#USER_ID 21!@#ACTIVITY_CODE 1
12/11/2022 04:04:30 PM script INFO: SUCCESS!@#KODE 1!@#USER_ID 21!@#ACTIVITY_CODE 3
12/11/2022 04:04:30 PM script INFO: SUCCESS!@#KODE 1!@#USER_ID 21!@#ACTIVITY_CODE 3
12/11/2022 04:04:30 PM script INFO: SUCCESS!@#KODE 1!@#USER_ID 21!@#ACTIVITY_CODE 2
12/11/2022 04:04:30 PM script INFO: SUCCESS!@#KODE 1!@#USER_ID 21!@#ACTIVITY_CODE 2
12/11/2022 04:04:30 PM script INFO: SUCCESS!@#KODE 1!@#USER_ID 21!@#ACTIVITY_CODE 2
12/11/2022 04:04:31 PM script INFO: SUCCESS!@#KODE 1!@#USER_ID 21!@#ACTIVITY_CODE 2
12/11/2022 04:04:31 PM script INFO: SUCCESS!@#KODE 1!@#USER_ID 21!@#ACTIVITY_CODE 3
12/11/2022 04:04:31 PM script INFO: SUCCESS!@#KODE 1!@#USER_ID 21!@#ACTIVITY_CODE 3
12/11/2022 04:04:31 PM script INFO: SUCCESS!@#KODE 1!@#USER_ID 21!@#ACTIVITY_CODE 3
12/11/2022 04:04:31 PM script INFO: SUCCESS!@#KODE 1!@#USER_ID 21!@#ACTIVITY_CODE 2
12/11/2022 04:04:31 PM script INFO: SUCCESS!@#KODE 1!@#USER_ID 21!@#ACTIVITY_CODE 3
12/11/2022 04:04:31 PM script INFO: SUCCESS!@#KODE 1!@#USER_ID 21!@#ACTIVITY_CODE 2
12/11/2022 04:04:31 PM script INFO: SUCCESS!@#KODE 1!@#USER_ID 21!@#ACTIVITY_CODE 2
12/11/2022 04:04:31 PM script INFO: SUCCESS!@#KODE 1!@#USER_ID 21!@#ACTIVITY_CODE 2
12/11/2022 04:04:31 PM script INFO: SUCCESS!@#KODE 1!@#USER_ID 21!@#ACTIVITY_CODE 1
12/11/2022 04:04:32 PM script INFO: SUCCESS!@#KODE 1!@#USER_ID 21!@#ACTIVITY_CODE 4
12/11/2022 04:04:32 PM script INFO: SUCCESS!@#KODE 1!@#USER_ID 21!@#ACTIVITY_CODE 1
12/11/2022 04:04:32 PM script INFO: SUCCESS!@#KODE 1!@#USER_ID 21!@#ACTIVITY_CODE 3
12/11/2022 04:04:32 PM script INFO: SUCCESS!@#KODE 1!@#USER_ID 21!@#ACTIVITY_CODE 2
12/11/2022 04:04:32 PM script INFO: SUCCESS!@#KODE 1!@#USER_ID 21!@#ACTIVITY_CODE 2
12/11/2022 04:04:32 PM script INFO: SUCCESS!@#KODE 1!@#USER_ID 21!@#ACTIVITY_CODE 1
12/11/2022 04:04:32 PM script INFO: SUCCESS!@#KODE 1!@#USER_ID 21!@#ACTIVITY_CODE 3
12/11/2022 04:04:32 PM script INFO: SUCCESS!@#KODE 1!@#USER_ID 21!@#ACTIVITY_CODE 1
12/11/2022 04:04:32 PM script INFO: SUCCESS!@#KODE 1!@#USER_ID 21!@#ACTIVITY_CODE 3
12/11/2022 04:04:32 PM script INFO: SUCCESS!@#KODE 1!@#USER_ID 21!@#ACTIVITY_CODE 1
12/11/2022 04:04:32 PM script INFO: SUCCESS!@#KODE 1!@#USER_ID 21!@#ACTIVITY_CODE 3
12/11/2022 04:04:32 PM script INFO: SUCCESS!@#KODE 1!@#USER_ID 21!@#ACTIVITY_CODE 3
12/11/2022 04:04:32 PM script INFO: SUCCESS!@#KODE 1!@#USER_ID 21!@#ACTIVITY_CODE 3
12/11/2022 04:04:32 PM script INFO: SUCCESS!@#KODE 1!@#USER_ID 21!@#ACTIVITY_CODE 3
12/11/2022 04:04:33 PM script INFO: SUCCESS!@#KODE 1!@#USER_ID 21!@#ACTIVITY_CODE 2
12/11/2022 04:04:33 PM script INFO: SUCCESS!@#KODE 1!@#USER_ID 21!@#ACTIVITY_CODE 1
12/11/2022 04:04:33 PM script INFO: SUCCESS!@#KODE 1!@#USER_ID 21!@#ACTIVITY_CODE 1
12/11/2022 04:04:33 PM script INFO: SUCCESS!@#KODE 1!@#USER_ID 21!@#ACTIVITY_CODE 1
12/11/2022 04:04:33 PM script INFO: SUCCESS!@#KODE 1!@#USER_ID 21!@#ACTIVITY_CODE 4
12/11/2022 04:04:33 PM script INFO: Duration: 114.02288866043091
12/11/2022 04:04:33 PM script INFO: mengakhiri-quiz
12/11/2022 04:04:36 PM script INFO: SUCCESS!@#KODE 1!@#USER_ID 21!@#ACTIVITY_CODE 5
12/11/2022 04:04:36 PM script INFO: berhasil-submit
12/11/2022 04:06:06 PM script ERROR: TIMEOUT EXCEPTION!@#KODE 0!@#LOCATION berhasil-submit
12/11/2022 04:06:06 PM main_worker ERROR: Message: None

