12/23/2022 01:17:54 AM script INFO: Prepared chrome options..
12/23/2022 01:17:55 AM script INFO: Initialized chrome browser..
12/23/2022 01:17:55 AM script INFO: mengakses-homepage
12/23/2022 01:18:19 AM script INFO: mengakses-login-page
12/23/2022 01:19:14 AM script INFO: mengakses-site-home
12/23/2022 01:19:29 AM script INFO: mengakses-site-course
12/23/2022 01:19:58 AM script INFO: mengakses-quiz
12/23/2022 01:20:11 AM script INFO: mengakses-start-quiz-page
12/23/2022 01:20:28 AM script INFO: memulai-quiz
12/23/2022 01:20:28 AM script INFO: SUCCESS!@#KODE 1!@#USER_ID 47!@#ACTIVITY_CODE 5
12/23/2022 01:20:39 AM script INFO: SUCCESS!@#KODE 1!@#USER_ID 47!@#ACTIVITY_CODE 5
12/23/2022 01:20:39 AM script INFO: SUCCESS!@#KODE 1!@#USER_ID 47!@#ACTIVITY_CODE 5
12/23/2022 01:20:41 AM script INFO: SUCCESS!@#KODE 1!@#USER_ID 47!@#ACTIVITY_CODE 2
12/23/2022 01:20:41 AM script INFO: SUCCESS!@#KODE 1!@#USER_ID 47!@#ACTIVITY_CODE 5
12/23/2022 01:20:41 AM script INFO: SUCCESS!@#KODE 1!@#USER_ID 47!@#ACTIVITY_CODE 5
12/23/2022 01:20:44 AM script INFO: SUCCESS!@#KODE 1!@#USER_ID 47!@#ACTIVITY_CODE 5
12/23/2022 01:20:44 AM script INFO: SUCCESS!@#KODE 1!@#USER_ID 47!@#ACTIVITY_CODE 5
12/23/2022 01:20:46 AM script INFO: SUCCESS!@#KODE 1!@#USER_ID 47!@#ACTIVITY_CODE 3
12/23/2022 01:20:46 AM script INFO: SUCCESS!@#KODE 1!@#USER_ID 47!@#ACTIVITY_CODE 2
12/23/2022 01:20:47 AM script INFO: SUCCESS!@#KODE 1!@#USER_ID 47!@#ACTIVITY_CODE 1
12/23/2022 01:20:47 AM script INFO: SUCCESS!@#KODE 1!@#USER_ID 47!@#ACTIVITY_CODE 1
12/23/2022 01:20:47 AM script INFO: SUCCESS!@#KODE 1!@#USER_ID 47!@#ACTIVITY_CODE 4
12/23/2022 01:20:47 AM script INFO: SUCCESS!@#KODE 1!@#USER_ID 47!@#ACTIVITY_CODE 5
12/23/2022 01:20:47 AM script INFO: SUCCESS!@#KODE 1!@#USER_ID 47!@#ACTIVITY_CODE 5
12/23/2022 01:20:49 AM script INFO: SUCCESS!@#KODE 1!@#USER_ID 47!@#ACTIVITY_CODE 3
12/23/2022 01:20:49 AM script INFO: SUCCESS!@#KODE 1!@#USER_ID 47!@#ACTIVITY_CODE 1
12/23/2022 01:20:49 AM script INFO: SUCCESS!@#KODE 1!@#USER_ID 47!@#ACTIVITY_CODE 5
12/23/2022 01:20:49 AM script INFO: SUCCESS!@#KODE 1!@#USER_ID 47!@#ACTIVITY_CODE 5
12/23/2022 01:20:52 AM script INFO: SUCCESS!@#KODE 1!@#USER_ID 47!@#ACTIVITY_CODE 3
12/23/2022 01:20:52 AM script INFO: SUCCESS!@#KODE 1!@#USER_ID 47!@#ACTIVITY_CODE 3
12/23/2022 01:20:52 AM script INFO: SUCCESS!@#KODE 1!@#USER_ID 47!@#ACTIVITY_CODE 2
12/23/2022 01:20:52 AM script INFO: SUCCESS!@#KODE 1!@#USER_ID 47!@#ACTIVITY_CODE 1
12/23/2022 01:20:52 AM script INFO: SUCCESS!@#KODE 1!@#USER_ID 47!@#ACTIVITY_CODE 3
12/23/2022 01:20:52 AM script INFO: SUCCESS!@#KODE 1!@#USER_ID 47!@#ACTIVITY_CODE 2
12/23/2022 01:20:52 AM script INFO: SUCCESS!@#KODE 1!@#USER_ID 47!@#ACTIVITY_CODE 2
12/23/2022 01:20:52 AM script INFO: SUCCESS!@#KODE 1!@#USER_ID 47!@#ACTIVITY_CODE 3
12/23/2022 01:20:53 AM script INFO: SUCCESS!@#KODE 1!@#USER_ID 47!@#ACTIVITY_CODE 2
12/23/2022 01:20:53 AM script INFO: SUCCESS!@#KODE 1!@#USER_ID 47!@#ACTIVITY_CODE 3
12/23/2022 01:20:53 AM script INFO: SUCCESS!@#KODE 1!@#USER_ID 47!@#ACTIVITY_CODE 5
12/23/2022 01:20:53 AM script INFO: SUCCESS!@#KODE 1!@#USER_ID 47!@#ACTIVITY_CODE 5
12/23/2022 01:20:55 AM script INFO: SUCCESS!@#KODE 1!@#USER_ID 47!@#ACTIVITY_CODE 5
12/23/2022 01:20:55 AM script INFO: SUCCESS!@#KODE 1!@#USER_ID 47!@#ACTIVITY_CODE 5
12/23/2022 01:20:58 AM script INFO: SUCCESS!@#KODE 1!@#USER_ID 47!@#ACTIVITY_CODE 3
12/23/2022 01:20:58 AM script INFO: SUCCESS!@#KODE 1!@#USER_ID 47!@#ACTIVITY_CODE 3
12/23/2022 01:20:58 AM script INFO: SUCCESS!@#KODE 1!@#USER_ID 47!@#ACTIVITY_CODE 1
12/23/2022 01:20:58 AM script INFO: SUCCESS!@#KODE 1!@#USER_ID 47!@#ACTIVITY_CODE 2
12/23/2022 01:20:58 AM script INFO: SUCCESS!@#KODE 1!@#USER_ID 47!@#ACTIVITY_CODE 1
12/23/2022 01:20:58 AM script INFO: SUCCESS!@#KODE 1!@#USER_ID 47!@#ACTIVITY_CODE 2
12/23/2022 01:20:58 AM script INFO: SUCCESS!@#KODE 1!@#USER_ID 47!@#ACTIVITY_CODE 1
12/23/2022 01:20:58 AM script INFO: SUCCESS!@#KODE 1!@#USER_ID 47!@#ACTIVITY_CODE 2
12/23/2022 01:20:58 AM script INFO: SUCCESS!@#KODE 1!@#USER_ID 47!@#ACTIVITY_CODE 5
12/23/2022 01:20:58 AM script INFO: SUCCESS!@#KODE 1!@#USER_ID 47!@#ACTIVITY_CODE 5
12/23/2022 01:21:01 AM script INFO: SUCCESS!@#KODE 1!@#USER_ID 47!@#ACTIVITY_CODE 4
12/23/2022 01:21:01 AM script INFO: SUCCESS!@#KODE 1!@#USER_ID 47!@#ACTIVITY_CODE 2
12/23/2022 01:21:01 AM script INFO: SUCCESS!@#KODE 1!@#USER_ID 47!@#ACTIVITY_CODE 4
12/23/2022 01:21:01 AM script INFO: SUCCESS!@#KODE 1!@#USER_ID 47!@#ACTIVITY_CODE 3
12/23/2022 01:21:01 AM script INFO: SUCCESS!@#KODE 1!@#USER_ID 47!@#ACTIVITY_CODE 2
12/23/2022 01:21:01 AM script INFO: SUCCESS!@#KODE 1!@#USER_ID 47!@#ACTIVITY_CODE 2
12/23/2022 01:21:01 AM script INFO: SUCCESS!@#KODE 1!@#USER_ID 47!@#ACTIVITY_CODE 5
12/23/2022 01:21:01 AM script INFO: SUCCESS!@#KODE 1!@#USER_ID 47!@#ACTIVITY_CODE 5
12/23/2022 01:21:04 AM script INFO: SUCCESS!@#KODE 1!@#USER_ID 47!@#ACTIVITY_CODE 5
12/23/2022 01:21:04 AM script INFO: SUCCESS!@#KODE 1!@#USER_ID 47!@#ACTIVITY_CODE 5
12/23/2022 01:21:07 AM script INFO: SUCCESS!@#KODE 1!@#USER_ID 47!@#ACTIVITY_CODE 3
12/23/2022 01:21:07 AM script INFO: SUCCESS!@#KODE 1!@#USER_ID 47!@#ACTIVITY_CODE 2
12/23/2022 01:21:07 AM script INFO: SUCCESS!@#KODE 1!@#USER_ID 47!@#ACTIVITY_CODE 4
12/23/2022 01:21:07 AM script INFO: SUCCESS!@#KODE 1!@#USER_ID 47!@#ACTIVITY_CODE 3
12/23/2022 01:21:07 AM script INFO: SUCCESS!@#KODE 1!@#USER_ID 47!@#ACTIVITY_CODE 5
12/23/2022 01:21:07 AM script INFO: SUCCESS!@#KODE 1!@#USER_ID 47!@#ACTIVITY_CODE 5
12/23/2022 01:21:09 AM script INFO: SUCCESS!@#KODE 1!@#USER_ID 47!@#ACTIVITY_CODE 1
12/23/2022 01:21:09 AM script INFO: SUCCESS!@#KODE 1!@#USER_ID 47!@#ACTIVITY_CODE 1
12/23/2022 01:21:10 AM script INFO: SUCCESS!@#KODE 1!@#USER_ID 47!@#ACTIVITY_CODE 2
12/23/2022 01:21:10 AM script INFO: SUCCESS!@#KODE 1!@#USER_ID 47!@#ACTIVITY_CODE 2
12/23/2022 01:21:10 AM script INFO: SUCCESS!@#KODE 1!@#USER_ID 47!@#ACTIVITY_CODE 3
12/23/2022 01:21:10 AM script INFO: SUCCESS!@#KODE 1!@#USER_ID 47!@#ACTIVITY_CODE 3
12/23/2022 01:21:10 AM script INFO: SUCCESS!@#KODE 1!@#USER_ID 47!@#ACTIVITY_CODE 1
12/23/2022 01:21:10 AM script INFO: SUCCESS!@#KODE 1!@#USER_ID 47!@#ACTIVITY_CODE 2
12/23/2022 01:21:10 AM script INFO: SUCCESS!@#KODE 1!@#USER_ID 47!@#ACTIVITY_CODE 1
12/23/2022 01:21:10 AM script INFO: SUCCESS!@#KODE 1!@#USER_ID 47!@#ACTIVITY_CODE 2
12/23/2022 01:21:10 AM script INFO: SUCCESS!@#KODE 1!@#USER_ID 47!@#ACTIVITY_CODE 2
12/23/2022 01:21:10 AM script INFO: SUCCESS!@#KODE 1!@#USER_ID 47!@#ACTIVITY_CODE 2
12/23/2022 01:21:10 AM script INFO: SUCCESS!@#KODE 1!@#USER_ID 47!@#ACTIVITY_CODE 1
12/23/2022 01:21:11 AM script INFO: SUCCESS!@#KODE 1!@#USER_ID 47!@#ACTIVITY_CODE 4
12/23/2022 01:21:11 AM script INFO: SUCCESS!@#KODE 1!@#USER_ID 47!@#ACTIVITY_CODE 1
12/23/2022 01:21:11 AM script INFO: SUCCESS!@#KODE 1!@#USER_ID 47!@#ACTIVITY_CODE 1
12/23/2022 01:21:11 AM script INFO: SUCCESS!@#KODE 1!@#USER_ID 47!@#ACTIVITY_CODE 3
12/23/2022 01:21:11 AM script INFO: SUCCESS!@#KODE 1!@#USER_ID 47!@#ACTIVITY_CODE 1
12/23/2022 01:21:11 AM script INFO: SUCCESS!@#KODE 1!@#USER_ID 47!@#ACTIVITY_CODE 4
12/23/2022 01:21:11 AM script INFO: SUCCESS!@#KODE 1!@#USER_ID 47!@#ACTIVITY_CODE 2
12/23/2022 01:21:11 AM script INFO: SUCCESS!@#KODE 1!@#USER_ID 47!@#ACTIVITY_CODE 1
12/23/2022 01:21:11 AM script INFO: SUCCESS!@#KODE 1!@#USER_ID 47!@#ACTIVITY_CODE 2
12/23/2022 01:21:11 AM script INFO: SUCCESS!@#KODE 1!@#USER_ID 47!@#ACTIVITY_CODE 3
12/23/2022 01:21:11 AM script INFO: SUCCESS!@#KODE 1!@#USER_ID 47!@#ACTIVITY_CODE 1
12/23/2022 01:21:11 AM script INFO: SUCCESS!@#KODE 1!@#USER_ID 47!@#ACTIVITY_CODE 4
12/23/2022 01:21:11 AM script INFO: SUCCESS!@#KODE 1!@#USER_ID 47!@#ACTIVITY_CODE 2
12/23/2022 01:21:12 AM script INFO: SUCCESS!@#KODE 1!@#USER_ID 47!@#ACTIVITY_CODE 2
12/23/2022 01:21:12 AM script INFO: SUCCESS!@#KODE 1!@#USER_ID 47!@#ACTIVITY_CODE 2
12/23/2022 01:21:12 AM script INFO: SUCCESS!@#KODE 1!@#USER_ID 47!@#ACTIVITY_CODE 3
12/23/2022 01:21:12 AM script INFO: SUCCESS!@#KODE 1!@#USER_ID 47!@#ACTIVITY_CODE 2
12/23/2022 01:21:12 AM script INFO: SUCCESS!@#KODE 1!@#USER_ID 47!@#ACTIVITY_CODE 1
12/23/2022 01:21:12 AM script INFO: SUCCESS!@#KODE 1!@#USER_ID 47!@#ACTIVITY_CODE 4
12/23/2022 01:21:12 AM script INFO: SUCCESS!@#KODE 1!@#USER_ID 47!@#ACTIVITY_CODE 3
12/23/2022 01:21:12 AM script INFO: SUCCESS!@#KODE 1!@#USER_ID 47!@#ACTIVITY_CODE 3
12/23/2022 01:21:12 AM script INFO: SUCCESS!@#KODE 1!@#USER_ID 47!@#ACTIVITY_CODE 2
12/23/2022 01:21:12 AM script INFO: SUCCESS!@#KODE 1!@#USER_ID 47!@#ACTIVITY_CODE 1
12/23/2022 01:21:12 AM script INFO: SUCCESS!@#KODE 1!@#USER_ID 47!@#ACTIVITY_CODE 4
12/23/2022 01:21:12 AM script INFO: SUCCESS!@#KODE 1!@#USER_ID 47!@#ACTIVITY_CODE 3
12/23/2022 01:21:13 AM script INFO: SUCCESS!@#KODE 1!@#USER_ID 47!@#ACTIVITY_CODE 2
12/23/2022 01:21:13 AM script INFO: SUCCESS!@#KODE 1!@#USER_ID 47!@#ACTIVITY_CODE 2
12/23/2022 01:21:13 AM script INFO: Duration: 34.1706600189209
12/23/2022 01:21:13 AM script INFO: mengakhiri-quiz
12/23/2022 01:21:49 AM script INFO: SUCCESS!@#KODE 1!@#USER_ID 47!@#ACTIVITY_CODE 5
12/23/2022 01:21:49 AM script INFO: berhasil-submit
