12/23/2022 04:26:04 AM script INFO: Prepared chrome options..
12/23/2022 04:26:05 AM script INFO: Initialized chrome browser..
12/23/2022 04:26:05 AM script INFO: mengakses-homepage
12/23/2022 04:26:28 AM script INFO: mengakses-login-page
12/23/2022 04:27:19 AM script INFO: mengakses-site-home
12/23/2022 04:27:29 AM script INFO: mengakses-site-course
12/23/2022 04:27:56 AM script INFO: mengakses-quiz
12/23/2022 04:27:57 AM main_worker ERROR: Message: no such element: Unable to locate element: {"method":"xpath","selector":"//*[@data-userid]"}
  (Session info: headless chrome=107.0.5304.87)
Stacktrace:
#0 0x55657ed42463 <unknown>
#1 0x55657eb068d8 <unknown>
#2 0x55657eb4443a <unknown>
#3 0x55657eb44651 <unknown>
#4 0x55657eb807a4 <unknown>
#5 0x55657eb6564d <unknown>
#6 0x55657eb7e30f <unknown>
#7 0x55657eb65443 <unknown>
#8 0x55657eb363c5 <unknown>
#9 0x55657eb37531 <unknown>
#10 0x55657ed94dce <unknown>
#11 0x55657ed98192 <unknown>
#12 0x55657ed7993e <unknown>
#13 0x55657ed99103 <unknown>
#14 0x55657ed6cd85 <unknown>
#15 0x55657edba0a8 <unknown>
#16 0x55657edba239 <unknown>
#17 0x55657edd5492 <unknown>
#18 0x7f62897a5609 start_thread

