12/11/2022 03:05:19 PM script INFO: Prepared chrome options..
12/11/2022 03:05:21 PM script INFO: Initialized chrome browser..
12/11/2022 03:05:21 PM script INFO: mengakses-homepage
12/11/2022 03:05:46 PM script INFO: mengakses-login-page
12/11/2022 03:05:48 PM script INFO: mengakses-site-home
12/11/2022 03:05:49 PM script INFO: mengakses-site-course
12/11/2022 03:06:05 PM script INFO: mengakses-quiz
12/11/2022 03:06:19 PM script INFO: mengakses-start-quiz-page
12/11/2022 03:06:28 PM script INFO: memulai-quiz
12/11/2022 03:06:28 PM script INFO: SUCCESS!@#KODE 1!@#USER_ID 87!@#ACTIVITY_CODE 5
12/11/2022 03:06:39 PM script INFO: SUCCESS!@#KODE 1!@#USER_ID 87!@#ACTIVITY_CODE 2
12/11/2022 03:06:39 PM script INFO: SUCCESS!@#KODE 1!@#USER_ID 87!@#ACTIVITY_CODE 5
12/11/2022 03:06:39 PM script INFO: SUCCESS!@#KODE 1!@#USER_ID 87!@#ACTIVITY_CODE 5
12/11/2022 03:06:41 PM script INFO: SUCCESS!@#KODE 1!@#USER_ID 87!@#ACTIVITY_CODE 3
12/11/2022 03:06:42 PM script INFO: SUCCESS!@#KODE 1!@#USER_ID 87!@#ACTIVITY_CODE 1
12/11/2022 03:06:42 PM script INFO: SUCCESS!@#KODE 1!@#USER_ID 87!@#ACTIVITY_CODE 4
12/11/2022 03:06:42 PM script INFO: SUCCESS!@#KODE 1!@#USER_ID 87!@#ACTIVITY_CODE 1
12/11/2022 03:06:42 PM script INFO: SUCCESS!@#KODE 1!@#USER_ID 87!@#ACTIVITY_CODE 5
12/11/2022 03:06:42 PM script INFO: SUCCESS!@#KODE 1!@#USER_ID 87!@#ACTIVITY_CODE 5
12/11/2022 03:06:44 PM script INFO: SUCCESS!@#KODE 1!@#USER_ID 87!@#ACTIVITY_CODE 5
12/11/2022 03:06:44 PM script INFO: SUCCESS!@#KODE 1!@#USER_ID 87!@#ACTIVITY_CODE 5
12/11/2022 03:06:47 PM script INFO: SUCCESS!@#KODE 1!@#USER_ID 87!@#ACTIVITY_CODE 2
12/11/2022 03:06:47 PM script INFO: SUCCESS!@#KODE 1!@#USER_ID 87!@#ACTIVITY_CODE 2
12/11/2022 03:06:47 PM script INFO: SUCCESS!@#KODE 1!@#USER_ID 87!@#ACTIVITY_CODE 5
12/11/2022 03:06:47 PM script INFO: SUCCESS!@#KODE 1!@#USER_ID 87!@#ACTIVITY_CODE 5
12/11/2022 03:06:50 PM script INFO: SUCCESS!@#KODE 1!@#USER_ID 87!@#ACTIVITY_CODE 1
12/11/2022 03:06:50 PM script INFO: SUCCESS!@#KODE 1!@#USER_ID 87!@#ACTIVITY_CODE 5
12/11/2022 03:06:50 PM script INFO: SUCCESS!@#KODE 1!@#USER_ID 87!@#ACTIVITY_CODE 5
12/11/2022 03:06:52 PM script INFO: SUCCESS!@#KODE 1!@#USER_ID 87!@#ACTIVITY_CODE 2
12/11/2022 03:06:52 PM script INFO: SUCCESS!@#KODE 1!@#USER_ID 87!@#ACTIVITY_CODE 5
12/11/2022 03:06:52 PM script INFO: SUCCESS!@#KODE 1!@#USER_ID 87!@#ACTIVITY_CODE 5
12/11/2022 03:06:55 PM script INFO: SUCCESS!@#KODE 1!@#USER_ID 87!@#ACTIVITY_CODE 1
12/11/2022 03:06:55 PM script INFO: SUCCESS!@#KODE 1!@#USER_ID 87!@#ACTIVITY_CODE 1
12/11/2022 03:06:55 PM script INFO: SUCCESS!@#KODE 1!@#USER_ID 87!@#ACTIVITY_CODE 2
12/11/2022 03:06:55 PM script INFO: SUCCESS!@#KODE 1!@#USER_ID 87!@#ACTIVITY_CODE 3
12/11/2022 03:06:55 PM script INFO: SUCCESS!@#KODE 1!@#USER_ID 87!@#ACTIVITY_CODE 2
12/11/2022 03:06:55 PM script INFO: SUCCESS!@#KODE 1!@#USER_ID 87!@#ACTIVITY_CODE 2
12/11/2022 03:06:55 PM script INFO: SUCCESS!@#KODE 1!@#USER_ID 87!@#ACTIVITY_CODE 3
12/11/2022 03:06:55 PM script INFO: SUCCESS!@#KODE 1!@#USER_ID 87!@#ACTIVITY_CODE 2
12/11/2022 03:06:55 PM script INFO: SUCCESS!@#KODE 1!@#USER_ID 87!@#ACTIVITY_CODE 3
12/11/2022 03:06:55 PM script INFO: SUCCESS!@#KODE 1!@#USER_ID 87!@#ACTIVITY_CODE 3
12/11/2022 03:06:56 PM script INFO: SUCCESS!@#KODE 1!@#USER_ID 87!@#ACTIVITY_CODE 1
12/11/2022 03:06:56 PM script INFO: SUCCESS!@#KODE 1!@#USER_ID 87!@#ACTIVITY_CODE 3
12/11/2022 03:06:56 PM script INFO: SUCCESS!@#KODE 1!@#USER_ID 87!@#ACTIVITY_CODE 2
12/11/2022 03:06:56 PM script INFO: SUCCESS!@#KODE 1!@#USER_ID 87!@#ACTIVITY_CODE 1
12/11/2022 03:06:56 PM script INFO: SUCCESS!@#KODE 1!@#USER_ID 87!@#ACTIVITY_CODE 2
12/11/2022 03:06:56 PM script INFO: SUCCESS!@#KODE 1!@#USER_ID 87!@#ACTIVITY_CODE 3
12/11/2022 03:06:56 PM script INFO: SUCCESS!@#KODE 1!@#USER_ID 87!@#ACTIVITY_CODE 3
12/11/2022 03:06:56 PM script INFO: SUCCESS!@#KODE 1!@#USER_ID 87!@#ACTIVITY_CODE 1
12/11/2022 03:06:56 PM script INFO: SUCCESS!@#KODE 1!@#USER_ID 87!@#ACTIVITY_CODE 4
12/11/2022 03:06:56 PM script INFO: SUCCESS!@#KODE 1!@#USER_ID 87!@#ACTIVITY_CODE 1
12/11/2022 03:06:56 PM script INFO: SUCCESS!@#KODE 1!@#USER_ID 87!@#ACTIVITY_CODE 4
12/11/2022 03:06:57 PM script INFO: SUCCESS!@#KODE 1!@#USER_ID 87!@#ACTIVITY_CODE 2
12/11/2022 03:06:57 PM script INFO: SUCCESS!@#KODE 1!@#USER_ID 87!@#ACTIVITY_CODE 2
12/11/2022 03:06:57 PM script INFO: SUCCESS!@#KODE 1!@#USER_ID 87!@#ACTIVITY_CODE 3
12/11/2022 03:06:57 PM script INFO: SUCCESS!@#KODE 1!@#USER_ID 87!@#ACTIVITY_CODE 1
12/11/2022 03:06:57 PM script INFO: SUCCESS!@#KODE 1!@#USER_ID 87!@#ACTIVITY_CODE 4
12/11/2022 03:06:57 PM script INFO: SUCCESS!@#KODE 1!@#USER_ID 87!@#ACTIVITY_CODE 2
12/11/2022 03:06:57 PM script INFO: Duration: 18.393267393112183
12/11/2022 03:06:57 PM script INFO: mengakhiri-quiz
12/11/2022 03:06:59 PM script INFO: SUCCESS!@#KODE 1!@#USER_ID 87!@#ACTIVITY_CODE 5
12/11/2022 03:06:59 PM script INFO: berhasil-submit
