12/21/2022 01:36:43 PM script INFO: Prepared chrome options..
12/21/2022 01:36:44 PM script INFO: Initialized chrome browser..
12/21/2022 01:36:44 PM script INFO: mengakses-homepage
12/21/2022 01:37:10 PM script INFO: mengakses-login-page
12/21/2022 01:37:15 PM script INFO: mengakses-site-home
12/21/2022 01:37:41 PM script INFO: mengakses-site-course
12/21/2022 01:38:05 PM script INFO: mengakses-quiz
12/21/2022 01:38:06 PM script INFO: mengakses-start-quiz-page
12/21/2022 01:38:07 PM script INFO: memulai-quiz
12/21/2022 01:38:07 PM script INFO: SUCCESS!@#KODE 1!@#USER_ID 53!@#ACTIVITY_CODE 5
12/21/2022 01:38:18 PM script INFO: SUCCESS!@#KODE 1!@#USER_ID 53!@#ACTIVITY_CODE 1
12/21/2022 01:38:18 PM script INFO: SUCCESS!@#KODE 1!@#USER_ID 53!@#ACTIVITY_CODE 5
12/21/2022 01:38:18 PM script INFO: SUCCESS!@#KODE 1!@#USER_ID 53!@#ACTIVITY_CODE 5
12/21/2022 01:38:21 PM script INFO: SUCCESS!@#KODE 1!@#USER_ID 53!@#ACTIVITY_CODE 4
12/21/2022 01:38:21 PM script INFO: SUCCESS!@#KODE 1!@#USER_ID 53!@#ACTIVITY_CODE 5
12/21/2022 01:38:21 PM script INFO: SUCCESS!@#KODE 1!@#USER_ID 53!@#ACTIVITY_CODE 5
12/21/2022 01:38:23 PM script INFO: SUCCESS!@#KODE 1!@#USER_ID 53!@#ACTIVITY_CODE 5
12/21/2022 01:38:23 PM script INFO: SUCCESS!@#KODE 1!@#USER_ID 53!@#ACTIVITY_CODE 5
12/21/2022 01:38:26 PM script INFO: SUCCESS!@#KODE 1!@#USER_ID 53!@#ACTIVITY_CODE 2
12/21/2022 01:38:26 PM script INFO: SUCCESS!@#KODE 1!@#USER_ID 53!@#ACTIVITY_CODE 2
12/21/2022 01:38:26 PM script INFO: SUCCESS!@#KODE 1!@#USER_ID 53!@#ACTIVITY_CODE 3
12/21/2022 01:38:26 PM script INFO: SUCCESS!@#KODE 1!@#USER_ID 53!@#ACTIVITY_CODE 5
12/21/2022 01:38:26 PM script INFO: SUCCESS!@#KODE 1!@#USER_ID 53!@#ACTIVITY_CODE 5
12/21/2022 01:38:29 PM script INFO: SUCCESS!@#KODE 1!@#USER_ID 53!@#ACTIVITY_CODE 3
12/21/2022 01:38:29 PM script INFO: SUCCESS!@#KODE 1!@#USER_ID 53!@#ACTIVITY_CODE 2
12/21/2022 01:38:29 PM script INFO: SUCCESS!@#KODE 1!@#USER_ID 53!@#ACTIVITY_CODE 5
12/21/2022 01:38:29 PM script INFO: SUCCESS!@#KODE 1!@#USER_ID 53!@#ACTIVITY_CODE 5
12/21/2022 01:38:31 PM script INFO: SUCCESS!@#KODE 1!@#USER_ID 53!@#ACTIVITY_CODE 2
12/21/2022 01:38:31 PM script INFO: SUCCESS!@#KODE 1!@#USER_ID 53!@#ACTIVITY_CODE 5
12/21/2022 01:38:31 PM script INFO: SUCCESS!@#KODE 1!@#USER_ID 53!@#ACTIVITY_CODE 5
12/21/2022 01:38:34 PM script INFO: SUCCESS!@#KODE 1!@#USER_ID 53!@#ACTIVITY_CODE 2
12/21/2022 01:38:34 PM script INFO: SUCCESS!@#KODE 1!@#USER_ID 53!@#ACTIVITY_CODE 1
12/21/2022 01:38:34 PM script INFO: SUCCESS!@#KODE 1!@#USER_ID 53!@#ACTIVITY_CODE 3
12/21/2022 01:38:34 PM script INFO: SUCCESS!@#KODE 1!@#USER_ID 53!@#ACTIVITY_CODE 5
12/21/2022 01:38:34 PM script INFO: SUCCESS!@#KODE 1!@#USER_ID 53!@#ACTIVITY_CODE 5
12/21/2022 01:38:37 PM script INFO: SUCCESS!@#KODE 1!@#USER_ID 53!@#ACTIVITY_CODE 1
12/21/2022 01:38:37 PM script INFO: SUCCESS!@#KODE 1!@#USER_ID 53!@#ACTIVITY_CODE 5
12/21/2022 01:38:37 PM script INFO: SUCCESS!@#KODE 1!@#USER_ID 53!@#ACTIVITY_CODE 5
12/21/2022 01:38:39 PM script INFO: SUCCESS!@#KODE 1!@#USER_ID 53!@#ACTIVITY_CODE 4
12/21/2022 01:38:39 PM script INFO: SUCCESS!@#KODE 1!@#USER_ID 53!@#ACTIVITY_CODE 2
12/21/2022 01:38:39 PM script INFO: SUCCESS!@#KODE 1!@#USER_ID 53!@#ACTIVITY_CODE 5
12/21/2022 01:38:39 PM script INFO: SUCCESS!@#KODE 1!@#USER_ID 53!@#ACTIVITY_CODE 5
12/21/2022 01:38:42 PM script INFO: SUCCESS!@#KODE 1!@#USER_ID 53!@#ACTIVITY_CODE 1
12/21/2022 01:38:42 PM script INFO: SUCCESS!@#KODE 1!@#USER_ID 53!@#ACTIVITY_CODE 3
12/21/2022 01:38:42 PM script INFO: SUCCESS!@#KODE 1!@#USER_ID 53!@#ACTIVITY_CODE 4
12/21/2022 01:38:42 PM script INFO: SUCCESS!@#KODE 1!@#USER_ID 53!@#ACTIVITY_CODE 2
12/21/2022 01:38:42 PM script INFO: SUCCESS!@#KODE 1!@#USER_ID 53!@#ACTIVITY_CODE 2
12/21/2022 01:38:43 PM script INFO: SUCCESS!@#KODE 1!@#USER_ID 53!@#ACTIVITY_CODE 2
12/21/2022 01:38:43 PM script INFO: SUCCESS!@#KODE 1!@#USER_ID 53!@#ACTIVITY_CODE 1
12/21/2022 01:38:43 PM script INFO: SUCCESS!@#KODE 1!@#USER_ID 53!@#ACTIVITY_CODE 4
12/21/2022 01:38:43 PM script INFO: SUCCESS!@#KODE 1!@#USER_ID 53!@#ACTIVITY_CODE 3
12/21/2022 01:38:43 PM script INFO: SUCCESS!@#KODE 1!@#USER_ID 53!@#ACTIVITY_CODE 3
12/21/2022 01:38:43 PM script INFO: SUCCESS!@#KODE 1!@#USER_ID 53!@#ACTIVITY_CODE 2
12/21/2022 01:38:43 PM script INFO: SUCCESS!@#KODE 1!@#USER_ID 53!@#ACTIVITY_CODE 3
12/21/2022 01:38:43 PM script INFO: SUCCESS!@#KODE 1!@#USER_ID 53!@#ACTIVITY_CODE 2
12/21/2022 01:38:43 PM script INFO: SUCCESS!@#KODE 1!@#USER_ID 53!@#ACTIVITY_CODE 2
12/21/2022 01:38:44 PM script INFO: SUCCESS!@#KODE 1!@#USER_ID 53!@#ACTIVITY_CODE 1
12/21/2022 01:38:44 PM script INFO: SUCCESS!@#KODE 1!@#USER_ID 53!@#ACTIVITY_CODE 3
12/21/2022 01:38:44 PM script INFO: SUCCESS!@#KODE 1!@#USER_ID 53!@#ACTIVITY_CODE 4
12/21/2022 01:38:44 PM script INFO: SUCCESS!@#KODE 1!@#USER_ID 53!@#ACTIVITY_CODE 3
12/21/2022 01:38:44 PM script INFO: SUCCESS!@#KODE 1!@#USER_ID 53!@#ACTIVITY_CODE 5
12/21/2022 01:38:44 PM script INFO: SUCCESS!@#KODE 1!@#USER_ID 53!@#ACTIVITY_CODE 5
12/21/2022 01:38:46 PM script INFO: SUCCESS!@#KODE 1!@#USER_ID 53!@#ACTIVITY_CODE 5
12/21/2022 01:38:46 PM script INFO: SUCCESS!@#KODE 1!@#USER_ID 53!@#ACTIVITY_CODE 5
12/21/2022 01:38:49 PM script INFO: SUCCESS!@#KODE 1!@#USER_ID 53!@#ACTIVITY_CODE 3
12/21/2022 01:38:49 PM script INFO: SUCCESS!@#KODE 1!@#USER_ID 53!@#ACTIVITY_CODE 3
12/21/2022 01:38:49 PM script INFO: SUCCESS!@#KODE 1!@#USER_ID 53!@#ACTIVITY_CODE 2
12/21/2022 01:38:49 PM script INFO: SUCCESS!@#KODE 1!@#USER_ID 53!@#ACTIVITY_CODE 3
12/21/2022 01:38:49 PM script INFO: SUCCESS!@#KODE 1!@#USER_ID 53!@#ACTIVITY_CODE 1
12/21/2022 01:38:49 PM script INFO: SUCCESS!@#KODE 1!@#USER_ID 53!@#ACTIVITY_CODE 2
12/21/2022 01:38:49 PM script INFO: SUCCESS!@#KODE 1!@#USER_ID 53!@#ACTIVITY_CODE 1
12/21/2022 01:38:50 PM script INFO: SUCCESS!@#KODE 1!@#USER_ID 53!@#ACTIVITY_CODE 3
12/21/2022 01:38:50 PM script INFO: SUCCESS!@#KODE 1!@#USER_ID 53!@#ACTIVITY_CODE 3
12/21/2022 01:38:50 PM script INFO: SUCCESS!@#KODE 1!@#USER_ID 53!@#ACTIVITY_CODE 1
12/21/2022 01:38:50 PM script INFO: SUCCESS!@#KODE 1!@#USER_ID 53!@#ACTIVITY_CODE 2
12/21/2022 01:38:50 PM script INFO: SUCCESS!@#KODE 1!@#USER_ID 53!@#ACTIVITY_CODE 1
12/21/2022 01:38:50 PM script INFO: SUCCESS!@#KODE 1!@#USER_ID 53!@#ACTIVITY_CODE 4
12/21/2022 01:38:50 PM script INFO: SUCCESS!@#KODE 1!@#USER_ID 53!@#ACTIVITY_CODE 2
12/21/2022 01:38:50 PM script INFO: SUCCESS!@#KODE 1!@#USER_ID 53!@#ACTIVITY_CODE 1
12/21/2022 01:38:50 PM script INFO: SUCCESS!@#KODE 1!@#USER_ID 53!@#ACTIVITY_CODE 1
12/21/2022 01:38:50 PM script INFO: SUCCESS!@#KODE 1!@#USER_ID 53!@#ACTIVITY_CODE 2
12/21/2022 01:38:50 PM script INFO: SUCCESS!@#KODE 1!@#USER_ID 53!@#ACTIVITY_CODE 4
12/21/2022 01:38:51 PM script INFO: SUCCESS!@#KODE 1!@#USER_ID 53!@#ACTIVITY_CODE 3
12/21/2022 01:38:51 PM script INFO: SUCCESS!@#KODE 1!@#USER_ID 53!@#ACTIVITY_CODE 2
12/21/2022 01:38:51 PM script INFO: SUCCESS!@#KODE 1!@#USER_ID 53!@#ACTIVITY_CODE 1
12/21/2022 01:38:51 PM script INFO: SUCCESS!@#KODE 1!@#USER_ID 53!@#ACTIVITY_CODE 4
12/21/2022 01:38:51 PM script INFO: SUCCESS!@#KODE 1!@#USER_ID 53!@#ACTIVITY_CODE 3
12/21/2022 01:38:51 PM script INFO: SUCCESS!@#KODE 1!@#USER_ID 53!@#ACTIVITY_CODE 2
12/21/2022 01:38:51 PM script INFO: SUCCESS!@#KODE 1!@#USER_ID 53!@#ACTIVITY_CODE 2
12/21/2022 01:38:51 PM script INFO: SUCCESS!@#KODE 1!@#USER_ID 53!@#ACTIVITY_CODE 3
12/21/2022 01:38:51 PM script INFO: SUCCESS!@#KODE 1!@#USER_ID 53!@#ACTIVITY_CODE 2
12/21/2022 01:38:51 PM script INFO: SUCCESS!@#KODE 1!@#USER_ID 53!@#ACTIVITY_CODE 2
12/21/2022 01:38:52 PM script INFO: SUCCESS!@#KODE 1!@#USER_ID 53!@#ACTIVITY_CODE 3
12/21/2022 01:38:52 PM script INFO: SUCCESS!@#KODE 1!@#USER_ID 53!@#ACTIVITY_CODE 3
12/21/2022 01:38:52 PM script INFO: SUCCESS!@#KODE 1!@#USER_ID 53!@#ACTIVITY_CODE 1
12/21/2022 01:38:52 PM script INFO: SUCCESS!@#KODE 1!@#USER_ID 53!@#ACTIVITY_CODE 1
12/21/2022 01:38:52 PM script INFO: SUCCESS!@#KODE 1!@#USER_ID 53!@#ACTIVITY_CODE 2
12/21/2022 01:38:52 PM script INFO: SUCCESS!@#KODE 1!@#USER_ID 53!@#ACTIVITY_CODE 1
12/21/2022 01:38:52 PM script INFO: SUCCESS!@#KODE 1!@#USER_ID 53!@#ACTIVITY_CODE 4
12/21/2022 01:38:52 PM script INFO: SUCCESS!@#KODE 1!@#USER_ID 53!@#ACTIVITY_CODE 2
12/21/2022 01:38:52 PM script INFO: SUCCESS!@#KODE 1!@#USER_ID 53!@#ACTIVITY_CODE 1
12/21/2022 01:38:52 PM script INFO: SUCCESS!@#KODE 1!@#USER_ID 53!@#ACTIVITY_CODE 2
12/21/2022 01:38:52 PM script INFO: SUCCESS!@#KODE 1!@#USER_ID 53!@#ACTIVITY_CODE 1
12/21/2022 01:38:52 PM script INFO: SUCCESS!@#KODE 1!@#USER_ID 53!@#ACTIVITY_CODE 4
12/21/2022 01:38:52 PM script INFO: SUCCESS!@#KODE 1!@#USER_ID 53!@#ACTIVITY_CODE 2
12/21/2022 01:38:53 PM script INFO: SUCCESS!@#KODE 1!@#USER_ID 53!@#ACTIVITY_CODE 3
12/21/2022 01:38:53 PM script INFO: SUCCESS!@#KODE 1!@#USER_ID 53!@#ACTIVITY_CODE 3
12/21/2022 01:38:53 PM script INFO: SUCCESS!@#KODE 1!@#USER_ID 53!@#ACTIVITY_CODE 1
12/21/2022 01:38:53 PM script INFO: Duration: 34.67127871513367
12/21/2022 01:38:53 PM script INFO: mengakhiri-quiz
12/21/2022 01:38:57 PM script INFO: SUCCESS!@#KODE 1!@#USER_ID 53!@#ACTIVITY_CODE 5
12/21/2022 01:38:57 PM script INFO: berhasil-submit
12/21/2022 01:40:27 PM script ERROR: TIMEOUT EXCEPTION!@#KODE 0!@#LOCATION berhasil-submit
12/21/2022 01:40:27 PM main_worker ERROR: Message: None

