12/12/2022 01:09:55 AM script INFO: Prepared chrome options..
12/12/2022 01:09:56 AM script INFO: Initialized chrome browser..
12/12/2022 01:09:56 AM script INFO: mengakses-homepage
12/12/2022 01:10:34 AM script INFO: mengakses-login-page
12/12/2022 01:10:44 AM script INFO: mengakses-site-home
12/12/2022 01:10:45 AM script INFO: mengakses-site-course
12/12/2022 01:10:54 AM script INFO: mengakses-quiz
12/12/2022 01:11:01 AM script INFO: mengakses-start-quiz-page
12/12/2022 01:11:05 AM script INFO: memulai-quiz
12/12/2022 01:11:05 AM script INFO: SUCCESS!@#KODE 1!@#USER_ID 34!@#ACTIVITY_CODE 5
12/12/2022 01:11:15 AM script INFO: SUCCESS!@#KODE 1!@#USER_ID 34!@#ACTIVITY_CODE 3
12/12/2022 01:11:15 AM script INFO: SUCCESS!@#KODE 1!@#USER_ID 34!@#ACTIVITY_CODE 3
12/12/2022 01:11:16 AM script INFO: SUCCESS!@#KODE 1!@#USER_ID 34!@#ACTIVITY_CODE 3
12/12/2022 01:11:16 AM script INFO: SUCCESS!@#KODE 1!@#USER_ID 34!@#ACTIVITY_CODE 2
12/12/2022 01:11:16 AM script INFO: SUCCESS!@#KODE 1!@#USER_ID 34!@#ACTIVITY_CODE 3
12/12/2022 01:11:16 AM script INFO: SUCCESS!@#KODE 1!@#USER_ID 34!@#ACTIVITY_CODE 2
12/12/2022 01:11:16 AM script INFO: SUCCESS!@#KODE 1!@#USER_ID 34!@#ACTIVITY_CODE 5
12/12/2022 01:11:16 AM script INFO: SUCCESS!@#KODE 1!@#USER_ID 34!@#ACTIVITY_CODE 5
12/12/2022 01:11:18 AM script INFO: SUCCESS!@#KODE 1!@#USER_ID 34!@#ACTIVITY_CODE 3
12/12/2022 01:11:18 AM script INFO: SUCCESS!@#KODE 1!@#USER_ID 34!@#ACTIVITY_CODE 5
12/12/2022 01:11:18 AM script INFO: SUCCESS!@#KODE 1!@#USER_ID 34!@#ACTIVITY_CODE 5
12/12/2022 01:11:21 AM script INFO: SUCCESS!@#KODE 1!@#USER_ID 34!@#ACTIVITY_CODE 5
12/12/2022 01:11:21 AM script INFO: SUCCESS!@#KODE 1!@#USER_ID 34!@#ACTIVITY_CODE 5
12/12/2022 01:11:23 AM script INFO: SUCCESS!@#KODE 1!@#USER_ID 34!@#ACTIVITY_CODE 3
12/12/2022 01:11:24 AM script INFO: SUCCESS!@#KODE 1!@#USER_ID 34!@#ACTIVITY_CODE 3
12/12/2022 01:11:24 AM script INFO: SUCCESS!@#KODE 1!@#USER_ID 34!@#ACTIVITY_CODE 2
12/12/2022 01:11:24 AM script INFO: SUCCESS!@#KODE 1!@#USER_ID 34!@#ACTIVITY_CODE 3
12/12/2022 01:11:24 AM script INFO: SUCCESS!@#KODE 1!@#USER_ID 34!@#ACTIVITY_CODE 2
12/12/2022 01:11:24 AM script INFO: SUCCESS!@#KODE 1!@#USER_ID 34!@#ACTIVITY_CODE 1
12/12/2022 01:11:24 AM script INFO: SUCCESS!@#KODE 1!@#USER_ID 34!@#ACTIVITY_CODE 2
12/12/2022 01:11:24 AM script INFO: SUCCESS!@#KODE 1!@#USER_ID 34!@#ACTIVITY_CODE 5
12/12/2022 01:11:24 AM script INFO: SUCCESS!@#KODE 1!@#USER_ID 34!@#ACTIVITY_CODE 5
12/12/2022 01:11:27 AM script INFO: SUCCESS!@#KODE 1!@#USER_ID 34!@#ACTIVITY_CODE 3
12/12/2022 01:11:27 AM script INFO: SUCCESS!@#KODE 1!@#USER_ID 34!@#ACTIVITY_CODE 2
12/12/2022 01:11:27 AM script INFO: SUCCESS!@#KODE 1!@#USER_ID 34!@#ACTIVITY_CODE 2
12/12/2022 01:11:27 AM script INFO: SUCCESS!@#KODE 1!@#USER_ID 34!@#ACTIVITY_CODE 3
12/12/2022 01:11:27 AM script INFO: SUCCESS!@#KODE 1!@#USER_ID 34!@#ACTIVITY_CODE 5
12/12/2022 01:11:27 AM script INFO: SUCCESS!@#KODE 1!@#USER_ID 34!@#ACTIVITY_CODE 5
12/12/2022 01:11:29 AM script INFO: SUCCESS!@#KODE 1!@#USER_ID 34!@#ACTIVITY_CODE 2
12/12/2022 01:11:30 AM script INFO: SUCCESS!@#KODE 1!@#USER_ID 34!@#ACTIVITY_CODE 1
12/12/2022 01:11:30 AM script INFO: SUCCESS!@#KODE 1!@#USER_ID 34!@#ACTIVITY_CODE 3
12/12/2022 01:11:30 AM script INFO: SUCCESS!@#KODE 1!@#USER_ID 34!@#ACTIVITY_CODE 5
12/12/2022 01:11:30 AM script INFO: SUCCESS!@#KODE 1!@#USER_ID 34!@#ACTIVITY_CODE 5
12/12/2022 01:11:32 AM script INFO: SUCCESS!@#KODE 1!@#USER_ID 34!@#ACTIVITY_CODE 1
12/12/2022 01:11:32 AM script INFO: SUCCESS!@#KODE 1!@#USER_ID 34!@#ACTIVITY_CODE 2
12/12/2022 01:11:32 AM script INFO: SUCCESS!@#KODE 1!@#USER_ID 34!@#ACTIVITY_CODE 2
12/12/2022 01:11:32 AM script INFO: SUCCESS!@#KODE 1!@#USER_ID 34!@#ACTIVITY_CODE 1
12/12/2022 01:11:32 AM script INFO: SUCCESS!@#KODE 1!@#USER_ID 34!@#ACTIVITY_CODE 2
12/12/2022 01:11:33 AM script INFO: SUCCESS!@#KODE 1!@#USER_ID 34!@#ACTIVITY_CODE 2
12/12/2022 01:11:33 AM script INFO: SUCCESS!@#KODE 1!@#USER_ID 34!@#ACTIVITY_CODE 2
12/12/2022 01:11:33 AM script INFO: SUCCESS!@#KODE 1!@#USER_ID 34!@#ACTIVITY_CODE 3
12/12/2022 01:11:33 AM script INFO: SUCCESS!@#KODE 1!@#USER_ID 34!@#ACTIVITY_CODE 3
12/12/2022 01:11:33 AM script INFO: SUCCESS!@#KODE 1!@#USER_ID 34!@#ACTIVITY_CODE 2
12/12/2022 01:11:33 AM script INFO: SUCCESS!@#KODE 1!@#USER_ID 34!@#ACTIVITY_CODE 3
12/12/2022 01:11:33 AM script INFO: SUCCESS!@#KODE 1!@#USER_ID 34!@#ACTIVITY_CODE 1
12/12/2022 01:11:33 AM script INFO: SUCCESS!@#KODE 1!@#USER_ID 34!@#ACTIVITY_CODE 1
12/12/2022 01:11:33 AM script INFO: SUCCESS!@#KODE 1!@#USER_ID 34!@#ACTIVITY_CODE 2
12/12/2022 01:11:33 AM script INFO: SUCCESS!@#KODE 1!@#USER_ID 34!@#ACTIVITY_CODE 4
12/12/2022 01:11:33 AM script INFO: Duration: 17.89749264717102
12/12/2022 01:11:33 AM script INFO: mengakhiri-quiz
12/12/2022 01:11:34 AM script INFO: SUCCESS!@#KODE 1!@#USER_ID 34!@#ACTIVITY_CODE 5
12/12/2022 01:11:34 AM script INFO: berhasil-submit
