12/11/2022 03:05:19 PM script INFO: Prepared chrome options..
12/11/2022 03:05:21 PM script INFO: Initialized chrome browser..
12/11/2022 03:05:21 PM script INFO: mengakses-homepage
12/11/2022 03:05:58 PM script INFO: mengakses-login-page
12/11/2022 03:06:04 PM script INFO: mengakses-site-home
12/11/2022 03:06:06 PM script INFO: mengakses-site-course
12/11/2022 03:06:09 PM script INFO: mengakses-quiz
12/11/2022 03:06:10 PM script INFO: mengakses-start-quiz-page
12/11/2022 03:06:13 PM script INFO: memulai-quiz
12/11/2022 03:06:13 PM script INFO: SUCCESS!@#KODE 1!@#USER_ID 10!@#ACTIVITY_CODE 5
12/11/2022 03:06:24 PM script INFO: SUCCESS!@#KODE 1!@#USER_ID 10!@#ACTIVITY_CODE 3
12/11/2022 03:06:24 PM script INFO: SUCCESS!@#KODE 1!@#USER_ID 10!@#ACTIVITY_CODE 2
12/11/2022 03:06:24 PM script INFO: SUCCESS!@#KODE 1!@#USER_ID 10!@#ACTIVITY_CODE 5
12/11/2022 03:06:24 PM script INFO: SUCCESS!@#KODE 1!@#USER_ID 10!@#ACTIVITY_CODE 5
12/11/2022 03:06:27 PM script INFO: SUCCESS!@#KODE 1!@#USER_ID 10!@#ACTIVITY_CODE 5
12/11/2022 03:06:27 PM script INFO: SUCCESS!@#KODE 1!@#USER_ID 10!@#ACTIVITY_CODE 5
12/11/2022 03:06:29 PM script INFO: SUCCESS!@#KODE 1!@#USER_ID 10!@#ACTIVITY_CODE 3
12/11/2022 03:06:29 PM script INFO: SUCCESS!@#KODE 1!@#USER_ID 10!@#ACTIVITY_CODE 5
12/11/2022 03:06:29 PM script INFO: SUCCESS!@#KODE 1!@#USER_ID 10!@#ACTIVITY_CODE 5
12/11/2022 03:06:32 PM script INFO: SUCCESS!@#KODE 1!@#USER_ID 10!@#ACTIVITY_CODE 2
12/11/2022 03:06:32 PM script INFO: SUCCESS!@#KODE 1!@#USER_ID 10!@#ACTIVITY_CODE 3
12/11/2022 03:06:32 PM script INFO: SUCCESS!@#KODE 1!@#USER_ID 10!@#ACTIVITY_CODE 1
12/11/2022 03:06:32 PM script INFO: SUCCESS!@#KODE 1!@#USER_ID 10!@#ACTIVITY_CODE 3
12/11/2022 03:06:32 PM script INFO: SUCCESS!@#KODE 1!@#USER_ID 10!@#ACTIVITY_CODE 2
12/11/2022 03:06:32 PM script INFO: SUCCESS!@#KODE 1!@#USER_ID 10!@#ACTIVITY_CODE 1
12/11/2022 03:06:32 PM script INFO: SUCCESS!@#KODE 1!@#USER_ID 10!@#ACTIVITY_CODE 1
12/11/2022 03:06:33 PM script INFO: SUCCESS!@#KODE 1!@#USER_ID 10!@#ACTIVITY_CODE 2
12/11/2022 03:06:33 PM script INFO: SUCCESS!@#KODE 1!@#USER_ID 10!@#ACTIVITY_CODE 3
12/11/2022 03:06:33 PM script INFO: SUCCESS!@#KODE 1!@#USER_ID 10!@#ACTIVITY_CODE 2
12/11/2022 03:06:33 PM script INFO: SUCCESS!@#KODE 1!@#USER_ID 10!@#ACTIVITY_CODE 1
12/11/2022 03:06:33 PM script INFO: SUCCESS!@#KODE 1!@#USER_ID 10!@#ACTIVITY_CODE 1
12/11/2022 03:06:33 PM script INFO: SUCCESS!@#KODE 1!@#USER_ID 10!@#ACTIVITY_CODE 5
12/11/2022 03:06:33 PM script INFO: SUCCESS!@#KODE 1!@#USER_ID 10!@#ACTIVITY_CODE 5
12/11/2022 03:06:36 PM script INFO: SUCCESS!@#KODE 1!@#USER_ID 10!@#ACTIVITY_CODE 1
12/11/2022 03:06:36 PM script INFO: SUCCESS!@#KODE 1!@#USER_ID 10!@#ACTIVITY_CODE 4
12/11/2022 03:06:36 PM script INFO: SUCCESS!@#KODE 1!@#USER_ID 10!@#ACTIVITY_CODE 2
12/11/2022 03:06:36 PM script INFO: SUCCESS!@#KODE 1!@#USER_ID 10!@#ACTIVITY_CODE 1
12/11/2022 03:06:36 PM script INFO: SUCCESS!@#KODE 1!@#USER_ID 10!@#ACTIVITY_CODE 1
12/11/2022 03:06:36 PM script INFO: SUCCESS!@#KODE 1!@#USER_ID 10!@#ACTIVITY_CODE 2
12/11/2022 03:06:36 PM script INFO: SUCCESS!@#KODE 1!@#USER_ID 10!@#ACTIVITY_CODE 2
12/11/2022 03:06:36 PM script INFO: SUCCESS!@#KODE 1!@#USER_ID 10!@#ACTIVITY_CODE 2
12/11/2022 03:06:36 PM script INFO: SUCCESS!@#KODE 1!@#USER_ID 10!@#ACTIVITY_CODE 3
12/11/2022 03:06:36 PM script INFO: SUCCESS!@#KODE 1!@#USER_ID 10!@#ACTIVITY_CODE 1
12/11/2022 03:06:37 PM script INFO: SUCCESS!@#KODE 1!@#USER_ID 10!@#ACTIVITY_CODE 2
12/11/2022 03:06:37 PM script INFO: SUCCESS!@#KODE 1!@#USER_ID 10!@#ACTIVITY_CODE 3
12/11/2022 03:06:37 PM script INFO: SUCCESS!@#KODE 1!@#USER_ID 10!@#ACTIVITY_CODE 5
12/11/2022 03:06:37 PM script INFO: SUCCESS!@#KODE 1!@#USER_ID 10!@#ACTIVITY_CODE 5
12/11/2022 03:06:39 PM script INFO: SUCCESS!@#KODE 1!@#USER_ID 10!@#ACTIVITY_CODE 2
12/11/2022 03:06:39 PM script INFO: SUCCESS!@#KODE 1!@#USER_ID 10!@#ACTIVITY_CODE 5
12/11/2022 03:06:39 PM script INFO: SUCCESS!@#KODE 1!@#USER_ID 10!@#ACTIVITY_CODE 5
12/11/2022 03:06:42 PM script INFO: SUCCESS!@#KODE 1!@#USER_ID 10!@#ACTIVITY_CODE 2
12/11/2022 03:06:42 PM script INFO: SUCCESS!@#KODE 1!@#USER_ID 10!@#ACTIVITY_CODE 1
12/11/2022 03:06:42 PM script INFO: SUCCESS!@#KODE 1!@#USER_ID 10!@#ACTIVITY_CODE 3
12/11/2022 03:06:42 PM script INFO: SUCCESS!@#KODE 1!@#USER_ID 10!@#ACTIVITY_CODE 1
12/11/2022 03:06:42 PM script INFO: SUCCESS!@#KODE 1!@#USER_ID 10!@#ACTIVITY_CODE 4
12/11/2022 03:06:42 PM script INFO: SUCCESS!@#KODE 1!@#USER_ID 10!@#ACTIVITY_CODE 3
12/11/2022 03:06:42 PM script INFO: SUCCESS!@#KODE 1!@#USER_ID 10!@#ACTIVITY_CODE 2
12/11/2022 03:06:42 PM script INFO: SUCCESS!@#KODE 1!@#USER_ID 10!@#ACTIVITY_CODE 1
12/11/2022 03:06:42 PM script INFO: Duration: 18.445462226867676
12/11/2022 03:06:42 PM script INFO: mengakhiri-quiz
12/11/2022 03:06:43 PM script INFO: SUCCESS!@#KODE 1!@#USER_ID 10!@#ACTIVITY_CODE 5
12/11/2022 03:06:43 PM script INFO: berhasil-submit
