12/23/2022 03:16:01 AM script INFO: Prepared chrome options..
12/23/2022 03:16:03 AM script INFO: Initialized chrome browser..
12/23/2022 03:16:03 AM script INFO: mengakses-homepage
12/23/2022 03:16:17 AM script INFO: mengakses-login-page
12/23/2022 03:16:18 AM script INFO: mengakses-site-home
12/23/2022 03:16:18 AM script INFO: mengakses-site-course
12/23/2022 03:16:19 AM script INFO: mengakses-quiz
12/23/2022 03:16:20 AM script INFO: mengakses-start-quiz-page
12/23/2022 03:16:21 AM script INFO: memulai-quiz
12/23/2022 03:16:21 AM script INFO: SUCCESS!@#KODE 1!@#USER_ID 94!@#ACTIVITY_CODE 5
12/23/2022 03:16:32 AM script INFO: SUCCESS!@#KODE 1!@#USER_ID 94!@#ACTIVITY_CODE 1
12/23/2022 03:16:32 AM script INFO: SUCCESS!@#KODE 1!@#USER_ID 94!@#ACTIVITY_CODE 2
12/23/2022 03:16:32 AM script INFO: SUCCESS!@#KODE 1!@#USER_ID 94!@#ACTIVITY_CODE 1
12/23/2022 03:16:32 AM script INFO: SUCCESS!@#KODE 1!@#USER_ID 94!@#ACTIVITY_CODE 5
12/23/2022 03:16:32 AM script INFO: SUCCESS!@#KODE 1!@#USER_ID 94!@#ACTIVITY_CODE 5
12/23/2022 03:16:34 AM script INFO: SUCCESS!@#KODE 1!@#USER_ID 94!@#ACTIVITY_CODE 5
12/23/2022 03:16:34 AM script INFO: SUCCESS!@#KODE 1!@#USER_ID 94!@#ACTIVITY_CODE 5
12/23/2022 03:16:37 AM script INFO: SUCCESS!@#KODE 1!@#USER_ID 94!@#ACTIVITY_CODE 2
12/23/2022 03:16:37 AM script INFO: SUCCESS!@#KODE 1!@#USER_ID 94!@#ACTIVITY_CODE 2
12/23/2022 03:16:37 AM script INFO: SUCCESS!@#KODE 1!@#USER_ID 94!@#ACTIVITY_CODE 1
12/23/2022 03:16:37 AM script INFO: SUCCESS!@#KODE 1!@#USER_ID 94!@#ACTIVITY_CODE 2
12/23/2022 03:16:38 AM script INFO: SUCCESS!@#KODE 1!@#USER_ID 94!@#ACTIVITY_CODE 2
12/23/2022 03:16:38 AM script INFO: SUCCESS!@#KODE 1!@#USER_ID 94!@#ACTIVITY_CODE 1
12/23/2022 03:16:38 AM script INFO: SUCCESS!@#KODE 1!@#USER_ID 94!@#ACTIVITY_CODE 2
12/23/2022 03:16:38 AM script INFO: SUCCESS!@#KODE 1!@#USER_ID 94!@#ACTIVITY_CODE 5
12/23/2022 03:16:38 AM script INFO: SUCCESS!@#KODE 1!@#USER_ID 94!@#ACTIVITY_CODE 5
12/23/2022 03:16:40 AM script INFO: SUCCESS!@#KODE 1!@#USER_ID 94!@#ACTIVITY_CODE 2
12/23/2022 03:16:41 AM script INFO: SUCCESS!@#KODE 1!@#USER_ID 94!@#ACTIVITY_CODE 3
12/23/2022 03:16:41 AM script INFO: SUCCESS!@#KODE 1!@#USER_ID 94!@#ACTIVITY_CODE 1
12/23/2022 03:16:41 AM script INFO: SUCCESS!@#KODE 1!@#USER_ID 94!@#ACTIVITY_CODE 5
12/23/2022 03:16:41 AM script INFO: SUCCESS!@#KODE 1!@#USER_ID 94!@#ACTIVITY_CODE 5
12/23/2022 03:16:43 AM script INFO: SUCCESS!@#KODE 1!@#USER_ID 94!@#ACTIVITY_CODE 3
12/23/2022 03:16:43 AM script INFO: SUCCESS!@#KODE 1!@#USER_ID 94!@#ACTIVITY_CODE 2
12/23/2022 03:16:44 AM script INFO: SUCCESS!@#KODE 1!@#USER_ID 94!@#ACTIVITY_CODE 2
12/23/2022 03:16:44 AM script INFO: SUCCESS!@#KODE 1!@#USER_ID 94!@#ACTIVITY_CODE 1
12/23/2022 03:16:44 AM script INFO: SUCCESS!@#KODE 1!@#USER_ID 94!@#ACTIVITY_CODE 2
12/23/2022 03:16:44 AM script INFO: SUCCESS!@#KODE 1!@#USER_ID 94!@#ACTIVITY_CODE 2
12/23/2022 03:16:44 AM script INFO: SUCCESS!@#KODE 1!@#USER_ID 94!@#ACTIVITY_CODE 3
12/23/2022 03:16:44 AM script INFO: SUCCESS!@#KODE 1!@#USER_ID 94!@#ACTIVITY_CODE 3
12/23/2022 03:16:44 AM script INFO: SUCCESS!@#KODE 1!@#USER_ID 94!@#ACTIVITY_CODE 5
12/23/2022 03:16:44 AM script INFO: SUCCESS!@#KODE 1!@#USER_ID 94!@#ACTIVITY_CODE 5
12/23/2022 03:16:47 AM script INFO: SUCCESS!@#KODE 1!@#USER_ID 94!@#ACTIVITY_CODE 5
12/23/2022 03:16:47 AM script INFO: SUCCESS!@#KODE 1!@#USER_ID 94!@#ACTIVITY_CODE 5
12/23/2022 03:16:50 AM script INFO: SUCCESS!@#KODE 1!@#USER_ID 94!@#ACTIVITY_CODE 4
12/23/2022 03:16:50 AM script INFO: SUCCESS!@#KODE 1!@#USER_ID 94!@#ACTIVITY_CODE 3
12/23/2022 03:16:50 AM script INFO: SUCCESS!@#KODE 1!@#USER_ID 94!@#ACTIVITY_CODE 1
12/23/2022 03:16:50 AM script INFO: SUCCESS!@#KODE 1!@#USER_ID 94!@#ACTIVITY_CODE 1
12/23/2022 03:16:50 AM script INFO: SUCCESS!@#KODE 1!@#USER_ID 94!@#ACTIVITY_CODE 1
12/23/2022 03:16:50 AM script INFO: SUCCESS!@#KODE 1!@#USER_ID 94!@#ACTIVITY_CODE 1
12/23/2022 03:16:50 AM script INFO: SUCCESS!@#KODE 1!@#USER_ID 94!@#ACTIVITY_CODE 4
12/23/2022 03:16:50 AM script INFO: SUCCESS!@#KODE 1!@#USER_ID 94!@#ACTIVITY_CODE 2
12/23/2022 03:16:50 AM script INFO: SUCCESS!@#KODE 1!@#USER_ID 94!@#ACTIVITY_CODE 4
12/23/2022 03:16:50 AM script INFO: SUCCESS!@#KODE 1!@#USER_ID 94!@#ACTIVITY_CODE 1
12/23/2022 03:16:50 AM script INFO: SUCCESS!@#KODE 1!@#USER_ID 94!@#ACTIVITY_CODE 2
12/23/2022 03:16:51 AM script INFO: SUCCESS!@#KODE 1!@#USER_ID 94!@#ACTIVITY_CODE 3
12/23/2022 03:16:51 AM script INFO: SUCCESS!@#KODE 1!@#USER_ID 94!@#ACTIVITY_CODE 4
12/23/2022 03:16:51 AM script INFO: SUCCESS!@#KODE 1!@#USER_ID 94!@#ACTIVITY_CODE 3
12/23/2022 03:16:51 AM script INFO: SUCCESS!@#KODE 1!@#USER_ID 94!@#ACTIVITY_CODE 2
12/23/2022 03:16:51 AM script INFO: Duration: 19.341187477111816
12/23/2022 03:16:51 AM script INFO: mengakhiri-quiz
12/23/2022 03:16:52 AM script INFO: SUCCESS!@#KODE 1!@#USER_ID 94!@#ACTIVITY_CODE 5
12/23/2022 03:16:52 AM script INFO: berhasil-submit
