12/23/2022 04:20:19 AM script INFO: Prepared chrome options..
12/23/2022 04:20:21 AM script INFO: Initialized chrome browser..
12/23/2022 04:20:21 AM script INFO: mengakses-homepage
12/23/2022 04:21:24 AM script INFO: mengakses-login-page
12/23/2022 04:22:02 AM script INFO: mengakses-site-home
12/23/2022 04:22:03 AM main_worker ERROR: Message: element click intercepted: Element <a class="list-group-item list-group-item-action  " href="http://35.238.154.97/?redirect=0" data-key="home" data-isexpandable="0" data-indent="0" data-showdivider="0" data-type="70" data-nodetype="0" data-collapse="0" data-forceopen="0" data-isactive="0" data-hidden="0" data-preceedwithhr="0" data-parent-key="myhome">...</a> is not clickable at point (142, 141). Other element would receive the click: <div class="yui3-widget-mask" style="position: fixed; width: 100%; height: 100%; top: 0px; left: 0px; z-index: 1046;"></div>
  (Session info: headless chrome=107.0.5304.87)
Stacktrace:
#0 0x5640c8c0e463 <unknown>
#1 0x5640c89d28d8 <unknown>
#2 0x5640c8a1823b <unknown>
#3 0x5640c8a15a79 <unknown>
#4 0x5640c8a12fe4 <unknown>
#5 0x5640c8a11b21 <unknown>
#6 0x5640c8a04421 <unknown>
#7 0x5640c8a31622 <unknown>
#8 0x5640c8a03ba7 <unknown>
#9 0x5640c8a3178e <unknown>
#10 0x5640c8a4a30f <unknown>
#11 0x5640c8a31443 <unknown>
#12 0x5640c8a023c5 <unknown>
#13 0x5640c8a03531 <unknown>
#14 0x5640c8c60dce <unknown>
#15 0x5640c8c64192 <unknown>
#16 0x5640c8c4593e <unknown>
#17 0x5640c8c65103 <unknown>
#18 0x5640c8c38d85 <unknown>
#19 0x5640c8c860a8 <unknown>
#20 0x5640c8c86239 <unknown>
#21 0x5640c8ca1492 <unknown>
#22 0x7ff1f9836609 start_thread

