12/23/2022 07:11:46 AM script INFO: Prepared chrome options..
12/23/2022 07:11:48 AM script INFO: Initialized chrome browser..
12/23/2022 07:11:48 AM script INFO: mengakses-homepage
12/23/2022 07:12:12 AM script INFO: mengakses-login-page
12/23/2022 07:12:13 AM script INFO: mengakses-site-home
12/23/2022 07:12:13 AM script INFO: mengakses-site-course
12/23/2022 07:12:14 AM script INFO: mengakses-quiz
12/23/2022 07:12:14 AM script INFO: mengakses-start-quiz-page
12/23/2022 07:12:15 AM script INFO: memulai-quiz
12/23/2022 07:12:15 AM script INFO: SUCCESS!@#KODE 1!@#USER_ID 40!@#ACTIVITY_CODE 5
12/23/2022 07:12:26 AM script INFO: SUCCESS!@#KODE 1!@#USER_ID 40!@#ACTIVITY_CODE 3
12/23/2022 07:12:26 AM script INFO: SUCCESS!@#KODE 1!@#USER_ID 40!@#ACTIVITY_CODE 5
12/23/2022 07:12:26 AM script INFO: SUCCESS!@#KODE 1!@#USER_ID 40!@#ACTIVITY_CODE 5
12/23/2022 07:12:29 AM script INFO: SUCCESS!@#KODE 1!@#USER_ID 40!@#ACTIVITY_CODE 1
12/23/2022 07:12:29 AM script INFO: SUCCESS!@#KODE 1!@#USER_ID 40!@#ACTIVITY_CODE 2
12/23/2022 07:12:29 AM script INFO: SUCCESS!@#KODE 1!@#USER_ID 40!@#ACTIVITY_CODE 1
12/23/2022 07:12:29 AM script INFO: SUCCESS!@#KODE 1!@#USER_ID 40!@#ACTIVITY_CODE 3
12/23/2022 07:12:29 AM script INFO: SUCCESS!@#KODE 1!@#USER_ID 40!@#ACTIVITY_CODE 3
12/23/2022 07:12:29 AM script INFO: SUCCESS!@#KODE 1!@#USER_ID 40!@#ACTIVITY_CODE 5
12/23/2022 07:12:29 AM script INFO: SUCCESS!@#KODE 1!@#USER_ID 40!@#ACTIVITY_CODE 5
12/23/2022 07:12:32 AM script INFO: SUCCESS!@#KODE 1!@#USER_ID 40!@#ACTIVITY_CODE 1
12/23/2022 07:12:32 AM script INFO: SUCCESS!@#KODE 1!@#USER_ID 40!@#ACTIVITY_CODE 5
12/23/2022 07:12:32 AM script INFO: SUCCESS!@#KODE 1!@#USER_ID 40!@#ACTIVITY_CODE 5
12/23/2022 07:12:34 AM script INFO: SUCCESS!@#KODE 1!@#USER_ID 40!@#ACTIVITY_CODE 4
12/23/2022 07:12:35 AM script INFO: SUCCESS!@#KODE 1!@#USER_ID 40!@#ACTIVITY_CODE 3
12/23/2022 07:12:35 AM script INFO: SUCCESS!@#KODE 1!@#USER_ID 40!@#ACTIVITY_CODE 2
12/23/2022 07:12:35 AM script INFO: SUCCESS!@#KODE 1!@#USER_ID 40!@#ACTIVITY_CODE 3
12/23/2022 07:12:35 AM script INFO: SUCCESS!@#KODE 1!@#USER_ID 40!@#ACTIVITY_CODE 2
12/23/2022 07:12:35 AM script INFO: SUCCESS!@#KODE 1!@#USER_ID 40!@#ACTIVITY_CODE 3
12/23/2022 07:12:35 AM script INFO: SUCCESS!@#KODE 1!@#USER_ID 40!@#ACTIVITY_CODE 5
12/23/2022 07:12:35 AM script INFO: SUCCESS!@#KODE 1!@#USER_ID 40!@#ACTIVITY_CODE 5
12/23/2022 07:12:38 AM script INFO: SUCCESS!@#KODE 1!@#USER_ID 40!@#ACTIVITY_CODE 3
12/23/2022 07:12:38 AM script INFO: SUCCESS!@#KODE 1!@#USER_ID 40!@#ACTIVITY_CODE 3
12/23/2022 07:12:38 AM script INFO: SUCCESS!@#KODE 1!@#USER_ID 40!@#ACTIVITY_CODE 1
12/23/2022 07:12:38 AM script INFO: SUCCESS!@#KODE 1!@#USER_ID 40!@#ACTIVITY_CODE 5
12/23/2022 07:12:38 AM script INFO: SUCCESS!@#KODE 1!@#USER_ID 40!@#ACTIVITY_CODE 5
12/23/2022 07:12:40 AM script INFO: SUCCESS!@#KODE 1!@#USER_ID 40!@#ACTIVITY_CODE 5
12/23/2022 07:12:40 AM script INFO: SUCCESS!@#KODE 1!@#USER_ID 40!@#ACTIVITY_CODE 5
12/23/2022 07:12:43 AM script INFO: SUCCESS!@#KODE 1!@#USER_ID 40!@#ACTIVITY_CODE 2
12/23/2022 07:12:43 AM script INFO: SUCCESS!@#KODE 1!@#USER_ID 40!@#ACTIVITY_CODE 1
12/23/2022 07:12:43 AM script INFO: SUCCESS!@#KODE 1!@#USER_ID 40!@#ACTIVITY_CODE 3
12/23/2022 07:12:43 AM script INFO: SUCCESS!@#KODE 1!@#USER_ID 40!@#ACTIVITY_CODE 1
12/23/2022 07:12:43 AM script INFO: SUCCESS!@#KODE 1!@#USER_ID 40!@#ACTIVITY_CODE 1
12/23/2022 07:12:43 AM script INFO: SUCCESS!@#KODE 1!@#USER_ID 40!@#ACTIVITY_CODE 4
12/23/2022 07:12:44 AM script INFO: SUCCESS!@#KODE 1!@#USER_ID 40!@#ACTIVITY_CODE 2
12/23/2022 07:12:44 AM script INFO: SUCCESS!@#KODE 1!@#USER_ID 40!@#ACTIVITY_CODE 2
12/23/2022 07:12:44 AM script INFO: SUCCESS!@#KODE 1!@#USER_ID 40!@#ACTIVITY_CODE 2
12/23/2022 07:12:44 AM script INFO: SUCCESS!@#KODE 1!@#USER_ID 40!@#ACTIVITY_CODE 5
12/23/2022 07:12:44 AM script INFO: SUCCESS!@#KODE 1!@#USER_ID 40!@#ACTIVITY_CODE 5
12/23/2022 07:12:47 AM script INFO: SUCCESS!@#KODE 1!@#USER_ID 40!@#ACTIVITY_CODE 5
12/23/2022 07:12:47 AM script INFO: SUCCESS!@#KODE 1!@#USER_ID 40!@#ACTIVITY_CODE 5
12/23/2022 07:12:49 AM script INFO: SUCCESS!@#KODE 1!@#USER_ID 40!@#ACTIVITY_CODE 5
12/23/2022 07:12:49 AM script INFO: SUCCESS!@#KODE 1!@#USER_ID 40!@#ACTIVITY_CODE 5
12/23/2022 07:12:52 AM script INFO: SUCCESS!@#KODE 1!@#USER_ID 40!@#ACTIVITY_CODE 1
12/23/2022 07:12:52 AM script INFO: SUCCESS!@#KODE 1!@#USER_ID 40!@#ACTIVITY_CODE 3
12/23/2022 07:12:52 AM script INFO: SUCCESS!@#KODE 1!@#USER_ID 40!@#ACTIVITY_CODE 2
12/23/2022 07:12:52 AM script INFO: SUCCESS!@#KODE 1!@#USER_ID 40!@#ACTIVITY_CODE 3
12/23/2022 07:12:52 AM script INFO: SUCCESS!@#KODE 1!@#USER_ID 40!@#ACTIVITY_CODE 5
12/23/2022 07:12:52 AM script INFO: SUCCESS!@#KODE 1!@#USER_ID 40!@#ACTIVITY_CODE 5
12/23/2022 07:12:55 AM script INFO: SUCCESS!@#KODE 1!@#USER_ID 40!@#ACTIVITY_CODE 1
12/23/2022 07:12:55 AM script INFO: SUCCESS!@#KODE 1!@#USER_ID 40!@#ACTIVITY_CODE 3
12/23/2022 07:12:55 AM script INFO: SUCCESS!@#KODE 1!@#USER_ID 40!@#ACTIVITY_CODE 5
12/23/2022 07:12:55 AM script INFO: SUCCESS!@#KODE 1!@#USER_ID 40!@#ACTIVITY_CODE 5
12/23/2022 07:12:57 AM script INFO: SUCCESS!@#KODE 1!@#USER_ID 40!@#ACTIVITY_CODE 1
12/23/2022 07:12:57 AM script INFO: SUCCESS!@#KODE 1!@#USER_ID 40!@#ACTIVITY_CODE 2
12/23/2022 07:12:57 AM script INFO: SUCCESS!@#KODE 1!@#USER_ID 40!@#ACTIVITY_CODE 1
12/23/2022 07:12:58 AM script INFO: SUCCESS!@#KODE 1!@#USER_ID 40!@#ACTIVITY_CODE 4
12/23/2022 07:12:58 AM script INFO: SUCCESS!@#KODE 1!@#USER_ID 40!@#ACTIVITY_CODE 3
12/23/2022 07:12:58 AM script INFO: SUCCESS!@#KODE 1!@#USER_ID 40!@#ACTIVITY_CODE 1
12/23/2022 07:12:58 AM script INFO: SUCCESS!@#KODE 1!@#USER_ID 40!@#ACTIVITY_CODE 1
12/23/2022 07:12:58 AM script INFO: SUCCESS!@#KODE 1!@#USER_ID 40!@#ACTIVITY_CODE 3
12/23/2022 07:12:58 AM script INFO: SUCCESS!@#KODE 1!@#USER_ID 40!@#ACTIVITY_CODE 1
12/23/2022 07:12:58 AM script INFO: SUCCESS!@#KODE 1!@#USER_ID 40!@#ACTIVITY_CODE 3
12/23/2022 07:12:58 AM script INFO: SUCCESS!@#KODE 1!@#USER_ID 40!@#ACTIVITY_CODE 2
12/23/2022 07:12:58 AM script INFO: SUCCESS!@#KODE 1!@#USER_ID 40!@#ACTIVITY_CODE 2
12/23/2022 07:12:58 AM script INFO: SUCCESS!@#KODE 1!@#USER_ID 40!@#ACTIVITY_CODE 1
12/23/2022 07:12:58 AM script INFO: SUCCESS!@#KODE 1!@#USER_ID 40!@#ACTIVITY_CODE 2
12/23/2022 07:12:58 AM script INFO: SUCCESS!@#KODE 1!@#USER_ID 40!@#ACTIVITY_CODE 2
12/23/2022 07:12:59 AM script INFO: SUCCESS!@#KODE 1!@#USER_ID 40!@#ACTIVITY_CODE 1
12/23/2022 07:12:59 AM script INFO: SUCCESS!@#KODE 1!@#USER_ID 40!@#ACTIVITY_CODE 2
12/23/2022 07:12:59 AM script INFO: SUCCESS!@#KODE 1!@#USER_ID 40!@#ACTIVITY_CODE 1
12/23/2022 07:12:59 AM script INFO: SUCCESS!@#KODE 1!@#USER_ID 40!@#ACTIVITY_CODE 2
12/23/2022 07:12:59 AM script INFO: SUCCESS!@#KODE 1!@#USER_ID 40!@#ACTIVITY_CODE 3
12/23/2022 07:12:59 AM script INFO: SUCCESS!@#KODE 1!@#USER_ID 40!@#ACTIVITY_CODE 1
12/23/2022 07:12:59 AM script INFO: SUCCESS!@#KODE 1!@#USER_ID 40!@#ACTIVITY_CODE 4
12/23/2022 07:12:59 AM script INFO: SUCCESS!@#KODE 1!@#USER_ID 40!@#ACTIVITY_CODE 1
12/23/2022 07:12:59 AM script INFO: SUCCESS!@#KODE 1!@#USER_ID 40!@#ACTIVITY_CODE 4
12/23/2022 07:12:59 AM script INFO: SUCCESS!@#KODE 1!@#USER_ID 40!@#ACTIVITY_CODE 1
12/23/2022 07:12:59 AM script INFO: SUCCESS!@#KODE 1!@#USER_ID 40!@#ACTIVITY_CODE 2
12/23/2022 07:12:59 AM script INFO: SUCCESS!@#KODE 1!@#USER_ID 40!@#ACTIVITY_CODE 3
12/23/2022 07:13:00 AM script INFO: SUCCESS!@#KODE 1!@#USER_ID 40!@#ACTIVITY_CODE 4
12/23/2022 07:13:00 AM script INFO: SUCCESS!@#KODE 1!@#USER_ID 40!@#ACTIVITY_CODE 1
12/23/2022 07:13:00 AM script INFO: SUCCESS!@#KODE 1!@#USER_ID 40!@#ACTIVITY_CODE 1
12/23/2022 07:13:00 AM script INFO: SUCCESS!@#KODE 1!@#USER_ID 40!@#ACTIVITY_CODE 3
12/23/2022 07:13:00 AM script INFO: SUCCESS!@#KODE 1!@#USER_ID 40!@#ACTIVITY_CODE 3
12/23/2022 07:13:00 AM script INFO: SUCCESS!@#KODE 1!@#USER_ID 40!@#ACTIVITY_CODE 4
12/23/2022 07:13:00 AM script INFO: SUCCESS!@#KODE 1!@#USER_ID 40!@#ACTIVITY_CODE 3
12/23/2022 07:13:00 AM script INFO: SUCCESS!@#KODE 1!@#USER_ID 40!@#ACTIVITY_CODE 2
12/23/2022 07:13:00 AM script INFO: SUCCESS!@#KODE 1!@#USER_ID 40!@#ACTIVITY_CODE 3
12/23/2022 07:13:00 AM script INFO: SUCCESS!@#KODE 1!@#USER_ID 40!@#ACTIVITY_CODE 2
12/23/2022 07:13:00 AM script INFO: SUCCESS!@#KODE 1!@#USER_ID 40!@#ACTIVITY_CODE 3
12/23/2022 07:13:00 AM script INFO: SUCCESS!@#KODE 1!@#USER_ID 40!@#ACTIVITY_CODE 3
12/23/2022 07:13:00 AM script INFO: SUCCESS!@#KODE 1!@#USER_ID 40!@#ACTIVITY_CODE 3
12/23/2022 07:13:01 AM script INFO: SUCCESS!@#KODE 1!@#USER_ID 40!@#ACTIVITY_CODE 2
12/23/2022 07:13:01 AM script INFO: SUCCESS!@#KODE 1!@#USER_ID 40!@#ACTIVITY_CODE 3
12/23/2022 07:13:01 AM script INFO: SUCCESS!@#KODE 1!@#USER_ID 40!@#ACTIVITY_CODE 1
12/23/2022 07:13:01 AM script INFO: SUCCESS!@#KODE 1!@#USER_ID 40!@#ACTIVITY_CODE 3
12/23/2022 07:13:01 AM script INFO: SUCCESS!@#KODE 1!@#USER_ID 40!@#ACTIVITY_CODE 2
12/23/2022 07:13:01 AM script INFO: Duration: 34.78826570510864
12/23/2022 07:13:01 AM script INFO: mengakhiri-quiz
12/23/2022 07:13:06 AM script INFO: SUCCESS!@#KODE 1!@#USER_ID 40!@#ACTIVITY_CODE 5
12/23/2022 07:13:06 AM script INFO: berhasil-submit
