12/23/2022 03:21:10 AM script INFO: Prepared chrome options..
12/23/2022 03:21:11 AM script INFO: Initialized chrome browser..
12/23/2022 03:21:11 AM script INFO: mengakses-homepage
12/23/2022 03:21:52 AM script INFO: mengakses-login-page
12/23/2022 03:22:08 AM script INFO: mengakses-site-home
12/23/2022 03:22:08 AM script INFO: mengakses-site-course
12/23/2022 03:22:09 AM script INFO: mengakses-quiz
12/23/2022 03:22:10 AM script INFO: mengakses-start-quiz-page
12/23/2022 03:22:11 AM script INFO: memulai-quiz
12/23/2022 03:22:11 AM script INFO: SUCCESS!@#KODE 1!@#USER_ID 4!@#ACTIVITY_CODE 5
12/23/2022 03:22:21 AM script INFO: SUCCESS!@#KODE 1!@#USER_ID 4!@#ACTIVITY_CODE 1
12/23/2022 03:22:22 AM script INFO: SUCCESS!@#KODE 1!@#USER_ID 4!@#ACTIVITY_CODE 3
12/23/2022 03:22:22 AM script INFO: SUCCESS!@#KODE 1!@#USER_ID 4!@#ACTIVITY_CODE 3
12/23/2022 03:22:22 AM script INFO: SUCCESS!@#KODE 1!@#USER_ID 4!@#ACTIVITY_CODE 3
12/23/2022 03:22:22 AM script INFO: SUCCESS!@#KODE 1!@#USER_ID 4!@#ACTIVITY_CODE 2
12/23/2022 03:22:22 AM script INFO: SUCCESS!@#KODE 1!@#USER_ID 4!@#ACTIVITY_CODE 3
12/23/2022 03:22:22 AM script INFO: SUCCESS!@#KODE 1!@#USER_ID 4!@#ACTIVITY_CODE 5
12/23/2022 03:22:22 AM script INFO: SUCCESS!@#KODE 1!@#USER_ID 4!@#ACTIVITY_CODE 5
12/23/2022 03:22:25 AM script INFO: SUCCESS!@#KODE 1!@#USER_ID 4!@#ACTIVITY_CODE 2
12/23/2022 03:22:25 AM script INFO: SUCCESS!@#KODE 1!@#USER_ID 4!@#ACTIVITY_CODE 3
12/23/2022 03:22:25 AM script INFO: SUCCESS!@#KODE 1!@#USER_ID 4!@#ACTIVITY_CODE 5
12/23/2022 03:22:25 AM script INFO: SUCCESS!@#KODE 1!@#USER_ID 4!@#ACTIVITY_CODE 5
12/23/2022 03:22:27 AM script INFO: SUCCESS!@#KODE 1!@#USER_ID 4!@#ACTIVITY_CODE 2
12/23/2022 03:22:27 AM script INFO: SUCCESS!@#KODE 1!@#USER_ID 4!@#ACTIVITY_CODE 1
12/23/2022 03:22:28 AM script INFO: SUCCESS!@#KODE 1!@#USER_ID 4!@#ACTIVITY_CODE 2
12/23/2022 03:22:28 AM script INFO: SUCCESS!@#KODE 1!@#USER_ID 4!@#ACTIVITY_CODE 2
12/23/2022 03:22:28 AM script INFO: SUCCESS!@#KODE 1!@#USER_ID 4!@#ACTIVITY_CODE 2
12/23/2022 03:22:28 AM script INFO: SUCCESS!@#KODE 1!@#USER_ID 4!@#ACTIVITY_CODE 2
12/23/2022 03:22:28 AM script INFO: SUCCESS!@#KODE 1!@#USER_ID 4!@#ACTIVITY_CODE 5
12/23/2022 03:22:28 AM script INFO: SUCCESS!@#KODE 1!@#USER_ID 4!@#ACTIVITY_CODE 5
12/23/2022 03:22:31 AM script INFO: SUCCESS!@#KODE 1!@#USER_ID 4!@#ACTIVITY_CODE 3
12/23/2022 03:22:31 AM script INFO: SUCCESS!@#KODE 1!@#USER_ID 4!@#ACTIVITY_CODE 2
12/23/2022 03:22:31 AM script INFO: SUCCESS!@#KODE 1!@#USER_ID 4!@#ACTIVITY_CODE 5
12/23/2022 03:22:31 AM script INFO: SUCCESS!@#KODE 1!@#USER_ID 4!@#ACTIVITY_CODE 5
12/23/2022 03:22:33 AM script INFO: SUCCESS!@#KODE 1!@#USER_ID 4!@#ACTIVITY_CODE 2
12/23/2022 03:22:33 AM script INFO: SUCCESS!@#KODE 1!@#USER_ID 4!@#ACTIVITY_CODE 1
12/23/2022 03:22:33 AM script INFO: SUCCESS!@#KODE 1!@#USER_ID 4!@#ACTIVITY_CODE 5
12/23/2022 03:22:33 AM script INFO: SUCCESS!@#KODE 1!@#USER_ID 4!@#ACTIVITY_CODE 5
12/23/2022 03:22:36 AM script INFO: SUCCESS!@#KODE 1!@#USER_ID 4!@#ACTIVITY_CODE 1
12/23/2022 03:22:36 AM script INFO: SUCCESS!@#KODE 1!@#USER_ID 4!@#ACTIVITY_CODE 5
12/23/2022 03:22:36 AM script INFO: SUCCESS!@#KODE 1!@#USER_ID 4!@#ACTIVITY_CODE 5
12/23/2022 03:22:39 AM script INFO: SUCCESS!@#KODE 1!@#USER_ID 4!@#ACTIVITY_CODE 3
12/23/2022 03:22:39 AM script INFO: SUCCESS!@#KODE 1!@#USER_ID 4!@#ACTIVITY_CODE 1
12/23/2022 03:22:39 AM script INFO: SUCCESS!@#KODE 1!@#USER_ID 4!@#ACTIVITY_CODE 4
12/23/2022 03:22:39 AM script INFO: SUCCESS!@#KODE 1!@#USER_ID 4!@#ACTIVITY_CODE 2
12/23/2022 03:22:39 AM script INFO: SUCCESS!@#KODE 1!@#USER_ID 4!@#ACTIVITY_CODE 3
12/23/2022 03:22:39 AM script INFO: SUCCESS!@#KODE 1!@#USER_ID 4!@#ACTIVITY_CODE 1
12/23/2022 03:22:39 AM script INFO: SUCCESS!@#KODE 1!@#USER_ID 4!@#ACTIVITY_CODE 5
12/23/2022 03:22:39 AM script INFO: SUCCESS!@#KODE 1!@#USER_ID 4!@#ACTIVITY_CODE 5
12/23/2022 03:22:41 AM script INFO: SUCCESS!@#KODE 1!@#USER_ID 4!@#ACTIVITY_CODE 2
12/23/2022 03:22:42 AM script INFO: SUCCESS!@#KODE 1!@#USER_ID 4!@#ACTIVITY_CODE 2
12/23/2022 03:22:42 AM script INFO: SUCCESS!@#KODE 1!@#USER_ID 4!@#ACTIVITY_CODE 5
12/23/2022 03:22:42 AM script INFO: SUCCESS!@#KODE 1!@#USER_ID 4!@#ACTIVITY_CODE 5
12/23/2022 03:22:44 AM script INFO: SUCCESS!@#KODE 1!@#USER_ID 4!@#ACTIVITY_CODE 3
12/23/2022 03:22:44 AM script INFO: SUCCESS!@#KODE 1!@#USER_ID 4!@#ACTIVITY_CODE 1
12/23/2022 03:22:44 AM script INFO: SUCCESS!@#KODE 1!@#USER_ID 4!@#ACTIVITY_CODE 2
12/23/2022 03:22:44 AM script INFO: SUCCESS!@#KODE 1!@#USER_ID 4!@#ACTIVITY_CODE 2
12/23/2022 03:22:44 AM script INFO: SUCCESS!@#KODE 1!@#USER_ID 4!@#ACTIVITY_CODE 2
12/23/2022 03:22:45 AM script INFO: SUCCESS!@#KODE 1!@#USER_ID 4!@#ACTIVITY_CODE 2
12/23/2022 03:22:45 AM script INFO: SUCCESS!@#KODE 1!@#USER_ID 4!@#ACTIVITY_CODE 1
12/23/2022 03:22:45 AM script INFO: SUCCESS!@#KODE 1!@#USER_ID 4!@#ACTIVITY_CODE 4
12/23/2022 03:22:45 AM script INFO: SUCCESS!@#KODE 1!@#USER_ID 4!@#ACTIVITY_CODE 5
12/23/2022 03:22:45 AM script INFO: SUCCESS!@#KODE 1!@#USER_ID 4!@#ACTIVITY_CODE 5
12/23/2022 03:22:47 AM script INFO: SUCCESS!@#KODE 1!@#USER_ID 4!@#ACTIVITY_CODE 5
12/23/2022 03:22:47 AM script INFO: SUCCESS!@#KODE 1!@#USER_ID 4!@#ACTIVITY_CODE 5
12/23/2022 03:22:50 AM script INFO: SUCCESS!@#KODE 1!@#USER_ID 4!@#ACTIVITY_CODE 3
12/23/2022 03:22:50 AM script INFO: SUCCESS!@#KODE 1!@#USER_ID 4!@#ACTIVITY_CODE 2
12/23/2022 03:22:50 AM script INFO: SUCCESS!@#KODE 1!@#USER_ID 4!@#ACTIVITY_CODE 1
12/23/2022 03:22:50 AM script INFO: SUCCESS!@#KODE 1!@#USER_ID 4!@#ACTIVITY_CODE 3
12/23/2022 03:22:50 AM script INFO: SUCCESS!@#KODE 1!@#USER_ID 4!@#ACTIVITY_CODE 3
12/23/2022 03:22:50 AM script INFO: SUCCESS!@#KODE 1!@#USER_ID 4!@#ACTIVITY_CODE 4
12/23/2022 03:22:50 AM script INFO: SUCCESS!@#KODE 1!@#USER_ID 4!@#ACTIVITY_CODE 2
12/23/2022 03:22:50 AM script INFO: SUCCESS!@#KODE 1!@#USER_ID 4!@#ACTIVITY_CODE 1
12/23/2022 03:22:50 AM script INFO: SUCCESS!@#KODE 1!@#USER_ID 4!@#ACTIVITY_CODE 2
12/23/2022 03:22:50 AM script INFO: SUCCESS!@#KODE 1!@#USER_ID 4!@#ACTIVITY_CODE 5
12/23/2022 03:22:50 AM script INFO: SUCCESS!@#KODE 1!@#USER_ID 4!@#ACTIVITY_CODE 5
12/23/2022 03:22:53 AM script INFO: SUCCESS!@#KODE 1!@#USER_ID 4!@#ACTIVITY_CODE 3
12/23/2022 03:22:53 AM script INFO: SUCCESS!@#KODE 1!@#USER_ID 4!@#ACTIVITY_CODE 3
12/23/2022 03:22:53 AM script INFO: SUCCESS!@#KODE 1!@#USER_ID 4!@#ACTIVITY_CODE 1
12/23/2022 03:22:53 AM script INFO: SUCCESS!@#KODE 1!@#USER_ID 4!@#ACTIVITY_CODE 1
12/23/2022 03:22:53 AM script INFO: SUCCESS!@#KODE 1!@#USER_ID 4!@#ACTIVITY_CODE 2
12/23/2022 03:22:53 AM script INFO: SUCCESS!@#KODE 1!@#USER_ID 4!@#ACTIVITY_CODE 2
12/23/2022 03:22:53 AM script INFO: SUCCESS!@#KODE 1!@#USER_ID 4!@#ACTIVITY_CODE 3
12/23/2022 03:22:53 AM script INFO: SUCCESS!@#KODE 1!@#USER_ID 4!@#ACTIVITY_CODE 3
12/23/2022 03:22:53 AM script INFO: SUCCESS!@#KODE 1!@#USER_ID 4!@#ACTIVITY_CODE 4
12/23/2022 03:22:53 AM script INFO: SUCCESS!@#KODE 1!@#USER_ID 4!@#ACTIVITY_CODE 3
12/23/2022 03:22:54 AM script INFO: SUCCESS!@#KODE 1!@#USER_ID 4!@#ACTIVITY_CODE 2
12/23/2022 03:22:54 AM script INFO: SUCCESS!@#KODE 1!@#USER_ID 4!@#ACTIVITY_CODE 2
12/23/2022 03:22:54 AM script INFO: SUCCESS!@#KODE 1!@#USER_ID 4!@#ACTIVITY_CODE 1
12/23/2022 03:22:54 AM script INFO: SUCCESS!@#KODE 1!@#USER_ID 4!@#ACTIVITY_CODE 2
12/23/2022 03:22:54 AM script INFO: SUCCESS!@#KODE 1!@#USER_ID 4!@#ACTIVITY_CODE 4
12/23/2022 03:22:54 AM script INFO: SUCCESS!@#KODE 1!@#USER_ID 4!@#ACTIVITY_CODE 3
12/23/2022 03:22:54 AM script INFO: SUCCESS!@#KODE 1!@#USER_ID 4!@#ACTIVITY_CODE 1
12/23/2022 03:22:54 AM script INFO: SUCCESS!@#KODE 1!@#USER_ID 4!@#ACTIVITY_CODE 3
12/23/2022 03:22:54 AM script INFO: SUCCESS!@#KODE 1!@#USER_ID 4!@#ACTIVITY_CODE 4
12/23/2022 03:22:54 AM script INFO: SUCCESS!@#KODE 1!@#USER_ID 4!@#ACTIVITY_CODE 2
12/23/2022 03:22:54 AM script INFO: SUCCESS!@#KODE 1!@#USER_ID 4!@#ACTIVITY_CODE 2
12/23/2022 03:22:54 AM script INFO: SUCCESS!@#KODE 1!@#USER_ID 4!@#ACTIVITY_CODE 3
12/23/2022 03:22:54 AM script INFO: SUCCESS!@#KODE 1!@#USER_ID 4!@#ACTIVITY_CODE 1
12/23/2022 03:22:54 AM script INFO: SUCCESS!@#KODE 1!@#USER_ID 4!@#ACTIVITY_CODE 4
12/23/2022 03:22:55 AM script INFO: SUCCESS!@#KODE 1!@#USER_ID 4!@#ACTIVITY_CODE 2
12/23/2022 03:22:55 AM script INFO: SUCCESS!@#KODE 1!@#USER_ID 4!@#ACTIVITY_CODE 3
12/23/2022 03:22:55 AM script INFO: SUCCESS!@#KODE 1!@#USER_ID 4!@#ACTIVITY_CODE 1
12/23/2022 03:22:55 AM script INFO: SUCCESS!@#KODE 1!@#USER_ID 4!@#ACTIVITY_CODE 1
12/23/2022 03:22:55 AM script INFO: SUCCESS!@#KODE 1!@#USER_ID 4!@#ACTIVITY_CODE 1
12/23/2022 03:22:55 AM script INFO: SUCCESS!@#KODE 1!@#USER_ID 4!@#ACTIVITY_CODE 1
12/23/2022 03:22:55 AM script INFO: SUCCESS!@#KODE 1!@#USER_ID 4!@#ACTIVITY_CODE 1
12/23/2022 03:22:55 AM script INFO: SUCCESS!@#KODE 1!@#USER_ID 4!@#ACTIVITY_CODE 1
12/23/2022 03:22:55 AM script INFO: Duration: 33.419739961624146
12/23/2022 03:22:55 AM script INFO: mengakhiri-quiz
12/23/2022 03:22:56 AM script INFO: SUCCESS!@#KODE 1!@#USER_ID 4!@#ACTIVITY_CODE 5
12/23/2022 03:22:56 AM script INFO: berhasil-submit
