12/21/2022 02:35:01 PM script INFO: Prepared chrome options..
12/21/2022 02:35:02 PM script INFO: Initialized chrome browser..
12/21/2022 02:35:02 PM script INFO: mengakses-homepage
12/21/2022 02:35:46 PM script INFO: mengakses-login-page
12/21/2022 02:35:59 PM script INFO: mengakses-site-home
12/21/2022 02:36:00 PM script INFO: mengakses-site-course
12/21/2022 02:36:01 PM script INFO: mengakses-quiz
12/21/2022 02:36:01 PM script INFO: mengakses-start-quiz-page
12/21/2022 02:36:02 PM script INFO: memulai-quiz
12/21/2022 02:36:02 PM script INFO: SUCCESS!@#KODE 1!@#USER_ID 43!@#ACTIVITY_CODE 5
12/21/2022 02:36:13 PM script INFO: SUCCESS!@#KODE 1!@#USER_ID 43!@#ACTIVITY_CODE 5
12/21/2022 02:36:13 PM script INFO: SUCCESS!@#KODE 1!@#USER_ID 43!@#ACTIVITY_CODE 5
12/21/2022 02:36:16 PM script INFO: SUCCESS!@#KODE 1!@#USER_ID 43!@#ACTIVITY_CODE 1
12/21/2022 02:36:16 PM script INFO: SUCCESS!@#KODE 1!@#USER_ID 43!@#ACTIVITY_CODE 1
12/21/2022 02:36:16 PM script INFO: SUCCESS!@#KODE 1!@#USER_ID 43!@#ACTIVITY_CODE 2
12/21/2022 02:36:16 PM script INFO: SUCCESS!@#KODE 1!@#USER_ID 43!@#ACTIVITY_CODE 5
12/21/2022 02:36:16 PM script INFO: SUCCESS!@#KODE 1!@#USER_ID 43!@#ACTIVITY_CODE 5
12/21/2022 02:36:18 PM script INFO: SUCCESS!@#KODE 1!@#USER_ID 43!@#ACTIVITY_CODE 3
12/21/2022 02:36:18 PM script INFO: SUCCESS!@#KODE 1!@#USER_ID 43!@#ACTIVITY_CODE 2
12/21/2022 02:36:19 PM script INFO: SUCCESS!@#KODE 1!@#USER_ID 43!@#ACTIVITY_CODE 4
12/21/2022 02:36:19 PM script INFO: SUCCESS!@#KODE 1!@#USER_ID 43!@#ACTIVITY_CODE 3
12/21/2022 02:36:19 PM script INFO: SUCCESS!@#KODE 1!@#USER_ID 43!@#ACTIVITY_CODE 5
12/21/2022 02:36:19 PM script INFO: SUCCESS!@#KODE 1!@#USER_ID 43!@#ACTIVITY_CODE 5
12/21/2022 02:36:21 PM script INFO: SUCCESS!@#KODE 1!@#USER_ID 43!@#ACTIVITY_CODE 3
12/21/2022 02:36:21 PM script INFO: SUCCESS!@#KODE 1!@#USER_ID 43!@#ACTIVITY_CODE 5
12/21/2022 02:36:21 PM script INFO: SUCCESS!@#KODE 1!@#USER_ID 43!@#ACTIVITY_CODE 5
12/21/2022 02:36:24 PM script INFO: SUCCESS!@#KODE 1!@#USER_ID 43!@#ACTIVITY_CODE 3
12/21/2022 02:36:24 PM script INFO: SUCCESS!@#KODE 1!@#USER_ID 43!@#ACTIVITY_CODE 3
12/21/2022 02:36:24 PM script INFO: SUCCESS!@#KODE 1!@#USER_ID 43!@#ACTIVITY_CODE 1
12/21/2022 02:36:24 PM script INFO: SUCCESS!@#KODE 1!@#USER_ID 43!@#ACTIVITY_CODE 3
12/21/2022 02:36:24 PM script INFO: SUCCESS!@#KODE 1!@#USER_ID 43!@#ACTIVITY_CODE 3
12/21/2022 02:36:24 PM script INFO: SUCCESS!@#KODE 1!@#USER_ID 43!@#ACTIVITY_CODE 1
12/21/2022 02:36:24 PM script INFO: SUCCESS!@#KODE 1!@#USER_ID 43!@#ACTIVITY_CODE 4
12/21/2022 02:36:24 PM script INFO: SUCCESS!@#KODE 1!@#USER_ID 43!@#ACTIVITY_CODE 2
12/21/2022 02:36:24 PM script INFO: SUCCESS!@#KODE 1!@#USER_ID 43!@#ACTIVITY_CODE 3
12/21/2022 02:36:24 PM script INFO: SUCCESS!@#KODE 1!@#USER_ID 43!@#ACTIVITY_CODE 3
12/21/2022 02:36:24 PM script INFO: SUCCESS!@#KODE 1!@#USER_ID 43!@#ACTIVITY_CODE 2
12/21/2022 02:36:25 PM script INFO: SUCCESS!@#KODE 1!@#USER_ID 43!@#ACTIVITY_CODE 2
12/21/2022 02:36:25 PM script INFO: SUCCESS!@#KODE 1!@#USER_ID 43!@#ACTIVITY_CODE 2
12/21/2022 02:36:25 PM script INFO: SUCCESS!@#KODE 1!@#USER_ID 43!@#ACTIVITY_CODE 3
12/21/2022 02:36:25 PM script INFO: SUCCESS!@#KODE 1!@#USER_ID 43!@#ACTIVITY_CODE 3
12/21/2022 02:36:25 PM script INFO: SUCCESS!@#KODE 1!@#USER_ID 43!@#ACTIVITY_CODE 2
12/21/2022 02:36:25 PM script INFO: SUCCESS!@#KODE 1!@#USER_ID 43!@#ACTIVITY_CODE 2
12/21/2022 02:36:25 PM script INFO: SUCCESS!@#KODE 1!@#USER_ID 43!@#ACTIVITY_CODE 5
12/21/2022 02:36:25 PM script INFO: SUCCESS!@#KODE 1!@#USER_ID 43!@#ACTIVITY_CODE 5
12/21/2022 02:36:28 PM script INFO: SUCCESS!@#KODE 1!@#USER_ID 43!@#ACTIVITY_CODE 5
12/21/2022 02:36:28 PM script INFO: SUCCESS!@#KODE 1!@#USER_ID 43!@#ACTIVITY_CODE 5
12/21/2022 02:36:30 PM script INFO: SUCCESS!@#KODE 1!@#USER_ID 43!@#ACTIVITY_CODE 2
12/21/2022 02:36:30 PM script INFO: SUCCESS!@#KODE 1!@#USER_ID 43!@#ACTIVITY_CODE 5
12/21/2022 02:36:30 PM script INFO: SUCCESS!@#KODE 1!@#USER_ID 43!@#ACTIVITY_CODE 5
12/21/2022 02:36:33 PM script INFO: SUCCESS!@#KODE 1!@#USER_ID 43!@#ACTIVITY_CODE 2
12/21/2022 02:36:33 PM script INFO: SUCCESS!@#KODE 1!@#USER_ID 43!@#ACTIVITY_CODE 3
12/21/2022 02:36:33 PM script INFO: SUCCESS!@#KODE 1!@#USER_ID 43!@#ACTIVITY_CODE 2
12/21/2022 02:36:33 PM script INFO: SUCCESS!@#KODE 1!@#USER_ID 43!@#ACTIVITY_CODE 1
12/21/2022 02:36:33 PM script INFO: SUCCESS!@#KODE 1!@#USER_ID 43!@#ACTIVITY_CODE 2
12/21/2022 02:36:33 PM script INFO: SUCCESS!@#KODE 1!@#USER_ID 43!@#ACTIVITY_CODE 3
12/21/2022 02:36:33 PM script INFO: SUCCESS!@#KODE 1!@#USER_ID 43!@#ACTIVITY_CODE 2
12/21/2022 02:36:33 PM script INFO: SUCCESS!@#KODE 1!@#USER_ID 43!@#ACTIVITY_CODE 1
12/21/2022 02:36:33 PM script INFO: SUCCESS!@#KODE 1!@#USER_ID 43!@#ACTIVITY_CODE 1
12/21/2022 02:36:33 PM script INFO: SUCCESS!@#KODE 1!@#USER_ID 43!@#ACTIVITY_CODE 3
12/21/2022 02:36:33 PM script INFO: SUCCESS!@#KODE 1!@#USER_ID 43!@#ACTIVITY_CODE 5
12/21/2022 02:36:33 PM script INFO: SUCCESS!@#KODE 1!@#USER_ID 43!@#ACTIVITY_CODE 5
12/21/2022 02:36:36 PM script INFO: SUCCESS!@#KODE 1!@#USER_ID 43!@#ACTIVITY_CODE 5
12/21/2022 02:36:36 PM script INFO: SUCCESS!@#KODE 1!@#USER_ID 43!@#ACTIVITY_CODE 5
12/21/2022 02:36:38 PM script INFO: SUCCESS!@#KODE 1!@#USER_ID 43!@#ACTIVITY_CODE 5
12/21/2022 02:36:38 PM script INFO: SUCCESS!@#KODE 1!@#USER_ID 43!@#ACTIVITY_CODE 5
12/21/2022 02:36:41 PM script INFO: SUCCESS!@#KODE 1!@#USER_ID 43!@#ACTIVITY_CODE 3
12/21/2022 02:36:41 PM script INFO: SUCCESS!@#KODE 1!@#USER_ID 43!@#ACTIVITY_CODE 1
12/21/2022 02:36:41 PM script INFO: SUCCESS!@#KODE 1!@#USER_ID 43!@#ACTIVITY_CODE 5
12/21/2022 02:36:41 PM script INFO: SUCCESS!@#KODE 1!@#USER_ID 43!@#ACTIVITY_CODE 5
12/21/2022 02:36:44 PM script INFO: SUCCESS!@#KODE 1!@#USER_ID 43!@#ACTIVITY_CODE 1
12/21/2022 02:36:44 PM script INFO: SUCCESS!@#KODE 1!@#USER_ID 43!@#ACTIVITY_CODE 2
12/21/2022 02:36:44 PM script INFO: SUCCESS!@#KODE 1!@#USER_ID 43!@#ACTIVITY_CODE 3
12/21/2022 02:36:44 PM script INFO: SUCCESS!@#KODE 1!@#USER_ID 43!@#ACTIVITY_CODE 2
12/21/2022 02:36:44 PM script INFO: SUCCESS!@#KODE 1!@#USER_ID 43!@#ACTIVITY_CODE 2
12/21/2022 02:36:44 PM script INFO: SUCCESS!@#KODE 1!@#USER_ID 43!@#ACTIVITY_CODE 1
12/21/2022 02:36:44 PM script INFO: SUCCESS!@#KODE 1!@#USER_ID 43!@#ACTIVITY_CODE 1
12/21/2022 02:36:44 PM script INFO: SUCCESS!@#KODE 1!@#USER_ID 43!@#ACTIVITY_CODE 2
12/21/2022 02:36:44 PM script INFO: SUCCESS!@#KODE 1!@#USER_ID 43!@#ACTIVITY_CODE 3
12/21/2022 02:36:44 PM script INFO: SUCCESS!@#KODE 1!@#USER_ID 43!@#ACTIVITY_CODE 3
12/21/2022 02:36:44 PM script INFO: SUCCESS!@#KODE 1!@#USER_ID 43!@#ACTIVITY_CODE 2
12/21/2022 02:36:44 PM script INFO: SUCCESS!@#KODE 1!@#USER_ID 43!@#ACTIVITY_CODE 1
12/21/2022 02:36:45 PM script INFO: SUCCESS!@#KODE 1!@#USER_ID 43!@#ACTIVITY_CODE 2
12/21/2022 02:36:45 PM script INFO: SUCCESS!@#KODE 1!@#USER_ID 43!@#ACTIVITY_CODE 1
12/21/2022 02:36:45 PM script INFO: SUCCESS!@#KODE 1!@#USER_ID 43!@#ACTIVITY_CODE 1
12/21/2022 02:36:45 PM script INFO: SUCCESS!@#KODE 1!@#USER_ID 43!@#ACTIVITY_CODE 1
12/21/2022 02:36:45 PM script INFO: SUCCESS!@#KODE 1!@#USER_ID 43!@#ACTIVITY_CODE 3
12/21/2022 02:36:45 PM script INFO: SUCCESS!@#KODE 1!@#USER_ID 43!@#ACTIVITY_CODE 1
12/21/2022 02:36:45 PM script INFO: SUCCESS!@#KODE 1!@#USER_ID 43!@#ACTIVITY_CODE 3
12/21/2022 02:36:45 PM script INFO: SUCCESS!@#KODE 1!@#USER_ID 43!@#ACTIVITY_CODE 3
12/21/2022 02:36:45 PM script INFO: SUCCESS!@#KODE 1!@#USER_ID 43!@#ACTIVITY_CODE 1
12/21/2022 02:36:45 PM script INFO: SUCCESS!@#KODE 1!@#USER_ID 43!@#ACTIVITY_CODE 1
12/21/2022 02:36:45 PM script INFO: SUCCESS!@#KODE 1!@#USER_ID 43!@#ACTIVITY_CODE 2
12/21/2022 02:36:45 PM script INFO: SUCCESS!@#KODE 1!@#USER_ID 43!@#ACTIVITY_CODE 1
12/21/2022 02:36:45 PM script INFO: SUCCESS!@#KODE 1!@#USER_ID 43!@#ACTIVITY_CODE 4
12/21/2022 02:36:45 PM script INFO: SUCCESS!@#KODE 1!@#USER_ID 43!@#ACTIVITY_CODE 1
12/21/2022 02:36:45 PM script INFO: SUCCESS!@#KODE 1!@#USER_ID 43!@#ACTIVITY_CODE 3
12/21/2022 02:36:45 PM script INFO: SUCCESS!@#KODE 1!@#USER_ID 43!@#ACTIVITY_CODE 2
12/21/2022 02:36:45 PM script INFO: SUCCESS!@#KODE 1!@#USER_ID 43!@#ACTIVITY_CODE 1
12/21/2022 02:36:46 PM script INFO: SUCCESS!@#KODE 1!@#USER_ID 43!@#ACTIVITY_CODE 2
12/21/2022 02:36:46 PM script INFO: SUCCESS!@#KODE 1!@#USER_ID 43!@#ACTIVITY_CODE 2
12/21/2022 02:36:46 PM script INFO: SUCCESS!@#KODE 1!@#USER_ID 43!@#ACTIVITY_CODE 1
12/21/2022 02:36:46 PM script INFO: SUCCESS!@#KODE 1!@#USER_ID 43!@#ACTIVITY_CODE 2
12/21/2022 02:36:46 PM script INFO: SUCCESS!@#KODE 1!@#USER_ID 43!@#ACTIVITY_CODE 1
12/21/2022 02:36:46 PM script INFO: SUCCESS!@#KODE 1!@#USER_ID 43!@#ACTIVITY_CODE 2
12/21/2022 02:36:46 PM script INFO: SUCCESS!@#KODE 1!@#USER_ID 43!@#ACTIVITY_CODE 1
12/21/2022 02:36:46 PM script INFO: SUCCESS!@#KODE 1!@#USER_ID 43!@#ACTIVITY_CODE 3
12/21/2022 02:36:46 PM script INFO: SUCCESS!@#KODE 1!@#USER_ID 43!@#ACTIVITY_CODE 1
12/21/2022 02:36:46 PM script INFO: Duration: 33.029149770736694
12/21/2022 02:36:46 PM script INFO: mengakhiri-quiz
12/21/2022 02:36:47 PM script INFO: SUCCESS!@#KODE 1!@#USER_ID 43!@#ACTIVITY_CODE 5
12/21/2022 02:36:47 PM script INFO: berhasil-submit
