12/21/2022 02:35:01 PM script INFO: Prepared chrome options..
12/21/2022 02:35:02 PM script INFO: Initialized chrome browser..
12/21/2022 02:35:02 PM script INFO: mengakses-homepage
12/21/2022 02:35:28 PM script INFO: mengakses-login-page
12/21/2022 02:35:29 PM script INFO: mengakses-site-home
12/21/2022 02:35:29 PM script INFO: mengakses-site-course
12/21/2022 02:35:30 PM script INFO: mengakses-quiz
12/21/2022 02:35:31 PM script INFO: mengakses-start-quiz-page
12/21/2022 02:35:32 PM script INFO: memulai-quiz
12/21/2022 02:35:32 PM script INFO: SUCCESS!@#KODE 1!@#USER_ID 51!@#ACTIVITY_CODE 5
12/21/2022 02:35:42 PM script INFO: SUCCESS!@#KODE 1!@#USER_ID 51!@#ACTIVITY_CODE 2
12/21/2022 02:35:42 PM script INFO: SUCCESS!@#KODE 1!@#USER_ID 51!@#ACTIVITY_CODE 5
12/21/2022 02:35:42 PM script INFO: SUCCESS!@#KODE 1!@#USER_ID 51!@#ACTIVITY_CODE 5
12/21/2022 02:35:45 PM script INFO: SUCCESS!@#KODE 1!@#USER_ID 51!@#ACTIVITY_CODE 5
12/21/2022 02:35:45 PM script INFO: SUCCESS!@#KODE 1!@#USER_ID 51!@#ACTIVITY_CODE 5
12/21/2022 02:35:47 PM script INFO: SUCCESS!@#KODE 1!@#USER_ID 51!@#ACTIVITY_CODE 1
12/21/2022 02:35:47 PM script INFO: SUCCESS!@#KODE 1!@#USER_ID 51!@#ACTIVITY_CODE 5
12/21/2022 02:35:47 PM script INFO: SUCCESS!@#KODE 1!@#USER_ID 51!@#ACTIVITY_CODE 5
12/21/2022 02:35:50 PM script INFO: SUCCESS!@#KODE 1!@#USER_ID 51!@#ACTIVITY_CODE 2
12/21/2022 02:35:50 PM script INFO: SUCCESS!@#KODE 1!@#USER_ID 51!@#ACTIVITY_CODE 3
12/21/2022 02:35:50 PM script INFO: SUCCESS!@#KODE 1!@#USER_ID 51!@#ACTIVITY_CODE 3
12/21/2022 02:35:50 PM script INFO: SUCCESS!@#KODE 1!@#USER_ID 51!@#ACTIVITY_CODE 2
12/21/2022 02:35:50 PM script INFO: SUCCESS!@#KODE 1!@#USER_ID 51!@#ACTIVITY_CODE 5
12/21/2022 02:35:50 PM script INFO: SUCCESS!@#KODE 1!@#USER_ID 51!@#ACTIVITY_CODE 5
12/21/2022 02:35:53 PM script INFO: SUCCESS!@#KODE 1!@#USER_ID 51!@#ACTIVITY_CODE 5
12/21/2022 02:35:53 PM script INFO: SUCCESS!@#KODE 1!@#USER_ID 51!@#ACTIVITY_CODE 5
12/21/2022 02:35:55 PM script INFO: SUCCESS!@#KODE 1!@#USER_ID 51!@#ACTIVITY_CODE 1
12/21/2022 02:35:55 PM script INFO: SUCCESS!@#KODE 1!@#USER_ID 51!@#ACTIVITY_CODE 1
12/21/2022 02:35:56 PM script INFO: SUCCESS!@#KODE 1!@#USER_ID 51!@#ACTIVITY_CODE 1
12/21/2022 02:35:56 PM script INFO: SUCCESS!@#KODE 1!@#USER_ID 51!@#ACTIVITY_CODE 2
12/21/2022 02:35:56 PM script INFO: SUCCESS!@#KODE 1!@#USER_ID 51!@#ACTIVITY_CODE 3
12/21/2022 02:35:56 PM script INFO: SUCCESS!@#KODE 1!@#USER_ID 51!@#ACTIVITY_CODE 1
12/21/2022 02:35:56 PM script INFO: SUCCESS!@#KODE 1!@#USER_ID 51!@#ACTIVITY_CODE 5
12/21/2022 02:35:56 PM script INFO: SUCCESS!@#KODE 1!@#USER_ID 51!@#ACTIVITY_CODE 5
12/21/2022 02:35:58 PM script INFO: SUCCESS!@#KODE 1!@#USER_ID 51!@#ACTIVITY_CODE 4
12/21/2022 02:35:59 PM script INFO: SUCCESS!@#KODE 1!@#USER_ID 51!@#ACTIVITY_CODE 2
12/21/2022 02:35:59 PM script INFO: SUCCESS!@#KODE 1!@#USER_ID 51!@#ACTIVITY_CODE 5
12/21/2022 02:35:59 PM script INFO: SUCCESS!@#KODE 1!@#USER_ID 51!@#ACTIVITY_CODE 5
12/21/2022 02:36:01 PM script INFO: SUCCESS!@#KODE 1!@#USER_ID 51!@#ACTIVITY_CODE 1
12/21/2022 02:36:01 PM script INFO: SUCCESS!@#KODE 1!@#USER_ID 51!@#ACTIVITY_CODE 2
12/21/2022 02:36:01 PM script INFO: SUCCESS!@#KODE 1!@#USER_ID 51!@#ACTIVITY_CODE 5
12/21/2022 02:36:01 PM script INFO: SUCCESS!@#KODE 1!@#USER_ID 51!@#ACTIVITY_CODE 5
12/21/2022 02:36:04 PM script INFO: SUCCESS!@#KODE 1!@#USER_ID 51!@#ACTIVITY_CODE 1
12/21/2022 02:36:04 PM script INFO: SUCCESS!@#KODE 1!@#USER_ID 51!@#ACTIVITY_CODE 1
12/21/2022 02:36:04 PM script INFO: SUCCESS!@#KODE 1!@#USER_ID 51!@#ACTIVITY_CODE 5
12/21/2022 02:36:04 PM script INFO: SUCCESS!@#KODE 1!@#USER_ID 51!@#ACTIVITY_CODE 5
12/21/2022 02:36:07 PM script INFO: SUCCESS!@#KODE 1!@#USER_ID 51!@#ACTIVITY_CODE 4
12/21/2022 02:36:07 PM script INFO: SUCCESS!@#KODE 1!@#USER_ID 51!@#ACTIVITY_CODE 5
12/21/2022 02:36:07 PM script INFO: SUCCESS!@#KODE 1!@#USER_ID 51!@#ACTIVITY_CODE 5
12/21/2022 02:36:09 PM script INFO: SUCCESS!@#KODE 1!@#USER_ID 51!@#ACTIVITY_CODE 1
12/21/2022 02:36:09 PM script INFO: SUCCESS!@#KODE 1!@#USER_ID 51!@#ACTIVITY_CODE 5
12/21/2022 02:36:09 PM script INFO: SUCCESS!@#KODE 1!@#USER_ID 51!@#ACTIVITY_CODE 5
12/21/2022 02:36:12 PM script INFO: SUCCESS!@#KODE 1!@#USER_ID 51!@#ACTIVITY_CODE 1
12/21/2022 02:36:12 PM script INFO: SUCCESS!@#KODE 1!@#USER_ID 51!@#ACTIVITY_CODE 3
12/21/2022 02:36:12 PM script INFO: SUCCESS!@#KODE 1!@#USER_ID 51!@#ACTIVITY_CODE 3
12/21/2022 02:36:12 PM script INFO: SUCCESS!@#KODE 1!@#USER_ID 51!@#ACTIVITY_CODE 2
12/21/2022 02:36:12 PM script INFO: SUCCESS!@#KODE 1!@#USER_ID 51!@#ACTIVITY_CODE 1
12/21/2022 02:36:12 PM script INFO: SUCCESS!@#KODE 1!@#USER_ID 51!@#ACTIVITY_CODE 3
12/21/2022 02:36:12 PM script INFO: SUCCESS!@#KODE 1!@#USER_ID 51!@#ACTIVITY_CODE 2
12/21/2022 02:36:12 PM script INFO: SUCCESS!@#KODE 1!@#USER_ID 51!@#ACTIVITY_CODE 2
12/21/2022 02:36:12 PM script INFO: SUCCESS!@#KODE 1!@#USER_ID 51!@#ACTIVITY_CODE 1
12/21/2022 02:36:12 PM script INFO: SUCCESS!@#KODE 1!@#USER_ID 51!@#ACTIVITY_CODE 1
12/21/2022 02:36:12 PM script INFO: SUCCESS!@#KODE 1!@#USER_ID 51!@#ACTIVITY_CODE 1
12/21/2022 02:36:13 PM script INFO: SUCCESS!@#KODE 1!@#USER_ID 51!@#ACTIVITY_CODE 1
12/21/2022 02:36:13 PM script INFO: SUCCESS!@#KODE 1!@#USER_ID 51!@#ACTIVITY_CODE 1
12/21/2022 02:36:13 PM script INFO: SUCCESS!@#KODE 1!@#USER_ID 51!@#ACTIVITY_CODE 4
12/21/2022 02:36:13 PM script INFO: SUCCESS!@#KODE 1!@#USER_ID 51!@#ACTIVITY_CODE 2
12/21/2022 02:36:13 PM script INFO: SUCCESS!@#KODE 1!@#USER_ID 51!@#ACTIVITY_CODE 3
12/21/2022 02:36:13 PM script INFO: SUCCESS!@#KODE 1!@#USER_ID 51!@#ACTIVITY_CODE 1
12/21/2022 02:36:13 PM script INFO: SUCCESS!@#KODE 1!@#USER_ID 51!@#ACTIVITY_CODE 3
12/21/2022 02:36:13 PM script INFO: SUCCESS!@#KODE 1!@#USER_ID 51!@#ACTIVITY_CODE 2
12/21/2022 02:36:13 PM script INFO: SUCCESS!@#KODE 1!@#USER_ID 51!@#ACTIVITY_CODE 1
12/21/2022 02:36:13 PM script INFO: SUCCESS!@#KODE 1!@#USER_ID 51!@#ACTIVITY_CODE 1
12/21/2022 02:36:13 PM script INFO: SUCCESS!@#KODE 1!@#USER_ID 51!@#ACTIVITY_CODE 2
12/21/2022 02:36:13 PM script INFO: SUCCESS!@#KODE 1!@#USER_ID 51!@#ACTIVITY_CODE 1
12/21/2022 02:36:14 PM script INFO: SUCCESS!@#KODE 1!@#USER_ID 51!@#ACTIVITY_CODE 1
12/21/2022 02:36:14 PM script INFO: SUCCESS!@#KODE 1!@#USER_ID 51!@#ACTIVITY_CODE 4
12/21/2022 02:36:14 PM script INFO: SUCCESS!@#KODE 1!@#USER_ID 51!@#ACTIVITY_CODE 2
12/21/2022 02:36:14 PM script INFO: SUCCESS!@#KODE 1!@#USER_ID 51!@#ACTIVITY_CODE 1
12/21/2022 02:36:14 PM script INFO: SUCCESS!@#KODE 1!@#USER_ID 51!@#ACTIVITY_CODE 2
12/21/2022 02:36:14 PM script INFO: SUCCESS!@#KODE 1!@#USER_ID 51!@#ACTIVITY_CODE 1
12/21/2022 02:36:14 PM script INFO: SUCCESS!@#KODE 1!@#USER_ID 51!@#ACTIVITY_CODE 4
12/21/2022 02:36:14 PM script INFO: SUCCESS!@#KODE 1!@#USER_ID 51!@#ACTIVITY_CODE 1
12/21/2022 02:36:14 PM script INFO: SUCCESS!@#KODE 1!@#USER_ID 51!@#ACTIVITY_CODE 1
12/21/2022 02:36:14 PM script INFO: SUCCESS!@#KODE 1!@#USER_ID 51!@#ACTIVITY_CODE 3
12/21/2022 02:36:14 PM script INFO: SUCCESS!@#KODE 1!@#USER_ID 51!@#ACTIVITY_CODE 1
12/21/2022 02:36:14 PM script INFO: SUCCESS!@#KODE 1!@#USER_ID 51!@#ACTIVITY_CODE 1
12/21/2022 02:36:14 PM script INFO: SUCCESS!@#KODE 1!@#USER_ID 51!@#ACTIVITY_CODE 2
12/21/2022 02:36:15 PM script INFO: SUCCESS!@#KODE 1!@#USER_ID 51!@#ACTIVITY_CODE 2
12/21/2022 02:36:15 PM script INFO: SUCCESS!@#KODE 1!@#USER_ID 51!@#ACTIVITY_CODE 2
12/21/2022 02:36:15 PM script INFO: SUCCESS!@#KODE 1!@#USER_ID 51!@#ACTIVITY_CODE 1
12/21/2022 02:36:15 PM script INFO: SUCCESS!@#KODE 1!@#USER_ID 51!@#ACTIVITY_CODE 3
12/21/2022 02:36:15 PM script INFO: SUCCESS!@#KODE 1!@#USER_ID 51!@#ACTIVITY_CODE 4
12/21/2022 02:36:15 PM script INFO: SUCCESS!@#KODE 1!@#USER_ID 51!@#ACTIVITY_CODE 1
12/21/2022 02:36:15 PM script INFO: SUCCESS!@#KODE 1!@#USER_ID 51!@#ACTIVITY_CODE 2
12/21/2022 02:36:15 PM script INFO: SUCCESS!@#KODE 1!@#USER_ID 51!@#ACTIVITY_CODE 3
12/21/2022 02:36:15 PM script INFO: SUCCESS!@#KODE 1!@#USER_ID 51!@#ACTIVITY_CODE 2
12/21/2022 02:36:15 PM script INFO: SUCCESS!@#KODE 1!@#USER_ID 51!@#ACTIVITY_CODE 2
12/21/2022 02:36:15 PM script INFO: SUCCESS!@#KODE 1!@#USER_ID 51!@#ACTIVITY_CODE 2
12/21/2022 02:36:15 PM script INFO: SUCCESS!@#KODE 1!@#USER_ID 51!@#ACTIVITY_CODE 1
12/21/2022 02:36:16 PM script INFO: SUCCESS!@#KODE 1!@#USER_ID 51!@#ACTIVITY_CODE 4
12/21/2022 02:36:16 PM script INFO: SUCCESS!@#KODE 1!@#USER_ID 51!@#ACTIVITY_CODE 2
12/21/2022 02:36:16 PM script INFO: SUCCESS!@#KODE 1!@#USER_ID 51!@#ACTIVITY_CODE 3
12/21/2022 02:36:16 PM script INFO: SUCCESS!@#KODE 1!@#USER_ID 51!@#ACTIVITY_CODE 1
12/21/2022 02:36:16 PM script INFO: SUCCESS!@#KODE 1!@#USER_ID 51!@#ACTIVITY_CODE 2
12/21/2022 02:36:16 PM script INFO: SUCCESS!@#KODE 1!@#USER_ID 51!@#ACTIVITY_CODE 4
12/21/2022 02:36:16 PM script INFO: SUCCESS!@#KODE 1!@#USER_ID 51!@#ACTIVITY_CODE 2
12/21/2022 02:36:16 PM script INFO: SUCCESS!@#KODE 1!@#USER_ID 51!@#ACTIVITY_CODE 2
12/21/2022 02:36:16 PM script INFO: Duration: 33.96295714378357
12/21/2022 02:36:16 PM script INFO: mengakhiri-quiz
12/21/2022 02:36:24 PM script INFO: SUCCESS!@#KODE 1!@#USER_ID 51!@#ACTIVITY_CODE 5
12/21/2022 02:36:24 PM script INFO: berhasil-submit
