12/10/2022 08:53:26 AM script INFO: Prepared chrome options..
12/10/2022 08:53:29 AM script INFO: Initialized chrome browser..
12/10/2022 08:53:29 AM script INFO: mengakses-homepage
12/10/2022 08:53:59 AM script INFO: mengakses-login-page
12/10/2022 08:54:24 AM script INFO: mengakses-site-home
12/10/2022 08:54:27 AM script INFO: mengakses-site-course
12/10/2022 08:54:50 AM script INFO: mengakses-quiz
12/10/2022 08:54:53 AM script INFO: mengakses-start-quiz-page
12/10/2022 08:55:13 AM script INFO: memulai-quiz
12/10/2022 08:55:13 AM script INFO: SUCCESS!@#KODE 1!@#USER_ID 4!@#ACTIVITY_CODE 5
12/10/2022 08:55:24 AM script INFO: SUCCESS!@#KODE 1!@#USER_ID 4!@#ACTIVITY_CODE 3
12/10/2022 08:55:24 AM script INFO: SUCCESS!@#KODE 1!@#USER_ID 4!@#ACTIVITY_CODE 1
12/10/2022 08:55:24 AM script INFO: SUCCESS!@#KODE 1!@#USER_ID 4!@#ACTIVITY_CODE 1
12/10/2022 08:55:25 AM script INFO: SUCCESS!@#KODE 1!@#USER_ID 4!@#ACTIVITY_CODE 4
12/10/2022 08:55:25 AM script INFO: SUCCESS!@#KODE 1!@#USER_ID 4!@#ACTIVITY_CODE 5
12/10/2022 08:55:25 AM script INFO: SUCCESS!@#KODE 1!@#USER_ID 4!@#ACTIVITY_CODE 5
12/10/2022 08:55:27 AM script INFO: SUCCESS!@#KODE 1!@#USER_ID 4!@#ACTIVITY_CODE 2
12/10/2022 08:55:27 AM script INFO: SUCCESS!@#KODE 1!@#USER_ID 4!@#ACTIVITY_CODE 3
12/10/2022 08:55:27 AM script INFO: SUCCESS!@#KODE 1!@#USER_ID 4!@#ACTIVITY_CODE 3
12/10/2022 08:55:27 AM script INFO: SUCCESS!@#KODE 1!@#USER_ID 4!@#ACTIVITY_CODE 5
12/10/2022 08:55:27 AM script INFO: SUCCESS!@#KODE 1!@#USER_ID 4!@#ACTIVITY_CODE 5
12/10/2022 08:55:30 AM script INFO: SUCCESS!@#KODE 1!@#USER_ID 4!@#ACTIVITY_CODE 1
12/10/2022 08:55:30 AM script INFO: SUCCESS!@#KODE 1!@#USER_ID 4!@#ACTIVITY_CODE 1
12/10/2022 08:55:30 AM script INFO: SUCCESS!@#KODE 1!@#USER_ID 4!@#ACTIVITY_CODE 5
12/10/2022 08:55:30 AM script INFO: SUCCESS!@#KODE 1!@#USER_ID 4!@#ACTIVITY_CODE 5
12/10/2022 08:55:33 AM script INFO: SUCCESS!@#KODE 1!@#USER_ID 4!@#ACTIVITY_CODE 3
12/10/2022 08:55:33 AM script INFO: SUCCESS!@#KODE 1!@#USER_ID 4!@#ACTIVITY_CODE 1
12/10/2022 08:55:33 AM script INFO: SUCCESS!@#KODE 1!@#USER_ID 4!@#ACTIVITY_CODE 3
12/10/2022 08:55:33 AM script INFO: SUCCESS!@#KODE 1!@#USER_ID 4!@#ACTIVITY_CODE 1
12/10/2022 08:55:33 AM script INFO: SUCCESS!@#KODE 1!@#USER_ID 4!@#ACTIVITY_CODE 4
12/10/2022 08:55:34 AM script INFO: SUCCESS!@#KODE 1!@#USER_ID 4!@#ACTIVITY_CODE 2
12/10/2022 08:55:34 AM script INFO: SUCCESS!@#KODE 1!@#USER_ID 4!@#ACTIVITY_CODE 5
12/10/2022 08:55:34 AM script INFO: SUCCESS!@#KODE 1!@#USER_ID 4!@#ACTIVITY_CODE 5
12/10/2022 08:55:37 AM script INFO: SUCCESS!@#KODE 1!@#USER_ID 4!@#ACTIVITY_CODE 3
12/10/2022 08:55:37 AM script INFO: SUCCESS!@#KODE 1!@#USER_ID 4!@#ACTIVITY_CODE 3
12/10/2022 08:55:37 AM script INFO: SUCCESS!@#KODE 1!@#USER_ID 4!@#ACTIVITY_CODE 3
12/10/2022 08:55:37 AM script INFO: SUCCESS!@#KODE 1!@#USER_ID 4!@#ACTIVITY_CODE 5
12/10/2022 08:55:37 AM script INFO: SUCCESS!@#KODE 1!@#USER_ID 4!@#ACTIVITY_CODE 5
12/10/2022 08:55:39 AM script INFO: SUCCESS!@#KODE 1!@#USER_ID 4!@#ACTIVITY_CODE 5
12/10/2022 08:55:39 AM script INFO: SUCCESS!@#KODE 1!@#USER_ID 4!@#ACTIVITY_CODE 5
12/10/2022 08:55:42 AM script INFO: SUCCESS!@#KODE 1!@#USER_ID 4!@#ACTIVITY_CODE 2
12/10/2022 08:55:42 AM script INFO: SUCCESS!@#KODE 1!@#USER_ID 4!@#ACTIVITY_CODE 3
12/10/2022 08:55:43 AM script INFO: SUCCESS!@#KODE 1!@#USER_ID 4!@#ACTIVITY_CODE 1
12/10/2022 08:55:43 AM script INFO: SUCCESS!@#KODE 1!@#USER_ID 4!@#ACTIVITY_CODE 1
12/10/2022 08:55:43 AM script INFO: SUCCESS!@#KODE 1!@#USER_ID 4!@#ACTIVITY_CODE 2
12/10/2022 08:55:43 AM script INFO: SUCCESS!@#KODE 1!@#USER_ID 4!@#ACTIVITY_CODE 3
12/10/2022 08:55:43 AM script INFO: SUCCESS!@#KODE 1!@#USER_ID 4!@#ACTIVITY_CODE 2
12/10/2022 08:55:44 AM script INFO: SUCCESS!@#KODE 1!@#USER_ID 4!@#ACTIVITY_CODE 1
12/10/2022 08:55:44 AM script INFO: SUCCESS!@#KODE 1!@#USER_ID 4!@#ACTIVITY_CODE 1
12/10/2022 08:55:44 AM script INFO: SUCCESS!@#KODE 1!@#USER_ID 4!@#ACTIVITY_CODE 4
12/10/2022 08:55:44 AM script INFO: SUCCESS!@#KODE 1!@#USER_ID 4!@#ACTIVITY_CODE 2
12/10/2022 08:55:45 AM script INFO: SUCCESS!@#KODE 1!@#USER_ID 4!@#ACTIVITY_CODE 2
12/10/2022 08:55:45 AM script INFO: SUCCESS!@#KODE 1!@#USER_ID 4!@#ACTIVITY_CODE 3
12/10/2022 08:55:45 AM script INFO: SUCCESS!@#KODE 1!@#USER_ID 4!@#ACTIVITY_CODE 1
12/10/2022 08:55:45 AM script INFO: SUCCESS!@#KODE 1!@#USER_ID 4!@#ACTIVITY_CODE 1
12/10/2022 08:55:45 AM script INFO: SUCCESS!@#KODE 1!@#USER_ID 4!@#ACTIVITY_CODE 4
12/10/2022 08:55:46 AM script INFO: SUCCESS!@#KODE 1!@#USER_ID 4!@#ACTIVITY_CODE 2
12/10/2022 08:55:46 AM script INFO: SUCCESS!@#KODE 1!@#USER_ID 4!@#ACTIVITY_CODE 1
12/10/2022 08:55:46 AM script INFO: Duration: 21.664156913757324
12/10/2022 08:55:46 AM script INFO: mengakhiri-quiz
12/10/2022 08:55:48 AM script INFO: SUCCESS!@#KODE 1!@#USER_ID 4!@#ACTIVITY_CODE 5
12/10/2022 08:55:48 AM script INFO: berhasil-submit
12/10/2022 08:57:18 AM script ERROR: TIMEOUT EXCEPTION!@#KODE 0!@#LOCATION berhasil-submit
12/10/2022 08:57:18 AM main_worker ERROR: Message: None

