12/21/2022 01:28:08 PM script INFO: Prepared chrome options..
12/21/2022 01:28:09 PM script INFO: Initialized chrome browser..
12/21/2022 01:28:09 PM script INFO: mengakses-homepage
12/21/2022 01:28:41 PM script INFO: mengakses-login-page
12/21/2022 01:29:05 PM script INFO: mengakses-site-home
12/21/2022 01:29:09 PM script INFO: mengakses-site-course
12/21/2022 01:29:39 PM script INFO: mengakses-quiz
12/21/2022 01:29:40 PM script INFO: mengakses-start-quiz-page
12/21/2022 01:29:40 PM script INFO: memulai-quiz
12/21/2022 01:29:40 PM script INFO: SUCCESS!@#KODE 1!@#USER_ID 62!@#ACTIVITY_CODE 5
12/21/2022 01:29:51 PM script INFO: SUCCESS!@#KODE 1!@#USER_ID 62!@#ACTIVITY_CODE 5
12/21/2022 01:29:51 PM script INFO: SUCCESS!@#KODE 1!@#USER_ID 62!@#ACTIVITY_CODE 5
12/21/2022 01:29:54 PM script INFO: SUCCESS!@#KODE 1!@#USER_ID 62!@#ACTIVITY_CODE 2
12/21/2022 01:29:54 PM script INFO: SUCCESS!@#KODE 1!@#USER_ID 62!@#ACTIVITY_CODE 5
12/21/2022 01:29:54 PM script INFO: SUCCESS!@#KODE 1!@#USER_ID 62!@#ACTIVITY_CODE 5
12/21/2022 01:29:56 PM script INFO: SUCCESS!@#KODE 1!@#USER_ID 62!@#ACTIVITY_CODE 2
12/21/2022 01:29:56 PM script INFO: SUCCESS!@#KODE 1!@#USER_ID 62!@#ACTIVITY_CODE 5
12/21/2022 01:29:56 PM script INFO: SUCCESS!@#KODE 1!@#USER_ID 62!@#ACTIVITY_CODE 5
12/21/2022 01:29:59 PM script INFO: SUCCESS!@#KODE 1!@#USER_ID 62!@#ACTIVITY_CODE 3
12/21/2022 01:29:59 PM script INFO: SUCCESS!@#KODE 1!@#USER_ID 62!@#ACTIVITY_CODE 3
12/21/2022 01:29:59 PM script INFO: SUCCESS!@#KODE 1!@#USER_ID 62!@#ACTIVITY_CODE 3
12/21/2022 01:29:59 PM script INFO: SUCCESS!@#KODE 1!@#USER_ID 62!@#ACTIVITY_CODE 3
12/21/2022 01:29:59 PM script INFO: SUCCESS!@#KODE 1!@#USER_ID 62!@#ACTIVITY_CODE 2
12/21/2022 01:29:59 PM script INFO: SUCCESS!@#KODE 1!@#USER_ID 62!@#ACTIVITY_CODE 3
12/21/2022 01:29:59 PM script INFO: SUCCESS!@#KODE 1!@#USER_ID 62!@#ACTIVITY_CODE 1
12/21/2022 01:30:00 PM script INFO: SUCCESS!@#KODE 1!@#USER_ID 62!@#ACTIVITY_CODE 1
12/21/2022 01:30:00 PM script INFO: SUCCESS!@#KODE 1!@#USER_ID 62!@#ACTIVITY_CODE 1
12/21/2022 01:30:00 PM script INFO: SUCCESS!@#KODE 1!@#USER_ID 62!@#ACTIVITY_CODE 2
12/21/2022 01:30:00 PM script INFO: SUCCESS!@#KODE 1!@#USER_ID 62!@#ACTIVITY_CODE 1
12/21/2022 01:30:00 PM script INFO: SUCCESS!@#KODE 1!@#USER_ID 62!@#ACTIVITY_CODE 3
12/21/2022 01:30:00 PM script INFO: SUCCESS!@#KODE 1!@#USER_ID 62!@#ACTIVITY_CODE 1
12/21/2022 01:30:00 PM script INFO: SUCCESS!@#KODE 1!@#USER_ID 62!@#ACTIVITY_CODE 1
12/21/2022 01:30:00 PM script INFO: SUCCESS!@#KODE 1!@#USER_ID 62!@#ACTIVITY_CODE 4
12/21/2022 01:30:00 PM script INFO: SUCCESS!@#KODE 1!@#USER_ID 62!@#ACTIVITY_CODE 5
12/21/2022 01:30:00 PM script INFO: SUCCESS!@#KODE 1!@#USER_ID 62!@#ACTIVITY_CODE 5
12/21/2022 01:30:03 PM script INFO: SUCCESS!@#KODE 1!@#USER_ID 62!@#ACTIVITY_CODE 3
12/21/2022 01:30:03 PM script INFO: SUCCESS!@#KODE 1!@#USER_ID 62!@#ACTIVITY_CODE 5
12/21/2022 01:30:03 PM script INFO: SUCCESS!@#KODE 1!@#USER_ID 62!@#ACTIVITY_CODE 5
12/21/2022 01:30:05 PM script INFO: SUCCESS!@#KODE 1!@#USER_ID 62!@#ACTIVITY_CODE 5
12/21/2022 01:30:05 PM script INFO: SUCCESS!@#KODE 1!@#USER_ID 62!@#ACTIVITY_CODE 5
12/21/2022 01:30:08 PM script INFO: SUCCESS!@#KODE 1!@#USER_ID 62!@#ACTIVITY_CODE 1
12/21/2022 01:30:08 PM script INFO: SUCCESS!@#KODE 1!@#USER_ID 62!@#ACTIVITY_CODE 3
12/21/2022 01:30:08 PM script INFO: SUCCESS!@#KODE 1!@#USER_ID 62!@#ACTIVITY_CODE 3
12/21/2022 01:30:08 PM script INFO: SUCCESS!@#KODE 1!@#USER_ID 62!@#ACTIVITY_CODE 1
12/21/2022 01:30:08 PM script INFO: SUCCESS!@#KODE 1!@#USER_ID 62!@#ACTIVITY_CODE 1
12/21/2022 01:30:08 PM script INFO: SUCCESS!@#KODE 1!@#USER_ID 62!@#ACTIVITY_CODE 4
12/21/2022 01:30:08 PM script INFO: SUCCESS!@#KODE 1!@#USER_ID 62!@#ACTIVITY_CODE 1
12/21/2022 01:30:08 PM script INFO: SUCCESS!@#KODE 1!@#USER_ID 62!@#ACTIVITY_CODE 3
12/21/2022 01:30:08 PM script INFO: SUCCESS!@#KODE 1!@#USER_ID 62!@#ACTIVITY_CODE 4
12/21/2022 01:30:08 PM script INFO: SUCCESS!@#KODE 1!@#USER_ID 62!@#ACTIVITY_CODE 3
12/21/2022 01:30:08 PM script INFO: SUCCESS!@#KODE 1!@#USER_ID 62!@#ACTIVITY_CODE 2
12/21/2022 01:30:08 PM script INFO: SUCCESS!@#KODE 1!@#USER_ID 62!@#ACTIVITY_CODE 3
12/21/2022 01:30:08 PM script INFO: SUCCESS!@#KODE 1!@#USER_ID 62!@#ACTIVITY_CODE 2
12/21/2022 01:30:09 PM script INFO: SUCCESS!@#KODE 1!@#USER_ID 62!@#ACTIVITY_CODE 3
12/21/2022 01:30:09 PM script INFO: SUCCESS!@#KODE 1!@#USER_ID 62!@#ACTIVITY_CODE 1
12/21/2022 01:30:09 PM script INFO: SUCCESS!@#KODE 1!@#USER_ID 62!@#ACTIVITY_CODE 3
12/21/2022 01:30:09 PM script INFO: SUCCESS!@#KODE 1!@#USER_ID 62!@#ACTIVITY_CODE 2
12/21/2022 01:30:09 PM script INFO: SUCCESS!@#KODE 1!@#USER_ID 62!@#ACTIVITY_CODE 2
12/21/2022 01:30:09 PM script INFO: Duration: 17.736435174942017
12/21/2022 01:30:09 PM script INFO: mengakhiri-quiz
12/21/2022 01:30:09 PM script INFO: SUCCESS!@#KODE 1!@#USER_ID 62!@#ACTIVITY_CODE 5
12/21/2022 01:30:09 PM script INFO: berhasil-submit
12/21/2022 01:31:39 PM script ERROR: TIMEOUT EXCEPTION!@#KODE 0!@#LOCATION berhasil-submit
12/21/2022 01:31:39 PM main_worker ERROR: Message: None

