12/23/2022 01:06:08 AM script INFO: Prepared chrome options..
12/23/2022 01:06:09 AM script INFO: Initialized chrome browser..
12/23/2022 01:06:09 AM script INFO: mengakses-homepage
12/23/2022 01:06:36 AM script INFO: mengakses-login-page
12/23/2022 01:07:11 AM script INFO: mengakses-site-home
12/23/2022 01:07:35 AM script INFO: mengakses-site-course
12/23/2022 01:09:06 AM script ERROR: TIMEOUT EXCEPTION!@#KODE 0!@#LOCATION mengakses-site-course
12/23/2022 01:09:06 AM main_worker ERROR: Message: None

