12/11/2022 03:52:31 PM script INFO: Prepared chrome options..
12/11/2022 03:52:32 PM script INFO: Initialized chrome browser..
12/11/2022 03:52:32 PM script INFO: mengakses-homepage
12/11/2022 03:52:46 PM script INFO: mengakses-login-page
12/11/2022 03:52:47 PM script INFO: mengakses-site-home
12/11/2022 03:52:48 PM script INFO: mengakses-site-course
12/11/2022 03:53:08 PM script INFO: mengakses-quiz
12/11/2022 03:53:24 PM script INFO: mengakses-start-quiz-page
12/11/2022 03:53:39 PM script INFO: memulai-quiz
12/11/2022 03:53:39 PM script INFO: SUCCESS!@#KODE 1!@#USER_ID 17!@#ACTIVITY_CODE 5
12/11/2022 03:53:50 PM script INFO: SUCCESS!@#KODE 1!@#USER_ID 17!@#ACTIVITY_CODE 5
12/11/2022 03:53:50 PM script INFO: SUCCESS!@#KODE 1!@#USER_ID 17!@#ACTIVITY_CODE 5
12/11/2022 03:53:53 PM script INFO: SUCCESS!@#KODE 1!@#USER_ID 17!@#ACTIVITY_CODE 3
12/11/2022 03:53:53 PM script INFO: SUCCESS!@#KODE 1!@#USER_ID 17!@#ACTIVITY_CODE 1
12/11/2022 03:53:53 PM script INFO: SUCCESS!@#KODE 1!@#USER_ID 17!@#ACTIVITY_CODE 2
12/11/2022 03:53:53 PM script INFO: SUCCESS!@#KODE 1!@#USER_ID 17!@#ACTIVITY_CODE 1
12/11/2022 03:53:53 PM script INFO: SUCCESS!@#KODE 1!@#USER_ID 17!@#ACTIVITY_CODE 3
12/11/2022 03:53:54 PM script INFO: SUCCESS!@#KODE 1!@#USER_ID 17!@#ACTIVITY_CODE 2
12/11/2022 03:53:54 PM script INFO: SUCCESS!@#KODE 1!@#USER_ID 17!@#ACTIVITY_CODE 1
12/11/2022 03:53:54 PM script INFO: SUCCESS!@#KODE 1!@#USER_ID 17!@#ACTIVITY_CODE 4
12/11/2022 03:53:54 PM script INFO: SUCCESS!@#KODE 1!@#USER_ID 17!@#ACTIVITY_CODE 3
12/11/2022 03:53:54 PM script INFO: SUCCESS!@#KODE 1!@#USER_ID 17!@#ACTIVITY_CODE 5
12/11/2022 03:53:54 PM script INFO: SUCCESS!@#KODE 1!@#USER_ID 17!@#ACTIVITY_CODE 5
12/11/2022 03:53:57 PM script INFO: SUCCESS!@#KODE 1!@#USER_ID 17!@#ACTIVITY_CODE 5
12/11/2022 03:53:57 PM script INFO: SUCCESS!@#KODE 1!@#USER_ID 17!@#ACTIVITY_CODE 5
12/11/2022 03:53:59 PM script INFO: SUCCESS!@#KODE 1!@#USER_ID 17!@#ACTIVITY_CODE 2
12/11/2022 03:53:59 PM script INFO: SUCCESS!@#KODE 1!@#USER_ID 17!@#ACTIVITY_CODE 5
12/11/2022 03:53:59 PM script INFO: SUCCESS!@#KODE 1!@#USER_ID 17!@#ACTIVITY_CODE 5
12/11/2022 03:54:02 PM script INFO: SUCCESS!@#KODE 1!@#USER_ID 17!@#ACTIVITY_CODE 2
12/11/2022 03:54:03 PM script INFO: SUCCESS!@#KODE 1!@#USER_ID 17!@#ACTIVITY_CODE 2
12/11/2022 03:54:03 PM script INFO: SUCCESS!@#KODE 1!@#USER_ID 17!@#ACTIVITY_CODE 2
12/11/2022 03:54:03 PM script INFO: SUCCESS!@#KODE 1!@#USER_ID 17!@#ACTIVITY_CODE 5
12/11/2022 03:54:03 PM script INFO: SUCCESS!@#KODE 1!@#USER_ID 17!@#ACTIVITY_CODE 5
12/11/2022 03:54:06 PM script INFO: SUCCESS!@#KODE 1!@#USER_ID 17!@#ACTIVITY_CODE 1
12/11/2022 03:54:06 PM script INFO: SUCCESS!@#KODE 1!@#USER_ID 17!@#ACTIVITY_CODE 2
12/11/2022 03:54:06 PM script INFO: SUCCESS!@#KODE 1!@#USER_ID 17!@#ACTIVITY_CODE 3
12/11/2022 03:54:06 PM script INFO: SUCCESS!@#KODE 1!@#USER_ID 17!@#ACTIVITY_CODE 5
12/11/2022 03:54:06 PM script INFO: SUCCESS!@#KODE 1!@#USER_ID 17!@#ACTIVITY_CODE 5
12/11/2022 03:54:09 PM script INFO: SUCCESS!@#KODE 1!@#USER_ID 17!@#ACTIVITY_CODE 3
12/11/2022 03:54:09 PM script INFO: SUCCESS!@#KODE 1!@#USER_ID 17!@#ACTIVITY_CODE 3
12/11/2022 03:54:09 PM script INFO: SUCCESS!@#KODE 1!@#USER_ID 17!@#ACTIVITY_CODE 3
12/11/2022 03:54:09 PM script INFO: SUCCESS!@#KODE 1!@#USER_ID 17!@#ACTIVITY_CODE 2
12/11/2022 03:54:09 PM script INFO: SUCCESS!@#KODE 1!@#USER_ID 17!@#ACTIVITY_CODE 5
12/11/2022 03:54:09 PM script INFO: SUCCESS!@#KODE 1!@#USER_ID 17!@#ACTIVITY_CODE 5
12/11/2022 03:54:12 PM script INFO: SUCCESS!@#KODE 1!@#USER_ID 17!@#ACTIVITY_CODE 3
12/11/2022 03:54:12 PM script INFO: SUCCESS!@#KODE 1!@#USER_ID 17!@#ACTIVITY_CODE 1
12/11/2022 03:54:12 PM script INFO: SUCCESS!@#KODE 1!@#USER_ID 17!@#ACTIVITY_CODE 5
12/11/2022 03:54:12 PM script INFO: SUCCESS!@#KODE 1!@#USER_ID 17!@#ACTIVITY_CODE 5
12/11/2022 03:54:15 PM script INFO: SUCCESS!@#KODE 1!@#USER_ID 17!@#ACTIVITY_CODE 4
12/11/2022 03:54:15 PM script INFO: SUCCESS!@#KODE 1!@#USER_ID 17!@#ACTIVITY_CODE 2
12/11/2022 03:54:15 PM script INFO: SUCCESS!@#KODE 1!@#USER_ID 17!@#ACTIVITY_CODE 5
12/11/2022 03:54:15 PM script INFO: SUCCESS!@#KODE 1!@#USER_ID 17!@#ACTIVITY_CODE 5
12/11/2022 03:54:17 PM script INFO: SUCCESS!@#KODE 1!@#USER_ID 17!@#ACTIVITY_CODE 2
12/11/2022 03:54:18 PM script INFO: SUCCESS!@#KODE 1!@#USER_ID 17!@#ACTIVITY_CODE 1
12/11/2022 03:54:18 PM script INFO: SUCCESS!@#KODE 1!@#USER_ID 17!@#ACTIVITY_CODE 3
12/11/2022 03:54:18 PM script INFO: SUCCESS!@#KODE 1!@#USER_ID 17!@#ACTIVITY_CODE 4
12/11/2022 03:54:18 PM script INFO: SUCCESS!@#KODE 1!@#USER_ID 17!@#ACTIVITY_CODE 3
12/11/2022 03:54:18 PM script INFO: SUCCESS!@#KODE 1!@#USER_ID 17!@#ACTIVITY_CODE 5
12/11/2022 03:54:18 PM script INFO: SUCCESS!@#KODE 1!@#USER_ID 17!@#ACTIVITY_CODE 5
12/11/2022 03:54:20 PM script INFO: SUCCESS!@#KODE 1!@#USER_ID 17!@#ACTIVITY_CODE 5
12/11/2022 03:54:20 PM script INFO: SUCCESS!@#KODE 1!@#USER_ID 17!@#ACTIVITY_CODE 5
12/11/2022 03:54:23 PM script INFO: SUCCESS!@#KODE 1!@#USER_ID 17!@#ACTIVITY_CODE 3
12/11/2022 03:54:23 PM script INFO: SUCCESS!@#KODE 1!@#USER_ID 17!@#ACTIVITY_CODE 2
12/11/2022 03:54:23 PM script INFO: SUCCESS!@#KODE 1!@#USER_ID 17!@#ACTIVITY_CODE 2
12/11/2022 03:54:23 PM script INFO: SUCCESS!@#KODE 1!@#USER_ID 17!@#ACTIVITY_CODE 1
12/11/2022 03:54:23 PM script INFO: SUCCESS!@#KODE 1!@#USER_ID 17!@#ACTIVITY_CODE 4
12/11/2022 03:54:23 PM script INFO: SUCCESS!@#KODE 1!@#USER_ID 17!@#ACTIVITY_CODE 1
12/11/2022 03:54:23 PM script INFO: SUCCESS!@#KODE 1!@#USER_ID 17!@#ACTIVITY_CODE 4
12/11/2022 03:54:23 PM script INFO: SUCCESS!@#KODE 1!@#USER_ID 17!@#ACTIVITY_CODE 5
12/11/2022 03:54:23 PM script INFO: SUCCESS!@#KODE 1!@#USER_ID 17!@#ACTIVITY_CODE 5
12/11/2022 03:54:26 PM script INFO: SUCCESS!@#KODE 1!@#USER_ID 17!@#ACTIVITY_CODE 5
12/11/2022 03:54:26 PM script INFO: SUCCESS!@#KODE 1!@#USER_ID 17!@#ACTIVITY_CODE 5
12/11/2022 03:54:28 PM script INFO: SUCCESS!@#KODE 1!@#USER_ID 17!@#ACTIVITY_CODE 5
12/11/2022 03:54:28 PM script INFO: SUCCESS!@#KODE 1!@#USER_ID 17!@#ACTIVITY_CODE 5
12/11/2022 03:54:31 PM script INFO: SUCCESS!@#KODE 1!@#USER_ID 17!@#ACTIVITY_CODE 1
12/11/2022 03:54:31 PM script INFO: SUCCESS!@#KODE 1!@#USER_ID 17!@#ACTIVITY_CODE 4
12/11/2022 03:54:31 PM script INFO: SUCCESS!@#KODE 1!@#USER_ID 17!@#ACTIVITY_CODE 1
12/11/2022 03:54:31 PM script INFO: SUCCESS!@#KODE 1!@#USER_ID 17!@#ACTIVITY_CODE 1
12/11/2022 03:54:31 PM script INFO: SUCCESS!@#KODE 1!@#USER_ID 17!@#ACTIVITY_CODE 2
12/11/2022 03:54:31 PM script INFO: SUCCESS!@#KODE 1!@#USER_ID 17!@#ACTIVITY_CODE 2
12/11/2022 03:54:31 PM script INFO: SUCCESS!@#KODE 1!@#USER_ID 17!@#ACTIVITY_CODE 5
12/11/2022 03:54:31 PM script INFO: SUCCESS!@#KODE 1!@#USER_ID 17!@#ACTIVITY_CODE 5
12/11/2022 03:54:34 PM script INFO: SUCCESS!@#KODE 1!@#USER_ID 17!@#ACTIVITY_CODE 2
12/11/2022 03:54:34 PM script INFO: SUCCESS!@#KODE 1!@#USER_ID 17!@#ACTIVITY_CODE 1
12/11/2022 03:54:34 PM script INFO: SUCCESS!@#KODE 1!@#USER_ID 17!@#ACTIVITY_CODE 3
12/11/2022 03:54:34 PM script INFO: SUCCESS!@#KODE 1!@#USER_ID 17!@#ACTIVITY_CODE 2
12/11/2022 03:54:34 PM script INFO: SUCCESS!@#KODE 1!@#USER_ID 17!@#ACTIVITY_CODE 3
12/11/2022 03:54:34 PM script INFO: SUCCESS!@#KODE 1!@#USER_ID 17!@#ACTIVITY_CODE 2
12/11/2022 03:54:34 PM script INFO: SUCCESS!@#KODE 1!@#USER_ID 17!@#ACTIVITY_CODE 1
12/11/2022 03:54:34 PM script INFO: SUCCESS!@#KODE 1!@#USER_ID 17!@#ACTIVITY_CODE 1
12/11/2022 03:54:34 PM script INFO: SUCCESS!@#KODE 1!@#USER_ID 17!@#ACTIVITY_CODE 1
12/11/2022 03:54:35 PM script INFO: SUCCESS!@#KODE 1!@#USER_ID 17!@#ACTIVITY_CODE 3
12/11/2022 03:54:35 PM script INFO: SUCCESS!@#KODE 1!@#USER_ID 17!@#ACTIVITY_CODE 1
12/11/2022 03:54:35 PM script INFO: SUCCESS!@#KODE 1!@#USER_ID 17!@#ACTIVITY_CODE 1
12/11/2022 03:54:35 PM script INFO: SUCCESS!@#KODE 1!@#USER_ID 17!@#ACTIVITY_CODE 1
12/11/2022 03:54:35 PM script INFO: SUCCESS!@#KODE 1!@#USER_ID 17!@#ACTIVITY_CODE 2
12/11/2022 03:54:35 PM script INFO: SUCCESS!@#KODE 1!@#USER_ID 17!@#ACTIVITY_CODE 1
12/11/2022 03:54:35 PM script INFO: SUCCESS!@#KODE 1!@#USER_ID 17!@#ACTIVITY_CODE 2
12/11/2022 03:54:35 PM script INFO: SUCCESS!@#KODE 1!@#USER_ID 17!@#ACTIVITY_CODE 2
12/11/2022 03:54:35 PM script INFO: SUCCESS!@#KODE 1!@#USER_ID 17!@#ACTIVITY_CODE 1
12/11/2022 03:54:35 PM script INFO: SUCCESS!@#KODE 1!@#USER_ID 17!@#ACTIVITY_CODE 2
12/11/2022 03:54:35 PM script INFO: SUCCESS!@#KODE 1!@#USER_ID 17!@#ACTIVITY_CODE 4
12/11/2022 03:54:35 PM script INFO: SUCCESS!@#KODE 1!@#USER_ID 17!@#ACTIVITY_CODE 2
12/11/2022 03:54:36 PM script INFO: SUCCESS!@#KODE 1!@#USER_ID 17!@#ACTIVITY_CODE 2
12/11/2022 03:54:36 PM script INFO: SUCCESS!@#KODE 1!@#USER_ID 17!@#ACTIVITY_CODE 5
12/11/2022 03:54:36 PM script INFO: SUCCESS!@#KODE 1!@#USER_ID 17!@#ACTIVITY_CODE 5
12/11/2022 03:54:38 PM script INFO: SUCCESS!@#KODE 1!@#USER_ID 17!@#ACTIVITY_CODE 1
12/11/2022 03:54:38 PM script INFO: SUCCESS!@#KODE 1!@#USER_ID 17!@#ACTIVITY_CODE 2
12/11/2022 03:54:38 PM script INFO: SUCCESS!@#KODE 1!@#USER_ID 17!@#ACTIVITY_CODE 3
12/11/2022 03:54:38 PM script INFO: SUCCESS!@#KODE 1!@#USER_ID 17!@#ACTIVITY_CODE 2
12/11/2022 03:54:39 PM script INFO: SUCCESS!@#KODE 1!@#USER_ID 17!@#ACTIVITY_CODE 2
12/11/2022 03:54:39 PM script INFO: SUCCESS!@#KODE 1!@#USER_ID 17!@#ACTIVITY_CODE 1
12/11/2022 03:54:39 PM script INFO: SUCCESS!@#KODE 1!@#USER_ID 17!@#ACTIVITY_CODE 2
12/11/2022 03:54:39 PM script INFO: SUCCESS!@#KODE 1!@#USER_ID 17!@#ACTIVITY_CODE 2
12/11/2022 03:54:39 PM script INFO: SUCCESS!@#KODE 1!@#USER_ID 17!@#ACTIVITY_CODE 1
12/11/2022 03:54:39 PM script INFO: SUCCESS!@#KODE 1!@#USER_ID 17!@#ACTIVITY_CODE 2
12/11/2022 03:54:39 PM script INFO: SUCCESS!@#KODE 1!@#USER_ID 17!@#ACTIVITY_CODE 2
12/11/2022 03:54:39 PM script INFO: SUCCESS!@#KODE 1!@#USER_ID 17!@#ACTIVITY_CODE 2
12/11/2022 03:54:39 PM script INFO: SUCCESS!@#KODE 1!@#USER_ID 17!@#ACTIVITY_CODE 2
12/11/2022 03:54:40 PM script INFO: SUCCESS!@#KODE 1!@#USER_ID 17!@#ACTIVITY_CODE 1
12/11/2022 03:54:40 PM script INFO: SUCCESS!@#KODE 1!@#USER_ID 17!@#ACTIVITY_CODE 1
12/11/2022 03:54:40 PM script INFO: SUCCESS!@#KODE 1!@#USER_ID 17!@#ACTIVITY_CODE 3
12/11/2022 03:54:40 PM script INFO: SUCCESS!@#KODE 1!@#USER_ID 17!@#ACTIVITY_CODE 1
12/11/2022 03:54:40 PM script INFO: SUCCESS!@#KODE 1!@#USER_ID 17!@#ACTIVITY_CODE 3
12/11/2022 03:54:40 PM script INFO: SUCCESS!@#KODE 1!@#USER_ID 17!@#ACTIVITY_CODE 3
12/11/2022 03:54:40 PM script INFO: SUCCESS!@#KODE 1!@#USER_ID 17!@#ACTIVITY_CODE 2
12/11/2022 03:54:40 PM script INFO: SUCCESS!@#KODE 1!@#USER_ID 17!@#ACTIVITY_CODE 3
12/11/2022 03:54:40 PM script INFO: SUCCESS!@#KODE 1!@#USER_ID 17!@#ACTIVITY_CODE 4
12/11/2022 03:54:40 PM script INFO: SUCCESS!@#KODE 1!@#USER_ID 17!@#ACTIVITY_CODE 3
12/11/2022 03:54:40 PM script INFO: SUCCESS!@#KODE 1!@#USER_ID 17!@#ACTIVITY_CODE 3
12/11/2022 03:54:40 PM script INFO: SUCCESS!@#KODE 1!@#USER_ID 17!@#ACTIVITY_CODE 2
12/11/2022 03:54:40 PM script INFO: SUCCESS!@#KODE 1!@#USER_ID 17!@#ACTIVITY_CODE 2
12/11/2022 03:54:40 PM script INFO: SUCCESS!@#KODE 1!@#USER_ID 17!@#ACTIVITY_CODE 3
12/11/2022 03:54:40 PM script INFO: SUCCESS!@#KODE 1!@#USER_ID 17!@#ACTIVITY_CODE 1
12/11/2022 03:54:41 PM script INFO: SUCCESS!@#KODE 1!@#USER_ID 17!@#ACTIVITY_CODE 2
12/11/2022 03:54:41 PM script INFO: SUCCESS!@#KODE 1!@#USER_ID 17!@#ACTIVITY_CODE 1
12/11/2022 03:54:41 PM script INFO: SUCCESS!@#KODE 1!@#USER_ID 17!@#ACTIVITY_CODE 4
12/11/2022 03:54:41 PM script INFO: SUCCESS!@#KODE 1!@#USER_ID 17!@#ACTIVITY_CODE 2
12/11/2022 03:54:41 PM script INFO: SUCCESS!@#KODE 1!@#USER_ID 17!@#ACTIVITY_CODE 3
12/11/2022 03:54:41 PM script INFO: SUCCESS!@#KODE 1!@#USER_ID 17!@#ACTIVITY_CODE 2
12/11/2022 03:54:41 PM script INFO: SUCCESS!@#KODE 1!@#USER_ID 17!@#ACTIVITY_CODE 1
12/11/2022 03:54:41 PM script INFO: SUCCESS!@#KODE 1!@#USER_ID 17!@#ACTIVITY_CODE 4
12/11/2022 03:54:41 PM script INFO: SUCCESS!@#KODE 1!@#USER_ID 17!@#ACTIVITY_CODE 1
12/11/2022 03:54:41 PM script INFO: SUCCESS!@#KODE 1!@#USER_ID 17!@#ACTIVITY_CODE 3
12/11/2022 03:54:41 PM script INFO: SUCCESS!@#KODE 1!@#USER_ID 17!@#ACTIVITY_CODE 4
12/11/2022 03:54:41 PM script INFO: SUCCESS!@#KODE 1!@#USER_ID 17!@#ACTIVITY_CODE 1
12/11/2022 03:54:41 PM script INFO: SUCCESS!@#KODE 1!@#USER_ID 17!@#ACTIVITY_CODE 3
12/11/2022 03:54:42 PM script INFO: SUCCESS!@#KODE 1!@#USER_ID 17!@#ACTIVITY_CODE 4
12/11/2022 03:54:42 PM script INFO: SUCCESS!@#KODE 1!@#USER_ID 17!@#ACTIVITY_CODE 1
12/11/2022 03:54:42 PM script INFO: SUCCESS!@#KODE 1!@#USER_ID 17!@#ACTIVITY_CODE 3
12/11/2022 03:54:42 PM script INFO: SUCCESS!@#KODE 1!@#USER_ID 17!@#ACTIVITY_CODE 3
12/11/2022 03:54:42 PM script INFO: SUCCESS!@#KODE 1!@#USER_ID 17!@#ACTIVITY_CODE 2
12/11/2022 03:54:42 PM script INFO: SUCCESS!@#KODE 1!@#USER_ID 17!@#ACTIVITY_CODE 3
12/11/2022 03:54:42 PM script INFO: SUCCESS!@#KODE 1!@#USER_ID 17!@#ACTIVITY_CODE 4
12/11/2022 03:54:42 PM script INFO: SUCCESS!@#KODE 1!@#USER_ID 17!@#ACTIVITY_CODE 2
12/11/2022 03:54:42 PM script INFO: SUCCESS!@#KODE 1!@#USER_ID 17!@#ACTIVITY_CODE 1
12/11/2022 03:54:42 PM script INFO: SUCCESS!@#KODE 1!@#USER_ID 17!@#ACTIVITY_CODE 1
12/11/2022 03:54:42 PM script INFO: SUCCESS!@#KODE 1!@#USER_ID 17!@#ACTIVITY_CODE 2
12/11/2022 03:54:42 PM script INFO: SUCCESS!@#KODE 1!@#USER_ID 17!@#ACTIVITY_CODE 3
12/11/2022 03:54:42 PM script INFO: SUCCESS!@#KODE 1!@#USER_ID 17!@#ACTIVITY_CODE 1
12/11/2022 03:54:43 PM script INFO: SUCCESS!@#KODE 1!@#USER_ID 17!@#ACTIVITY_CODE 2
12/11/2022 03:54:43 PM script INFO: SUCCESS!@#KODE 1!@#USER_ID 17!@#ACTIVITY_CODE 2
12/11/2022 03:54:43 PM script INFO: SUCCESS!@#KODE 1!@#USER_ID 17!@#ACTIVITY_CODE 4
12/11/2022 03:54:43 PM script INFO: SUCCESS!@#KODE 1!@#USER_ID 17!@#ACTIVITY_CODE 1
12/11/2022 03:54:43 PM script INFO: SUCCESS!@#KODE 1!@#USER_ID 17!@#ACTIVITY_CODE 2
12/11/2022 03:54:43 PM script INFO: SUCCESS!@#KODE 1!@#USER_ID 17!@#ACTIVITY_CODE 2
12/11/2022 03:54:43 PM script INFO: SUCCESS!@#KODE 1!@#USER_ID 17!@#ACTIVITY_CODE 2
12/11/2022 03:54:43 PM script INFO: SUCCESS!@#KODE 1!@#USER_ID 17!@#ACTIVITY_CODE 3
12/11/2022 03:54:43 PM script INFO: SUCCESS!@#KODE 1!@#USER_ID 17!@#ACTIVITY_CODE 3
12/11/2022 03:54:43 PM script INFO: SUCCESS!@#KODE 1!@#USER_ID 17!@#ACTIVITY_CODE 2
12/11/2022 03:54:44 PM script INFO: SUCCESS!@#KODE 1!@#USER_ID 17!@#ACTIVITY_CODE 1
12/11/2022 03:54:44 PM script INFO: SUCCESS!@#KODE 1!@#USER_ID 17!@#ACTIVITY_CODE 4
12/11/2022 03:54:44 PM script INFO: SUCCESS!@#KODE 1!@#USER_ID 17!@#ACTIVITY_CODE 3
12/11/2022 03:54:44 PM script INFO: SUCCESS!@#KODE 1!@#USER_ID 17!@#ACTIVITY_CODE 2
12/11/2022 03:54:44 PM script INFO: SUCCESS!@#KODE 1!@#USER_ID 17!@#ACTIVITY_CODE 1
12/11/2022 03:54:44 PM script INFO: SUCCESS!@#KODE 1!@#USER_ID 17!@#ACTIVITY_CODE 3
12/11/2022 03:54:44 PM script INFO: SUCCESS!@#KODE 1!@#USER_ID 17!@#ACTIVITY_CODE 1
12/11/2022 03:54:44 PM script INFO: SUCCESS!@#KODE 1!@#USER_ID 17!@#ACTIVITY_CODE 1
12/11/2022 03:54:44 PM script INFO: SUCCESS!@#KODE 1!@#USER_ID 17!@#ACTIVITY_CODE 1
12/11/2022 03:54:44 PM script INFO: SUCCESS!@#KODE 1!@#USER_ID 17!@#ACTIVITY_CODE 2
12/11/2022 03:54:44 PM script INFO: SUCCESS!@#KODE 1!@#USER_ID 17!@#ACTIVITY_CODE 3
12/11/2022 03:54:44 PM script INFO: SUCCESS!@#KODE 1!@#USER_ID 17!@#ACTIVITY_CODE 1
12/11/2022 03:54:44 PM script INFO: SUCCESS!@#KODE 1!@#USER_ID 17!@#ACTIVITY_CODE 2
12/11/2022 03:54:45 PM script INFO: SUCCESS!@#KODE 1!@#USER_ID 17!@#ACTIVITY_CODE 4
12/11/2022 03:54:45 PM script INFO: SUCCESS!@#KODE 1!@#USER_ID 17!@#ACTIVITY_CODE 1
12/11/2022 03:54:45 PM script INFO: SUCCESS!@#KODE 1!@#USER_ID 17!@#ACTIVITY_CODE 2
12/11/2022 03:54:45 PM script INFO: SUCCESS!@#KODE 1!@#USER_ID 17!@#ACTIVITY_CODE 2
12/11/2022 03:54:45 PM script INFO: SUCCESS!@#KODE 1!@#USER_ID 17!@#ACTIVITY_CODE 3
12/11/2022 03:54:45 PM script INFO: SUCCESS!@#KODE 1!@#USER_ID 17!@#ACTIVITY_CODE 1
12/11/2022 03:54:45 PM script INFO: SUCCESS!@#KODE 1!@#USER_ID 17!@#ACTIVITY_CODE 3
12/11/2022 03:54:45 PM script INFO: SUCCESS!@#KODE 1!@#USER_ID 17!@#ACTIVITY_CODE 4
12/11/2022 03:54:45 PM script INFO: SUCCESS!@#KODE 1!@#USER_ID 17!@#ACTIVITY_CODE 3
12/11/2022 03:54:45 PM script INFO: SUCCESS!@#KODE 1!@#USER_ID 17!@#ACTIVITY_CODE 1
12/11/2022 03:54:45 PM script INFO: SUCCESS!@#KODE 1!@#USER_ID 17!@#ACTIVITY_CODE 3
12/11/2022 03:54:45 PM script INFO: SUCCESS!@#KODE 1!@#USER_ID 17!@#ACTIVITY_CODE 1
12/11/2022 03:54:45 PM script INFO: SUCCESS!@#KODE 1!@#USER_ID 17!@#ACTIVITY_CODE 1
12/11/2022 03:54:45 PM script INFO: SUCCESS!@#KODE 1!@#USER_ID 17!@#ACTIVITY_CODE 2
12/11/2022 03:54:45 PM script INFO: SUCCESS!@#KODE 1!@#USER_ID 17!@#ACTIVITY_CODE 1
12/11/2022 03:54:46 PM script INFO: SUCCESS!@#KODE 1!@#USER_ID 17!@#ACTIVITY_CODE 3
12/11/2022 03:54:46 PM script INFO: SUCCESS!@#KODE 1!@#USER_ID 17!@#ACTIVITY_CODE 3
12/11/2022 03:54:46 PM script INFO: SUCCESS!@#KODE 1!@#USER_ID 17!@#ACTIVITY_CODE 2
12/11/2022 03:54:46 PM script INFO: SUCCESS!@#KODE 1!@#USER_ID 17!@#ACTIVITY_CODE 4
12/11/2022 03:54:46 PM script INFO: SUCCESS!@#KODE 1!@#USER_ID 17!@#ACTIVITY_CODE 2
12/11/2022 03:54:46 PM script INFO: SUCCESS!@#KODE 1!@#USER_ID 17!@#ACTIVITY_CODE 3
12/11/2022 03:54:46 PM script INFO: SUCCESS!@#KODE 1!@#USER_ID 17!@#ACTIVITY_CODE 2
12/11/2022 03:54:46 PM script INFO: SUCCESS!@#KODE 1!@#USER_ID 17!@#ACTIVITY_CODE 3
12/11/2022 03:54:46 PM script INFO: SUCCESS!@#KODE 1!@#USER_ID 17!@#ACTIVITY_CODE 1
12/11/2022 03:54:46 PM script INFO: SUCCESS!@#KODE 1!@#USER_ID 17!@#ACTIVITY_CODE 4
12/11/2022 03:54:46 PM script INFO: SUCCESS!@#KODE 1!@#USER_ID 17!@#ACTIVITY_CODE 1
12/11/2022 03:54:46 PM script INFO: SUCCESS!@#KODE 1!@#USER_ID 17!@#ACTIVITY_CODE 3
12/11/2022 03:54:47 PM script INFO: SUCCESS!@#KODE 1!@#USER_ID 17!@#ACTIVITY_CODE 1
12/11/2022 03:54:47 PM script INFO: SUCCESS!@#KODE 1!@#USER_ID 17!@#ACTIVITY_CODE 1
12/11/2022 03:54:47 PM script INFO: SUCCESS!@#KODE 1!@#USER_ID 17!@#ACTIVITY_CODE 2
12/11/2022 03:54:47 PM script INFO: SUCCESS!@#KODE 1!@#USER_ID 17!@#ACTIVITY_CODE 3
12/11/2022 03:54:47 PM script INFO: SUCCESS!@#KODE 1!@#USER_ID 17!@#ACTIVITY_CODE 1
12/11/2022 03:54:47 PM script INFO: SUCCESS!@#KODE 1!@#USER_ID 17!@#ACTIVITY_CODE 3
12/11/2022 03:54:47 PM script INFO: SUCCESS!@#KODE 1!@#USER_ID 17!@#ACTIVITY_CODE 1
12/11/2022 03:54:47 PM script INFO: SUCCESS!@#KODE 1!@#USER_ID 17!@#ACTIVITY_CODE 1
12/11/2022 03:54:47 PM script INFO: SUCCESS!@#KODE 1!@#USER_ID 17!@#ACTIVITY_CODE 4
12/11/2022 03:54:47 PM script INFO: SUCCESS!@#KODE 1!@#USER_ID 17!@#ACTIVITY_CODE 1
12/11/2022 03:54:47 PM script INFO: SUCCESS!@#KODE 1!@#USER_ID 17!@#ACTIVITY_CODE 2
12/11/2022 03:54:47 PM script INFO: SUCCESS!@#KODE 1!@#USER_ID 17!@#ACTIVITY_CODE 4
12/11/2022 03:54:47 PM script INFO: SUCCESS!@#KODE 1!@#USER_ID 17!@#ACTIVITY_CODE 2
12/11/2022 03:54:48 PM script INFO: SUCCESS!@#KODE 1!@#USER_ID 17!@#ACTIVITY_CODE 4
12/11/2022 03:54:48 PM script INFO: SUCCESS!@#KODE 1!@#USER_ID 17!@#ACTIVITY_CODE 2
12/11/2022 03:54:48 PM script INFO: SUCCESS!@#KODE 1!@#USER_ID 17!@#ACTIVITY_CODE 2
12/11/2022 03:54:48 PM script INFO: SUCCESS!@#KODE 1!@#USER_ID 17!@#ACTIVITY_CODE 4
12/11/2022 03:54:48 PM script INFO: SUCCESS!@#KODE 1!@#USER_ID 17!@#ACTIVITY_CODE 2
12/11/2022 03:54:48 PM script INFO: SUCCESS!@#KODE 1!@#USER_ID 17!@#ACTIVITY_CODE 1
12/11/2022 03:54:48 PM script INFO: SUCCESS!@#KODE 1!@#USER_ID 17!@#ACTIVITY_CODE 3
12/11/2022 03:54:48 PM script INFO: SUCCESS!@#KODE 1!@#USER_ID 17!@#ACTIVITY_CODE 1
12/11/2022 03:54:48 PM script INFO: SUCCESS!@#KODE 1!@#USER_ID 17!@#ACTIVITY_CODE 1
12/11/2022 03:54:48 PM script INFO: SUCCESS!@#KODE 1!@#USER_ID 17!@#ACTIVITY_CODE 3
12/11/2022 03:54:48 PM script INFO: SUCCESS!@#KODE 1!@#USER_ID 17!@#ACTIVITY_CODE 1
12/11/2022 03:54:48 PM script INFO: SUCCESS!@#KODE 1!@#USER_ID 17!@#ACTIVITY_CODE 3
12/11/2022 03:54:48 PM script INFO: SUCCESS!@#KODE 1!@#USER_ID 17!@#ACTIVITY_CODE 3
12/11/2022 03:54:49 PM script INFO: SUCCESS!@#KODE 1!@#USER_ID 17!@#ACTIVITY_CODE 3
12/11/2022 03:54:49 PM script INFO: SUCCESS!@#KODE 1!@#USER_ID 17!@#ACTIVITY_CODE 1
12/11/2022 03:54:49 PM script INFO: SUCCESS!@#KODE 1!@#USER_ID 17!@#ACTIVITY_CODE 1
12/11/2022 03:54:49 PM script INFO: SUCCESS!@#KODE 1!@#USER_ID 17!@#ACTIVITY_CODE 3
12/11/2022 03:54:49 PM script INFO: SUCCESS!@#KODE 1!@#USER_ID 17!@#ACTIVITY_CODE 2
12/11/2022 03:54:49 PM script INFO: SUCCESS!@#KODE 1!@#USER_ID 17!@#ACTIVITY_CODE 2
12/11/2022 03:54:49 PM script INFO: SUCCESS!@#KODE 1!@#USER_ID 17!@#ACTIVITY_CODE 1
12/11/2022 03:54:49 PM script INFO: SUCCESS!@#KODE 1!@#USER_ID 17!@#ACTIVITY_CODE 4
12/11/2022 03:54:49 PM script INFO: SUCCESS!@#KODE 1!@#USER_ID 17!@#ACTIVITY_CODE 2
12/11/2022 03:54:49 PM script INFO: SUCCESS!@#KODE 1!@#USER_ID 17!@#ACTIVITY_CODE 3
12/11/2022 03:54:50 PM script INFO: SUCCESS!@#KODE 1!@#USER_ID 17!@#ACTIVITY_CODE 2
12/11/2022 03:54:50 PM script INFO: SUCCESS!@#KODE 1!@#USER_ID 17!@#ACTIVITY_CODE 4
12/11/2022 03:54:50 PM script INFO: SUCCESS!@#KODE 1!@#USER_ID 17!@#ACTIVITY_CODE 3
12/11/2022 03:54:50 PM script INFO: SUCCESS!@#KODE 1!@#USER_ID 17!@#ACTIVITY_CODE 2
12/11/2022 03:54:50 PM script INFO: SUCCESS!@#KODE 1!@#USER_ID 17!@#ACTIVITY_CODE 2
12/11/2022 03:54:50 PM script INFO: SUCCESS!@#KODE 1!@#USER_ID 17!@#ACTIVITY_CODE 2
12/11/2022 03:54:50 PM script INFO: SUCCESS!@#KODE 1!@#USER_ID 17!@#ACTIVITY_CODE 1
12/11/2022 03:54:50 PM script INFO: SUCCESS!@#KODE 1!@#USER_ID 17!@#ACTIVITY_CODE 4
12/11/2022 03:54:50 PM script INFO: SUCCESS!@#KODE 1!@#USER_ID 17!@#ACTIVITY_CODE 1
12/11/2022 03:54:50 PM script INFO: SUCCESS!@#KODE 1!@#USER_ID 17!@#ACTIVITY_CODE 1
12/11/2022 03:54:50 PM script INFO: SUCCESS!@#KODE 1!@#USER_ID 17!@#ACTIVITY_CODE 3
12/11/2022 03:54:50 PM script INFO: SUCCESS!@#KODE 1!@#USER_ID 17!@#ACTIVITY_CODE 3
12/11/2022 03:54:50 PM script INFO: Duration: 60.5895049571991
12/11/2022 03:54:50 PM script INFO: mengakhiri-quiz
12/11/2022 03:55:11 PM script INFO: SUCCESS!@#KODE 1!@#USER_ID 17!@#ACTIVITY_CODE 5
12/11/2022 03:55:11 PM script INFO: berhasil-submit
