12/23/2022 01:17:54 AM script INFO: Prepared chrome options..
12/23/2022 01:17:55 AM script INFO: Initialized chrome browser..
12/23/2022 01:17:55 AM script INFO: mengakses-homepage
12/23/2022 01:18:22 AM script INFO: mengakses-login-page
12/23/2022 01:19:25 AM script INFO: mengakses-site-home
12/23/2022 01:19:35 AM script INFO: mengakses-site-course
12/23/2022 01:20:17 AM script INFO: mengakses-quiz
12/23/2022 01:20:28 AM script INFO: mengakses-start-quiz-page
12/23/2022 01:20:47 AM script INFO: memulai-quiz
12/23/2022 01:20:47 AM script INFO: SUCCESS!@#KODE 1!@#USER_ID 51!@#ACTIVITY_CODE 5
12/23/2022 01:20:58 AM script INFO: SUCCESS!@#KODE 1!@#USER_ID 51!@#ACTIVITY_CODE 5
12/23/2022 01:20:58 AM script INFO: SUCCESS!@#KODE 1!@#USER_ID 51!@#ACTIVITY_CODE 5
12/23/2022 01:21:00 AM script INFO: SUCCESS!@#KODE 1!@#USER_ID 51!@#ACTIVITY_CODE 5
12/23/2022 01:21:00 AM script INFO: SUCCESS!@#KODE 1!@#USER_ID 51!@#ACTIVITY_CODE 5
12/23/2022 01:21:03 AM script INFO: SUCCESS!@#KODE 1!@#USER_ID 51!@#ACTIVITY_CODE 3
12/23/2022 01:21:03 AM script INFO: SUCCESS!@#KODE 1!@#USER_ID 51!@#ACTIVITY_CODE 1
12/23/2022 01:21:03 AM script INFO: SUCCESS!@#KODE 1!@#USER_ID 51!@#ACTIVITY_CODE 3
12/23/2022 01:21:03 AM script INFO: SUCCESS!@#KODE 1!@#USER_ID 51!@#ACTIVITY_CODE 1
12/23/2022 01:21:03 AM script INFO: SUCCESS!@#KODE 1!@#USER_ID 51!@#ACTIVITY_CODE 5
12/23/2022 01:21:03 AM script INFO: SUCCESS!@#KODE 1!@#USER_ID 51!@#ACTIVITY_CODE 5
12/23/2022 01:21:05 AM script INFO: SUCCESS!@#KODE 1!@#USER_ID 51!@#ACTIVITY_CODE 5
12/23/2022 01:21:05 AM script INFO: SUCCESS!@#KODE 1!@#USER_ID 51!@#ACTIVITY_CODE 5
12/23/2022 01:21:08 AM script INFO: SUCCESS!@#KODE 1!@#USER_ID 51!@#ACTIVITY_CODE 2
12/23/2022 01:21:08 AM script INFO: SUCCESS!@#KODE 1!@#USER_ID 51!@#ACTIVITY_CODE 1
12/23/2022 01:21:08 AM script INFO: SUCCESS!@#KODE 1!@#USER_ID 51!@#ACTIVITY_CODE 3
12/23/2022 01:21:08 AM script INFO: SUCCESS!@#KODE 1!@#USER_ID 51!@#ACTIVITY_CODE 3
12/23/2022 01:21:08 AM script INFO: SUCCESS!@#KODE 1!@#USER_ID 51!@#ACTIVITY_CODE 2
12/23/2022 01:21:09 AM script INFO: SUCCESS!@#KODE 1!@#USER_ID 51!@#ACTIVITY_CODE 2
12/23/2022 01:21:09 AM script INFO: SUCCESS!@#KODE 1!@#USER_ID 51!@#ACTIVITY_CODE 3
12/23/2022 01:21:09 AM script INFO: SUCCESS!@#KODE 1!@#USER_ID 51!@#ACTIVITY_CODE 2
12/23/2022 01:21:09 AM script INFO: SUCCESS!@#KODE 1!@#USER_ID 51!@#ACTIVITY_CODE 3
12/23/2022 01:21:09 AM script INFO: SUCCESS!@#KODE 1!@#USER_ID 51!@#ACTIVITY_CODE 2
12/23/2022 01:21:09 AM script INFO: SUCCESS!@#KODE 1!@#USER_ID 51!@#ACTIVITY_CODE 1
12/23/2022 01:21:09 AM script INFO: SUCCESS!@#KODE 1!@#USER_ID 51!@#ACTIVITY_CODE 5
12/23/2022 01:21:09 AM script INFO: SUCCESS!@#KODE 1!@#USER_ID 51!@#ACTIVITY_CODE 5
12/23/2022 01:21:12 AM script INFO: SUCCESS!@#KODE 1!@#USER_ID 51!@#ACTIVITY_CODE 1
12/23/2022 01:21:12 AM script INFO: SUCCESS!@#KODE 1!@#USER_ID 51!@#ACTIVITY_CODE 3
12/23/2022 01:21:12 AM script INFO: SUCCESS!@#KODE 1!@#USER_ID 51!@#ACTIVITY_CODE 2
12/23/2022 01:21:12 AM script INFO: SUCCESS!@#KODE 1!@#USER_ID 51!@#ACTIVITY_CODE 3
12/23/2022 01:21:12 AM script INFO: SUCCESS!@#KODE 1!@#USER_ID 51!@#ACTIVITY_CODE 4
12/23/2022 01:21:12 AM script INFO: SUCCESS!@#KODE 1!@#USER_ID 51!@#ACTIVITY_CODE 5
12/23/2022 01:21:12 AM script INFO: SUCCESS!@#KODE 1!@#USER_ID 51!@#ACTIVITY_CODE 5
12/23/2022 01:21:14 AM script INFO: SUCCESS!@#KODE 1!@#USER_ID 51!@#ACTIVITY_CODE 5
12/23/2022 01:21:14 AM script INFO: SUCCESS!@#KODE 1!@#USER_ID 51!@#ACTIVITY_CODE 5
12/23/2022 01:21:17 AM script INFO: SUCCESS!@#KODE 1!@#USER_ID 51!@#ACTIVITY_CODE 5
12/23/2022 01:21:17 AM script INFO: SUCCESS!@#KODE 1!@#USER_ID 51!@#ACTIVITY_CODE 5
12/23/2022 01:21:20 AM script INFO: SUCCESS!@#KODE 1!@#USER_ID 51!@#ACTIVITY_CODE 2
12/23/2022 01:21:20 AM script INFO: SUCCESS!@#KODE 1!@#USER_ID 51!@#ACTIVITY_CODE 4
12/23/2022 01:21:20 AM script INFO: SUCCESS!@#KODE 1!@#USER_ID 51!@#ACTIVITY_CODE 1
12/23/2022 01:21:20 AM script INFO: SUCCESS!@#KODE 1!@#USER_ID 51!@#ACTIVITY_CODE 5
12/23/2022 01:21:20 AM script INFO: SUCCESS!@#KODE 1!@#USER_ID 51!@#ACTIVITY_CODE 5
12/23/2022 01:21:22 AM script INFO: SUCCESS!@#KODE 1!@#USER_ID 51!@#ACTIVITY_CODE 3
12/23/2022 01:21:22 AM script INFO: SUCCESS!@#KODE 1!@#USER_ID 51!@#ACTIVITY_CODE 4
12/23/2022 01:21:22 AM script INFO: SUCCESS!@#KODE 1!@#USER_ID 51!@#ACTIVITY_CODE 1
12/23/2022 01:21:23 AM script INFO: SUCCESS!@#KODE 1!@#USER_ID 51!@#ACTIVITY_CODE 3
12/23/2022 01:21:23 AM script INFO: SUCCESS!@#KODE 1!@#USER_ID 51!@#ACTIVITY_CODE 3
12/23/2022 01:21:23 AM script INFO: SUCCESS!@#KODE 1!@#USER_ID 51!@#ACTIVITY_CODE 2
12/23/2022 01:21:23 AM script INFO: SUCCESS!@#KODE 1!@#USER_ID 51!@#ACTIVITY_CODE 1
12/23/2022 01:21:23 AM script INFO: SUCCESS!@#KODE 1!@#USER_ID 51!@#ACTIVITY_CODE 1
12/23/2022 01:21:23 AM script INFO: SUCCESS!@#KODE 1!@#USER_ID 51!@#ACTIVITY_CODE 3
12/23/2022 01:21:23 AM script INFO: SUCCESS!@#KODE 1!@#USER_ID 51!@#ACTIVITY_CODE 5
12/23/2022 01:21:23 AM script INFO: SUCCESS!@#KODE 1!@#USER_ID 51!@#ACTIVITY_CODE 5
12/23/2022 01:21:25 AM script INFO: SUCCESS!@#KODE 1!@#USER_ID 51!@#ACTIVITY_CODE 1
12/23/2022 01:21:26 AM script INFO: SUCCESS!@#KODE 1!@#USER_ID 51!@#ACTIVITY_CODE 3
12/23/2022 01:21:26 AM script INFO: SUCCESS!@#KODE 1!@#USER_ID 51!@#ACTIVITY_CODE 3
12/23/2022 01:21:26 AM script INFO: SUCCESS!@#KODE 1!@#USER_ID 51!@#ACTIVITY_CODE 1
12/23/2022 01:21:26 AM script INFO: SUCCESS!@#KODE 1!@#USER_ID 51!@#ACTIVITY_CODE 3
12/23/2022 01:21:26 AM script INFO: SUCCESS!@#KODE 1!@#USER_ID 51!@#ACTIVITY_CODE 1
12/23/2022 01:21:26 AM script INFO: SUCCESS!@#KODE 1!@#USER_ID 51!@#ACTIVITY_CODE 2
12/23/2022 01:21:26 AM script INFO: SUCCESS!@#KODE 1!@#USER_ID 51!@#ACTIVITY_CODE 3
12/23/2022 01:21:26 AM script INFO: SUCCESS!@#KODE 1!@#USER_ID 51!@#ACTIVITY_CODE 3
12/23/2022 01:21:26 AM script INFO: SUCCESS!@#KODE 1!@#USER_ID 51!@#ACTIVITY_CODE 2
12/23/2022 01:21:26 AM script INFO: SUCCESS!@#KODE 1!@#USER_ID 51!@#ACTIVITY_CODE 3
12/23/2022 01:21:26 AM script INFO: SUCCESS!@#KODE 1!@#USER_ID 51!@#ACTIVITY_CODE 1
12/23/2022 01:21:26 AM script INFO: SUCCESS!@#KODE 1!@#USER_ID 51!@#ACTIVITY_CODE 5
12/23/2022 01:21:26 AM script INFO: SUCCESS!@#KODE 1!@#USER_ID 51!@#ACTIVITY_CODE 5
12/23/2022 01:21:29 AM script INFO: SUCCESS!@#KODE 1!@#USER_ID 51!@#ACTIVITY_CODE 1
12/23/2022 01:21:29 AM script INFO: SUCCESS!@#KODE 1!@#USER_ID 51!@#ACTIVITY_CODE 2
12/23/2022 01:21:29 AM script INFO: SUCCESS!@#KODE 1!@#USER_ID 51!@#ACTIVITY_CODE 1
12/23/2022 01:21:29 AM script INFO: SUCCESS!@#KODE 1!@#USER_ID 51!@#ACTIVITY_CODE 3
12/23/2022 01:21:29 AM script INFO: SUCCESS!@#KODE 1!@#USER_ID 51!@#ACTIVITY_CODE 1
12/23/2022 01:21:29 AM script INFO: SUCCESS!@#KODE 1!@#USER_ID 51!@#ACTIVITY_CODE 2
12/23/2022 01:21:29 AM script INFO: SUCCESS!@#KODE 1!@#USER_ID 51!@#ACTIVITY_CODE 1
12/23/2022 01:21:29 AM script INFO: SUCCESS!@#KODE 1!@#USER_ID 51!@#ACTIVITY_CODE 3
12/23/2022 01:21:29 AM script INFO: SUCCESS!@#KODE 1!@#USER_ID 51!@#ACTIVITY_CODE 1
12/23/2022 01:21:29 AM script INFO: SUCCESS!@#KODE 1!@#USER_ID 51!@#ACTIVITY_CODE 3
12/23/2022 01:21:29 AM script INFO: SUCCESS!@#KODE 1!@#USER_ID 51!@#ACTIVITY_CODE 2
12/23/2022 01:21:29 AM script INFO: SUCCESS!@#KODE 1!@#USER_ID 51!@#ACTIVITY_CODE 4
12/23/2022 01:21:30 AM script INFO: SUCCESS!@#KODE 1!@#USER_ID 51!@#ACTIVITY_CODE 3
12/23/2022 01:21:30 AM script INFO: SUCCESS!@#KODE 1!@#USER_ID 51!@#ACTIVITY_CODE 1
12/23/2022 01:21:30 AM script INFO: SUCCESS!@#KODE 1!@#USER_ID 51!@#ACTIVITY_CODE 2
12/23/2022 01:21:30 AM script INFO: SUCCESS!@#KODE 1!@#USER_ID 51!@#ACTIVITY_CODE 3
12/23/2022 01:21:30 AM script INFO: SUCCESS!@#KODE 1!@#USER_ID 51!@#ACTIVITY_CODE 1
12/23/2022 01:21:30 AM script INFO: SUCCESS!@#KODE 1!@#USER_ID 51!@#ACTIVITY_CODE 1
12/23/2022 01:21:30 AM script INFO: SUCCESS!@#KODE 1!@#USER_ID 51!@#ACTIVITY_CODE 1
12/23/2022 01:21:30 AM script INFO: SUCCESS!@#KODE 1!@#USER_ID 51!@#ACTIVITY_CODE 2
12/23/2022 01:21:30 AM script INFO: SUCCESS!@#KODE 1!@#USER_ID 51!@#ACTIVITY_CODE 1
12/23/2022 01:21:30 AM script INFO: SUCCESS!@#KODE 1!@#USER_ID 51!@#ACTIVITY_CODE 4
12/23/2022 01:21:30 AM script INFO: SUCCESS!@#KODE 1!@#USER_ID 51!@#ACTIVITY_CODE 3
12/23/2022 01:21:30 AM script INFO: SUCCESS!@#KODE 1!@#USER_ID 51!@#ACTIVITY_CODE 2
12/23/2022 01:21:30 AM script INFO: SUCCESS!@#KODE 1!@#USER_ID 51!@#ACTIVITY_CODE 2
12/23/2022 01:21:30 AM script INFO: SUCCESS!@#KODE 1!@#USER_ID 51!@#ACTIVITY_CODE 1
12/23/2022 01:21:31 AM script INFO: SUCCESS!@#KODE 1!@#USER_ID 51!@#ACTIVITY_CODE 4
12/23/2022 01:21:31 AM script INFO: SUCCESS!@#KODE 1!@#USER_ID 51!@#ACTIVITY_CODE 1
12/23/2022 01:21:31 AM script INFO: SUCCESS!@#KODE 1!@#USER_ID 51!@#ACTIVITY_CODE 2
12/23/2022 01:21:31 AM script INFO: SUCCESS!@#KODE 1!@#USER_ID 51!@#ACTIVITY_CODE 1
12/23/2022 01:21:31 AM script INFO: SUCCESS!@#KODE 1!@#USER_ID 51!@#ACTIVITY_CODE 3
12/23/2022 01:21:31 AM script INFO: SUCCESS!@#KODE 1!@#USER_ID 51!@#ACTIVITY_CODE 4
12/23/2022 01:21:31 AM script INFO: Duration: 33.17069721221924
12/23/2022 01:21:31 AM script INFO: mengakhiri-quiz
12/23/2022 01:21:47 AM script INFO: SUCCESS!@#KODE 1!@#USER_ID 51!@#ACTIVITY_CODE 5
12/23/2022 01:21:47 AM script INFO: berhasil-submit
12/23/2022 01:23:17 AM script ERROR: TIMEOUT EXCEPTION!@#KODE 0!@#LOCATION berhasil-submit
12/23/2022 01:23:17 AM main_worker ERROR: Message: None

