12/23/2022 03:16:01 AM script INFO: Prepared chrome options..
12/23/2022 03:16:03 AM script INFO: Initialized chrome browser..
12/23/2022 03:16:03 AM script INFO: mengakses-homepage
12/23/2022 03:16:25 AM script INFO: mengakses-login-page
12/23/2022 03:16:26 AM script INFO: mengakses-site-home
12/23/2022 03:16:26 AM script INFO: mengakses-site-course
12/23/2022 03:16:27 AM script INFO: mengakses-quiz
12/23/2022 03:16:28 AM script INFO: mengakses-start-quiz-page
12/23/2022 03:16:28 AM script INFO: memulai-quiz
12/23/2022 03:16:28 AM script INFO: SUCCESS!@#KODE 1!@#USER_ID 11!@#ACTIVITY_CODE 5
12/23/2022 03:16:39 AM script INFO: SUCCESS!@#KODE 1!@#USER_ID 11!@#ACTIVITY_CODE 1
12/23/2022 03:16:39 AM script INFO: SUCCESS!@#KODE 1!@#USER_ID 11!@#ACTIVITY_CODE 1
12/23/2022 03:16:39 AM script INFO: SUCCESS!@#KODE 1!@#USER_ID 11!@#ACTIVITY_CODE 1
12/23/2022 03:16:39 AM script INFO: SUCCESS!@#KODE 1!@#USER_ID 11!@#ACTIVITY_CODE 2
12/23/2022 03:16:39 AM script INFO: SUCCESS!@#KODE 1!@#USER_ID 11!@#ACTIVITY_CODE 5
12/23/2022 03:16:39 AM script INFO: SUCCESS!@#KODE 1!@#USER_ID 11!@#ACTIVITY_CODE 5
12/23/2022 03:16:42 AM script INFO: SUCCESS!@#KODE 1!@#USER_ID 11!@#ACTIVITY_CODE 5
12/23/2022 03:16:42 AM script INFO: SUCCESS!@#KODE 1!@#USER_ID 11!@#ACTIVITY_CODE 5
12/23/2022 03:16:44 AM script INFO: SUCCESS!@#KODE 1!@#USER_ID 11!@#ACTIVITY_CODE 1
12/23/2022 03:16:45 AM script INFO: SUCCESS!@#KODE 1!@#USER_ID 11!@#ACTIVITY_CODE 1
12/23/2022 03:16:45 AM script INFO: SUCCESS!@#KODE 1!@#USER_ID 11!@#ACTIVITY_CODE 4
12/23/2022 03:16:45 AM script INFO: SUCCESS!@#KODE 1!@#USER_ID 11!@#ACTIVITY_CODE 3
12/23/2022 03:16:45 AM script INFO: SUCCESS!@#KODE 1!@#USER_ID 11!@#ACTIVITY_CODE 5
12/23/2022 03:16:45 AM script INFO: SUCCESS!@#KODE 1!@#USER_ID 11!@#ACTIVITY_CODE 5
12/23/2022 03:16:47 AM script INFO: SUCCESS!@#KODE 1!@#USER_ID 11!@#ACTIVITY_CODE 1
12/23/2022 03:16:47 AM script INFO: SUCCESS!@#KODE 1!@#USER_ID 11!@#ACTIVITY_CODE 1
12/23/2022 03:16:47 AM script INFO: SUCCESS!@#KODE 1!@#USER_ID 11!@#ACTIVITY_CODE 1
12/23/2022 03:16:48 AM script INFO: SUCCESS!@#KODE 1!@#USER_ID 11!@#ACTIVITY_CODE 3
12/23/2022 03:16:48 AM script INFO: SUCCESS!@#KODE 1!@#USER_ID 11!@#ACTIVITY_CODE 4
12/23/2022 03:16:48 AM script INFO: SUCCESS!@#KODE 1!@#USER_ID 11!@#ACTIVITY_CODE 3
12/23/2022 03:16:48 AM script INFO: SUCCESS!@#KODE 1!@#USER_ID 11!@#ACTIVITY_CODE 5
12/23/2022 03:16:48 AM script INFO: SUCCESS!@#KODE 1!@#USER_ID 11!@#ACTIVITY_CODE 5
12/23/2022 03:16:50 AM script INFO: SUCCESS!@#KODE 1!@#USER_ID 11!@#ACTIVITY_CODE 2
12/23/2022 03:16:51 AM script INFO: SUCCESS!@#KODE 1!@#USER_ID 11!@#ACTIVITY_CODE 1
12/23/2022 03:16:51 AM script INFO: SUCCESS!@#KODE 1!@#USER_ID 11!@#ACTIVITY_CODE 1
12/23/2022 03:16:51 AM script INFO: SUCCESS!@#KODE 1!@#USER_ID 11!@#ACTIVITY_CODE 1
12/23/2022 03:16:51 AM script INFO: SUCCESS!@#KODE 1!@#USER_ID 11!@#ACTIVITY_CODE 2
12/23/2022 03:16:51 AM script INFO: SUCCESS!@#KODE 1!@#USER_ID 11!@#ACTIVITY_CODE 1
12/23/2022 03:16:51 AM script INFO: SUCCESS!@#KODE 1!@#USER_ID 11!@#ACTIVITY_CODE 2
12/23/2022 03:16:51 AM script INFO: SUCCESS!@#KODE 1!@#USER_ID 11!@#ACTIVITY_CODE 3
12/23/2022 03:16:51 AM script INFO: SUCCESS!@#KODE 1!@#USER_ID 11!@#ACTIVITY_CODE 4
12/23/2022 03:16:51 AM script INFO: SUCCESS!@#KODE 1!@#USER_ID 11!@#ACTIVITY_CODE 3
12/23/2022 03:16:51 AM script INFO: SUCCESS!@#KODE 1!@#USER_ID 11!@#ACTIVITY_CODE 5
12/23/2022 03:16:51 AM script INFO: SUCCESS!@#KODE 1!@#USER_ID 11!@#ACTIVITY_CODE 5
12/23/2022 03:16:54 AM script INFO: SUCCESS!@#KODE 1!@#USER_ID 11!@#ACTIVITY_CODE 5
12/23/2022 03:16:54 AM script INFO: SUCCESS!@#KODE 1!@#USER_ID 11!@#ACTIVITY_CODE 5
12/23/2022 03:16:56 AM script INFO: SUCCESS!@#KODE 1!@#USER_ID 11!@#ACTIVITY_CODE 3
12/23/2022 03:16:57 AM script INFO: SUCCESS!@#KODE 1!@#USER_ID 11!@#ACTIVITY_CODE 2
12/23/2022 03:16:57 AM script INFO: SUCCESS!@#KODE 1!@#USER_ID 11!@#ACTIVITY_CODE 3
12/23/2022 03:16:57 AM script INFO: SUCCESS!@#KODE 1!@#USER_ID 11!@#ACTIVITY_CODE 3
12/23/2022 03:16:57 AM script INFO: SUCCESS!@#KODE 1!@#USER_ID 11!@#ACTIVITY_CODE 1
12/23/2022 03:16:57 AM script INFO: SUCCESS!@#KODE 1!@#USER_ID 11!@#ACTIVITY_CODE 1
12/23/2022 03:16:57 AM script INFO: SUCCESS!@#KODE 1!@#USER_ID 11!@#ACTIVITY_CODE 2
12/23/2022 03:16:57 AM script INFO: SUCCESS!@#KODE 1!@#USER_ID 11!@#ACTIVITY_CODE 3
12/23/2022 03:16:57 AM script INFO: SUCCESS!@#KODE 1!@#USER_ID 11!@#ACTIVITY_CODE 2
12/23/2022 03:16:57 AM script INFO: SUCCESS!@#KODE 1!@#USER_ID 11!@#ACTIVITY_CODE 1
12/23/2022 03:16:57 AM script INFO: SUCCESS!@#KODE 1!@#USER_ID 11!@#ACTIVITY_CODE 3
12/23/2022 03:16:57 AM script INFO: SUCCESS!@#KODE 1!@#USER_ID 11!@#ACTIVITY_CODE 3
12/23/2022 03:16:57 AM script INFO: Duration: 18.290571212768555
12/23/2022 03:16:57 AM script INFO: mengakhiri-quiz
12/23/2022 03:16:58 AM script INFO: SUCCESS!@#KODE 1!@#USER_ID 11!@#ACTIVITY_CODE 5
12/23/2022 03:16:58 AM script INFO: berhasil-submit
