12/23/2022 07:30:31 AM script INFO: Prepared chrome options..
12/23/2022 07:30:32 AM script INFO: Initialized chrome browser..
12/23/2022 07:30:32 AM script INFO: mengakses-homepage
12/23/2022 07:30:50 AM script INFO: mengakses-login-page
12/23/2022 07:30:51 AM script INFO: mengakses-site-home
12/23/2022 07:30:51 AM script INFO: mengakses-site-course
12/23/2022 07:31:12 AM script INFO: mengakses-quiz
12/23/2022 07:31:28 AM script INFO: mengakses-start-quiz-page
12/23/2022 07:31:48 AM script INFO: memulai-quiz
12/23/2022 07:31:48 AM script INFO: SUCCESS!@#KODE 1!@#USER_ID 36!@#ACTIVITY_CODE 5
12/23/2022 07:31:59 AM script INFO: SUCCESS!@#KODE 1!@#USER_ID 36!@#ACTIVITY_CODE 5
12/23/2022 07:31:59 AM script INFO: SUCCESS!@#KODE 1!@#USER_ID 36!@#ACTIVITY_CODE 5
12/23/2022 07:32:01 AM script INFO: SUCCESS!@#KODE 1!@#USER_ID 36!@#ACTIVITY_CODE 2
12/23/2022 07:32:02 AM script INFO: SUCCESS!@#KODE 1!@#USER_ID 36!@#ACTIVITY_CODE 1
12/23/2022 07:32:02 AM script INFO: SUCCESS!@#KODE 1!@#USER_ID 36!@#ACTIVITY_CODE 4
12/23/2022 07:32:02 AM script INFO: SUCCESS!@#KODE 1!@#USER_ID 36!@#ACTIVITY_CODE 5
12/23/2022 07:32:02 AM script INFO: SUCCESS!@#KODE 1!@#USER_ID 36!@#ACTIVITY_CODE 5
12/23/2022 07:32:04 AM script INFO: SUCCESS!@#KODE 1!@#USER_ID 36!@#ACTIVITY_CODE 3
12/23/2022 07:32:05 AM script INFO: SUCCESS!@#KODE 1!@#USER_ID 36!@#ACTIVITY_CODE 3
12/23/2022 07:32:05 AM script INFO: SUCCESS!@#KODE 1!@#USER_ID 36!@#ACTIVITY_CODE 2
12/23/2022 07:32:05 AM script INFO: SUCCESS!@#KODE 1!@#USER_ID 36!@#ACTIVITY_CODE 1
12/23/2022 07:32:05 AM script INFO: SUCCESS!@#KODE 1!@#USER_ID 36!@#ACTIVITY_CODE 1
12/23/2022 07:32:05 AM script INFO: SUCCESS!@#KODE 1!@#USER_ID 36!@#ACTIVITY_CODE 5
12/23/2022 07:32:05 AM script INFO: SUCCESS!@#KODE 1!@#USER_ID 36!@#ACTIVITY_CODE 5
12/23/2022 07:32:08 AM script INFO: SUCCESS!@#KODE 1!@#USER_ID 36!@#ACTIVITY_CODE 4
12/23/2022 07:32:08 AM script INFO: SUCCESS!@#KODE 1!@#USER_ID 36!@#ACTIVITY_CODE 5
12/23/2022 07:32:08 AM script INFO: SUCCESS!@#KODE 1!@#USER_ID 36!@#ACTIVITY_CODE 5
12/23/2022 07:32:11 AM script INFO: SUCCESS!@#KODE 1!@#USER_ID 36!@#ACTIVITY_CODE 2
12/23/2022 07:32:11 AM script INFO: SUCCESS!@#KODE 1!@#USER_ID 36!@#ACTIVITY_CODE 1
12/23/2022 07:32:11 AM script INFO: SUCCESS!@#KODE 1!@#USER_ID 36!@#ACTIVITY_CODE 1
12/23/2022 07:32:11 AM script INFO: SUCCESS!@#KODE 1!@#USER_ID 36!@#ACTIVITY_CODE 2
12/23/2022 07:32:12 AM script INFO: SUCCESS!@#KODE 1!@#USER_ID 36!@#ACTIVITY_CODE 2
12/23/2022 07:32:12 AM script INFO: SUCCESS!@#KODE 1!@#USER_ID 36!@#ACTIVITY_CODE 1
12/23/2022 07:32:12 AM script INFO: SUCCESS!@#KODE 1!@#USER_ID 36!@#ACTIVITY_CODE 5
12/23/2022 07:32:12 AM script INFO: SUCCESS!@#KODE 1!@#USER_ID 36!@#ACTIVITY_CODE 5
12/23/2022 07:32:14 AM script INFO: SUCCESS!@#KODE 1!@#USER_ID 36!@#ACTIVITY_CODE 1
12/23/2022 07:32:15 AM script INFO: SUCCESS!@#KODE 1!@#USER_ID 36!@#ACTIVITY_CODE 2
12/23/2022 07:32:15 AM script INFO: SUCCESS!@#KODE 1!@#USER_ID 36!@#ACTIVITY_CODE 3
12/23/2022 07:32:15 AM script INFO: SUCCESS!@#KODE 1!@#USER_ID 36!@#ACTIVITY_CODE 3
12/23/2022 07:32:15 AM script INFO: SUCCESS!@#KODE 1!@#USER_ID 36!@#ACTIVITY_CODE 3
12/23/2022 07:32:15 AM script INFO: SUCCESS!@#KODE 1!@#USER_ID 36!@#ACTIVITY_CODE 5
12/23/2022 07:32:15 AM script INFO: SUCCESS!@#KODE 1!@#USER_ID 36!@#ACTIVITY_CODE 5
12/23/2022 07:32:18 AM script INFO: SUCCESS!@#KODE 1!@#USER_ID 36!@#ACTIVITY_CODE 2
12/23/2022 07:32:18 AM script INFO: SUCCESS!@#KODE 1!@#USER_ID 36!@#ACTIVITY_CODE 2
12/23/2022 07:32:19 AM script INFO: SUCCESS!@#KODE 1!@#USER_ID 36!@#ACTIVITY_CODE 3
12/23/2022 07:32:19 AM script INFO: SUCCESS!@#KODE 1!@#USER_ID 36!@#ACTIVITY_CODE 1
12/23/2022 07:32:19 AM script INFO: SUCCESS!@#KODE 1!@#USER_ID 36!@#ACTIVITY_CODE 3
12/23/2022 07:32:19 AM script INFO: SUCCESS!@#KODE 1!@#USER_ID 36!@#ACTIVITY_CODE 2
12/23/2022 07:32:19 AM script INFO: SUCCESS!@#KODE 1!@#USER_ID 36!@#ACTIVITY_CODE 5
12/23/2022 07:32:19 AM script INFO: SUCCESS!@#KODE 1!@#USER_ID 36!@#ACTIVITY_CODE 5
12/23/2022 07:32:22 AM script INFO: SUCCESS!@#KODE 1!@#USER_ID 36!@#ACTIVITY_CODE 5
12/23/2022 07:32:22 AM script INFO: SUCCESS!@#KODE 1!@#USER_ID 36!@#ACTIVITY_CODE 5
12/23/2022 07:32:25 AM script INFO: SUCCESS!@#KODE 1!@#USER_ID 36!@#ACTIVITY_CODE 2
12/23/2022 07:32:25 AM script INFO: SUCCESS!@#KODE 1!@#USER_ID 36!@#ACTIVITY_CODE 2
12/23/2022 07:32:26 AM script INFO: SUCCESS!@#KODE 1!@#USER_ID 36!@#ACTIVITY_CODE 2
12/23/2022 07:32:26 AM script INFO: SUCCESS!@#KODE 1!@#USER_ID 36!@#ACTIVITY_CODE 1
12/23/2022 07:32:26 AM script INFO: SUCCESS!@#KODE 1!@#USER_ID 36!@#ACTIVITY_CODE 2
12/23/2022 07:32:26 AM script INFO: SUCCESS!@#KODE 1!@#USER_ID 36!@#ACTIVITY_CODE 1
12/23/2022 07:32:27 AM script INFO: SUCCESS!@#KODE 1!@#USER_ID 36!@#ACTIVITY_CODE 5
12/23/2022 07:32:27 AM script INFO: SUCCESS!@#KODE 1!@#USER_ID 36!@#ACTIVITY_CODE 5
12/23/2022 07:32:29 AM script INFO: SUCCESS!@#KODE 1!@#USER_ID 36!@#ACTIVITY_CODE 5
12/23/2022 07:32:29 AM script INFO: SUCCESS!@#KODE 1!@#USER_ID 36!@#ACTIVITY_CODE 5
12/23/2022 07:32:32 AM script INFO: SUCCESS!@#KODE 1!@#USER_ID 36!@#ACTIVITY_CODE 3
12/23/2022 07:32:32 AM script INFO: SUCCESS!@#KODE 1!@#USER_ID 36!@#ACTIVITY_CODE 3
12/23/2022 07:32:32 AM script INFO: SUCCESS!@#KODE 1!@#USER_ID 36!@#ACTIVITY_CODE 1
12/23/2022 07:32:32 AM script INFO: SUCCESS!@#KODE 1!@#USER_ID 36!@#ACTIVITY_CODE 2
12/23/2022 07:32:32 AM script INFO: SUCCESS!@#KODE 1!@#USER_ID 36!@#ACTIVITY_CODE 1
12/23/2022 07:32:32 AM script INFO: SUCCESS!@#KODE 1!@#USER_ID 36!@#ACTIVITY_CODE 5
12/23/2022 07:32:32 AM script INFO: SUCCESS!@#KODE 1!@#USER_ID 36!@#ACTIVITY_CODE 5
12/23/2022 07:32:35 AM script INFO: SUCCESS!@#KODE 1!@#USER_ID 36!@#ACTIVITY_CODE 4
12/23/2022 07:32:35 AM script INFO: SUCCESS!@#KODE 1!@#USER_ID 36!@#ACTIVITY_CODE 1
12/23/2022 07:32:36 AM script INFO: SUCCESS!@#KODE 1!@#USER_ID 36!@#ACTIVITY_CODE 4
12/23/2022 07:32:36 AM script INFO: SUCCESS!@#KODE 1!@#USER_ID 36!@#ACTIVITY_CODE 3
12/23/2022 07:32:36 AM script INFO: SUCCESS!@#KODE 1!@#USER_ID 36!@#ACTIVITY_CODE 3
12/23/2022 07:32:36 AM script INFO: SUCCESS!@#KODE 1!@#USER_ID 36!@#ACTIVITY_CODE 3
12/23/2022 07:32:36 AM script INFO: SUCCESS!@#KODE 1!@#USER_ID 36!@#ACTIVITY_CODE 1
12/23/2022 07:32:37 AM script INFO: SUCCESS!@#KODE 1!@#USER_ID 36!@#ACTIVITY_CODE 3
12/23/2022 07:32:37 AM script INFO: SUCCESS!@#KODE 1!@#USER_ID 36!@#ACTIVITY_CODE 2
12/23/2022 07:32:37 AM script INFO: SUCCESS!@#KODE 1!@#USER_ID 36!@#ACTIVITY_CODE 3
12/23/2022 07:32:37 AM script INFO: SUCCESS!@#KODE 1!@#USER_ID 36!@#ACTIVITY_CODE 2
12/23/2022 07:32:38 AM script INFO: SUCCESS!@#KODE 1!@#USER_ID 36!@#ACTIVITY_CODE 1
12/23/2022 07:32:38 AM script INFO: SUCCESS!@#KODE 1!@#USER_ID 36!@#ACTIVITY_CODE 1
12/23/2022 07:32:38 AM script INFO: SUCCESS!@#KODE 1!@#USER_ID 36!@#ACTIVITY_CODE 4
12/23/2022 07:32:38 AM script INFO: SUCCESS!@#KODE 1!@#USER_ID 36!@#ACTIVITY_CODE 1
12/23/2022 07:32:38 AM script INFO: SUCCESS!@#KODE 1!@#USER_ID 36!@#ACTIVITY_CODE 2
12/23/2022 07:32:39 AM script INFO: SUCCESS!@#KODE 1!@#USER_ID 36!@#ACTIVITY_CODE 3
12/23/2022 07:32:39 AM script INFO: SUCCESS!@#KODE 1!@#USER_ID 36!@#ACTIVITY_CODE 4
12/23/2022 07:32:39 AM script INFO: SUCCESS!@#KODE 1!@#USER_ID 36!@#ACTIVITY_CODE 3
12/23/2022 07:32:39 AM script INFO: SUCCESS!@#KODE 1!@#USER_ID 36!@#ACTIVITY_CODE 5
12/23/2022 07:32:39 AM script INFO: SUCCESS!@#KODE 1!@#USER_ID 36!@#ACTIVITY_CODE 5
12/23/2022 07:32:42 AM script INFO: SUCCESS!@#KODE 1!@#USER_ID 36!@#ACTIVITY_CODE 1
12/23/2022 07:32:42 AM script INFO: SUCCESS!@#KODE 1!@#USER_ID 36!@#ACTIVITY_CODE 4
12/23/2022 07:32:42 AM script INFO: SUCCESS!@#KODE 1!@#USER_ID 36!@#ACTIVITY_CODE 3
12/23/2022 07:32:42 AM script INFO: SUCCESS!@#KODE 1!@#USER_ID 36!@#ACTIVITY_CODE 1
12/23/2022 07:32:43 AM script INFO: SUCCESS!@#KODE 1!@#USER_ID 36!@#ACTIVITY_CODE 4
12/23/2022 07:32:43 AM script INFO: SUCCESS!@#KODE 1!@#USER_ID 36!@#ACTIVITY_CODE 1
12/23/2022 07:32:43 AM script INFO: SUCCESS!@#KODE 1!@#USER_ID 36!@#ACTIVITY_CODE 2
12/23/2022 07:32:44 AM script INFO: SUCCESS!@#KODE 1!@#USER_ID 36!@#ACTIVITY_CODE 2
12/23/2022 07:32:44 AM script INFO: SUCCESS!@#KODE 1!@#USER_ID 36!@#ACTIVITY_CODE 1
12/23/2022 07:32:44 AM script INFO: SUCCESS!@#KODE 1!@#USER_ID 36!@#ACTIVITY_CODE 3
12/23/2022 07:32:44 AM script INFO: SUCCESS!@#KODE 1!@#USER_ID 36!@#ACTIVITY_CODE 5
12/23/2022 07:32:44 AM script INFO: SUCCESS!@#KODE 1!@#USER_ID 36!@#ACTIVITY_CODE 5
12/23/2022 07:32:47 AM script INFO: SUCCESS!@#KODE 1!@#USER_ID 36!@#ACTIVITY_CODE 3
12/23/2022 07:32:47 AM script INFO: SUCCESS!@#KODE 1!@#USER_ID 36!@#ACTIVITY_CODE 1
12/23/2022 07:32:47 AM script INFO: SUCCESS!@#KODE 1!@#USER_ID 36!@#ACTIVITY_CODE 2
12/23/2022 07:32:48 AM script INFO: SUCCESS!@#KODE 1!@#USER_ID 36!@#ACTIVITY_CODE 1
12/23/2022 07:32:48 AM script INFO: SUCCESS!@#KODE 1!@#USER_ID 36!@#ACTIVITY_CODE 5
12/23/2022 07:32:48 AM script INFO: SUCCESS!@#KODE 1!@#USER_ID 36!@#ACTIVITY_CODE 5
12/23/2022 07:32:50 AM script INFO: SUCCESS!@#KODE 1!@#USER_ID 36!@#ACTIVITY_CODE 3
12/23/2022 07:32:50 AM script INFO: SUCCESS!@#KODE 1!@#USER_ID 36!@#ACTIVITY_CODE 5
12/23/2022 07:32:50 AM script INFO: SUCCESS!@#KODE 1!@#USER_ID 36!@#ACTIVITY_CODE 5
12/23/2022 07:32:53 AM script INFO: SUCCESS!@#KODE 1!@#USER_ID 36!@#ACTIVITY_CODE 5
12/23/2022 07:32:53 AM script INFO: SUCCESS!@#KODE 1!@#USER_ID 36!@#ACTIVITY_CODE 5
12/23/2022 07:32:55 AM script INFO: SUCCESS!@#KODE 1!@#USER_ID 36!@#ACTIVITY_CODE 5
12/23/2022 07:32:55 AM script INFO: SUCCESS!@#KODE 1!@#USER_ID 36!@#ACTIVITY_CODE 5
12/23/2022 07:32:58 AM script INFO: SUCCESS!@#KODE 1!@#USER_ID 36!@#ACTIVITY_CODE 4
12/23/2022 07:32:59 AM script INFO: SUCCESS!@#KODE 1!@#USER_ID 36!@#ACTIVITY_CODE 2
12/23/2022 07:32:59 AM script INFO: SUCCESS!@#KODE 1!@#USER_ID 36!@#ACTIVITY_CODE 2
12/23/2022 07:32:59 AM script INFO: SUCCESS!@#KODE 1!@#USER_ID 36!@#ACTIVITY_CODE 5
12/23/2022 07:32:59 AM script INFO: SUCCESS!@#KODE 1!@#USER_ID 36!@#ACTIVITY_CODE 5
12/23/2022 07:33:02 AM script INFO: SUCCESS!@#KODE 1!@#USER_ID 36!@#ACTIVITY_CODE 2
12/23/2022 07:33:03 AM script INFO: SUCCESS!@#KODE 1!@#USER_ID 36!@#ACTIVITY_CODE 2
12/23/2022 07:33:03 AM script INFO: SUCCESS!@#KODE 1!@#USER_ID 36!@#ACTIVITY_CODE 1
12/23/2022 07:33:03 AM script INFO: SUCCESS!@#KODE 1!@#USER_ID 36!@#ACTIVITY_CODE 5
12/23/2022 07:33:03 AM script INFO: SUCCESS!@#KODE 1!@#USER_ID 36!@#ACTIVITY_CODE 5
12/23/2022 07:33:06 AM script INFO: SUCCESS!@#KODE 1!@#USER_ID 36!@#ACTIVITY_CODE 4
12/23/2022 07:33:06 AM script INFO: SUCCESS!@#KODE 1!@#USER_ID 36!@#ACTIVITY_CODE 3
12/23/2022 07:33:06 AM script INFO: SUCCESS!@#KODE 1!@#USER_ID 36!@#ACTIVITY_CODE 1
12/23/2022 07:33:06 AM script INFO: SUCCESS!@#KODE 1!@#USER_ID 36!@#ACTIVITY_CODE 1
12/23/2022 07:33:06 AM script INFO: SUCCESS!@#KODE 1!@#USER_ID 36!@#ACTIVITY_CODE 3
12/23/2022 07:33:06 AM script INFO: SUCCESS!@#KODE 1!@#USER_ID 36!@#ACTIVITY_CODE 5
12/23/2022 07:33:06 AM script INFO: SUCCESS!@#KODE 1!@#USER_ID 36!@#ACTIVITY_CODE 5
12/23/2022 07:33:09 AM script INFO: SUCCESS!@#KODE 1!@#USER_ID 36!@#ACTIVITY_CODE 5
12/23/2022 07:33:09 AM script INFO: SUCCESS!@#KODE 1!@#USER_ID 36!@#ACTIVITY_CODE 5
12/23/2022 07:33:12 AM script INFO: SUCCESS!@#KODE 1!@#USER_ID 36!@#ACTIVITY_CODE 3
12/23/2022 07:33:12 AM script INFO: SUCCESS!@#KODE 1!@#USER_ID 36!@#ACTIVITY_CODE 1
12/23/2022 07:33:12 AM script INFO: SUCCESS!@#KODE 1!@#USER_ID 36!@#ACTIVITY_CODE 1
12/23/2022 07:33:12 AM script INFO: SUCCESS!@#KODE 1!@#USER_ID 36!@#ACTIVITY_CODE 3
12/23/2022 07:33:12 AM script INFO: SUCCESS!@#KODE 1!@#USER_ID 36!@#ACTIVITY_CODE 1
12/23/2022 07:33:12 AM script INFO: SUCCESS!@#KODE 1!@#USER_ID 36!@#ACTIVITY_CODE 3
12/23/2022 07:33:13 AM script INFO: SUCCESS!@#KODE 1!@#USER_ID 36!@#ACTIVITY_CODE 2
12/23/2022 07:33:13 AM script INFO: SUCCESS!@#KODE 1!@#USER_ID 36!@#ACTIVITY_CODE 1
12/23/2022 07:33:13 AM script INFO: SUCCESS!@#KODE 1!@#USER_ID 36!@#ACTIVITY_CODE 1
12/23/2022 07:33:13 AM script INFO: SUCCESS!@#KODE 1!@#USER_ID 36!@#ACTIVITY_CODE 1
12/23/2022 07:33:13 AM script INFO: SUCCESS!@#KODE 1!@#USER_ID 36!@#ACTIVITY_CODE 1
12/23/2022 07:33:14 AM script INFO: SUCCESS!@#KODE 1!@#USER_ID 36!@#ACTIVITY_CODE 1
12/23/2022 07:33:14 AM script INFO: SUCCESS!@#KODE 1!@#USER_ID 36!@#ACTIVITY_CODE 2
12/23/2022 07:33:14 AM script INFO: SUCCESS!@#KODE 1!@#USER_ID 36!@#ACTIVITY_CODE 4
12/23/2022 07:33:14 AM script INFO: SUCCESS!@#KODE 1!@#USER_ID 36!@#ACTIVITY_CODE 3
12/23/2022 07:33:15 AM script INFO: SUCCESS!@#KODE 1!@#USER_ID 36!@#ACTIVITY_CODE 1
12/23/2022 07:33:15 AM script INFO: SUCCESS!@#KODE 1!@#USER_ID 36!@#ACTIVITY_CODE 2
12/23/2022 07:33:15 AM script INFO: SUCCESS!@#KODE 1!@#USER_ID 36!@#ACTIVITY_CODE 1
12/23/2022 07:33:15 AM script INFO: SUCCESS!@#KODE 1!@#USER_ID 36!@#ACTIVITY_CODE 1
12/23/2022 07:33:15 AM script INFO: SUCCESS!@#KODE 1!@#USER_ID 36!@#ACTIVITY_CODE 3
12/23/2022 07:33:16 AM script INFO: SUCCESS!@#KODE 1!@#USER_ID 36!@#ACTIVITY_CODE 1
12/23/2022 07:33:16 AM script INFO: SUCCESS!@#KODE 1!@#USER_ID 36!@#ACTIVITY_CODE 3
12/23/2022 07:33:16 AM script INFO: SUCCESS!@#KODE 1!@#USER_ID 36!@#ACTIVITY_CODE 4
12/23/2022 07:33:16 AM script INFO: SUCCESS!@#KODE 1!@#USER_ID 36!@#ACTIVITY_CODE 2
12/23/2022 07:33:17 AM script INFO: SUCCESS!@#KODE 1!@#USER_ID 36!@#ACTIVITY_CODE 3
12/23/2022 07:33:17 AM script INFO: SUCCESS!@#KODE 1!@#USER_ID 36!@#ACTIVITY_CODE 4
12/23/2022 07:33:17 AM script INFO: SUCCESS!@#KODE 1!@#USER_ID 36!@#ACTIVITY_CODE 2
12/23/2022 07:33:17 AM script INFO: SUCCESS!@#KODE 1!@#USER_ID 36!@#ACTIVITY_CODE 3
12/23/2022 07:33:17 AM script INFO: SUCCESS!@#KODE 1!@#USER_ID 36!@#ACTIVITY_CODE 1
12/23/2022 07:33:18 AM script INFO: SUCCESS!@#KODE 1!@#USER_ID 36!@#ACTIVITY_CODE 1
12/23/2022 07:33:18 AM script INFO: SUCCESS!@#KODE 1!@#USER_ID 36!@#ACTIVITY_CODE 1
12/23/2022 07:33:18 AM script INFO: SUCCESS!@#KODE 1!@#USER_ID 36!@#ACTIVITY_CODE 4
12/23/2022 07:33:18 AM script INFO: SUCCESS!@#KODE 1!@#USER_ID 36!@#ACTIVITY_CODE 2
12/23/2022 07:33:19 AM script INFO: SUCCESS!@#KODE 1!@#USER_ID 36!@#ACTIVITY_CODE 2
12/23/2022 07:33:19 AM script INFO: SUCCESS!@#KODE 1!@#USER_ID 36!@#ACTIVITY_CODE 1
12/23/2022 07:33:19 AM script INFO: SUCCESS!@#KODE 1!@#USER_ID 36!@#ACTIVITY_CODE 4
12/23/2022 07:33:19 AM script INFO: SUCCESS!@#KODE 1!@#USER_ID 36!@#ACTIVITY_CODE 2
12/23/2022 07:33:20 AM script INFO: SUCCESS!@#KODE 1!@#USER_ID 36!@#ACTIVITY_CODE 2
12/23/2022 07:33:20 AM script INFO: SUCCESS!@#KODE 1!@#USER_ID 36!@#ACTIVITY_CODE 3
12/23/2022 07:33:20 AM script INFO: SUCCESS!@#KODE 1!@#USER_ID 36!@#ACTIVITY_CODE 1
12/23/2022 07:33:20 AM script INFO: SUCCESS!@#KODE 1!@#USER_ID 36!@#ACTIVITY_CODE 1
12/23/2022 07:33:20 AM script INFO: SUCCESS!@#KODE 1!@#USER_ID 36!@#ACTIVITY_CODE 3
12/23/2022 07:33:20 AM script INFO: SUCCESS!@#KODE 1!@#USER_ID 36!@#ACTIVITY_CODE 1
12/23/2022 07:33:21 AM script INFO: SUCCESS!@#KODE 1!@#USER_ID 36!@#ACTIVITY_CODE 2
12/23/2022 07:33:21 AM script INFO: SUCCESS!@#KODE 1!@#USER_ID 36!@#ACTIVITY_CODE 3
12/23/2022 07:33:21 AM script INFO: SUCCESS!@#KODE 1!@#USER_ID 36!@#ACTIVITY_CODE 3
12/23/2022 07:33:21 AM script INFO: SUCCESS!@#KODE 1!@#USER_ID 36!@#ACTIVITY_CODE 1
12/23/2022 07:33:21 AM script INFO: SUCCESS!@#KODE 1!@#USER_ID 36!@#ACTIVITY_CODE 1
12/23/2022 07:33:21 AM script INFO: SUCCESS!@#KODE 1!@#USER_ID 36!@#ACTIVITY_CODE 3
12/23/2022 07:33:22 AM script INFO: SUCCESS!@#KODE 1!@#USER_ID 36!@#ACTIVITY_CODE 2
12/23/2022 07:33:22 AM script INFO: SUCCESS!@#KODE 1!@#USER_ID 36!@#ACTIVITY_CODE 2
12/23/2022 07:33:22 AM script INFO: SUCCESS!@#KODE 1!@#USER_ID 36!@#ACTIVITY_CODE 2
12/23/2022 07:33:22 AM script INFO: SUCCESS!@#KODE 1!@#USER_ID 36!@#ACTIVITY_CODE 1
12/23/2022 07:33:23 AM script INFO: SUCCESS!@#KODE 1!@#USER_ID 36!@#ACTIVITY_CODE 2
12/23/2022 07:33:23 AM script INFO: SUCCESS!@#KODE 1!@#USER_ID 36!@#ACTIVITY_CODE 1
12/23/2022 07:33:23 AM script INFO: SUCCESS!@#KODE 1!@#USER_ID 36!@#ACTIVITY_CODE 2
12/23/2022 07:33:23 AM script INFO: SUCCESS!@#KODE 1!@#USER_ID 36!@#ACTIVITY_CODE 2
12/23/2022 07:33:23 AM script INFO: SUCCESS!@#KODE 1!@#USER_ID 36!@#ACTIVITY_CODE 4
12/23/2022 07:33:24 AM script INFO: SUCCESS!@#KODE 1!@#USER_ID 36!@#ACTIVITY_CODE 2
12/23/2022 07:33:24 AM script INFO: SUCCESS!@#KODE 1!@#USER_ID 36!@#ACTIVITY_CODE 1
12/23/2022 07:33:24 AM script INFO: SUCCESS!@#KODE 1!@#USER_ID 36!@#ACTIVITY_CODE 4
12/23/2022 07:33:24 AM script INFO: SUCCESS!@#KODE 1!@#USER_ID 36!@#ACTIVITY_CODE 2
12/23/2022 07:33:25 AM script INFO: SUCCESS!@#KODE 1!@#USER_ID 36!@#ACTIVITY_CODE 1
12/23/2022 07:33:25 AM script INFO: SUCCESS!@#KODE 1!@#USER_ID 36!@#ACTIVITY_CODE 3
12/23/2022 07:33:25 AM script INFO: SUCCESS!@#KODE 1!@#USER_ID 36!@#ACTIVITY_CODE 3
12/23/2022 07:33:25 AM script INFO: SUCCESS!@#KODE 1!@#USER_ID 36!@#ACTIVITY_CODE 3
12/23/2022 07:33:25 AM script INFO: SUCCESS!@#KODE 1!@#USER_ID 36!@#ACTIVITY_CODE 1
12/23/2022 07:33:25 AM script INFO: SUCCESS!@#KODE 1!@#USER_ID 36!@#ACTIVITY_CODE 3
12/23/2022 07:33:25 AM script INFO: SUCCESS!@#KODE 1!@#USER_ID 36!@#ACTIVITY_CODE 3
12/23/2022 07:33:25 AM script INFO: SUCCESS!@#KODE 1!@#USER_ID 36!@#ACTIVITY_CODE 1
12/23/2022 07:33:26 AM script INFO: SUCCESS!@#KODE 1!@#USER_ID 36!@#ACTIVITY_CODE 3
12/23/2022 07:33:26 AM script INFO: SUCCESS!@#KODE 1!@#USER_ID 36!@#ACTIVITY_CODE 1
12/23/2022 07:33:26 AM script INFO: SUCCESS!@#KODE 1!@#USER_ID 36!@#ACTIVITY_CODE 1
12/23/2022 07:33:26 AM script INFO: SUCCESS!@#KODE 1!@#USER_ID 36!@#ACTIVITY_CODE 1
12/23/2022 07:33:26 AM script INFO: SUCCESS!@#KODE 1!@#USER_ID 36!@#ACTIVITY_CODE 4
12/23/2022 07:33:26 AM script INFO: SUCCESS!@#KODE 1!@#USER_ID 36!@#ACTIVITY_CODE 1
12/23/2022 07:33:26 AM script INFO: SUCCESS!@#KODE 1!@#USER_ID 36!@#ACTIVITY_CODE 3
12/23/2022 07:33:26 AM script INFO: SUCCESS!@#KODE 1!@#USER_ID 36!@#ACTIVITY_CODE 2
12/23/2022 07:33:27 AM script INFO: SUCCESS!@#KODE 1!@#USER_ID 36!@#ACTIVITY_CODE 2
12/23/2022 07:33:27 AM script INFO: SUCCESS!@#KODE 1!@#USER_ID 36!@#ACTIVITY_CODE 2
12/23/2022 07:33:27 AM script INFO: SUCCESS!@#KODE 1!@#USER_ID 36!@#ACTIVITY_CODE 2
12/23/2022 07:33:27 AM script INFO: SUCCESS!@#KODE 1!@#USER_ID 36!@#ACTIVITY_CODE 1
12/23/2022 07:33:28 AM script INFO: SUCCESS!@#KODE 1!@#USER_ID 36!@#ACTIVITY_CODE 2
12/23/2022 07:33:28 AM script INFO: SUCCESS!@#KODE 1!@#USER_ID 36!@#ACTIVITY_CODE 1
12/23/2022 07:33:28 AM script INFO: SUCCESS!@#KODE 1!@#USER_ID 36!@#ACTIVITY_CODE 2
12/23/2022 07:33:28 AM script INFO: SUCCESS!@#KODE 1!@#USER_ID 36!@#ACTIVITY_CODE 3
12/23/2022 07:33:28 AM script INFO: SUCCESS!@#KODE 1!@#USER_ID 36!@#ACTIVITY_CODE 3
12/23/2022 07:33:28 AM script INFO: SUCCESS!@#KODE 1!@#USER_ID 36!@#ACTIVITY_CODE 4
12/23/2022 07:33:29 AM script INFO: SUCCESS!@#KODE 1!@#USER_ID 36!@#ACTIVITY_CODE 2
12/23/2022 07:33:29 AM script INFO: SUCCESS!@#KODE 1!@#USER_ID 36!@#ACTIVITY_CODE 2
12/23/2022 07:33:29 AM script INFO: SUCCESS!@#KODE 1!@#USER_ID 36!@#ACTIVITY_CODE 2
12/23/2022 07:33:30 AM script INFO: SUCCESS!@#KODE 1!@#USER_ID 36!@#ACTIVITY_CODE 2
12/23/2022 07:33:30 AM script INFO: SUCCESS!@#KODE 1!@#USER_ID 36!@#ACTIVITY_CODE 1
12/23/2022 07:33:30 AM script INFO: SUCCESS!@#KODE 1!@#USER_ID 36!@#ACTIVITY_CODE 1
12/23/2022 07:33:30 AM script INFO: SUCCESS!@#KODE 1!@#USER_ID 36!@#ACTIVITY_CODE 3
12/23/2022 07:33:30 AM script INFO: SUCCESS!@#KODE 1!@#USER_ID 36!@#ACTIVITY_CODE 4
12/23/2022 07:33:30 AM script INFO: SUCCESS!@#KODE 1!@#USER_ID 36!@#ACTIVITY_CODE 3
12/23/2022 07:33:30 AM script INFO: SUCCESS!@#KODE 1!@#USER_ID 36!@#ACTIVITY_CODE 2
12/23/2022 07:33:30 AM script INFO: SUCCESS!@#KODE 1!@#USER_ID 36!@#ACTIVITY_CODE 1
12/23/2022 07:33:31 AM script INFO: SUCCESS!@#KODE 1!@#USER_ID 36!@#ACTIVITY_CODE 2
12/23/2022 07:33:31 AM script INFO: SUCCESS!@#KODE 1!@#USER_ID 36!@#ACTIVITY_CODE 2
12/23/2022 07:33:31 AM script INFO: SUCCESS!@#KODE 1!@#USER_ID 36!@#ACTIVITY_CODE 2
12/23/2022 07:33:31 AM script INFO: SUCCESS!@#KODE 1!@#USER_ID 36!@#ACTIVITY_CODE 1
12/23/2022 07:33:31 AM script INFO: SUCCESS!@#KODE 1!@#USER_ID 36!@#ACTIVITY_CODE 4
12/23/2022 07:33:32 AM script INFO: SUCCESS!@#KODE 1!@#USER_ID 36!@#ACTIVITY_CODE 2
12/23/2022 07:33:32 AM script INFO: SUCCESS!@#KODE 1!@#USER_ID 36!@#ACTIVITY_CODE 1
12/23/2022 07:33:32 AM script INFO: SUCCESS!@#KODE 1!@#USER_ID 36!@#ACTIVITY_CODE 2
12/23/2022 07:33:32 AM script INFO: SUCCESS!@#KODE 1!@#USER_ID 36!@#ACTIVITY_CODE 2
12/23/2022 07:33:32 AM script INFO: SUCCESS!@#KODE 1!@#USER_ID 36!@#ACTIVITY_CODE 2
12/23/2022 07:33:33 AM script INFO: SUCCESS!@#KODE 1!@#USER_ID 36!@#ACTIVITY_CODE 1
12/23/2022 07:33:33 AM script INFO: SUCCESS!@#KODE 1!@#USER_ID 36!@#ACTIVITY_CODE 4
12/23/2022 07:33:33 AM script INFO: SUCCESS!@#KODE 1!@#USER_ID 36!@#ACTIVITY_CODE 2
12/23/2022 07:33:33 AM script INFO: SUCCESS!@#KODE 1!@#USER_ID 36!@#ACTIVITY_CODE 3
12/23/2022 07:33:33 AM script INFO: SUCCESS!@#KODE 1!@#USER_ID 36!@#ACTIVITY_CODE 2
12/23/2022 07:33:33 AM script INFO: SUCCESS!@#KODE 1!@#USER_ID 36!@#ACTIVITY_CODE 1
12/23/2022 07:33:33 AM script INFO: SUCCESS!@#KODE 1!@#USER_ID 36!@#ACTIVITY_CODE 4
12/23/2022 07:33:33 AM script INFO: SUCCESS!@#KODE 1!@#USER_ID 36!@#ACTIVITY_CODE 1
12/23/2022 07:33:34 AM script INFO: SUCCESS!@#KODE 1!@#USER_ID 36!@#ACTIVITY_CODE 4
12/23/2022 07:33:34 AM script INFO: SUCCESS!@#KODE 1!@#USER_ID 36!@#ACTIVITY_CODE 3
12/23/2022 07:33:34 AM script INFO: SUCCESS!@#KODE 1!@#USER_ID 36!@#ACTIVITY_CODE 3
12/23/2022 07:33:34 AM script INFO: SUCCESS!@#KODE 1!@#USER_ID 36!@#ACTIVITY_CODE 3
12/23/2022 07:33:34 AM script INFO: SUCCESS!@#KODE 1!@#USER_ID 36!@#ACTIVITY_CODE 2
12/23/2022 07:33:34 AM script INFO: SUCCESS!@#KODE 1!@#USER_ID 36!@#ACTIVITY_CODE 1
12/23/2022 07:33:34 AM script INFO: SUCCESS!@#KODE 1!@#USER_ID 36!@#ACTIVITY_CODE 1
12/23/2022 07:33:34 AM script INFO: SUCCESS!@#KODE 1!@#USER_ID 36!@#ACTIVITY_CODE 1
12/23/2022 07:33:34 AM script INFO: SUCCESS!@#KODE 1!@#USER_ID 36!@#ACTIVITY_CODE 3
12/23/2022 07:33:34 AM script INFO: SUCCESS!@#KODE 1!@#USER_ID 36!@#ACTIVITY_CODE 2
12/23/2022 07:33:35 AM script INFO: SUCCESS!@#KODE 1!@#USER_ID 36!@#ACTIVITY_CODE 1
12/23/2022 07:33:35 AM script INFO: SUCCESS!@#KODE 1!@#USER_ID 36!@#ACTIVITY_CODE 4
12/23/2022 07:33:35 AM script INFO: SUCCESS!@#KODE 1!@#USER_ID 36!@#ACTIVITY_CODE 3
12/23/2022 07:33:35 AM script INFO: SUCCESS!@#KODE 1!@#USER_ID 36!@#ACTIVITY_CODE 1
12/23/2022 07:33:35 AM script INFO: SUCCESS!@#KODE 1!@#USER_ID 36!@#ACTIVITY_CODE 4
12/23/2022 07:33:35 AM script INFO: SUCCESS!@#KODE 1!@#USER_ID 36!@#ACTIVITY_CODE 2
12/23/2022 07:33:35 AM script INFO: SUCCESS!@#KODE 1!@#USER_ID 36!@#ACTIVITY_CODE 3
12/23/2022 07:33:36 AM script INFO: SUCCESS!@#KODE 1!@#USER_ID 36!@#ACTIVITY_CODE 2
12/23/2022 07:33:36 AM script INFO: SUCCESS!@#KODE 1!@#USER_ID 36!@#ACTIVITY_CODE 4
12/23/2022 07:33:36 AM script INFO: SUCCESS!@#KODE 1!@#USER_ID 36!@#ACTIVITY_CODE 3
12/23/2022 07:33:36 AM script INFO: SUCCESS!@#KODE 1!@#USER_ID 36!@#ACTIVITY_CODE 2
12/23/2022 07:33:36 AM script INFO: SUCCESS!@#KODE 1!@#USER_ID 36!@#ACTIVITY_CODE 1
12/23/2022 07:33:36 AM script INFO: SUCCESS!@#KODE 1!@#USER_ID 36!@#ACTIVITY_CODE 4
12/23/2022 07:33:36 AM script INFO: SUCCESS!@#KODE 1!@#USER_ID 36!@#ACTIVITY_CODE 1
12/23/2022 07:33:36 AM script INFO: SUCCESS!@#KODE 1!@#USER_ID 36!@#ACTIVITY_CODE 4
12/23/2022 07:33:37 AM script INFO: SUCCESS!@#KODE 1!@#USER_ID 36!@#ACTIVITY_CODE 2
12/23/2022 07:33:37 AM script INFO: SUCCESS!@#KODE 1!@#USER_ID 36!@#ACTIVITY_CODE 2
12/23/2022 07:33:37 AM script INFO: SUCCESS!@#KODE 1!@#USER_ID 36!@#ACTIVITY_CODE 1
12/23/2022 07:33:37 AM script INFO: SUCCESS!@#KODE 1!@#USER_ID 36!@#ACTIVITY_CODE 4
12/23/2022 07:33:37 AM script INFO: SUCCESS!@#KODE 1!@#USER_ID 36!@#ACTIVITY_CODE 2
12/23/2022 07:33:37 AM script INFO: SUCCESS!@#KODE 1!@#USER_ID 36!@#ACTIVITY_CODE 3
12/23/2022 07:33:37 AM script INFO: SUCCESS!@#KODE 1!@#USER_ID 36!@#ACTIVITY_CODE 1
12/23/2022 07:33:37 AM script INFO: SUCCESS!@#KODE 1!@#USER_ID 36!@#ACTIVITY_CODE 1
12/23/2022 07:33:37 AM script INFO: SUCCESS!@#KODE 1!@#USER_ID 36!@#ACTIVITY_CODE 4
12/23/2022 07:33:37 AM script INFO: SUCCESS!@#KODE 1!@#USER_ID 36!@#ACTIVITY_CODE 3
12/23/2022 07:33:37 AM script INFO: SUCCESS!@#KODE 1!@#USER_ID 36!@#ACTIVITY_CODE 3
12/23/2022 07:33:38 AM script INFO: SUCCESS!@#KODE 1!@#USER_ID 36!@#ACTIVITY_CODE 3
12/23/2022 07:33:38 AM script INFO: SUCCESS!@#KODE 1!@#USER_ID 36!@#ACTIVITY_CODE 2
12/23/2022 07:33:38 AM script INFO: SUCCESS!@#KODE 1!@#USER_ID 36!@#ACTIVITY_CODE 3
12/23/2022 07:33:38 AM script INFO: SUCCESS!@#KODE 1!@#USER_ID 36!@#ACTIVITY_CODE 1
12/23/2022 07:33:38 AM script INFO: SUCCESS!@#KODE 1!@#USER_ID 36!@#ACTIVITY_CODE 1
12/23/2022 07:33:38 AM script INFO: SUCCESS!@#KODE 1!@#USER_ID 36!@#ACTIVITY_CODE 2
12/23/2022 07:33:38 AM script INFO: SUCCESS!@#KODE 1!@#USER_ID 36!@#ACTIVITY_CODE 3
12/23/2022 07:33:38 AM script INFO: SUCCESS!@#KODE 1!@#USER_ID 36!@#ACTIVITY_CODE 2
12/23/2022 07:33:38 AM script INFO: SUCCESS!@#KODE 1!@#USER_ID 36!@#ACTIVITY_CODE 1
12/23/2022 07:33:39 AM script INFO: SUCCESS!@#KODE 1!@#USER_ID 36!@#ACTIVITY_CODE 4
12/23/2022 07:33:39 AM script INFO: SUCCESS!@#KODE 1!@#USER_ID 36!@#ACTIVITY_CODE 1
12/23/2022 07:33:39 AM script INFO: SUCCESS!@#KODE 1!@#USER_ID 36!@#ACTIVITY_CODE 2
12/23/2022 07:33:39 AM script INFO: SUCCESS!@#KODE 1!@#USER_ID 36!@#ACTIVITY_CODE 3
12/23/2022 07:33:39 AM script INFO: SUCCESS!@#KODE 1!@#USER_ID 36!@#ACTIVITY_CODE 2
12/23/2022 07:33:39 AM script INFO: SUCCESS!@#KODE 1!@#USER_ID 36!@#ACTIVITY_CODE 4
12/23/2022 07:33:39 AM script INFO: SUCCESS!@#KODE 1!@#USER_ID 36!@#ACTIVITY_CODE 3
12/23/2022 07:33:39 AM script INFO: SUCCESS!@#KODE 1!@#USER_ID 36!@#ACTIVITY_CODE 3
12/23/2022 07:33:39 AM script INFO: SUCCESS!@#KODE 1!@#USER_ID 36!@#ACTIVITY_CODE 2
12/23/2022 07:33:39 AM script INFO: SUCCESS!@#KODE 1!@#USER_ID 36!@#ACTIVITY_CODE 1
12/23/2022 07:33:40 AM script INFO: SUCCESS!@#KODE 1!@#USER_ID 36!@#ACTIVITY_CODE 1
12/23/2022 07:33:40 AM script INFO: SUCCESS!@#KODE 1!@#USER_ID 36!@#ACTIVITY_CODE 1
12/23/2022 07:33:40 AM script INFO: SUCCESS!@#KODE 1!@#USER_ID 36!@#ACTIVITY_CODE 1
12/23/2022 07:33:40 AM script INFO: SUCCESS!@#KODE 1!@#USER_ID 36!@#ACTIVITY_CODE 4
12/23/2022 07:33:40 AM script INFO: SUCCESS!@#KODE 1!@#USER_ID 36!@#ACTIVITY_CODE 1
12/23/2022 07:33:40 AM script INFO: SUCCESS!@#KODE 1!@#USER_ID 36!@#ACTIVITY_CODE 3
12/23/2022 07:33:40 AM script INFO: SUCCESS!@#KODE 1!@#USER_ID 36!@#ACTIVITY_CODE 4
12/23/2022 07:33:40 AM script INFO: SUCCESS!@#KODE 1!@#USER_ID 36!@#ACTIVITY_CODE 2
12/23/2022 07:33:40 AM script INFO: SUCCESS!@#KODE 1!@#USER_ID 36!@#ACTIVITY_CODE 3
12/23/2022 07:33:40 AM script INFO: SUCCESS!@#KODE 1!@#USER_ID 36!@#ACTIVITY_CODE 1
12/23/2022 07:33:40 AM script INFO: SUCCESS!@#KODE 1!@#USER_ID 36!@#ACTIVITY_CODE 3
12/23/2022 07:33:40 AM script INFO: SUCCESS!@#KODE 1!@#USER_ID 36!@#ACTIVITY_CODE 2
12/23/2022 07:33:40 AM script INFO: SUCCESS!@#KODE 1!@#USER_ID 36!@#ACTIVITY_CODE 4
12/23/2022 07:33:41 AM script INFO: SUCCESS!@#KODE 1!@#USER_ID 36!@#ACTIVITY_CODE 3
12/23/2022 07:33:41 AM script INFO: SUCCESS!@#KODE 1!@#USER_ID 36!@#ACTIVITY_CODE 2
12/23/2022 07:33:41 AM script INFO: SUCCESS!@#KODE 1!@#USER_ID 36!@#ACTIVITY_CODE 1
12/23/2022 07:33:41 AM script INFO: SUCCESS!@#KODE 1!@#USER_ID 36!@#ACTIVITY_CODE 2
12/23/2022 07:33:41 AM script INFO: SUCCESS!@#KODE 1!@#USER_ID 36!@#ACTIVITY_CODE 2
12/23/2022 07:33:41 AM script INFO: SUCCESS!@#KODE 1!@#USER_ID 36!@#ACTIVITY_CODE 3
12/23/2022 07:33:41 AM script INFO: SUCCESS!@#KODE 1!@#USER_ID 36!@#ACTIVITY_CODE 3
12/23/2022 07:33:41 AM script INFO: SUCCESS!@#KODE 1!@#USER_ID 36!@#ACTIVITY_CODE 2
12/23/2022 07:33:41 AM script INFO: SUCCESS!@#KODE 1!@#USER_ID 36!@#ACTIVITY_CODE 3
12/23/2022 07:33:42 AM script INFO: SUCCESS!@#KODE 1!@#USER_ID 36!@#ACTIVITY_CODE 1
12/23/2022 07:33:42 AM script INFO: SUCCESS!@#KODE 1!@#USER_ID 36!@#ACTIVITY_CODE 1
12/23/2022 07:33:42 AM script INFO: SUCCESS!@#KODE 1!@#USER_ID 36!@#ACTIVITY_CODE 3
12/23/2022 07:33:42 AM script INFO: SUCCESS!@#KODE 1!@#USER_ID 36!@#ACTIVITY_CODE 3
12/23/2022 07:33:42 AM script INFO: SUCCESS!@#KODE 1!@#USER_ID 36!@#ACTIVITY_CODE 3
12/23/2022 07:33:42 AM script INFO: SUCCESS!@#KODE 1!@#USER_ID 36!@#ACTIVITY_CODE 3
12/23/2022 07:33:42 AM script INFO: SUCCESS!@#KODE 1!@#USER_ID 36!@#ACTIVITY_CODE 3
12/23/2022 07:33:42 AM script INFO: SUCCESS!@#KODE 1!@#USER_ID 36!@#ACTIVITY_CODE 1
12/23/2022 07:33:42 AM script INFO: SUCCESS!@#KODE 1!@#USER_ID 36!@#ACTIVITY_CODE 1
12/23/2022 07:33:42 AM script INFO: SUCCESS!@#KODE 1!@#USER_ID 36!@#ACTIVITY_CODE 2
12/23/2022 07:33:42 AM script INFO: SUCCESS!@#KODE 1!@#USER_ID 36!@#ACTIVITY_CODE 3
12/23/2022 07:33:42 AM script INFO: SUCCESS!@#KODE 1!@#USER_ID 36!@#ACTIVITY_CODE 3
12/23/2022 07:33:42 AM script INFO: SUCCESS!@#KODE 1!@#USER_ID 36!@#ACTIVITY_CODE 3
12/23/2022 07:33:42 AM script INFO: SUCCESS!@#KODE 1!@#USER_ID 36!@#ACTIVITY_CODE 2
12/23/2022 07:33:43 AM script INFO: SUCCESS!@#KODE 1!@#USER_ID 36!@#ACTIVITY_CODE 4
12/23/2022 07:33:43 AM script INFO: SUCCESS!@#KODE 1!@#USER_ID 36!@#ACTIVITY_CODE 3
12/23/2022 07:33:43 AM script INFO: SUCCESS!@#KODE 1!@#USER_ID 36!@#ACTIVITY_CODE 3
12/23/2022 07:33:43 AM script INFO: SUCCESS!@#KODE 1!@#USER_ID 36!@#ACTIVITY_CODE 1
12/23/2022 07:33:43 AM script INFO: SUCCESS!@#KODE 1!@#USER_ID 36!@#ACTIVITY_CODE 3
12/23/2022 07:33:43 AM script INFO: SUCCESS!@#KODE 1!@#USER_ID 36!@#ACTIVITY_CODE 3
12/23/2022 07:33:43 AM script INFO: SUCCESS!@#KODE 1!@#USER_ID 36!@#ACTIVITY_CODE 4
12/23/2022 07:33:43 AM script INFO: SUCCESS!@#KODE 1!@#USER_ID 36!@#ACTIVITY_CODE 2
12/23/2022 07:33:43 AM script INFO: SUCCESS!@#KODE 1!@#USER_ID 36!@#ACTIVITY_CODE 1
12/23/2022 07:33:43 AM script INFO: SUCCESS!@#KODE 1!@#USER_ID 36!@#ACTIVITY_CODE 2
12/23/2022 07:33:43 AM script INFO: SUCCESS!@#KODE 1!@#USER_ID 36!@#ACTIVITY_CODE 2
12/23/2022 07:33:43 AM script INFO: SUCCESS!@#KODE 1!@#USER_ID 36!@#ACTIVITY_CODE 4
12/23/2022 07:33:44 AM script INFO: SUCCESS!@#KODE 1!@#USER_ID 36!@#ACTIVITY_CODE 1
12/23/2022 07:33:44 AM script INFO: SUCCESS!@#KODE 1!@#USER_ID 36!@#ACTIVITY_CODE 3
12/23/2022 07:33:44 AM script INFO: SUCCESS!@#KODE 1!@#USER_ID 36!@#ACTIVITY_CODE 3
12/23/2022 07:33:44 AM script INFO: SUCCESS!@#KODE 1!@#USER_ID 36!@#ACTIVITY_CODE 1
12/23/2022 07:33:44 AM script INFO: SUCCESS!@#KODE 1!@#USER_ID 36!@#ACTIVITY_CODE 4
12/23/2022 07:33:44 AM script INFO: SUCCESS!@#KODE 1!@#USER_ID 36!@#ACTIVITY_CODE 1
12/23/2022 07:33:44 AM script INFO: SUCCESS!@#KODE 1!@#USER_ID 36!@#ACTIVITY_CODE 4
12/23/2022 07:33:44 AM script INFO: SUCCESS!@#KODE 1!@#USER_ID 36!@#ACTIVITY_CODE 2
12/23/2022 07:33:44 AM script INFO: SUCCESS!@#KODE 1!@#USER_ID 36!@#ACTIVITY_CODE 2
12/23/2022 07:33:44 AM script INFO: SUCCESS!@#KODE 1!@#USER_ID 36!@#ACTIVITY_CODE 2
12/23/2022 07:33:44 AM script INFO: SUCCESS!@#KODE 1!@#USER_ID 36!@#ACTIVITY_CODE 2
12/23/2022 07:33:45 AM script INFO: SUCCESS!@#KODE 1!@#USER_ID 36!@#ACTIVITY_CODE 1
12/23/2022 07:33:45 AM script INFO: SUCCESS!@#KODE 1!@#USER_ID 36!@#ACTIVITY_CODE 3
12/23/2022 07:33:45 AM script INFO: SUCCESS!@#KODE 1!@#USER_ID 36!@#ACTIVITY_CODE 1
12/23/2022 07:33:45 AM script INFO: SUCCESS!@#KODE 1!@#USER_ID 36!@#ACTIVITY_CODE 2
12/23/2022 07:33:45 AM script INFO: SUCCESS!@#KODE 1!@#USER_ID 36!@#ACTIVITY_CODE 3
12/23/2022 07:33:45 AM script INFO: SUCCESS!@#KODE 1!@#USER_ID 36!@#ACTIVITY_CODE 3
12/23/2022 07:33:45 AM script INFO: SUCCESS!@#KODE 1!@#USER_ID 36!@#ACTIVITY_CODE 1
12/23/2022 07:33:45 AM script INFO: SUCCESS!@#KODE 1!@#USER_ID 36!@#ACTIVITY_CODE 1
12/23/2022 07:33:45 AM script INFO: SUCCESS!@#KODE 1!@#USER_ID 36!@#ACTIVITY_CODE 3
12/23/2022 07:33:45 AM script INFO: SUCCESS!@#KODE 1!@#USER_ID 36!@#ACTIVITY_CODE 2
12/23/2022 07:33:45 AM script INFO: SUCCESS!@#KODE 1!@#USER_ID 36!@#ACTIVITY_CODE 3
12/23/2022 07:33:45 AM script INFO: SUCCESS!@#KODE 1!@#USER_ID 36!@#ACTIVITY_CODE 3
12/23/2022 07:33:45 AM script INFO: SUCCESS!@#KODE 1!@#USER_ID 36!@#ACTIVITY_CODE 2
12/23/2022 07:33:46 AM script INFO: SUCCESS!@#KODE 1!@#USER_ID 36!@#ACTIVITY_CODE 2
12/23/2022 07:33:46 AM script INFO: SUCCESS!@#KODE 1!@#USER_ID 36!@#ACTIVITY_CODE 2
12/23/2022 07:33:46 AM script INFO: SUCCESS!@#KODE 1!@#USER_ID 36!@#ACTIVITY_CODE 1
12/23/2022 07:33:46 AM script INFO: SUCCESS!@#KODE 1!@#USER_ID 36!@#ACTIVITY_CODE 2
12/23/2022 07:33:46 AM script INFO: SUCCESS!@#KODE 1!@#USER_ID 36!@#ACTIVITY_CODE 2
12/23/2022 07:33:46 AM script INFO: SUCCESS!@#KODE 1!@#USER_ID 36!@#ACTIVITY_CODE 4
12/23/2022 07:33:46 AM script INFO: SUCCESS!@#KODE 1!@#USER_ID 36!@#ACTIVITY_CODE 2
12/23/2022 07:33:46 AM script INFO: SUCCESS!@#KODE 1!@#USER_ID 36!@#ACTIVITY_CODE 2
12/23/2022 07:33:47 AM script INFO: SUCCESS!@#KODE 1!@#USER_ID 36!@#ACTIVITY_CODE 2
12/23/2022 07:33:47 AM script INFO: SUCCESS!@#KODE 1!@#USER_ID 36!@#ACTIVITY_CODE 2
12/23/2022 07:33:47 AM script INFO: SUCCESS!@#KODE 1!@#USER_ID 36!@#ACTIVITY_CODE 1
12/23/2022 07:33:47 AM script INFO: SUCCESS!@#KODE 1!@#USER_ID 36!@#ACTIVITY_CODE 2
12/23/2022 07:33:47 AM script INFO: SUCCESS!@#KODE 1!@#USER_ID 36!@#ACTIVITY_CODE 2
12/23/2022 07:33:47 AM script INFO: SUCCESS!@#KODE 1!@#USER_ID 36!@#ACTIVITY_CODE 1
12/23/2022 07:33:47 AM script INFO: SUCCESS!@#KODE 1!@#USER_ID 36!@#ACTIVITY_CODE 2
12/23/2022 07:33:47 AM script INFO: SUCCESS!@#KODE 1!@#USER_ID 36!@#ACTIVITY_CODE 1
12/23/2022 07:33:47 AM script INFO: SUCCESS!@#KODE 1!@#USER_ID 36!@#ACTIVITY_CODE 2
12/23/2022 07:33:47 AM script INFO: SUCCESS!@#KODE 1!@#USER_ID 36!@#ACTIVITY_CODE 3
12/23/2022 07:33:47 AM script INFO: SUCCESS!@#KODE 1!@#USER_ID 36!@#ACTIVITY_CODE 3
12/23/2022 07:33:48 AM script INFO: SUCCESS!@#KODE 1!@#USER_ID 36!@#ACTIVITY_CODE 4
12/23/2022 07:33:48 AM script INFO: SUCCESS!@#KODE 1!@#USER_ID 36!@#ACTIVITY_CODE 1
12/23/2022 07:33:48 AM script INFO: SUCCESS!@#KODE 1!@#USER_ID 36!@#ACTIVITY_CODE 4
12/23/2022 07:33:48 AM script INFO: SUCCESS!@#KODE 1!@#USER_ID 36!@#ACTIVITY_CODE 3
12/23/2022 07:33:48 AM script INFO: SUCCESS!@#KODE 1!@#USER_ID 36!@#ACTIVITY_CODE 3
12/23/2022 07:33:48 AM script INFO: SUCCESS!@#KODE 1!@#USER_ID 36!@#ACTIVITY_CODE 1
12/23/2022 07:33:48 AM script INFO: SUCCESS!@#KODE 1!@#USER_ID 36!@#ACTIVITY_CODE 3
12/23/2022 07:33:48 AM script INFO: SUCCESS!@#KODE 1!@#USER_ID 36!@#ACTIVITY_CODE 2
12/23/2022 07:33:48 AM script INFO: SUCCESS!@#KODE 1!@#USER_ID 36!@#ACTIVITY_CODE 1
12/23/2022 07:33:48 AM script INFO: SUCCESS!@#KODE 1!@#USER_ID 36!@#ACTIVITY_CODE 3
12/23/2022 07:33:48 AM script INFO: SUCCESS!@#KODE 1!@#USER_ID 36!@#ACTIVITY_CODE 1
12/23/2022 07:33:48 AM script INFO: SUCCESS!@#KODE 1!@#USER_ID 36!@#ACTIVITY_CODE 1
12/23/2022 07:33:48 AM script INFO: SUCCESS!@#KODE 1!@#USER_ID 36!@#ACTIVITY_CODE 2
12/23/2022 07:33:48 AM script INFO: SUCCESS!@#KODE 1!@#USER_ID 36!@#ACTIVITY_CODE 4
12/23/2022 07:33:49 AM script INFO: SUCCESS!@#KODE 1!@#USER_ID 36!@#ACTIVITY_CODE 1
12/23/2022 07:33:49 AM script INFO: SUCCESS!@#KODE 1!@#USER_ID 36!@#ACTIVITY_CODE 1
12/23/2022 07:33:49 AM script INFO: SUCCESS!@#KODE 1!@#USER_ID 36!@#ACTIVITY_CODE 2
12/23/2022 07:33:49 AM script INFO: SUCCESS!@#KODE 1!@#USER_ID 36!@#ACTIVITY_CODE 1
12/23/2022 07:33:49 AM script INFO: SUCCESS!@#KODE 1!@#USER_ID 36!@#ACTIVITY_CODE 3
12/23/2022 07:33:49 AM script INFO: SUCCESS!@#KODE 1!@#USER_ID 36!@#ACTIVITY_CODE 2
12/23/2022 07:33:49 AM script INFO: SUCCESS!@#KODE 1!@#USER_ID 36!@#ACTIVITY_CODE 3
12/23/2022 07:33:49 AM script INFO: SUCCESS!@#KODE 1!@#USER_ID 36!@#ACTIVITY_CODE 3
12/23/2022 07:33:49 AM script INFO: SUCCESS!@#KODE 1!@#USER_ID 36!@#ACTIVITY_CODE 1
12/23/2022 07:33:49 AM script INFO: SUCCESS!@#KODE 1!@#USER_ID 36!@#ACTIVITY_CODE 1
12/23/2022 07:33:49 AM script INFO: SUCCESS!@#KODE 1!@#USER_ID 36!@#ACTIVITY_CODE 2
12/23/2022 07:33:49 AM script INFO: SUCCESS!@#KODE 1!@#USER_ID 36!@#ACTIVITY_CODE 2
12/23/2022 07:33:50 AM script INFO: SUCCESS!@#KODE 1!@#USER_ID 36!@#ACTIVITY_CODE 3
12/23/2022 07:33:50 AM script INFO: SUCCESS!@#KODE 1!@#USER_ID 36!@#ACTIVITY_CODE 4
12/23/2022 07:33:50 AM script INFO: SUCCESS!@#KODE 1!@#USER_ID 36!@#ACTIVITY_CODE 2
12/23/2022 07:33:50 AM script INFO: SUCCESS!@#KODE 1!@#USER_ID 36!@#ACTIVITY_CODE 1
12/23/2022 07:33:50 AM script INFO: SUCCESS!@#KODE 1!@#USER_ID 36!@#ACTIVITY_CODE 1
12/23/2022 07:33:50 AM script INFO: SUCCESS!@#KODE 1!@#USER_ID 36!@#ACTIVITY_CODE 1
12/23/2022 07:33:50 AM script INFO: SUCCESS!@#KODE 1!@#USER_ID 36!@#ACTIVITY_CODE 3
12/23/2022 07:33:50 AM script INFO: SUCCESS!@#KODE 1!@#USER_ID 36!@#ACTIVITY_CODE 2
12/23/2022 07:33:50 AM script INFO: SUCCESS!@#KODE 1!@#USER_ID 36!@#ACTIVITY_CODE 3
12/23/2022 07:33:50 AM script INFO: SUCCESS!@#KODE 1!@#USER_ID 36!@#ACTIVITY_CODE 1
12/23/2022 07:33:50 AM script INFO: SUCCESS!@#KODE 1!@#USER_ID 36!@#ACTIVITY_CODE 2
12/23/2022 07:33:50 AM script INFO: SUCCESS!@#KODE 1!@#USER_ID 36!@#ACTIVITY_CODE 1
12/23/2022 07:33:50 AM script INFO: SUCCESS!@#KODE 1!@#USER_ID 36!@#ACTIVITY_CODE 1
12/23/2022 07:33:50 AM script INFO: SUCCESS!@#KODE 1!@#USER_ID 36!@#ACTIVITY_CODE 3
12/23/2022 07:33:51 AM script INFO: SUCCESS!@#KODE 1!@#USER_ID 36!@#ACTIVITY_CODE 4
12/23/2022 07:33:51 AM script INFO: SUCCESS!@#KODE 1!@#USER_ID 36!@#ACTIVITY_CODE 1
12/23/2022 07:33:51 AM script INFO: SUCCESS!@#KODE 1!@#USER_ID 36!@#ACTIVITY_CODE 1
12/23/2022 07:33:51 AM script INFO: SUCCESS!@#KODE 1!@#USER_ID 36!@#ACTIVITY_CODE 2
12/23/2022 07:33:51 AM script INFO: SUCCESS!@#KODE 1!@#USER_ID 36!@#ACTIVITY_CODE 1
12/23/2022 07:33:51 AM script INFO: SUCCESS!@#KODE 1!@#USER_ID 36!@#ACTIVITY_CODE 4
12/23/2022 07:33:51 AM script INFO: SUCCESS!@#KODE 1!@#USER_ID 36!@#ACTIVITY_CODE 3
12/23/2022 07:33:51 AM script INFO: SUCCESS!@#KODE 1!@#USER_ID 36!@#ACTIVITY_CODE 3
12/23/2022 07:33:51 AM script INFO: SUCCESS!@#KODE 1!@#USER_ID 36!@#ACTIVITY_CODE 2
12/23/2022 07:33:51 AM script INFO: SUCCESS!@#KODE 1!@#USER_ID 36!@#ACTIVITY_CODE 2
12/23/2022 07:33:51 AM script INFO: SUCCESS!@#KODE 1!@#USER_ID 36!@#ACTIVITY_CODE 2
12/23/2022 07:33:52 AM script INFO: SUCCESS!@#KODE 1!@#USER_ID 36!@#ACTIVITY_CODE 2
12/23/2022 07:33:52 AM script INFO: SUCCESS!@#KODE 1!@#USER_ID 36!@#ACTIVITY_CODE 1
12/23/2022 07:33:52 AM script INFO: SUCCESS!@#KODE 1!@#USER_ID 36!@#ACTIVITY_CODE 1
12/23/2022 07:33:52 AM script INFO: SUCCESS!@#KODE 1!@#USER_ID 36!@#ACTIVITY_CODE 4
12/23/2022 07:33:52 AM script INFO: SUCCESS!@#KODE 1!@#USER_ID 36!@#ACTIVITY_CODE 3
12/23/2022 07:33:52 AM script INFO: SUCCESS!@#KODE 1!@#USER_ID 36!@#ACTIVITY_CODE 2
12/23/2022 07:33:52 AM script INFO: SUCCESS!@#KODE 1!@#USER_ID 36!@#ACTIVITY_CODE 1
12/23/2022 07:33:52 AM script INFO: SUCCESS!@#KODE 1!@#USER_ID 36!@#ACTIVITY_CODE 3
12/23/2022 07:33:52 AM script INFO: SUCCESS!@#KODE 1!@#USER_ID 36!@#ACTIVITY_CODE 4
12/23/2022 07:33:52 AM script INFO: SUCCESS!@#KODE 1!@#USER_ID 36!@#ACTIVITY_CODE 3
12/23/2022 07:33:52 AM script INFO: SUCCESS!@#KODE 1!@#USER_ID 36!@#ACTIVITY_CODE 2
12/23/2022 07:33:52 AM script INFO: SUCCESS!@#KODE 1!@#USER_ID 36!@#ACTIVITY_CODE 3
12/23/2022 07:33:53 AM script INFO: SUCCESS!@#KODE 1!@#USER_ID 36!@#ACTIVITY_CODE 2
12/23/2022 07:33:53 AM script INFO: SUCCESS!@#KODE 1!@#USER_ID 36!@#ACTIVITY_CODE 2
12/23/2022 07:33:53 AM script INFO: SUCCESS!@#KODE 1!@#USER_ID 36!@#ACTIVITY_CODE 3
12/23/2022 07:33:53 AM script INFO: SUCCESS!@#KODE 1!@#USER_ID 36!@#ACTIVITY_CODE 1
12/23/2022 07:33:53 AM script INFO: SUCCESS!@#KODE 1!@#USER_ID 36!@#ACTIVITY_CODE 1
12/23/2022 07:33:53 AM script INFO: SUCCESS!@#KODE 1!@#USER_ID 36!@#ACTIVITY_CODE 2
12/23/2022 07:33:53 AM script INFO: SUCCESS!@#KODE 1!@#USER_ID 36!@#ACTIVITY_CODE 2
12/23/2022 07:33:53 AM script INFO: SUCCESS!@#KODE 1!@#USER_ID 36!@#ACTIVITY_CODE 2
12/23/2022 07:33:53 AM script INFO: SUCCESS!@#KODE 1!@#USER_ID 36!@#ACTIVITY_CODE 2
12/23/2022 07:33:53 AM script INFO: SUCCESS!@#KODE 1!@#USER_ID 36!@#ACTIVITY_CODE 1
12/23/2022 07:33:54 AM script INFO: SUCCESS!@#KODE 1!@#USER_ID 36!@#ACTIVITY_CODE 2
12/23/2022 07:33:54 AM script INFO: SUCCESS!@#KODE 1!@#USER_ID 36!@#ACTIVITY_CODE 1
12/23/2022 07:33:54 AM script INFO: SUCCESS!@#KODE 1!@#USER_ID 36!@#ACTIVITY_CODE 3
12/23/2022 07:33:54 AM script INFO: SUCCESS!@#KODE 1!@#USER_ID 36!@#ACTIVITY_CODE 3
12/23/2022 07:33:54 AM script INFO: SUCCESS!@#KODE 1!@#USER_ID 36!@#ACTIVITY_CODE 2
12/23/2022 07:33:54 AM script INFO: SUCCESS!@#KODE 1!@#USER_ID 36!@#ACTIVITY_CODE 1
12/23/2022 07:33:54 AM script INFO: SUCCESS!@#KODE 1!@#USER_ID 36!@#ACTIVITY_CODE 1
12/23/2022 07:33:54 AM script INFO: SUCCESS!@#KODE 1!@#USER_ID 36!@#ACTIVITY_CODE 1
12/23/2022 07:33:54 AM script INFO: SUCCESS!@#KODE 1!@#USER_ID 36!@#ACTIVITY_CODE 2
12/23/2022 07:33:54 AM script INFO: SUCCESS!@#KODE 1!@#USER_ID 36!@#ACTIVITY_CODE 4
12/23/2022 07:33:54 AM script INFO: SUCCESS!@#KODE 1!@#USER_ID 36!@#ACTIVITY_CODE 2
12/23/2022 07:33:54 AM script INFO: SUCCESS!@#KODE 1!@#USER_ID 36!@#ACTIVITY_CODE 1
12/23/2022 07:33:54 AM script INFO: SUCCESS!@#KODE 1!@#USER_ID 36!@#ACTIVITY_CODE 1
12/23/2022 07:33:55 AM script INFO: SUCCESS!@#KODE 1!@#USER_ID 36!@#ACTIVITY_CODE 2
12/23/2022 07:33:55 AM script INFO: SUCCESS!@#KODE 1!@#USER_ID 36!@#ACTIVITY_CODE 2
12/23/2022 07:33:55 AM script INFO: SUCCESS!@#KODE 1!@#USER_ID 36!@#ACTIVITY_CODE 1
12/23/2022 07:33:55 AM script INFO: SUCCESS!@#KODE 1!@#USER_ID 36!@#ACTIVITY_CODE 2
12/23/2022 07:33:55 AM script INFO: SUCCESS!@#KODE 1!@#USER_ID 36!@#ACTIVITY_CODE 1
12/23/2022 07:33:55 AM script INFO: SUCCESS!@#KODE 1!@#USER_ID 36!@#ACTIVITY_CODE 3
12/23/2022 07:33:55 AM script INFO: SUCCESS!@#KODE 1!@#USER_ID 36!@#ACTIVITY_CODE 4
12/23/2022 07:33:55 AM script INFO: SUCCESS!@#KODE 1!@#USER_ID 36!@#ACTIVITY_CODE 2
12/23/2022 07:33:55 AM script INFO: SUCCESS!@#KODE 1!@#USER_ID 36!@#ACTIVITY_CODE 1
12/23/2022 07:33:55 AM script INFO: SUCCESS!@#KODE 1!@#USER_ID 36!@#ACTIVITY_CODE 3
12/23/2022 07:33:55 AM script INFO: SUCCESS!@#KODE 1!@#USER_ID 36!@#ACTIVITY_CODE 2
12/23/2022 07:33:56 AM script INFO: SUCCESS!@#KODE 1!@#USER_ID 36!@#ACTIVITY_CODE 2
12/23/2022 07:33:56 AM script INFO: SUCCESS!@#KODE 1!@#USER_ID 36!@#ACTIVITY_CODE 3
12/23/2022 07:33:56 AM script INFO: SUCCESS!@#KODE 1!@#USER_ID 36!@#ACTIVITY_CODE 4
12/23/2022 07:33:56 AM script INFO: SUCCESS!@#KODE 1!@#USER_ID 36!@#ACTIVITY_CODE 1
12/23/2022 07:33:56 AM script INFO: SUCCESS!@#KODE 1!@#USER_ID 36!@#ACTIVITY_CODE 2
12/23/2022 07:33:56 AM script INFO: SUCCESS!@#KODE 1!@#USER_ID 36!@#ACTIVITY_CODE 2
12/23/2022 07:33:56 AM script INFO: SUCCESS!@#KODE 1!@#USER_ID 36!@#ACTIVITY_CODE 2
12/23/2022 07:33:56 AM script INFO: SUCCESS!@#KODE 1!@#USER_ID 36!@#ACTIVITY_CODE 1
12/23/2022 07:33:56 AM script INFO: SUCCESS!@#KODE 1!@#USER_ID 36!@#ACTIVITY_CODE 1
12/23/2022 07:33:56 AM script INFO: SUCCESS!@#KODE 1!@#USER_ID 36!@#ACTIVITY_CODE 1
12/23/2022 07:33:56 AM script INFO: SUCCESS!@#KODE 1!@#USER_ID 36!@#ACTIVITY_CODE 1
12/23/2022 07:33:57 AM script INFO: SUCCESS!@#KODE 1!@#USER_ID 36!@#ACTIVITY_CODE 4
12/23/2022 07:33:57 AM script INFO: SUCCESS!@#KODE 1!@#USER_ID 36!@#ACTIVITY_CODE 2
12/23/2022 07:33:57 AM script INFO: SUCCESS!@#KODE 1!@#USER_ID 36!@#ACTIVITY_CODE 1
12/23/2022 07:33:57 AM script INFO: Duration: 118.1647539138794
12/23/2022 07:33:57 AM script INFO: mengakhiri-quiz
12/23/2022 07:33:58 AM script INFO: SUCCESS!@#KODE 1!@#USER_ID 36!@#ACTIVITY_CODE 5
12/23/2022 07:33:58 AM script INFO: berhasil-submit
