12/11/2022 03:52:31 PM script INFO: Prepared chrome options..
12/11/2022 03:52:33 PM script INFO: Initialized chrome browser..
12/11/2022 03:52:33 PM script INFO: mengakses-homepage
12/11/2022 03:53:22 PM script INFO: mengakses-login-page
12/11/2022 03:53:38 PM script INFO: mengakses-site-home
12/11/2022 03:53:38 PM script INFO: mengakses-site-course
12/11/2022 03:54:16 PM script INFO: mengakses-quiz
12/11/2022 03:54:39 PM script INFO: mengakses-start-quiz-page
12/11/2022 03:54:46 PM script INFO: memulai-quiz
12/11/2022 03:54:46 PM script INFO: SUCCESS!@#KODE 1!@#USER_ID 85!@#ACTIVITY_CODE 5
12/11/2022 03:54:57 PM script INFO: SUCCESS!@#KODE 1!@#USER_ID 85!@#ACTIVITY_CODE 3
12/11/2022 03:54:57 PM script INFO: SUCCESS!@#KODE 1!@#USER_ID 85!@#ACTIVITY_CODE 3
12/11/2022 03:54:57 PM script INFO: SUCCESS!@#KODE 1!@#USER_ID 85!@#ACTIVITY_CODE 3
12/11/2022 03:54:57 PM script INFO: SUCCESS!@#KODE 1!@#USER_ID 85!@#ACTIVITY_CODE 2
12/11/2022 03:54:57 PM script INFO: SUCCESS!@#KODE 1!@#USER_ID 85!@#ACTIVITY_CODE 5
12/11/2022 03:54:57 PM script INFO: SUCCESS!@#KODE 1!@#USER_ID 85!@#ACTIVITY_CODE 5
12/11/2022 03:55:00 PM script INFO: SUCCESS!@#KODE 1!@#USER_ID 85!@#ACTIVITY_CODE 3
12/11/2022 03:55:00 PM script INFO: SUCCESS!@#KODE 1!@#USER_ID 85!@#ACTIVITY_CODE 1
12/11/2022 03:55:00 PM script INFO: SUCCESS!@#KODE 1!@#USER_ID 85!@#ACTIVITY_CODE 5
12/11/2022 03:55:00 PM script INFO: SUCCESS!@#KODE 1!@#USER_ID 85!@#ACTIVITY_CODE 5
12/11/2022 03:55:03 PM script INFO: SUCCESS!@#KODE 1!@#USER_ID 85!@#ACTIVITY_CODE 1
12/11/2022 03:55:03 PM script INFO: SUCCESS!@#KODE 1!@#USER_ID 85!@#ACTIVITY_CODE 1
12/11/2022 03:55:03 PM script INFO: SUCCESS!@#KODE 1!@#USER_ID 85!@#ACTIVITY_CODE 2
12/11/2022 03:55:03 PM script INFO: SUCCESS!@#KODE 1!@#USER_ID 85!@#ACTIVITY_CODE 3
12/11/2022 03:55:03 PM script INFO: SUCCESS!@#KODE 1!@#USER_ID 85!@#ACTIVITY_CODE 2
12/11/2022 03:55:03 PM script INFO: SUCCESS!@#KODE 1!@#USER_ID 85!@#ACTIVITY_CODE 3
12/11/2022 03:55:03 PM script INFO: SUCCESS!@#KODE 1!@#USER_ID 85!@#ACTIVITY_CODE 1
12/11/2022 03:55:03 PM script INFO: SUCCESS!@#KODE 1!@#USER_ID 85!@#ACTIVITY_CODE 2
12/11/2022 03:55:04 PM script INFO: SUCCESS!@#KODE 1!@#USER_ID 85!@#ACTIVITY_CODE 2
12/11/2022 03:55:04 PM script INFO: SUCCESS!@#KODE 1!@#USER_ID 85!@#ACTIVITY_CODE 3
12/11/2022 03:55:04 PM script INFO: SUCCESS!@#KODE 1!@#USER_ID 85!@#ACTIVITY_CODE 5
12/11/2022 03:55:04 PM script INFO: SUCCESS!@#KODE 1!@#USER_ID 85!@#ACTIVITY_CODE 5
12/11/2022 03:55:06 PM script INFO: SUCCESS!@#KODE 1!@#USER_ID 85!@#ACTIVITY_CODE 1
12/11/2022 03:55:06 PM script INFO: SUCCESS!@#KODE 1!@#USER_ID 85!@#ACTIVITY_CODE 2
12/11/2022 03:55:06 PM script INFO: SUCCESS!@#KODE 1!@#USER_ID 85!@#ACTIVITY_CODE 5
12/11/2022 03:55:06 PM script INFO: SUCCESS!@#KODE 1!@#USER_ID 85!@#ACTIVITY_CODE 5
12/11/2022 03:55:09 PM script INFO: SUCCESS!@#KODE 1!@#USER_ID 85!@#ACTIVITY_CODE 2
12/11/2022 03:55:09 PM script INFO: SUCCESS!@#KODE 1!@#USER_ID 85!@#ACTIVITY_CODE 1
12/11/2022 03:55:09 PM script INFO: SUCCESS!@#KODE 1!@#USER_ID 85!@#ACTIVITY_CODE 1
12/11/2022 03:55:09 PM script INFO: SUCCESS!@#KODE 1!@#USER_ID 85!@#ACTIVITY_CODE 2
12/11/2022 03:55:09 PM script INFO: SUCCESS!@#KODE 1!@#USER_ID 85!@#ACTIVITY_CODE 4
12/11/2022 03:55:09 PM script INFO: SUCCESS!@#KODE 1!@#USER_ID 85!@#ACTIVITY_CODE 2
12/11/2022 03:55:10 PM script INFO: SUCCESS!@#KODE 1!@#USER_ID 85!@#ACTIVITY_CODE 1
12/11/2022 03:55:10 PM script INFO: SUCCESS!@#KODE 1!@#USER_ID 85!@#ACTIVITY_CODE 4
12/11/2022 03:55:10 PM script INFO: SUCCESS!@#KODE 1!@#USER_ID 85!@#ACTIVITY_CODE 2
12/11/2022 03:55:10 PM script INFO: SUCCESS!@#KODE 1!@#USER_ID 85!@#ACTIVITY_CODE 2
12/11/2022 03:55:10 PM script INFO: SUCCESS!@#KODE 1!@#USER_ID 85!@#ACTIVITY_CODE 5
12/11/2022 03:55:10 PM script INFO: SUCCESS!@#KODE 1!@#USER_ID 85!@#ACTIVITY_CODE 5
12/11/2022 03:55:12 PM script INFO: SUCCESS!@#KODE 1!@#USER_ID 85!@#ACTIVITY_CODE 3
12/11/2022 03:55:12 PM script INFO: SUCCESS!@#KODE 1!@#USER_ID 85!@#ACTIVITY_CODE 5
12/11/2022 03:55:12 PM script INFO: SUCCESS!@#KODE 1!@#USER_ID 85!@#ACTIVITY_CODE 5
12/11/2022 03:55:15 PM script INFO: SUCCESS!@#KODE 1!@#USER_ID 85!@#ACTIVITY_CODE 2
12/11/2022 03:55:15 PM script INFO: SUCCESS!@#KODE 1!@#USER_ID 85!@#ACTIVITY_CODE 3
12/11/2022 03:55:15 PM script INFO: SUCCESS!@#KODE 1!@#USER_ID 85!@#ACTIVITY_CODE 1
12/11/2022 03:55:15 PM script INFO: SUCCESS!@#KODE 1!@#USER_ID 85!@#ACTIVITY_CODE 5
12/11/2022 03:55:15 PM script INFO: SUCCESS!@#KODE 1!@#USER_ID 85!@#ACTIVITY_CODE 5
12/11/2022 03:55:18 PM script INFO: SUCCESS!@#KODE 1!@#USER_ID 85!@#ACTIVITY_CODE 5
12/11/2022 03:55:18 PM script INFO: SUCCESS!@#KODE 1!@#USER_ID 85!@#ACTIVITY_CODE 5
12/11/2022 03:55:20 PM script INFO: SUCCESS!@#KODE 1!@#USER_ID 85!@#ACTIVITY_CODE 2
12/11/2022 03:55:20 PM script INFO: SUCCESS!@#KODE 1!@#USER_ID 85!@#ACTIVITY_CODE 3
12/11/2022 03:55:21 PM script INFO: SUCCESS!@#KODE 1!@#USER_ID 85!@#ACTIVITY_CODE 3
12/11/2022 03:55:21 PM script INFO: SUCCESS!@#KODE 1!@#USER_ID 85!@#ACTIVITY_CODE 2
12/11/2022 03:55:21 PM script INFO: SUCCESS!@#KODE 1!@#USER_ID 85!@#ACTIVITY_CODE 2
12/11/2022 03:55:21 PM script INFO: SUCCESS!@#KODE 1!@#USER_ID 85!@#ACTIVITY_CODE 1
12/11/2022 03:55:21 PM script INFO: SUCCESS!@#KODE 1!@#USER_ID 85!@#ACTIVITY_CODE 1
12/11/2022 03:55:21 PM script INFO: SUCCESS!@#KODE 1!@#USER_ID 85!@#ACTIVITY_CODE 4
12/11/2022 03:55:21 PM script INFO: SUCCESS!@#KODE 1!@#USER_ID 85!@#ACTIVITY_CODE 1
12/11/2022 03:55:21 PM script INFO: SUCCESS!@#KODE 1!@#USER_ID 85!@#ACTIVITY_CODE 1
12/11/2022 03:55:21 PM script INFO: SUCCESS!@#KODE 1!@#USER_ID 85!@#ACTIVITY_CODE 3
12/11/2022 03:55:21 PM script INFO: SUCCESS!@#KODE 1!@#USER_ID 85!@#ACTIVITY_CODE 1
12/11/2022 03:55:21 PM script INFO: SUCCESS!@#KODE 1!@#USER_ID 85!@#ACTIVITY_CODE 4
12/11/2022 03:55:21 PM script INFO: SUCCESS!@#KODE 1!@#USER_ID 85!@#ACTIVITY_CODE 2
12/11/2022 03:55:21 PM script INFO: SUCCESS!@#KODE 1!@#USER_ID 85!@#ACTIVITY_CODE 4
12/11/2022 03:55:21 PM script INFO: SUCCESS!@#KODE 1!@#USER_ID 85!@#ACTIVITY_CODE 5
12/11/2022 03:55:21 PM script INFO: SUCCESS!@#KODE 1!@#USER_ID 85!@#ACTIVITY_CODE 5
12/11/2022 03:55:24 PM script INFO: SUCCESS!@#KODE 1!@#USER_ID 85!@#ACTIVITY_CODE 2
12/11/2022 03:55:24 PM script INFO: SUCCESS!@#KODE 1!@#USER_ID 85!@#ACTIVITY_CODE 1
12/11/2022 03:55:24 PM script INFO: SUCCESS!@#KODE 1!@#USER_ID 85!@#ACTIVITY_CODE 2
12/11/2022 03:55:24 PM script INFO: SUCCESS!@#KODE 1!@#USER_ID 85!@#ACTIVITY_CODE 1
12/11/2022 03:55:24 PM script INFO: SUCCESS!@#KODE 1!@#USER_ID 85!@#ACTIVITY_CODE 4
12/11/2022 03:55:24 PM script INFO: SUCCESS!@#KODE 1!@#USER_ID 85!@#ACTIVITY_CODE 5
12/11/2022 03:55:24 PM script INFO: SUCCESS!@#KODE 1!@#USER_ID 85!@#ACTIVITY_CODE 5
12/11/2022 03:55:27 PM script INFO: SUCCESS!@#KODE 1!@#USER_ID 85!@#ACTIVITY_CODE 5
12/11/2022 03:55:27 PM script INFO: SUCCESS!@#KODE 1!@#USER_ID 85!@#ACTIVITY_CODE 5
12/11/2022 03:55:29 PM script INFO: SUCCESS!@#KODE 1!@#USER_ID 85!@#ACTIVITY_CODE 3
12/11/2022 03:55:29 PM script INFO: SUCCESS!@#KODE 1!@#USER_ID 85!@#ACTIVITY_CODE 1
12/11/2022 03:55:30 PM script INFO: SUCCESS!@#KODE 1!@#USER_ID 85!@#ACTIVITY_CODE 1
12/11/2022 03:55:30 PM script INFO: SUCCESS!@#KODE 1!@#USER_ID 85!@#ACTIVITY_CODE 1
12/11/2022 03:55:30 PM script INFO: SUCCESS!@#KODE 1!@#USER_ID 85!@#ACTIVITY_CODE 4
12/11/2022 03:55:30 PM script INFO: SUCCESS!@#KODE 1!@#USER_ID 85!@#ACTIVITY_CODE 2
12/11/2022 03:55:30 PM script INFO: SUCCESS!@#KODE 1!@#USER_ID 85!@#ACTIVITY_CODE 2
12/11/2022 03:55:30 PM script INFO: SUCCESS!@#KODE 1!@#USER_ID 85!@#ACTIVITY_CODE 5
12/11/2022 03:55:30 PM script INFO: SUCCESS!@#KODE 1!@#USER_ID 85!@#ACTIVITY_CODE 5
12/11/2022 03:55:32 PM script INFO: SUCCESS!@#KODE 1!@#USER_ID 85!@#ACTIVITY_CODE 2
12/11/2022 03:55:32 PM script INFO: SUCCESS!@#KODE 1!@#USER_ID 85!@#ACTIVITY_CODE 3
12/11/2022 03:55:32 PM script INFO: SUCCESS!@#KODE 1!@#USER_ID 85!@#ACTIVITY_CODE 5
12/11/2022 03:55:32 PM script INFO: SUCCESS!@#KODE 1!@#USER_ID 85!@#ACTIVITY_CODE 5
12/11/2022 03:55:35 PM script INFO: SUCCESS!@#KODE 1!@#USER_ID 85!@#ACTIVITY_CODE 2
12/11/2022 03:55:35 PM script INFO: SUCCESS!@#KODE 1!@#USER_ID 85!@#ACTIVITY_CODE 2
12/11/2022 03:55:35 PM script INFO: SUCCESS!@#KODE 1!@#USER_ID 85!@#ACTIVITY_CODE 2
12/11/2022 03:55:35 PM script INFO: SUCCESS!@#KODE 1!@#USER_ID 85!@#ACTIVITY_CODE 2
12/11/2022 03:55:35 PM script INFO: SUCCESS!@#KODE 1!@#USER_ID 85!@#ACTIVITY_CODE 5
12/11/2022 03:55:35 PM script INFO: SUCCESS!@#KODE 1!@#USER_ID 85!@#ACTIVITY_CODE 5
12/11/2022 03:55:38 PM script INFO: SUCCESS!@#KODE 1!@#USER_ID 85!@#ACTIVITY_CODE 3
12/11/2022 03:55:38 PM script INFO: SUCCESS!@#KODE 1!@#USER_ID 85!@#ACTIVITY_CODE 3
12/11/2022 03:55:38 PM script INFO: SUCCESS!@#KODE 1!@#USER_ID 85!@#ACTIVITY_CODE 1
12/11/2022 03:55:38 PM script INFO: SUCCESS!@#KODE 1!@#USER_ID 85!@#ACTIVITY_CODE 4
12/11/2022 03:55:38 PM script INFO: SUCCESS!@#KODE 1!@#USER_ID 85!@#ACTIVITY_CODE 1
12/11/2022 03:55:38 PM script INFO: SUCCESS!@#KODE 1!@#USER_ID 85!@#ACTIVITY_CODE 3
12/11/2022 03:55:38 PM script INFO: SUCCESS!@#KODE 1!@#USER_ID 85!@#ACTIVITY_CODE 5
12/11/2022 03:55:38 PM script INFO: SUCCESS!@#KODE 1!@#USER_ID 85!@#ACTIVITY_CODE 5
12/11/2022 03:55:41 PM script INFO: SUCCESS!@#KODE 1!@#USER_ID 85!@#ACTIVITY_CODE 5
12/11/2022 03:55:41 PM script INFO: SUCCESS!@#KODE 1!@#USER_ID 85!@#ACTIVITY_CODE 5
12/11/2022 03:55:43 PM script INFO: SUCCESS!@#KODE 1!@#USER_ID 85!@#ACTIVITY_CODE 1
12/11/2022 03:55:43 PM script INFO: SUCCESS!@#KODE 1!@#USER_ID 85!@#ACTIVITY_CODE 4
12/11/2022 03:55:43 PM script INFO: SUCCESS!@#KODE 1!@#USER_ID 85!@#ACTIVITY_CODE 1
12/11/2022 03:55:43 PM script INFO: SUCCESS!@#KODE 1!@#USER_ID 85!@#ACTIVITY_CODE 2
12/11/2022 03:55:43 PM script INFO: SUCCESS!@#KODE 1!@#USER_ID 85!@#ACTIVITY_CODE 3
12/11/2022 03:55:44 PM script INFO: SUCCESS!@#KODE 1!@#USER_ID 85!@#ACTIVITY_CODE 3
12/11/2022 03:55:44 PM script INFO: SUCCESS!@#KODE 1!@#USER_ID 85!@#ACTIVITY_CODE 1
12/11/2022 03:55:44 PM script INFO: SUCCESS!@#KODE 1!@#USER_ID 85!@#ACTIVITY_CODE 1
12/11/2022 03:55:44 PM script INFO: SUCCESS!@#KODE 1!@#USER_ID 85!@#ACTIVITY_CODE 2
12/11/2022 03:55:44 PM script INFO: SUCCESS!@#KODE 1!@#USER_ID 85!@#ACTIVITY_CODE 3
12/11/2022 03:55:44 PM script INFO: SUCCESS!@#KODE 1!@#USER_ID 85!@#ACTIVITY_CODE 2
12/11/2022 03:55:44 PM script INFO: SUCCESS!@#KODE 1!@#USER_ID 85!@#ACTIVITY_CODE 4
12/11/2022 03:55:44 PM script INFO: SUCCESS!@#KODE 1!@#USER_ID 85!@#ACTIVITY_CODE 1
12/11/2022 03:55:44 PM script INFO: SUCCESS!@#KODE 1!@#USER_ID 85!@#ACTIVITY_CODE 3
12/11/2022 03:55:44 PM script INFO: SUCCESS!@#KODE 1!@#USER_ID 85!@#ACTIVITY_CODE 2
12/11/2022 03:55:44 PM script INFO: SUCCESS!@#KODE 1!@#USER_ID 85!@#ACTIVITY_CODE 1
12/11/2022 03:55:44 PM script INFO: SUCCESS!@#KODE 1!@#USER_ID 85!@#ACTIVITY_CODE 3
12/11/2022 03:55:44 PM script INFO: SUCCESS!@#KODE 1!@#USER_ID 85!@#ACTIVITY_CODE 4
12/11/2022 03:55:44 PM script INFO: SUCCESS!@#KODE 1!@#USER_ID 85!@#ACTIVITY_CODE 1
12/11/2022 03:55:44 PM script INFO: SUCCESS!@#KODE 1!@#USER_ID 85!@#ACTIVITY_CODE 1
12/11/2022 03:55:44 PM script INFO: SUCCESS!@#KODE 1!@#USER_ID 85!@#ACTIVITY_CODE 1
12/11/2022 03:55:44 PM script INFO: SUCCESS!@#KODE 1!@#USER_ID 85!@#ACTIVITY_CODE 1
12/11/2022 03:55:45 PM script INFO: SUCCESS!@#KODE 1!@#USER_ID 85!@#ACTIVITY_CODE 2
12/11/2022 03:55:45 PM script INFO: SUCCESS!@#KODE 1!@#USER_ID 85!@#ACTIVITY_CODE 1
12/11/2022 03:55:45 PM script INFO: SUCCESS!@#KODE 1!@#USER_ID 85!@#ACTIVITY_CODE 2
12/11/2022 03:55:45 PM script INFO: SUCCESS!@#KODE 1!@#USER_ID 85!@#ACTIVITY_CODE 4
12/11/2022 03:55:45 PM script INFO: SUCCESS!@#KODE 1!@#USER_ID 85!@#ACTIVITY_CODE 1
12/11/2022 03:55:45 PM script INFO: SUCCESS!@#KODE 1!@#USER_ID 85!@#ACTIVITY_CODE 2
12/11/2022 03:55:45 PM script INFO: SUCCESS!@#KODE 1!@#USER_ID 85!@#ACTIVITY_CODE 2
12/11/2022 03:55:45 PM script INFO: SUCCESS!@#KODE 1!@#USER_ID 85!@#ACTIVITY_CODE 4
12/11/2022 03:55:45 PM script INFO: SUCCESS!@#KODE 1!@#USER_ID 85!@#ACTIVITY_CODE 3
12/11/2022 03:55:45 PM script INFO: SUCCESS!@#KODE 1!@#USER_ID 85!@#ACTIVITY_CODE 2
12/11/2022 03:55:45 PM script INFO: SUCCESS!@#KODE 1!@#USER_ID 85!@#ACTIVITY_CODE 1
12/11/2022 03:55:45 PM script INFO: SUCCESS!@#KODE 1!@#USER_ID 85!@#ACTIVITY_CODE 2
12/11/2022 03:55:45 PM script INFO: SUCCESS!@#KODE 1!@#USER_ID 85!@#ACTIVITY_CODE 4
12/11/2022 03:55:45 PM script INFO: SUCCESS!@#KODE 1!@#USER_ID 85!@#ACTIVITY_CODE 1
12/11/2022 03:55:45 PM script INFO: SUCCESS!@#KODE 1!@#USER_ID 85!@#ACTIVITY_CODE 1
12/11/2022 03:55:46 PM script INFO: SUCCESS!@#KODE 1!@#USER_ID 85!@#ACTIVITY_CODE 3
12/11/2022 03:55:46 PM script INFO: SUCCESS!@#KODE 1!@#USER_ID 85!@#ACTIVITY_CODE 3
12/11/2022 03:55:46 PM script INFO: SUCCESS!@#KODE 1!@#USER_ID 85!@#ACTIVITY_CODE 2
12/11/2022 03:55:46 PM script INFO: SUCCESS!@#KODE 1!@#USER_ID 85!@#ACTIVITY_CODE 3
12/11/2022 03:55:46 PM script INFO: SUCCESS!@#KODE 1!@#USER_ID 85!@#ACTIVITY_CODE 2
12/11/2022 03:55:46 PM script INFO: SUCCESS!@#KODE 1!@#USER_ID 85!@#ACTIVITY_CODE 2
12/11/2022 03:55:46 PM script INFO: SUCCESS!@#KODE 1!@#USER_ID 85!@#ACTIVITY_CODE 4
12/11/2022 03:55:46 PM script INFO: SUCCESS!@#KODE 1!@#USER_ID 85!@#ACTIVITY_CODE 1
12/11/2022 03:55:46 PM script INFO: SUCCESS!@#KODE 1!@#USER_ID 85!@#ACTIVITY_CODE 1
12/11/2022 03:55:46 PM script INFO: SUCCESS!@#KODE 1!@#USER_ID 85!@#ACTIVITY_CODE 4
12/11/2022 03:55:46 PM script INFO: SUCCESS!@#KODE 1!@#USER_ID 85!@#ACTIVITY_CODE 1
12/11/2022 03:55:46 PM script INFO: SUCCESS!@#KODE 1!@#USER_ID 85!@#ACTIVITY_CODE 1
12/11/2022 03:55:46 PM script INFO: SUCCESS!@#KODE 1!@#USER_ID 85!@#ACTIVITY_CODE 3
12/11/2022 03:55:46 PM script INFO: SUCCESS!@#KODE 1!@#USER_ID 85!@#ACTIVITY_CODE 2
12/11/2022 03:55:46 PM script INFO: SUCCESS!@#KODE 1!@#USER_ID 85!@#ACTIVITY_CODE 3
12/11/2022 03:55:46 PM script INFO: SUCCESS!@#KODE 1!@#USER_ID 85!@#ACTIVITY_CODE 3
12/11/2022 03:55:47 PM script INFO: SUCCESS!@#KODE 1!@#USER_ID 85!@#ACTIVITY_CODE 2
12/11/2022 03:55:47 PM script INFO: SUCCESS!@#KODE 1!@#USER_ID 85!@#ACTIVITY_CODE 4
12/11/2022 03:55:47 PM script INFO: SUCCESS!@#KODE 1!@#USER_ID 85!@#ACTIVITY_CODE 1
12/11/2022 03:55:47 PM script INFO: SUCCESS!@#KODE 1!@#USER_ID 85!@#ACTIVITY_CODE 3
12/11/2022 03:55:47 PM script INFO: SUCCESS!@#KODE 1!@#USER_ID 85!@#ACTIVITY_CODE 3
12/11/2022 03:55:47 PM script INFO: SUCCESS!@#KODE 1!@#USER_ID 85!@#ACTIVITY_CODE 3
12/11/2022 03:55:47 PM script INFO: SUCCESS!@#KODE 1!@#USER_ID 85!@#ACTIVITY_CODE 4
12/11/2022 03:55:47 PM script INFO: SUCCESS!@#KODE 1!@#USER_ID 85!@#ACTIVITY_CODE 3
12/11/2022 03:55:47 PM script INFO: SUCCESS!@#KODE 1!@#USER_ID 85!@#ACTIVITY_CODE 3
12/11/2022 03:55:47 PM script INFO: SUCCESS!@#KODE 1!@#USER_ID 85!@#ACTIVITY_CODE 1
12/11/2022 03:55:47 PM script INFO: SUCCESS!@#KODE 1!@#USER_ID 85!@#ACTIVITY_CODE 3
12/11/2022 03:55:47 PM script INFO: SUCCESS!@#KODE 1!@#USER_ID 85!@#ACTIVITY_CODE 1
12/11/2022 03:55:47 PM script INFO: SUCCESS!@#KODE 1!@#USER_ID 85!@#ACTIVITY_CODE 2
12/11/2022 03:55:47 PM script INFO: SUCCESS!@#KODE 1!@#USER_ID 85!@#ACTIVITY_CODE 4
12/11/2022 03:55:47 PM script INFO: SUCCESS!@#KODE 1!@#USER_ID 85!@#ACTIVITY_CODE 2
12/11/2022 03:55:47 PM script INFO: SUCCESS!@#KODE 1!@#USER_ID 85!@#ACTIVITY_CODE 2
12/11/2022 03:55:48 PM script INFO: SUCCESS!@#KODE 1!@#USER_ID 85!@#ACTIVITY_CODE 1
12/11/2022 03:55:48 PM script INFO: SUCCESS!@#KODE 1!@#USER_ID 85!@#ACTIVITY_CODE 2
12/11/2022 03:55:48 PM script INFO: SUCCESS!@#KODE 1!@#USER_ID 85!@#ACTIVITY_CODE 1
12/11/2022 03:55:48 PM script INFO: SUCCESS!@#KODE 1!@#USER_ID 85!@#ACTIVITY_CODE 2
12/11/2022 03:55:48 PM script INFO: SUCCESS!@#KODE 1!@#USER_ID 85!@#ACTIVITY_CODE 2
12/11/2022 03:55:48 PM script INFO: SUCCESS!@#KODE 1!@#USER_ID 85!@#ACTIVITY_CODE 2
12/11/2022 03:55:48 PM script INFO: SUCCESS!@#KODE 1!@#USER_ID 85!@#ACTIVITY_CODE 2
12/11/2022 03:55:48 PM script INFO: SUCCESS!@#KODE 1!@#USER_ID 85!@#ACTIVITY_CODE 1
12/11/2022 03:55:48 PM script INFO: SUCCESS!@#KODE 1!@#USER_ID 85!@#ACTIVITY_CODE 4
12/11/2022 03:55:48 PM script INFO: SUCCESS!@#KODE 1!@#USER_ID 85!@#ACTIVITY_CODE 3
12/11/2022 03:55:48 PM script INFO: SUCCESS!@#KODE 1!@#USER_ID 85!@#ACTIVITY_CODE 2
12/11/2022 03:55:48 PM script INFO: SUCCESS!@#KODE 1!@#USER_ID 85!@#ACTIVITY_CODE 3
12/11/2022 03:55:48 PM script INFO: SUCCESS!@#KODE 1!@#USER_ID 85!@#ACTIVITY_CODE 3
12/11/2022 03:55:48 PM script INFO: SUCCESS!@#KODE 1!@#USER_ID 85!@#ACTIVITY_CODE 4
12/11/2022 03:55:49 PM script INFO: SUCCESS!@#KODE 1!@#USER_ID 85!@#ACTIVITY_CODE 1
12/11/2022 03:55:49 PM script INFO: SUCCESS!@#KODE 1!@#USER_ID 85!@#ACTIVITY_CODE 4
12/11/2022 03:55:49 PM script INFO: SUCCESS!@#KODE 1!@#USER_ID 85!@#ACTIVITY_CODE 1
12/11/2022 03:55:49 PM script INFO: SUCCESS!@#KODE 1!@#USER_ID 85!@#ACTIVITY_CODE 3
12/11/2022 03:55:49 PM script INFO: SUCCESS!@#KODE 1!@#USER_ID 85!@#ACTIVITY_CODE 3
12/11/2022 03:55:49 PM script INFO: SUCCESS!@#KODE 1!@#USER_ID 85!@#ACTIVITY_CODE 3
12/11/2022 03:55:49 PM script INFO: SUCCESS!@#KODE 1!@#USER_ID 85!@#ACTIVITY_CODE 4
12/11/2022 03:55:49 PM script INFO: SUCCESS!@#KODE 1!@#USER_ID 85!@#ACTIVITY_CODE 2
12/11/2022 03:55:49 PM script INFO: SUCCESS!@#KODE 1!@#USER_ID 85!@#ACTIVITY_CODE 2
12/11/2022 03:55:49 PM script INFO: SUCCESS!@#KODE 1!@#USER_ID 85!@#ACTIVITY_CODE 2
12/11/2022 03:55:49 PM script INFO: SUCCESS!@#KODE 1!@#USER_ID 85!@#ACTIVITY_CODE 1
12/11/2022 03:55:49 PM script INFO: SUCCESS!@#KODE 1!@#USER_ID 85!@#ACTIVITY_CODE 3
12/11/2022 03:55:49 PM script INFO: SUCCESS!@#KODE 1!@#USER_ID 85!@#ACTIVITY_CODE 4
12/11/2022 03:55:49 PM script INFO: SUCCESS!@#KODE 1!@#USER_ID 85!@#ACTIVITY_CODE 2
12/11/2022 03:55:49 PM script INFO: SUCCESS!@#KODE 1!@#USER_ID 85!@#ACTIVITY_CODE 1
12/11/2022 03:55:50 PM script INFO: SUCCESS!@#KODE 1!@#USER_ID 85!@#ACTIVITY_CODE 2
12/11/2022 03:55:50 PM script INFO: SUCCESS!@#KODE 1!@#USER_ID 85!@#ACTIVITY_CODE 2
12/11/2022 03:55:50 PM script INFO: SUCCESS!@#KODE 1!@#USER_ID 85!@#ACTIVITY_CODE 1
12/11/2022 03:55:50 PM script INFO: SUCCESS!@#KODE 1!@#USER_ID 85!@#ACTIVITY_CODE 3
12/11/2022 03:55:50 PM script INFO: SUCCESS!@#KODE 1!@#USER_ID 85!@#ACTIVITY_CODE 3
12/11/2022 03:55:50 PM script INFO: SUCCESS!@#KODE 1!@#USER_ID 85!@#ACTIVITY_CODE 1
12/11/2022 03:55:50 PM script INFO: SUCCESS!@#KODE 1!@#USER_ID 85!@#ACTIVITY_CODE 2
12/11/2022 03:55:50 PM script INFO: SUCCESS!@#KODE 1!@#USER_ID 85!@#ACTIVITY_CODE 2
12/11/2022 03:55:50 PM script INFO: SUCCESS!@#KODE 1!@#USER_ID 85!@#ACTIVITY_CODE 2
12/11/2022 03:55:50 PM script INFO: SUCCESS!@#KODE 1!@#USER_ID 85!@#ACTIVITY_CODE 2
12/11/2022 03:55:50 PM script INFO: SUCCESS!@#KODE 1!@#USER_ID 85!@#ACTIVITY_CODE 3
12/11/2022 03:55:50 PM script INFO: SUCCESS!@#KODE 1!@#USER_ID 85!@#ACTIVITY_CODE 1
12/11/2022 03:55:50 PM script INFO: SUCCESS!@#KODE 1!@#USER_ID 85!@#ACTIVITY_CODE 2
12/11/2022 03:55:50 PM script INFO: SUCCESS!@#KODE 1!@#USER_ID 85!@#ACTIVITY_CODE 3
12/11/2022 03:55:51 PM script INFO: SUCCESS!@#KODE 1!@#USER_ID 85!@#ACTIVITY_CODE 3
12/11/2022 03:55:51 PM script INFO: SUCCESS!@#KODE 1!@#USER_ID 85!@#ACTIVITY_CODE 3
12/11/2022 03:55:51 PM script INFO: SUCCESS!@#KODE 1!@#USER_ID 85!@#ACTIVITY_CODE 1
12/11/2022 03:55:51 PM script INFO: SUCCESS!@#KODE 1!@#USER_ID 85!@#ACTIVITY_CODE 3
12/11/2022 03:55:51 PM script INFO: SUCCESS!@#KODE 1!@#USER_ID 85!@#ACTIVITY_CODE 1
12/11/2022 03:55:51 PM script INFO: SUCCESS!@#KODE 1!@#USER_ID 85!@#ACTIVITY_CODE 2
12/11/2022 03:55:51 PM script INFO: SUCCESS!@#KODE 1!@#USER_ID 85!@#ACTIVITY_CODE 1
12/11/2022 03:55:51 PM script INFO: SUCCESS!@#KODE 1!@#USER_ID 85!@#ACTIVITY_CODE 2
12/11/2022 03:55:51 PM script INFO: SUCCESS!@#KODE 1!@#USER_ID 85!@#ACTIVITY_CODE 1
12/11/2022 03:55:51 PM script INFO: SUCCESS!@#KODE 1!@#USER_ID 85!@#ACTIVITY_CODE 2
12/11/2022 03:55:51 PM script INFO: SUCCESS!@#KODE 1!@#USER_ID 85!@#ACTIVITY_CODE 3
12/11/2022 03:55:51 PM script INFO: SUCCESS!@#KODE 1!@#USER_ID 85!@#ACTIVITY_CODE 3
12/11/2022 03:55:51 PM script INFO: SUCCESS!@#KODE 1!@#USER_ID 85!@#ACTIVITY_CODE 3
12/11/2022 03:55:51 PM script INFO: SUCCESS!@#KODE 1!@#USER_ID 85!@#ACTIVITY_CODE 2
12/11/2022 03:55:51 PM script INFO: SUCCESS!@#KODE 1!@#USER_ID 85!@#ACTIVITY_CODE 4
12/11/2022 03:55:51 PM script INFO: SUCCESS!@#KODE 1!@#USER_ID 85!@#ACTIVITY_CODE 2
12/11/2022 03:55:52 PM script INFO: SUCCESS!@#KODE 1!@#USER_ID 85!@#ACTIVITY_CODE 2
12/11/2022 03:55:52 PM script INFO: SUCCESS!@#KODE 1!@#USER_ID 85!@#ACTIVITY_CODE 2
12/11/2022 03:55:52 PM script INFO: SUCCESS!@#KODE 1!@#USER_ID 85!@#ACTIVITY_CODE 2
12/11/2022 03:55:52 PM script INFO: SUCCESS!@#KODE 1!@#USER_ID 85!@#ACTIVITY_CODE 2
12/11/2022 03:55:52 PM script INFO: SUCCESS!@#KODE 1!@#USER_ID 85!@#ACTIVITY_CODE 4
12/11/2022 03:55:52 PM script INFO: SUCCESS!@#KODE 1!@#USER_ID 85!@#ACTIVITY_CODE 2
12/11/2022 03:55:52 PM script INFO: SUCCESS!@#KODE 1!@#USER_ID 85!@#ACTIVITY_CODE 2
12/11/2022 03:55:52 PM script INFO: SUCCESS!@#KODE 1!@#USER_ID 85!@#ACTIVITY_CODE 3
12/11/2022 03:55:52 PM script INFO: SUCCESS!@#KODE 1!@#USER_ID 85!@#ACTIVITY_CODE 2
12/11/2022 03:55:52 PM script INFO: SUCCESS!@#KODE 1!@#USER_ID 85!@#ACTIVITY_CODE 1
12/11/2022 03:55:52 PM script INFO: SUCCESS!@#KODE 1!@#USER_ID 85!@#ACTIVITY_CODE 2
12/11/2022 03:55:52 PM script INFO: SUCCESS!@#KODE 1!@#USER_ID 85!@#ACTIVITY_CODE 1
12/11/2022 03:55:52 PM script INFO: SUCCESS!@#KODE 1!@#USER_ID 85!@#ACTIVITY_CODE 3
12/11/2022 03:55:53 PM script INFO: SUCCESS!@#KODE 1!@#USER_ID 85!@#ACTIVITY_CODE 3
12/11/2022 03:55:53 PM script INFO: SUCCESS!@#KODE 1!@#USER_ID 85!@#ACTIVITY_CODE 2
12/11/2022 03:55:53 PM script INFO: SUCCESS!@#KODE 1!@#USER_ID 85!@#ACTIVITY_CODE 3
12/11/2022 03:55:53 PM script INFO: SUCCESS!@#KODE 1!@#USER_ID 85!@#ACTIVITY_CODE 4
12/11/2022 03:55:53 PM script INFO: Duration: 55.67490863800049
12/11/2022 03:55:53 PM script INFO: mengakhiri-quiz
12/11/2022 03:55:53 PM script INFO: SUCCESS!@#KODE 1!@#USER_ID 85!@#ACTIVITY_CODE 5
12/11/2022 03:55:53 PM script INFO: berhasil-submit
