12/21/2022 02:29:40 PM script INFO: Prepared chrome options..
12/21/2022 02:29:41 PM script INFO: Initialized chrome browser..
12/21/2022 02:29:41 PM script INFO: mengakses-homepage
12/21/2022 02:29:52 PM script INFO: mengakses-login-page
12/21/2022 02:29:53 PM script INFO: mengakses-site-home
12/21/2022 02:29:54 PM script INFO: mengakses-site-course
12/21/2022 02:29:54 PM script INFO: mengakses-quiz
12/21/2022 02:29:55 PM script INFO: mengakses-start-quiz-page
12/21/2022 02:29:56 PM script INFO: memulai-quiz
12/21/2022 02:29:56 PM script INFO: SUCCESS!@#KODE 1!@#USER_ID 72!@#ACTIVITY_CODE 5
12/21/2022 02:30:07 PM script INFO: SUCCESS!@#KODE 1!@#USER_ID 72!@#ACTIVITY_CODE 5
12/21/2022 02:30:07 PM script INFO: SUCCESS!@#KODE 1!@#USER_ID 72!@#ACTIVITY_CODE 5
12/21/2022 02:30:09 PM script INFO: SUCCESS!@#KODE 1!@#USER_ID 72!@#ACTIVITY_CODE 1
12/21/2022 02:30:09 PM script INFO: SUCCESS!@#KODE 1!@#USER_ID 72!@#ACTIVITY_CODE 5
12/21/2022 02:30:09 PM script INFO: SUCCESS!@#KODE 1!@#USER_ID 72!@#ACTIVITY_CODE 5
12/21/2022 02:30:12 PM script INFO: SUCCESS!@#KODE 1!@#USER_ID 72!@#ACTIVITY_CODE 2
12/21/2022 02:30:12 PM script INFO: SUCCESS!@#KODE 1!@#USER_ID 72!@#ACTIVITY_CODE 5
12/21/2022 02:30:12 PM script INFO: SUCCESS!@#KODE 1!@#USER_ID 72!@#ACTIVITY_CODE 5
12/21/2022 02:30:15 PM script INFO: SUCCESS!@#KODE 1!@#USER_ID 72!@#ACTIVITY_CODE 2
12/21/2022 02:30:15 PM script INFO: SUCCESS!@#KODE 1!@#USER_ID 72!@#ACTIVITY_CODE 2
12/21/2022 02:30:15 PM script INFO: SUCCESS!@#KODE 1!@#USER_ID 72!@#ACTIVITY_CODE 2
12/21/2022 02:30:15 PM script INFO: SUCCESS!@#KODE 1!@#USER_ID 72!@#ACTIVITY_CODE 1
12/21/2022 02:30:15 PM script INFO: SUCCESS!@#KODE 1!@#USER_ID 72!@#ACTIVITY_CODE 5
12/21/2022 02:30:15 PM script INFO: SUCCESS!@#KODE 1!@#USER_ID 72!@#ACTIVITY_CODE 5
12/21/2022 02:30:18 PM script INFO: SUCCESS!@#KODE 1!@#USER_ID 72!@#ACTIVITY_CODE 3
12/21/2022 02:30:18 PM script INFO: SUCCESS!@#KODE 1!@#USER_ID 72!@#ACTIVITY_CODE 2
12/21/2022 02:30:18 PM script INFO: SUCCESS!@#KODE 1!@#USER_ID 72!@#ACTIVITY_CODE 3
12/21/2022 02:30:18 PM script INFO: SUCCESS!@#KODE 1!@#USER_ID 72!@#ACTIVITY_CODE 4
12/21/2022 02:30:18 PM script INFO: SUCCESS!@#KODE 1!@#USER_ID 72!@#ACTIVITY_CODE 3
12/21/2022 02:30:18 PM script INFO: SUCCESS!@#KODE 1!@#USER_ID 72!@#ACTIVITY_CODE 2
12/21/2022 02:30:18 PM script INFO: SUCCESS!@#KODE 1!@#USER_ID 72!@#ACTIVITY_CODE 1
12/21/2022 02:30:18 PM script INFO: SUCCESS!@#KODE 1!@#USER_ID 72!@#ACTIVITY_CODE 1
12/21/2022 02:30:18 PM script INFO: SUCCESS!@#KODE 1!@#USER_ID 72!@#ACTIVITY_CODE 2
12/21/2022 02:30:18 PM script INFO: SUCCESS!@#KODE 1!@#USER_ID 72!@#ACTIVITY_CODE 1
12/21/2022 02:30:19 PM script INFO: SUCCESS!@#KODE 1!@#USER_ID 72!@#ACTIVITY_CODE 1
12/21/2022 02:30:19 PM script INFO: SUCCESS!@#KODE 1!@#USER_ID 72!@#ACTIVITY_CODE 4
12/21/2022 02:30:19 PM script INFO: SUCCESS!@#KODE 1!@#USER_ID 72!@#ACTIVITY_CODE 5
12/21/2022 02:30:19 PM script INFO: SUCCESS!@#KODE 1!@#USER_ID 72!@#ACTIVITY_CODE 5
12/21/2022 02:30:21 PM script INFO: SUCCESS!@#KODE 1!@#USER_ID 72!@#ACTIVITY_CODE 3
12/21/2022 02:30:21 PM script INFO: SUCCESS!@#KODE 1!@#USER_ID 72!@#ACTIVITY_CODE 2
12/21/2022 02:30:21 PM script INFO: SUCCESS!@#KODE 1!@#USER_ID 72!@#ACTIVITY_CODE 3
12/21/2022 02:30:22 PM script INFO: SUCCESS!@#KODE 1!@#USER_ID 72!@#ACTIVITY_CODE 2
12/21/2022 02:30:22 PM script INFO: SUCCESS!@#KODE 1!@#USER_ID 72!@#ACTIVITY_CODE 1
12/21/2022 02:30:22 PM script INFO: SUCCESS!@#KODE 1!@#USER_ID 72!@#ACTIVITY_CODE 4
12/21/2022 02:30:22 PM script INFO: SUCCESS!@#KODE 1!@#USER_ID 72!@#ACTIVITY_CODE 1
12/21/2022 02:30:22 PM script INFO: SUCCESS!@#KODE 1!@#USER_ID 72!@#ACTIVITY_CODE 4
12/21/2022 02:30:22 PM script INFO: SUCCESS!@#KODE 1!@#USER_ID 72!@#ACTIVITY_CODE 5
12/21/2022 02:30:22 PM script INFO: SUCCESS!@#KODE 1!@#USER_ID 72!@#ACTIVITY_CODE 5
12/21/2022 02:30:25 PM script INFO: SUCCESS!@#KODE 1!@#USER_ID 72!@#ACTIVITY_CODE 2
12/21/2022 02:30:25 PM script INFO: SUCCESS!@#KODE 1!@#USER_ID 72!@#ACTIVITY_CODE 3
12/21/2022 02:30:25 PM script INFO: SUCCESS!@#KODE 1!@#USER_ID 72!@#ACTIVITY_CODE 3
12/21/2022 02:30:25 PM script INFO: SUCCESS!@#KODE 1!@#USER_ID 72!@#ACTIVITY_CODE 1
12/21/2022 02:30:25 PM script INFO: SUCCESS!@#KODE 1!@#USER_ID 72!@#ACTIVITY_CODE 1
12/21/2022 02:30:25 PM script INFO: SUCCESS!@#KODE 1!@#USER_ID 72!@#ACTIVITY_CODE 3
12/21/2022 02:30:25 PM script INFO: SUCCESS!@#KODE 1!@#USER_ID 72!@#ACTIVITY_CODE 2
12/21/2022 02:30:25 PM script INFO: SUCCESS!@#KODE 1!@#USER_ID 72!@#ACTIVITY_CODE 3
12/21/2022 02:30:25 PM script INFO: SUCCESS!@#KODE 1!@#USER_ID 72!@#ACTIVITY_CODE 2
12/21/2022 02:30:25 PM script INFO: SUCCESS!@#KODE 1!@#USER_ID 72!@#ACTIVITY_CODE 1
12/21/2022 02:30:25 PM script INFO: Duration: 18.653799772262573
12/21/2022 02:30:25 PM script INFO: mengakhiri-quiz
12/21/2022 02:30:41 PM script INFO: SUCCESS!@#KODE 1!@#USER_ID 72!@#ACTIVITY_CODE 5
12/21/2022 02:30:41 PM script INFO: berhasil-submit
