12/21/2022 02:49:19 PM script INFO: Prepared chrome options..
12/21/2022 02:49:20 PM script INFO: Initialized chrome browser..
12/21/2022 02:49:20 PM script INFO: mengakses-homepage
12/21/2022 02:49:50 PM script INFO: mengakses-login-page
12/21/2022 02:49:51 PM script INFO: mengakses-site-home
12/21/2022 02:49:51 PM script INFO: mengakses-site-course
12/21/2022 02:50:05 PM script INFO: mengakses-quiz
12/21/2022 02:50:18 PM script INFO: mengakses-start-quiz-page
12/21/2022 02:50:35 PM script INFO: memulai-quiz
12/21/2022 02:50:35 PM script INFO: SUCCESS!@#KODE 1!@#USER_ID 98!@#ACTIVITY_CODE 5
12/21/2022 02:50:46 PM script INFO: SUCCESS!@#KODE 1!@#USER_ID 98!@#ACTIVITY_CODE 1
12/21/2022 02:50:46 PM script INFO: SUCCESS!@#KODE 1!@#USER_ID 98!@#ACTIVITY_CODE 3
12/21/2022 02:50:46 PM script INFO: SUCCESS!@#KODE 1!@#USER_ID 98!@#ACTIVITY_CODE 1
12/21/2022 02:50:46 PM script INFO: SUCCESS!@#KODE 1!@#USER_ID 98!@#ACTIVITY_CODE 3
12/21/2022 02:50:46 PM script INFO: SUCCESS!@#KODE 1!@#USER_ID 98!@#ACTIVITY_CODE 5
12/21/2022 02:50:46 PM script INFO: SUCCESS!@#KODE 1!@#USER_ID 98!@#ACTIVITY_CODE 5
12/21/2022 02:50:49 PM script INFO: SUCCESS!@#KODE 1!@#USER_ID 98!@#ACTIVITY_CODE 4
12/21/2022 02:50:49 PM script INFO: SUCCESS!@#KODE 1!@#USER_ID 98!@#ACTIVITY_CODE 5
12/21/2022 02:50:49 PM script INFO: SUCCESS!@#KODE 1!@#USER_ID 98!@#ACTIVITY_CODE 5
12/21/2022 02:50:52 PM script INFO: SUCCESS!@#KODE 1!@#USER_ID 98!@#ACTIVITY_CODE 3
12/21/2022 02:50:52 PM script INFO: SUCCESS!@#KODE 1!@#USER_ID 98!@#ACTIVITY_CODE 5
12/21/2022 02:50:52 PM script INFO: SUCCESS!@#KODE 1!@#USER_ID 98!@#ACTIVITY_CODE 5
12/21/2022 02:50:54 PM script INFO: SUCCESS!@#KODE 1!@#USER_ID 98!@#ACTIVITY_CODE 2
12/21/2022 02:50:54 PM script INFO: SUCCESS!@#KODE 1!@#USER_ID 98!@#ACTIVITY_CODE 2
12/21/2022 02:50:55 PM script INFO: SUCCESS!@#KODE 1!@#USER_ID 98!@#ACTIVITY_CODE 2
12/21/2022 02:50:55 PM script INFO: SUCCESS!@#KODE 1!@#USER_ID 98!@#ACTIVITY_CODE 5
12/21/2022 02:50:55 PM script INFO: SUCCESS!@#KODE 1!@#USER_ID 98!@#ACTIVITY_CODE 5
12/21/2022 02:50:57 PM script INFO: SUCCESS!@#KODE 1!@#USER_ID 98!@#ACTIVITY_CODE 3
12/21/2022 02:50:57 PM script INFO: SUCCESS!@#KODE 1!@#USER_ID 98!@#ACTIVITY_CODE 5
12/21/2022 02:50:57 PM script INFO: SUCCESS!@#KODE 1!@#USER_ID 98!@#ACTIVITY_CODE 5
12/21/2022 02:51:00 PM script INFO: SUCCESS!@#KODE 1!@#USER_ID 98!@#ACTIVITY_CODE 3
12/21/2022 02:51:00 PM script INFO: SUCCESS!@#KODE 1!@#USER_ID 98!@#ACTIVITY_CODE 3
12/21/2022 02:51:00 PM script INFO: SUCCESS!@#KODE 1!@#USER_ID 98!@#ACTIVITY_CODE 5
12/21/2022 02:51:00 PM script INFO: SUCCESS!@#KODE 1!@#USER_ID 98!@#ACTIVITY_CODE 5
12/21/2022 02:51:03 PM script INFO: SUCCESS!@#KODE 1!@#USER_ID 98!@#ACTIVITY_CODE 1
12/21/2022 02:51:03 PM script INFO: SUCCESS!@#KODE 1!@#USER_ID 98!@#ACTIVITY_CODE 1
12/21/2022 02:51:03 PM script INFO: SUCCESS!@#KODE 1!@#USER_ID 98!@#ACTIVITY_CODE 1
12/21/2022 02:51:03 PM script INFO: SUCCESS!@#KODE 1!@#USER_ID 98!@#ACTIVITY_CODE 5
12/21/2022 02:51:03 PM script INFO: SUCCESS!@#KODE 1!@#USER_ID 98!@#ACTIVITY_CODE 5
12/21/2022 02:51:05 PM script INFO: SUCCESS!@#KODE 1!@#USER_ID 98!@#ACTIVITY_CODE 2
12/21/2022 02:51:06 PM script INFO: SUCCESS!@#KODE 1!@#USER_ID 98!@#ACTIVITY_CODE 2
12/21/2022 02:51:06 PM script INFO: SUCCESS!@#KODE 1!@#USER_ID 98!@#ACTIVITY_CODE 4
12/21/2022 02:51:06 PM script INFO: SUCCESS!@#KODE 1!@#USER_ID 98!@#ACTIVITY_CODE 5
12/21/2022 02:51:06 PM script INFO: SUCCESS!@#KODE 1!@#USER_ID 98!@#ACTIVITY_CODE 5
12/21/2022 02:51:08 PM script INFO: SUCCESS!@#KODE 1!@#USER_ID 98!@#ACTIVITY_CODE 1
12/21/2022 02:51:09 PM script INFO: SUCCESS!@#KODE 1!@#USER_ID 98!@#ACTIVITY_CODE 4
12/21/2022 02:51:09 PM script INFO: SUCCESS!@#KODE 1!@#USER_ID 98!@#ACTIVITY_CODE 1
12/21/2022 02:51:09 PM script INFO: SUCCESS!@#KODE 1!@#USER_ID 98!@#ACTIVITY_CODE 5
12/21/2022 02:51:09 PM script INFO: SUCCESS!@#KODE 1!@#USER_ID 98!@#ACTIVITY_CODE 5
12/21/2022 02:51:11 PM script INFO: SUCCESS!@#KODE 1!@#USER_ID 98!@#ACTIVITY_CODE 5
12/21/2022 02:51:11 PM script INFO: SUCCESS!@#KODE 1!@#USER_ID 98!@#ACTIVITY_CODE 5
12/21/2022 02:51:14 PM script INFO: SUCCESS!@#KODE 1!@#USER_ID 98!@#ACTIVITY_CODE 5
12/21/2022 02:51:14 PM script INFO: SUCCESS!@#KODE 1!@#USER_ID 98!@#ACTIVITY_CODE 5
12/21/2022 02:51:16 PM script INFO: SUCCESS!@#KODE 1!@#USER_ID 98!@#ACTIVITY_CODE 1
12/21/2022 02:51:16 PM script INFO: SUCCESS!@#KODE 1!@#USER_ID 98!@#ACTIVITY_CODE 3
12/21/2022 02:51:17 PM script INFO: SUCCESS!@#KODE 1!@#USER_ID 98!@#ACTIVITY_CODE 2
12/21/2022 02:51:17 PM script INFO: SUCCESS!@#KODE 1!@#USER_ID 98!@#ACTIVITY_CODE 2
12/21/2022 02:51:17 PM script INFO: SUCCESS!@#KODE 1!@#USER_ID 98!@#ACTIVITY_CODE 2
12/21/2022 02:51:18 PM script INFO: SUCCESS!@#KODE 1!@#USER_ID 98!@#ACTIVITY_CODE 2
12/21/2022 02:51:18 PM script INFO: SUCCESS!@#KODE 1!@#USER_ID 98!@#ACTIVITY_CODE 5
12/21/2022 02:51:18 PM script INFO: SUCCESS!@#KODE 1!@#USER_ID 98!@#ACTIVITY_CODE 5
12/21/2022 02:51:20 PM script INFO: SUCCESS!@#KODE 1!@#USER_ID 98!@#ACTIVITY_CODE 1
12/21/2022 02:51:21 PM script INFO: SUCCESS!@#KODE 1!@#USER_ID 98!@#ACTIVITY_CODE 4
12/21/2022 02:51:21 PM script INFO: SUCCESS!@#KODE 1!@#USER_ID 98!@#ACTIVITY_CODE 3
12/21/2022 02:51:21 PM script INFO: SUCCESS!@#KODE 1!@#USER_ID 98!@#ACTIVITY_CODE 3
12/21/2022 02:51:21 PM script INFO: SUCCESS!@#KODE 1!@#USER_ID 98!@#ACTIVITY_CODE 3
12/21/2022 02:51:21 PM script INFO: SUCCESS!@#KODE 1!@#USER_ID 98!@#ACTIVITY_CODE 5
12/21/2022 02:51:21 PM script INFO: SUCCESS!@#KODE 1!@#USER_ID 98!@#ACTIVITY_CODE 5
12/21/2022 02:51:24 PM script INFO: SUCCESS!@#KODE 1!@#USER_ID 98!@#ACTIVITY_CODE 5
12/21/2022 02:51:24 PM script INFO: SUCCESS!@#KODE 1!@#USER_ID 98!@#ACTIVITY_CODE 5
12/21/2022 02:51:26 PM script INFO: SUCCESS!@#KODE 1!@#USER_ID 98!@#ACTIVITY_CODE 2
12/21/2022 02:51:26 PM script INFO: SUCCESS!@#KODE 1!@#USER_ID 98!@#ACTIVITY_CODE 1
12/21/2022 02:51:27 PM script INFO: SUCCESS!@#KODE 1!@#USER_ID 98!@#ACTIVITY_CODE 4
12/21/2022 02:51:27 PM script INFO: SUCCESS!@#KODE 1!@#USER_ID 98!@#ACTIVITY_CODE 2
12/21/2022 02:51:27 PM script INFO: SUCCESS!@#KODE 1!@#USER_ID 98!@#ACTIVITY_CODE 2
12/21/2022 02:51:27 PM script INFO: SUCCESS!@#KODE 1!@#USER_ID 98!@#ACTIVITY_CODE 3
12/21/2022 02:51:27 PM script INFO: SUCCESS!@#KODE 1!@#USER_ID 98!@#ACTIVITY_CODE 5
12/21/2022 02:51:27 PM script INFO: SUCCESS!@#KODE 1!@#USER_ID 98!@#ACTIVITY_CODE 5
12/21/2022 02:51:30 PM script INFO: SUCCESS!@#KODE 1!@#USER_ID 98!@#ACTIVITY_CODE 2
12/21/2022 02:51:30 PM script INFO: SUCCESS!@#KODE 1!@#USER_ID 98!@#ACTIVITY_CODE 2
12/21/2022 02:51:30 PM script INFO: SUCCESS!@#KODE 1!@#USER_ID 98!@#ACTIVITY_CODE 4
12/21/2022 02:51:31 PM script INFO: SUCCESS!@#KODE 1!@#USER_ID 98!@#ACTIVITY_CODE 3
12/21/2022 02:51:31 PM script INFO: SUCCESS!@#KODE 1!@#USER_ID 98!@#ACTIVITY_CODE 3
12/21/2022 02:51:31 PM script INFO: SUCCESS!@#KODE 1!@#USER_ID 98!@#ACTIVITY_CODE 3
12/21/2022 02:51:31 PM script INFO: SUCCESS!@#KODE 1!@#USER_ID 98!@#ACTIVITY_CODE 5
12/21/2022 02:51:31 PM script INFO: SUCCESS!@#KODE 1!@#USER_ID 98!@#ACTIVITY_CODE 5
12/21/2022 02:51:34 PM script INFO: SUCCESS!@#KODE 1!@#USER_ID 98!@#ACTIVITY_CODE 1
12/21/2022 02:51:34 PM script INFO: SUCCESS!@#KODE 1!@#USER_ID 98!@#ACTIVITY_CODE 3
12/21/2022 02:51:34 PM script INFO: SUCCESS!@#KODE 1!@#USER_ID 98!@#ACTIVITY_CODE 1
12/21/2022 02:51:34 PM script INFO: SUCCESS!@#KODE 1!@#USER_ID 98!@#ACTIVITY_CODE 2
12/21/2022 02:51:34 PM script INFO: SUCCESS!@#KODE 1!@#USER_ID 98!@#ACTIVITY_CODE 5
12/21/2022 02:51:34 PM script INFO: SUCCESS!@#KODE 1!@#USER_ID 98!@#ACTIVITY_CODE 5
12/21/2022 02:51:37 PM script INFO: SUCCESS!@#KODE 1!@#USER_ID 98!@#ACTIVITY_CODE 5
12/21/2022 02:51:37 PM script INFO: SUCCESS!@#KODE 1!@#USER_ID 98!@#ACTIVITY_CODE 5
12/21/2022 02:51:39 PM script INFO: SUCCESS!@#KODE 1!@#USER_ID 98!@#ACTIVITY_CODE 5
12/21/2022 02:51:39 PM script INFO: SUCCESS!@#KODE 1!@#USER_ID 98!@#ACTIVITY_CODE 5
12/21/2022 02:51:42 PM script INFO: SUCCESS!@#KODE 1!@#USER_ID 98!@#ACTIVITY_CODE 2
12/21/2022 02:51:42 PM script INFO: SUCCESS!@#KODE 1!@#USER_ID 98!@#ACTIVITY_CODE 3
12/21/2022 02:51:42 PM script INFO: SUCCESS!@#KODE 1!@#USER_ID 98!@#ACTIVITY_CODE 3
12/21/2022 02:51:42 PM script INFO: SUCCESS!@#KODE 1!@#USER_ID 98!@#ACTIVITY_CODE 3
12/21/2022 02:51:43 PM script INFO: SUCCESS!@#KODE 1!@#USER_ID 98!@#ACTIVITY_CODE 1
12/21/2022 02:51:43 PM script INFO: SUCCESS!@#KODE 1!@#USER_ID 98!@#ACTIVITY_CODE 2
12/21/2022 02:51:43 PM script INFO: SUCCESS!@#KODE 1!@#USER_ID 98!@#ACTIVITY_CODE 2
12/21/2022 02:51:43 PM script INFO: SUCCESS!@#KODE 1!@#USER_ID 98!@#ACTIVITY_CODE 3
12/21/2022 02:51:43 PM script INFO: SUCCESS!@#KODE 1!@#USER_ID 98!@#ACTIVITY_CODE 3
12/21/2022 02:51:43 PM script INFO: SUCCESS!@#KODE 1!@#USER_ID 98!@#ACTIVITY_CODE 5
12/21/2022 02:51:43 PM script INFO: SUCCESS!@#KODE 1!@#USER_ID 98!@#ACTIVITY_CODE 5
12/21/2022 02:51:46 PM script INFO: SUCCESS!@#KODE 1!@#USER_ID 98!@#ACTIVITY_CODE 2
12/21/2022 02:51:46 PM script INFO: SUCCESS!@#KODE 1!@#USER_ID 98!@#ACTIVITY_CODE 3
12/21/2022 02:51:47 PM script INFO: SUCCESS!@#KODE 1!@#USER_ID 98!@#ACTIVITY_CODE 1
12/21/2022 02:51:47 PM script INFO: SUCCESS!@#KODE 1!@#USER_ID 98!@#ACTIVITY_CODE 5
12/21/2022 02:51:47 PM script INFO: SUCCESS!@#KODE 1!@#USER_ID 98!@#ACTIVITY_CODE 5
12/21/2022 02:51:49 PM script INFO: SUCCESS!@#KODE 1!@#USER_ID 98!@#ACTIVITY_CODE 4
12/21/2022 02:51:49 PM script INFO: SUCCESS!@#KODE 1!@#USER_ID 98!@#ACTIVITY_CODE 1
12/21/2022 02:51:50 PM script INFO: SUCCESS!@#KODE 1!@#USER_ID 98!@#ACTIVITY_CODE 2
12/21/2022 02:51:50 PM script INFO: SUCCESS!@#KODE 1!@#USER_ID 98!@#ACTIVITY_CODE 2
12/21/2022 02:51:50 PM script INFO: SUCCESS!@#KODE 1!@#USER_ID 98!@#ACTIVITY_CODE 3
12/21/2022 02:51:50 PM script INFO: SUCCESS!@#KODE 1!@#USER_ID 98!@#ACTIVITY_CODE 1
12/21/2022 02:51:51 PM script INFO: SUCCESS!@#KODE 1!@#USER_ID 98!@#ACTIVITY_CODE 1
12/21/2022 02:51:51 PM script INFO: SUCCESS!@#KODE 1!@#USER_ID 98!@#ACTIVITY_CODE 3
12/21/2022 02:51:51 PM script INFO: SUCCESS!@#KODE 1!@#USER_ID 98!@#ACTIVITY_CODE 2
12/21/2022 02:51:51 PM script INFO: SUCCESS!@#KODE 1!@#USER_ID 98!@#ACTIVITY_CODE 4
12/21/2022 02:51:52 PM script INFO: SUCCESS!@#KODE 1!@#USER_ID 98!@#ACTIVITY_CODE 2
12/21/2022 02:51:52 PM script INFO: SUCCESS!@#KODE 1!@#USER_ID 98!@#ACTIVITY_CODE 2
12/21/2022 02:51:52 PM script INFO: SUCCESS!@#KODE 1!@#USER_ID 98!@#ACTIVITY_CODE 2
12/21/2022 02:51:53 PM script INFO: SUCCESS!@#KODE 1!@#USER_ID 98!@#ACTIVITY_CODE 1
12/21/2022 02:51:53 PM script INFO: SUCCESS!@#KODE 1!@#USER_ID 98!@#ACTIVITY_CODE 3
12/21/2022 02:51:53 PM script INFO: SUCCESS!@#KODE 1!@#USER_ID 98!@#ACTIVITY_CODE 3
12/21/2022 02:51:53 PM script INFO: SUCCESS!@#KODE 1!@#USER_ID 98!@#ACTIVITY_CODE 3
12/21/2022 02:51:53 PM script INFO: SUCCESS!@#KODE 1!@#USER_ID 98!@#ACTIVITY_CODE 1
12/21/2022 02:51:53 PM script INFO: SUCCESS!@#KODE 1!@#USER_ID 98!@#ACTIVITY_CODE 2
12/21/2022 02:51:53 PM script INFO: SUCCESS!@#KODE 1!@#USER_ID 98!@#ACTIVITY_CODE 3
12/21/2022 02:51:54 PM script INFO: SUCCESS!@#KODE 1!@#USER_ID 98!@#ACTIVITY_CODE 2
12/21/2022 02:51:54 PM script INFO: SUCCESS!@#KODE 1!@#USER_ID 98!@#ACTIVITY_CODE 3
12/21/2022 02:51:54 PM script INFO: SUCCESS!@#KODE 1!@#USER_ID 98!@#ACTIVITY_CODE 4
12/21/2022 02:51:54 PM script INFO: SUCCESS!@#KODE 1!@#USER_ID 98!@#ACTIVITY_CODE 1
12/21/2022 02:51:54 PM script INFO: SUCCESS!@#KODE 1!@#USER_ID 98!@#ACTIVITY_CODE 2
12/21/2022 02:51:55 PM script INFO: SUCCESS!@#KODE 1!@#USER_ID 98!@#ACTIVITY_CODE 3
12/21/2022 02:51:55 PM script INFO: SUCCESS!@#KODE 1!@#USER_ID 98!@#ACTIVITY_CODE 1
12/21/2022 02:51:55 PM script INFO: SUCCESS!@#KODE 1!@#USER_ID 98!@#ACTIVITY_CODE 1
12/21/2022 02:51:55 PM script INFO: SUCCESS!@#KODE 1!@#USER_ID 98!@#ACTIVITY_CODE 1
12/21/2022 02:51:55 PM script INFO: SUCCESS!@#KODE 1!@#USER_ID 98!@#ACTIVITY_CODE 1
12/21/2022 02:51:55 PM script INFO: SUCCESS!@#KODE 1!@#USER_ID 98!@#ACTIVITY_CODE 4
12/21/2022 02:51:56 PM script INFO: SUCCESS!@#KODE 1!@#USER_ID 98!@#ACTIVITY_CODE 1
12/21/2022 02:51:56 PM script INFO: SUCCESS!@#KODE 1!@#USER_ID 98!@#ACTIVITY_CODE 2
12/21/2022 02:51:56 PM script INFO: SUCCESS!@#KODE 1!@#USER_ID 98!@#ACTIVITY_CODE 2
12/21/2022 02:51:56 PM script INFO: SUCCESS!@#KODE 1!@#USER_ID 98!@#ACTIVITY_CODE 1
12/21/2022 02:51:57 PM script INFO: SUCCESS!@#KODE 1!@#USER_ID 98!@#ACTIVITY_CODE 1
12/21/2022 02:51:57 PM script INFO: SUCCESS!@#KODE 1!@#USER_ID 98!@#ACTIVITY_CODE 2
12/21/2022 02:51:57 PM script INFO: SUCCESS!@#KODE 1!@#USER_ID 98!@#ACTIVITY_CODE 3
12/21/2022 02:51:57 PM script INFO: SUCCESS!@#KODE 1!@#USER_ID 98!@#ACTIVITY_CODE 2
12/21/2022 02:51:58 PM script INFO: SUCCESS!@#KODE 1!@#USER_ID 98!@#ACTIVITY_CODE 4
12/21/2022 02:51:58 PM script INFO: SUCCESS!@#KODE 1!@#USER_ID 98!@#ACTIVITY_CODE 2
12/21/2022 02:51:59 PM script INFO: SUCCESS!@#KODE 1!@#USER_ID 98!@#ACTIVITY_CODE 2
12/21/2022 02:51:59 PM script INFO: SUCCESS!@#KODE 1!@#USER_ID 98!@#ACTIVITY_CODE 3
12/21/2022 02:51:59 PM script INFO: SUCCESS!@#KODE 1!@#USER_ID 98!@#ACTIVITY_CODE 4
12/21/2022 02:52:00 PM script INFO: SUCCESS!@#KODE 1!@#USER_ID 98!@#ACTIVITY_CODE 3
12/21/2022 02:52:00 PM script INFO: SUCCESS!@#KODE 1!@#USER_ID 98!@#ACTIVITY_CODE 2
12/21/2022 02:52:00 PM script INFO: SUCCESS!@#KODE 1!@#USER_ID 98!@#ACTIVITY_CODE 2
12/21/2022 02:52:00 PM script INFO: SUCCESS!@#KODE 1!@#USER_ID 98!@#ACTIVITY_CODE 2
12/21/2022 02:52:01 PM script INFO: SUCCESS!@#KODE 1!@#USER_ID 98!@#ACTIVITY_CODE 2
12/21/2022 02:52:01 PM script INFO: SUCCESS!@#KODE 1!@#USER_ID 98!@#ACTIVITY_CODE 3
12/21/2022 02:52:01 PM script INFO: SUCCESS!@#KODE 1!@#USER_ID 98!@#ACTIVITY_CODE 1
12/21/2022 02:52:01 PM script INFO: SUCCESS!@#KODE 1!@#USER_ID 98!@#ACTIVITY_CODE 4
12/21/2022 02:52:02 PM script INFO: SUCCESS!@#KODE 1!@#USER_ID 98!@#ACTIVITY_CODE 1
12/21/2022 02:52:02 PM script INFO: SUCCESS!@#KODE 1!@#USER_ID 98!@#ACTIVITY_CODE 1
12/21/2022 02:52:02 PM script INFO: SUCCESS!@#KODE 1!@#USER_ID 98!@#ACTIVITY_CODE 2
12/21/2022 02:52:02 PM script INFO: SUCCESS!@#KODE 1!@#USER_ID 98!@#ACTIVITY_CODE 1
12/21/2022 02:52:02 PM script INFO: SUCCESS!@#KODE 1!@#USER_ID 98!@#ACTIVITY_CODE 4
12/21/2022 02:52:02 PM script INFO: SUCCESS!@#KODE 1!@#USER_ID 98!@#ACTIVITY_CODE 1
12/21/2022 02:52:02 PM script INFO: SUCCESS!@#KODE 1!@#USER_ID 98!@#ACTIVITY_CODE 4
12/21/2022 02:52:03 PM script INFO: SUCCESS!@#KODE 1!@#USER_ID 98!@#ACTIVITY_CODE 2
12/21/2022 02:52:03 PM script INFO: SUCCESS!@#KODE 1!@#USER_ID 98!@#ACTIVITY_CODE 1
12/21/2022 02:52:03 PM script INFO: SUCCESS!@#KODE 1!@#USER_ID 98!@#ACTIVITY_CODE 1
12/21/2022 02:52:03 PM script INFO: SUCCESS!@#KODE 1!@#USER_ID 98!@#ACTIVITY_CODE 2
12/21/2022 02:52:04 PM script INFO: SUCCESS!@#KODE 1!@#USER_ID 98!@#ACTIVITY_CODE 2
12/21/2022 02:52:04 PM script INFO: SUCCESS!@#KODE 1!@#USER_ID 98!@#ACTIVITY_CODE 4
12/21/2022 02:52:04 PM script INFO: SUCCESS!@#KODE 1!@#USER_ID 98!@#ACTIVITY_CODE 2
12/21/2022 02:52:04 PM script INFO: SUCCESS!@#KODE 1!@#USER_ID 98!@#ACTIVITY_CODE 1
12/21/2022 02:52:04 PM script INFO: SUCCESS!@#KODE 1!@#USER_ID 98!@#ACTIVITY_CODE 1
12/21/2022 02:52:04 PM script INFO: SUCCESS!@#KODE 1!@#USER_ID 98!@#ACTIVITY_CODE 1
12/21/2022 02:52:05 PM script INFO: SUCCESS!@#KODE 1!@#USER_ID 98!@#ACTIVITY_CODE 4
12/21/2022 02:52:05 PM script INFO: SUCCESS!@#KODE 1!@#USER_ID 98!@#ACTIVITY_CODE 2
12/21/2022 02:52:05 PM script INFO: SUCCESS!@#KODE 1!@#USER_ID 98!@#ACTIVITY_CODE 1
12/21/2022 02:52:05 PM script INFO: SUCCESS!@#KODE 1!@#USER_ID 98!@#ACTIVITY_CODE 3
12/21/2022 02:52:06 PM script INFO: SUCCESS!@#KODE 1!@#USER_ID 98!@#ACTIVITY_CODE 2
12/21/2022 02:52:06 PM script INFO: SUCCESS!@#KODE 1!@#USER_ID 98!@#ACTIVITY_CODE 4
12/21/2022 02:52:06 PM script INFO: SUCCESS!@#KODE 1!@#USER_ID 98!@#ACTIVITY_CODE 3
12/21/2022 02:52:06 PM script INFO: SUCCESS!@#KODE 1!@#USER_ID 98!@#ACTIVITY_CODE 1
12/21/2022 02:52:06 PM script INFO: SUCCESS!@#KODE 1!@#USER_ID 98!@#ACTIVITY_CODE 2
12/21/2022 02:52:07 PM script INFO: SUCCESS!@#KODE 1!@#USER_ID 98!@#ACTIVITY_CODE 3
12/21/2022 02:52:07 PM script INFO: SUCCESS!@#KODE 1!@#USER_ID 98!@#ACTIVITY_CODE 2
12/21/2022 02:52:07 PM script INFO: SUCCESS!@#KODE 1!@#USER_ID 98!@#ACTIVITY_CODE 3
12/21/2022 02:52:07 PM script INFO: SUCCESS!@#KODE 1!@#USER_ID 98!@#ACTIVITY_CODE 3
12/21/2022 02:52:07 PM script INFO: SUCCESS!@#KODE 1!@#USER_ID 98!@#ACTIVITY_CODE 3
12/21/2022 02:52:08 PM script INFO: SUCCESS!@#KODE 1!@#USER_ID 98!@#ACTIVITY_CODE 2
12/21/2022 02:52:08 PM script INFO: SUCCESS!@#KODE 1!@#USER_ID 98!@#ACTIVITY_CODE 1
12/21/2022 02:52:08 PM script INFO: SUCCESS!@#KODE 1!@#USER_ID 98!@#ACTIVITY_CODE 4
12/21/2022 02:52:08 PM script INFO: SUCCESS!@#KODE 1!@#USER_ID 98!@#ACTIVITY_CODE 2
12/21/2022 02:52:08 PM script INFO: SUCCESS!@#KODE 1!@#USER_ID 98!@#ACTIVITY_CODE 1
12/21/2022 02:52:08 PM script INFO: SUCCESS!@#KODE 1!@#USER_ID 98!@#ACTIVITY_CODE 1
12/21/2022 02:52:09 PM script INFO: SUCCESS!@#KODE 1!@#USER_ID 98!@#ACTIVITY_CODE 1
12/21/2022 02:52:09 PM script INFO: SUCCESS!@#KODE 1!@#USER_ID 98!@#ACTIVITY_CODE 2
12/21/2022 02:52:09 PM script INFO: SUCCESS!@#KODE 1!@#USER_ID 98!@#ACTIVITY_CODE 2
12/21/2022 02:52:10 PM script INFO: SUCCESS!@#KODE 1!@#USER_ID 98!@#ACTIVITY_CODE 2
12/21/2022 02:52:10 PM script INFO: SUCCESS!@#KODE 1!@#USER_ID 98!@#ACTIVITY_CODE 4
12/21/2022 02:52:10 PM script INFO: SUCCESS!@#KODE 1!@#USER_ID 98!@#ACTIVITY_CODE 1
12/21/2022 02:52:10 PM script INFO: SUCCESS!@#KODE 1!@#USER_ID 98!@#ACTIVITY_CODE 3
12/21/2022 02:52:10 PM script INFO: SUCCESS!@#KODE 1!@#USER_ID 98!@#ACTIVITY_CODE 3
12/21/2022 02:52:10 PM script INFO: SUCCESS!@#KODE 1!@#USER_ID 98!@#ACTIVITY_CODE 1
12/21/2022 02:52:10 PM script INFO: SUCCESS!@#KODE 1!@#USER_ID 98!@#ACTIVITY_CODE 1
12/21/2022 02:52:10 PM script INFO: SUCCESS!@#KODE 1!@#USER_ID 98!@#ACTIVITY_CODE 4
12/21/2022 02:52:11 PM script INFO: SUCCESS!@#KODE 1!@#USER_ID 98!@#ACTIVITY_CODE 1
12/21/2022 02:52:11 PM script INFO: SUCCESS!@#KODE 1!@#USER_ID 98!@#ACTIVITY_CODE 3
12/21/2022 02:52:11 PM script INFO: SUCCESS!@#KODE 1!@#USER_ID 98!@#ACTIVITY_CODE 1
12/21/2022 02:52:11 PM script INFO: SUCCESS!@#KODE 1!@#USER_ID 98!@#ACTIVITY_CODE 2
12/21/2022 02:52:11 PM script INFO: SUCCESS!@#KODE 1!@#USER_ID 98!@#ACTIVITY_CODE 1
12/21/2022 02:52:12 PM script INFO: SUCCESS!@#KODE 1!@#USER_ID 98!@#ACTIVITY_CODE 3
12/21/2022 02:52:12 PM script INFO: SUCCESS!@#KODE 1!@#USER_ID 98!@#ACTIVITY_CODE 1
12/21/2022 02:52:12 PM script INFO: SUCCESS!@#KODE 1!@#USER_ID 98!@#ACTIVITY_CODE 2
12/21/2022 02:52:12 PM script INFO: SUCCESS!@#KODE 1!@#USER_ID 98!@#ACTIVITY_CODE 3
12/21/2022 02:52:12 PM script INFO: SUCCESS!@#KODE 1!@#USER_ID 98!@#ACTIVITY_CODE 2
12/21/2022 02:52:13 PM script INFO: SUCCESS!@#KODE 1!@#USER_ID 98!@#ACTIVITY_CODE 3
12/21/2022 02:52:13 PM script INFO: SUCCESS!@#KODE 1!@#USER_ID 98!@#ACTIVITY_CODE 1
12/21/2022 02:52:13 PM script INFO: SUCCESS!@#KODE 1!@#USER_ID 98!@#ACTIVITY_CODE 3
12/21/2022 02:52:13 PM script INFO: SUCCESS!@#KODE 1!@#USER_ID 98!@#ACTIVITY_CODE 2
12/21/2022 02:52:13 PM script INFO: SUCCESS!@#KODE 1!@#USER_ID 98!@#ACTIVITY_CODE 2
12/21/2022 02:52:13 PM script INFO: SUCCESS!@#KODE 1!@#USER_ID 98!@#ACTIVITY_CODE 1
12/21/2022 02:52:14 PM script INFO: SUCCESS!@#KODE 1!@#USER_ID 98!@#ACTIVITY_CODE 1
12/21/2022 02:52:14 PM script INFO: SUCCESS!@#KODE 1!@#USER_ID 98!@#ACTIVITY_CODE 2
12/21/2022 02:52:14 PM script INFO: SUCCESS!@#KODE 1!@#USER_ID 98!@#ACTIVITY_CODE 2
12/21/2022 02:52:14 PM script INFO: SUCCESS!@#KODE 1!@#USER_ID 98!@#ACTIVITY_CODE 2
12/21/2022 02:52:15 PM script INFO: SUCCESS!@#KODE 1!@#USER_ID 98!@#ACTIVITY_CODE 2
12/21/2022 02:52:15 PM script INFO: SUCCESS!@#KODE 1!@#USER_ID 98!@#ACTIVITY_CODE 3
12/21/2022 02:52:15 PM script INFO: SUCCESS!@#KODE 1!@#USER_ID 98!@#ACTIVITY_CODE 2
12/21/2022 02:52:15 PM script INFO: SUCCESS!@#KODE 1!@#USER_ID 98!@#ACTIVITY_CODE 3
12/21/2022 02:52:15 PM script INFO: SUCCESS!@#KODE 1!@#USER_ID 98!@#ACTIVITY_CODE 4
12/21/2022 02:52:15 PM script INFO: SUCCESS!@#KODE 1!@#USER_ID 98!@#ACTIVITY_CODE 1
12/21/2022 02:52:16 PM script INFO: SUCCESS!@#KODE 1!@#USER_ID 98!@#ACTIVITY_CODE 2
12/21/2022 02:52:16 PM script INFO: SUCCESS!@#KODE 1!@#USER_ID 98!@#ACTIVITY_CODE 3
12/21/2022 02:52:16 PM script INFO: SUCCESS!@#KODE 1!@#USER_ID 98!@#ACTIVITY_CODE 3
12/21/2022 02:52:16 PM script INFO: SUCCESS!@#KODE 1!@#USER_ID 98!@#ACTIVITY_CODE 2
12/21/2022 02:52:16 PM script INFO: SUCCESS!@#KODE 1!@#USER_ID 98!@#ACTIVITY_CODE 2
12/21/2022 02:52:16 PM script INFO: SUCCESS!@#KODE 1!@#USER_ID 98!@#ACTIVITY_CODE 1
12/21/2022 02:52:17 PM script INFO: SUCCESS!@#KODE 1!@#USER_ID 98!@#ACTIVITY_CODE 4
12/21/2022 02:52:17 PM script INFO: SUCCESS!@#KODE 1!@#USER_ID 98!@#ACTIVITY_CODE 2
12/21/2022 02:52:17 PM script INFO: SUCCESS!@#KODE 1!@#USER_ID 98!@#ACTIVITY_CODE 2
12/21/2022 02:52:17 PM script INFO: SUCCESS!@#KODE 1!@#USER_ID 98!@#ACTIVITY_CODE 3
12/21/2022 02:52:17 PM script INFO: SUCCESS!@#KODE 1!@#USER_ID 98!@#ACTIVITY_CODE 3
12/21/2022 02:52:18 PM script INFO: SUCCESS!@#KODE 1!@#USER_ID 98!@#ACTIVITY_CODE 2
12/21/2022 02:52:18 PM script INFO: SUCCESS!@#KODE 1!@#USER_ID 98!@#ACTIVITY_CODE 2
12/21/2022 02:52:18 PM script INFO: SUCCESS!@#KODE 1!@#USER_ID 98!@#ACTIVITY_CODE 3
12/21/2022 02:52:18 PM script INFO: SUCCESS!@#KODE 1!@#USER_ID 98!@#ACTIVITY_CODE 2
12/21/2022 02:52:18 PM script INFO: SUCCESS!@#KODE 1!@#USER_ID 98!@#ACTIVITY_CODE 3
12/21/2022 02:52:18 PM script INFO: SUCCESS!@#KODE 1!@#USER_ID 98!@#ACTIVITY_CODE 3
12/21/2022 02:52:19 PM script INFO: SUCCESS!@#KODE 1!@#USER_ID 98!@#ACTIVITY_CODE 3
12/21/2022 02:52:19 PM script INFO: SUCCESS!@#KODE 1!@#USER_ID 98!@#ACTIVITY_CODE 2
12/21/2022 02:52:19 PM script INFO: SUCCESS!@#KODE 1!@#USER_ID 98!@#ACTIVITY_CODE 4
12/21/2022 02:52:19 PM script INFO: SUCCESS!@#KODE 1!@#USER_ID 98!@#ACTIVITY_CODE 3
12/21/2022 02:52:19 PM script INFO: SUCCESS!@#KODE 1!@#USER_ID 98!@#ACTIVITY_CODE 3
12/21/2022 02:52:19 PM script INFO: SUCCESS!@#KODE 1!@#USER_ID 98!@#ACTIVITY_CODE 3
12/21/2022 02:52:19 PM script INFO: SUCCESS!@#KODE 1!@#USER_ID 98!@#ACTIVITY_CODE 3
12/21/2022 02:52:19 PM script INFO: SUCCESS!@#KODE 1!@#USER_ID 98!@#ACTIVITY_CODE 3
12/21/2022 02:52:20 PM script INFO: SUCCESS!@#KODE 1!@#USER_ID 98!@#ACTIVITY_CODE 3
12/21/2022 02:52:20 PM script INFO: SUCCESS!@#KODE 1!@#USER_ID 98!@#ACTIVITY_CODE 1
12/21/2022 02:52:20 PM script INFO: SUCCESS!@#KODE 1!@#USER_ID 98!@#ACTIVITY_CODE 3
12/21/2022 02:52:20 PM script INFO: SUCCESS!@#KODE 1!@#USER_ID 98!@#ACTIVITY_CODE 2
12/21/2022 02:52:20 PM script INFO: SUCCESS!@#KODE 1!@#USER_ID 98!@#ACTIVITY_CODE 2
12/21/2022 02:52:20 PM script INFO: SUCCESS!@#KODE 1!@#USER_ID 98!@#ACTIVITY_CODE 1
12/21/2022 02:52:20 PM script INFO: SUCCESS!@#KODE 1!@#USER_ID 98!@#ACTIVITY_CODE 3
12/21/2022 02:52:21 PM script INFO: SUCCESS!@#KODE 1!@#USER_ID 98!@#ACTIVITY_CODE 3
12/21/2022 02:52:21 PM script INFO: SUCCESS!@#KODE 1!@#USER_ID 98!@#ACTIVITY_CODE 2
12/21/2022 02:52:21 PM script INFO: SUCCESS!@#KODE 1!@#USER_ID 98!@#ACTIVITY_CODE 2
12/21/2022 02:52:21 PM script INFO: SUCCESS!@#KODE 1!@#USER_ID 98!@#ACTIVITY_CODE 2
12/21/2022 02:52:22 PM script INFO: SUCCESS!@#KODE 1!@#USER_ID 98!@#ACTIVITY_CODE 2
12/21/2022 02:52:22 PM script INFO: SUCCESS!@#KODE 1!@#USER_ID 98!@#ACTIVITY_CODE 3
12/21/2022 02:52:22 PM script INFO: SUCCESS!@#KODE 1!@#USER_ID 98!@#ACTIVITY_CODE 4
12/21/2022 02:52:22 PM script INFO: SUCCESS!@#KODE 1!@#USER_ID 98!@#ACTIVITY_CODE 2
12/21/2022 02:52:22 PM script INFO: SUCCESS!@#KODE 1!@#USER_ID 98!@#ACTIVITY_CODE 2
12/21/2022 02:52:22 PM script INFO: SUCCESS!@#KODE 1!@#USER_ID 98!@#ACTIVITY_CODE 2
12/21/2022 02:52:23 PM script INFO: SUCCESS!@#KODE 1!@#USER_ID 98!@#ACTIVITY_CODE 2
12/21/2022 02:52:23 PM script INFO: SUCCESS!@#KODE 1!@#USER_ID 98!@#ACTIVITY_CODE 2
12/21/2022 02:52:23 PM script INFO: SUCCESS!@#KODE 1!@#USER_ID 98!@#ACTIVITY_CODE 3
12/21/2022 02:52:23 PM script INFO: SUCCESS!@#KODE 1!@#USER_ID 98!@#ACTIVITY_CODE 1
12/21/2022 02:52:23 PM script INFO: SUCCESS!@#KODE 1!@#USER_ID 98!@#ACTIVITY_CODE 3
12/21/2022 02:52:23 PM script INFO: SUCCESS!@#KODE 1!@#USER_ID 98!@#ACTIVITY_CODE 3
12/21/2022 02:52:23 PM script INFO: SUCCESS!@#KODE 1!@#USER_ID 98!@#ACTIVITY_CODE 3
12/21/2022 02:52:23 PM script INFO: SUCCESS!@#KODE 1!@#USER_ID 98!@#ACTIVITY_CODE 1
12/21/2022 02:52:24 PM script INFO: SUCCESS!@#KODE 1!@#USER_ID 98!@#ACTIVITY_CODE 1
12/21/2022 02:52:24 PM script INFO: SUCCESS!@#KODE 1!@#USER_ID 98!@#ACTIVITY_CODE 1
12/21/2022 02:52:24 PM script INFO: SUCCESS!@#KODE 1!@#USER_ID 98!@#ACTIVITY_CODE 2
12/21/2022 02:52:24 PM script INFO: SUCCESS!@#KODE 1!@#USER_ID 98!@#ACTIVITY_CODE 2
12/21/2022 02:52:24 PM script INFO: SUCCESS!@#KODE 1!@#USER_ID 98!@#ACTIVITY_CODE 1
12/21/2022 02:52:24 PM script INFO: SUCCESS!@#KODE 1!@#USER_ID 98!@#ACTIVITY_CODE 3
12/21/2022 02:52:24 PM script INFO: SUCCESS!@#KODE 1!@#USER_ID 98!@#ACTIVITY_CODE 3
12/21/2022 02:52:24 PM script INFO: SUCCESS!@#KODE 1!@#USER_ID 98!@#ACTIVITY_CODE 1
12/21/2022 02:52:24 PM script INFO: SUCCESS!@#KODE 1!@#USER_ID 98!@#ACTIVITY_CODE 3
12/21/2022 02:52:24 PM script INFO: SUCCESS!@#KODE 1!@#USER_ID 98!@#ACTIVITY_CODE 1
12/21/2022 02:52:25 PM script INFO: SUCCESS!@#KODE 1!@#USER_ID 98!@#ACTIVITY_CODE 3
12/21/2022 02:52:25 PM script INFO: SUCCESS!@#KODE 1!@#USER_ID 98!@#ACTIVITY_CODE 1
12/21/2022 02:52:25 PM script INFO: SUCCESS!@#KODE 1!@#USER_ID 98!@#ACTIVITY_CODE 2
12/21/2022 02:52:25 PM script INFO: SUCCESS!@#KODE 1!@#USER_ID 98!@#ACTIVITY_CODE 2
12/21/2022 02:52:25 PM script INFO: SUCCESS!@#KODE 1!@#USER_ID 98!@#ACTIVITY_CODE 3
12/21/2022 02:52:25 PM script INFO: SUCCESS!@#KODE 1!@#USER_ID 98!@#ACTIVITY_CODE 1
12/21/2022 02:52:25 PM script INFO: SUCCESS!@#KODE 1!@#USER_ID 98!@#ACTIVITY_CODE 1
12/21/2022 02:52:25 PM script INFO: SUCCESS!@#KODE 1!@#USER_ID 98!@#ACTIVITY_CODE 3
12/21/2022 02:52:26 PM script INFO: SUCCESS!@#KODE 1!@#USER_ID 98!@#ACTIVITY_CODE 2
12/21/2022 02:52:26 PM script INFO: SUCCESS!@#KODE 1!@#USER_ID 98!@#ACTIVITY_CODE 1
12/21/2022 02:52:26 PM script INFO: SUCCESS!@#KODE 1!@#USER_ID 98!@#ACTIVITY_CODE 1
12/21/2022 02:52:26 PM script INFO: SUCCESS!@#KODE 1!@#USER_ID 98!@#ACTIVITY_CODE 3
12/21/2022 02:52:26 PM script INFO: SUCCESS!@#KODE 1!@#USER_ID 98!@#ACTIVITY_CODE 3
12/21/2022 02:52:26 PM script INFO: SUCCESS!@#KODE 1!@#USER_ID 98!@#ACTIVITY_CODE 2
12/21/2022 02:52:26 PM script INFO: SUCCESS!@#KODE 1!@#USER_ID 98!@#ACTIVITY_CODE 2
12/21/2022 02:52:27 PM script INFO: SUCCESS!@#KODE 1!@#USER_ID 98!@#ACTIVITY_CODE 2
12/21/2022 02:52:27 PM script INFO: SUCCESS!@#KODE 1!@#USER_ID 98!@#ACTIVITY_CODE 2
12/21/2022 02:52:27 PM script INFO: SUCCESS!@#KODE 1!@#USER_ID 98!@#ACTIVITY_CODE 4
12/21/2022 02:52:27 PM script INFO: SUCCESS!@#KODE 1!@#USER_ID 98!@#ACTIVITY_CODE 3
12/21/2022 02:52:27 PM script INFO: SUCCESS!@#KODE 1!@#USER_ID 98!@#ACTIVITY_CODE 1
12/21/2022 02:52:27 PM script INFO: SUCCESS!@#KODE 1!@#USER_ID 98!@#ACTIVITY_CODE 2
12/21/2022 02:52:27 PM script INFO: SUCCESS!@#KODE 1!@#USER_ID 98!@#ACTIVITY_CODE 2
12/21/2022 02:52:28 PM script INFO: SUCCESS!@#KODE 1!@#USER_ID 98!@#ACTIVITY_CODE 1
12/21/2022 02:52:28 PM script INFO: SUCCESS!@#KODE 1!@#USER_ID 98!@#ACTIVITY_CODE 2
12/21/2022 02:52:28 PM script INFO: SUCCESS!@#KODE 1!@#USER_ID 98!@#ACTIVITY_CODE 4
12/21/2022 02:52:28 PM script INFO: SUCCESS!@#KODE 1!@#USER_ID 98!@#ACTIVITY_CODE 3
12/21/2022 02:52:28 PM script INFO: SUCCESS!@#KODE 1!@#USER_ID 98!@#ACTIVITY_CODE 2
12/21/2022 02:52:28 PM script INFO: SUCCESS!@#KODE 1!@#USER_ID 98!@#ACTIVITY_CODE 2
12/21/2022 02:52:29 PM script INFO: SUCCESS!@#KODE 1!@#USER_ID 98!@#ACTIVITY_CODE 2
12/21/2022 02:52:29 PM script INFO: SUCCESS!@#KODE 1!@#USER_ID 98!@#ACTIVITY_CODE 2
12/21/2022 02:52:29 PM script INFO: SUCCESS!@#KODE 1!@#USER_ID 98!@#ACTIVITY_CODE 3
12/21/2022 02:52:29 PM script INFO: SUCCESS!@#KODE 1!@#USER_ID 98!@#ACTIVITY_CODE 2
12/21/2022 02:52:29 PM script INFO: SUCCESS!@#KODE 1!@#USER_ID 98!@#ACTIVITY_CODE 2
12/21/2022 02:52:30 PM script INFO: SUCCESS!@#KODE 1!@#USER_ID 98!@#ACTIVITY_CODE 2
12/21/2022 02:52:30 PM script INFO: SUCCESS!@#KODE 1!@#USER_ID 98!@#ACTIVITY_CODE 1
12/21/2022 02:52:30 PM script INFO: SUCCESS!@#KODE 1!@#USER_ID 98!@#ACTIVITY_CODE 2
12/21/2022 02:52:30 PM script INFO: SUCCESS!@#KODE 1!@#USER_ID 98!@#ACTIVITY_CODE 1
12/21/2022 02:52:30 PM script INFO: SUCCESS!@#KODE 1!@#USER_ID 98!@#ACTIVITY_CODE 1
12/21/2022 02:52:30 PM script INFO: SUCCESS!@#KODE 1!@#USER_ID 98!@#ACTIVITY_CODE 1
12/21/2022 02:52:30 PM script INFO: SUCCESS!@#KODE 1!@#USER_ID 98!@#ACTIVITY_CODE 3
12/21/2022 02:52:30 PM script INFO: SUCCESS!@#KODE 1!@#USER_ID 98!@#ACTIVITY_CODE 4
12/21/2022 02:52:31 PM script INFO: SUCCESS!@#KODE 1!@#USER_ID 98!@#ACTIVITY_CODE 2
12/21/2022 02:52:31 PM script INFO: SUCCESS!@#KODE 1!@#USER_ID 98!@#ACTIVITY_CODE 2
12/21/2022 02:52:31 PM script INFO: SUCCESS!@#KODE 1!@#USER_ID 98!@#ACTIVITY_CODE 2
12/21/2022 02:52:31 PM script INFO: SUCCESS!@#KODE 1!@#USER_ID 98!@#ACTIVITY_CODE 4
12/21/2022 02:52:31 PM script INFO: SUCCESS!@#KODE 1!@#USER_ID 98!@#ACTIVITY_CODE 3
12/21/2022 02:52:31 PM script INFO: SUCCESS!@#KODE 1!@#USER_ID 98!@#ACTIVITY_CODE 2
12/21/2022 02:52:32 PM script INFO: SUCCESS!@#KODE 1!@#USER_ID 98!@#ACTIVITY_CODE 2
12/21/2022 02:52:32 PM script INFO: SUCCESS!@#KODE 1!@#USER_ID 98!@#ACTIVITY_CODE 1
12/21/2022 02:52:32 PM script INFO: SUCCESS!@#KODE 1!@#USER_ID 98!@#ACTIVITY_CODE 4
12/21/2022 02:52:32 PM script INFO: SUCCESS!@#KODE 1!@#USER_ID 98!@#ACTIVITY_CODE 1
12/21/2022 02:52:32 PM script INFO: SUCCESS!@#KODE 1!@#USER_ID 98!@#ACTIVITY_CODE 3
12/21/2022 02:52:32 PM script INFO: SUCCESS!@#KODE 1!@#USER_ID 98!@#ACTIVITY_CODE 3
12/21/2022 02:52:32 PM script INFO: SUCCESS!@#KODE 1!@#USER_ID 98!@#ACTIVITY_CODE 2
12/21/2022 02:52:32 PM script INFO: SUCCESS!@#KODE 1!@#USER_ID 98!@#ACTIVITY_CODE 2
12/21/2022 02:52:33 PM script INFO: SUCCESS!@#KODE 1!@#USER_ID 98!@#ACTIVITY_CODE 2
12/21/2022 02:52:33 PM script INFO: SUCCESS!@#KODE 1!@#USER_ID 98!@#ACTIVITY_CODE 4
12/21/2022 02:52:33 PM script INFO: SUCCESS!@#KODE 1!@#USER_ID 98!@#ACTIVITY_CODE 2
12/21/2022 02:52:33 PM script INFO: SUCCESS!@#KODE 1!@#USER_ID 98!@#ACTIVITY_CODE 3
12/21/2022 02:52:33 PM script INFO: SUCCESS!@#KODE 1!@#USER_ID 98!@#ACTIVITY_CODE 1
12/21/2022 02:52:33 PM script INFO: SUCCESS!@#KODE 1!@#USER_ID 98!@#ACTIVITY_CODE 1
12/21/2022 02:52:33 PM script INFO: SUCCESS!@#KODE 1!@#USER_ID 98!@#ACTIVITY_CODE 3
12/21/2022 02:52:33 PM script INFO: SUCCESS!@#KODE 1!@#USER_ID 98!@#ACTIVITY_CODE 2
12/21/2022 02:52:34 PM script INFO: SUCCESS!@#KODE 1!@#USER_ID 98!@#ACTIVITY_CODE 2
12/21/2022 02:52:34 PM script INFO: SUCCESS!@#KODE 1!@#USER_ID 98!@#ACTIVITY_CODE 3
12/21/2022 02:52:34 PM script INFO: SUCCESS!@#KODE 1!@#USER_ID 98!@#ACTIVITY_CODE 4
12/21/2022 02:52:34 PM script INFO: SUCCESS!@#KODE 1!@#USER_ID 98!@#ACTIVITY_CODE 3
12/21/2022 02:52:34 PM script INFO: SUCCESS!@#KODE 1!@#USER_ID 98!@#ACTIVITY_CODE 2
12/21/2022 02:52:34 PM script INFO: SUCCESS!@#KODE 1!@#USER_ID 98!@#ACTIVITY_CODE 2
12/21/2022 02:52:35 PM script INFO: SUCCESS!@#KODE 1!@#USER_ID 98!@#ACTIVITY_CODE 2
12/21/2022 02:52:35 PM script INFO: SUCCESS!@#KODE 1!@#USER_ID 98!@#ACTIVITY_CODE 2
12/21/2022 02:52:35 PM script INFO: SUCCESS!@#KODE 1!@#USER_ID 98!@#ACTIVITY_CODE 2
12/21/2022 02:52:35 PM script INFO: SUCCESS!@#KODE 1!@#USER_ID 98!@#ACTIVITY_CODE 2
12/21/2022 02:52:35 PM script INFO: SUCCESS!@#KODE 1!@#USER_ID 98!@#ACTIVITY_CODE 2
12/21/2022 02:52:36 PM script INFO: SUCCESS!@#KODE 1!@#USER_ID 98!@#ACTIVITY_CODE 3
12/21/2022 02:52:36 PM script INFO: SUCCESS!@#KODE 1!@#USER_ID 98!@#ACTIVITY_CODE 2
12/21/2022 02:52:36 PM script INFO: SUCCESS!@#KODE 1!@#USER_ID 98!@#ACTIVITY_CODE 3
12/21/2022 02:52:36 PM script INFO: SUCCESS!@#KODE 1!@#USER_ID 98!@#ACTIVITY_CODE 1
12/21/2022 02:52:36 PM script INFO: SUCCESS!@#KODE 1!@#USER_ID 98!@#ACTIVITY_CODE 3
12/21/2022 02:52:36 PM script INFO: SUCCESS!@#KODE 1!@#USER_ID 98!@#ACTIVITY_CODE 1
12/21/2022 02:52:36 PM script INFO: SUCCESS!@#KODE 1!@#USER_ID 98!@#ACTIVITY_CODE 2
12/21/2022 02:52:36 PM script INFO: SUCCESS!@#KODE 1!@#USER_ID 98!@#ACTIVITY_CODE 1
12/21/2022 02:52:36 PM script INFO: SUCCESS!@#KODE 1!@#USER_ID 98!@#ACTIVITY_CODE 4
12/21/2022 02:52:37 PM script INFO: SUCCESS!@#KODE 1!@#USER_ID 98!@#ACTIVITY_CODE 1
12/21/2022 02:52:37 PM script INFO: SUCCESS!@#KODE 1!@#USER_ID 98!@#ACTIVITY_CODE 3
12/21/2022 02:52:37 PM script INFO: SUCCESS!@#KODE 1!@#USER_ID 98!@#ACTIVITY_CODE 3
12/21/2022 02:52:37 PM script INFO: SUCCESS!@#KODE 1!@#USER_ID 98!@#ACTIVITY_CODE 2
12/21/2022 02:52:37 PM script INFO: SUCCESS!@#KODE 1!@#USER_ID 98!@#ACTIVITY_CODE 1
12/21/2022 02:52:37 PM script INFO: SUCCESS!@#KODE 1!@#USER_ID 98!@#ACTIVITY_CODE 1
12/21/2022 02:52:37 PM script INFO: SUCCESS!@#KODE 1!@#USER_ID 98!@#ACTIVITY_CODE 2
12/21/2022 02:52:37 PM script INFO: SUCCESS!@#KODE 1!@#USER_ID 98!@#ACTIVITY_CODE 3
12/21/2022 02:52:37 PM script INFO: SUCCESS!@#KODE 1!@#USER_ID 98!@#ACTIVITY_CODE 1
12/21/2022 02:52:37 PM script INFO: SUCCESS!@#KODE 1!@#USER_ID 98!@#ACTIVITY_CODE 1
12/21/2022 02:52:38 PM script INFO: SUCCESS!@#KODE 1!@#USER_ID 98!@#ACTIVITY_CODE 3
12/21/2022 02:52:38 PM script INFO: SUCCESS!@#KODE 1!@#USER_ID 98!@#ACTIVITY_CODE 1
12/21/2022 02:52:38 PM script INFO: SUCCESS!@#KODE 1!@#USER_ID 98!@#ACTIVITY_CODE 2
12/21/2022 02:52:38 PM script INFO: SUCCESS!@#KODE 1!@#USER_ID 98!@#ACTIVITY_CODE 4
12/21/2022 02:52:38 PM script INFO: SUCCESS!@#KODE 1!@#USER_ID 98!@#ACTIVITY_CODE 2
12/21/2022 02:52:38 PM script INFO: SUCCESS!@#KODE 1!@#USER_ID 98!@#ACTIVITY_CODE 2
12/21/2022 02:52:39 PM script INFO: SUCCESS!@#KODE 1!@#USER_ID 98!@#ACTIVITY_CODE 2
12/21/2022 02:52:39 PM script INFO: SUCCESS!@#KODE 1!@#USER_ID 98!@#ACTIVITY_CODE 1
12/21/2022 02:52:39 PM script INFO: SUCCESS!@#KODE 1!@#USER_ID 98!@#ACTIVITY_CODE 1
12/21/2022 02:52:39 PM script INFO: SUCCESS!@#KODE 1!@#USER_ID 98!@#ACTIVITY_CODE 3
12/21/2022 02:52:39 PM script INFO: SUCCESS!@#KODE 1!@#USER_ID 98!@#ACTIVITY_CODE 3
12/21/2022 02:52:39 PM script INFO: SUCCESS!@#KODE 1!@#USER_ID 98!@#ACTIVITY_CODE 4
12/21/2022 02:52:39 PM script INFO: SUCCESS!@#KODE 1!@#USER_ID 98!@#ACTIVITY_CODE 2
12/21/2022 02:52:39 PM script INFO: SUCCESS!@#KODE 1!@#USER_ID 98!@#ACTIVITY_CODE 2
12/21/2022 02:52:39 PM script INFO: SUCCESS!@#KODE 1!@#USER_ID 98!@#ACTIVITY_CODE 3
12/21/2022 02:52:39 PM script INFO: SUCCESS!@#KODE 1!@#USER_ID 98!@#ACTIVITY_CODE 3
12/21/2022 02:52:40 PM script INFO: SUCCESS!@#KODE 1!@#USER_ID 98!@#ACTIVITY_CODE 3
12/21/2022 02:52:40 PM script INFO: SUCCESS!@#KODE 1!@#USER_ID 98!@#ACTIVITY_CODE 2
12/21/2022 02:52:40 PM script INFO: SUCCESS!@#KODE 1!@#USER_ID 98!@#ACTIVITY_CODE 3
12/21/2022 02:52:40 PM script INFO: SUCCESS!@#KODE 1!@#USER_ID 98!@#ACTIVITY_CODE 1
12/21/2022 02:52:40 PM script INFO: SUCCESS!@#KODE 1!@#USER_ID 98!@#ACTIVITY_CODE 2
12/21/2022 02:52:40 PM script INFO: SUCCESS!@#KODE 1!@#USER_ID 98!@#ACTIVITY_CODE 2
12/21/2022 02:52:40 PM script INFO: SUCCESS!@#KODE 1!@#USER_ID 98!@#ACTIVITY_CODE 1
12/21/2022 02:52:40 PM script INFO: SUCCESS!@#KODE 1!@#USER_ID 98!@#ACTIVITY_CODE 2
12/21/2022 02:52:41 PM script INFO: SUCCESS!@#KODE 1!@#USER_ID 98!@#ACTIVITY_CODE 2
12/21/2022 02:52:41 PM script INFO: SUCCESS!@#KODE 1!@#USER_ID 98!@#ACTIVITY_CODE 3
12/21/2022 02:52:41 PM script INFO: SUCCESS!@#KODE 1!@#USER_ID 98!@#ACTIVITY_CODE 3
12/21/2022 02:52:41 PM script INFO: SUCCESS!@#KODE 1!@#USER_ID 98!@#ACTIVITY_CODE 1
12/21/2022 02:52:41 PM script INFO: SUCCESS!@#KODE 1!@#USER_ID 98!@#ACTIVITY_CODE 2
12/21/2022 02:52:41 PM script INFO: SUCCESS!@#KODE 1!@#USER_ID 98!@#ACTIVITY_CODE 2
12/21/2022 02:52:41 PM script INFO: SUCCESS!@#KODE 1!@#USER_ID 98!@#ACTIVITY_CODE 4
12/21/2022 02:52:41 PM script INFO: SUCCESS!@#KODE 1!@#USER_ID 98!@#ACTIVITY_CODE 1
12/21/2022 02:52:42 PM script INFO: SUCCESS!@#KODE 1!@#USER_ID 98!@#ACTIVITY_CODE 1
12/21/2022 02:52:42 PM script INFO: SUCCESS!@#KODE 1!@#USER_ID 98!@#ACTIVITY_CODE 1
12/21/2022 02:52:42 PM script INFO: SUCCESS!@#KODE 1!@#USER_ID 98!@#ACTIVITY_CODE 2
12/21/2022 02:52:42 PM script INFO: SUCCESS!@#KODE 1!@#USER_ID 98!@#ACTIVITY_CODE 2
12/21/2022 02:52:42 PM script INFO: SUCCESS!@#KODE 1!@#USER_ID 98!@#ACTIVITY_CODE 2
12/21/2022 02:52:42 PM script INFO: SUCCESS!@#KODE 1!@#USER_ID 98!@#ACTIVITY_CODE 1
12/21/2022 02:52:42 PM script INFO: SUCCESS!@#KODE 1!@#USER_ID 98!@#ACTIVITY_CODE 3
12/21/2022 02:52:42 PM script INFO: SUCCESS!@#KODE 1!@#USER_ID 98!@#ACTIVITY_CODE 1
12/21/2022 02:52:42 PM script INFO: SUCCESS!@#KODE 1!@#USER_ID 98!@#ACTIVITY_CODE 4
12/21/2022 02:52:43 PM script INFO: SUCCESS!@#KODE 1!@#USER_ID 98!@#ACTIVITY_CODE 2
12/21/2022 02:52:43 PM script INFO: SUCCESS!@#KODE 1!@#USER_ID 98!@#ACTIVITY_CODE 2
12/21/2022 02:52:43 PM script INFO: SUCCESS!@#KODE 1!@#USER_ID 98!@#ACTIVITY_CODE 1
12/21/2022 02:52:43 PM script INFO: SUCCESS!@#KODE 1!@#USER_ID 98!@#ACTIVITY_CODE 1
12/21/2022 02:52:43 PM script INFO: SUCCESS!@#KODE 1!@#USER_ID 98!@#ACTIVITY_CODE 2
12/21/2022 02:52:43 PM script INFO: SUCCESS!@#KODE 1!@#USER_ID 98!@#ACTIVITY_CODE 1
12/21/2022 02:52:43 PM script INFO: SUCCESS!@#KODE 1!@#USER_ID 98!@#ACTIVITY_CODE 2
12/21/2022 02:52:43 PM script INFO: SUCCESS!@#KODE 1!@#USER_ID 98!@#ACTIVITY_CODE 1
12/21/2022 02:52:43 PM script INFO: SUCCESS!@#KODE 1!@#USER_ID 98!@#ACTIVITY_CODE 1
12/21/2022 02:52:43 PM script INFO: SUCCESS!@#KODE 1!@#USER_ID 98!@#ACTIVITY_CODE 4
12/21/2022 02:52:44 PM script INFO: SUCCESS!@#KODE 1!@#USER_ID 98!@#ACTIVITY_CODE 2
12/21/2022 02:52:44 PM script INFO: SUCCESS!@#KODE 1!@#USER_ID 98!@#ACTIVITY_CODE 1
12/21/2022 02:52:44 PM script INFO: SUCCESS!@#KODE 1!@#USER_ID 98!@#ACTIVITY_CODE 4
12/21/2022 02:52:44 PM script INFO: SUCCESS!@#KODE 1!@#USER_ID 98!@#ACTIVITY_CODE 3
12/21/2022 02:52:44 PM script INFO: SUCCESS!@#KODE 1!@#USER_ID 98!@#ACTIVITY_CODE 3
12/21/2022 02:52:44 PM script INFO: SUCCESS!@#KODE 1!@#USER_ID 98!@#ACTIVITY_CODE 1
12/21/2022 02:52:44 PM script INFO: SUCCESS!@#KODE 1!@#USER_ID 98!@#ACTIVITY_CODE 4
12/21/2022 02:52:44 PM script INFO: SUCCESS!@#KODE 1!@#USER_ID 98!@#ACTIVITY_CODE 2
12/21/2022 02:52:44 PM script INFO: SUCCESS!@#KODE 1!@#USER_ID 98!@#ACTIVITY_CODE 4
12/21/2022 02:52:44 PM script INFO: SUCCESS!@#KODE 1!@#USER_ID 98!@#ACTIVITY_CODE 2
12/21/2022 02:52:44 PM script INFO: SUCCESS!@#KODE 1!@#USER_ID 98!@#ACTIVITY_CODE 3
12/21/2022 02:52:44 PM script INFO: SUCCESS!@#KODE 1!@#USER_ID 98!@#ACTIVITY_CODE 2
12/21/2022 02:52:45 PM script INFO: SUCCESS!@#KODE 1!@#USER_ID 98!@#ACTIVITY_CODE 1
12/21/2022 02:52:45 PM script INFO: SUCCESS!@#KODE 1!@#USER_ID 98!@#ACTIVITY_CODE 2
12/21/2022 02:52:45 PM script INFO: SUCCESS!@#KODE 1!@#USER_ID 98!@#ACTIVITY_CODE 2
12/21/2022 02:52:45 PM script INFO: SUCCESS!@#KODE 1!@#USER_ID 98!@#ACTIVITY_CODE 2
12/21/2022 02:52:45 PM script INFO: SUCCESS!@#KODE 1!@#USER_ID 98!@#ACTIVITY_CODE 3
12/21/2022 02:52:45 PM script INFO: SUCCESS!@#KODE 1!@#USER_ID 98!@#ACTIVITY_CODE 1
12/21/2022 02:52:45 PM script INFO: SUCCESS!@#KODE 1!@#USER_ID 98!@#ACTIVITY_CODE 1
12/21/2022 02:52:45 PM script INFO: SUCCESS!@#KODE 1!@#USER_ID 98!@#ACTIVITY_CODE 4
12/21/2022 02:52:45 PM script INFO: SUCCESS!@#KODE 1!@#USER_ID 98!@#ACTIVITY_CODE 1
12/21/2022 02:52:45 PM script INFO: SUCCESS!@#KODE 1!@#USER_ID 98!@#ACTIVITY_CODE 1
12/21/2022 02:52:45 PM script INFO: SUCCESS!@#KODE 1!@#USER_ID 98!@#ACTIVITY_CODE 2
12/21/2022 02:52:45 PM script INFO: SUCCESS!@#KODE 1!@#USER_ID 98!@#ACTIVITY_CODE 4
12/21/2022 02:52:46 PM script INFO: SUCCESS!@#KODE 1!@#USER_ID 98!@#ACTIVITY_CODE 1
12/21/2022 02:52:46 PM script INFO: SUCCESS!@#KODE 1!@#USER_ID 98!@#ACTIVITY_CODE 3
12/21/2022 02:52:46 PM script INFO: SUCCESS!@#KODE 1!@#USER_ID 98!@#ACTIVITY_CODE 2
12/21/2022 02:52:46 PM script INFO: SUCCESS!@#KODE 1!@#USER_ID 98!@#ACTIVITY_CODE 3
12/21/2022 02:52:46 PM script INFO: SUCCESS!@#KODE 1!@#USER_ID 98!@#ACTIVITY_CODE 2
12/21/2022 02:52:46 PM script INFO: SUCCESS!@#KODE 1!@#USER_ID 98!@#ACTIVITY_CODE 1
12/21/2022 02:52:46 PM script INFO: SUCCESS!@#KODE 1!@#USER_ID 98!@#ACTIVITY_CODE 4
12/21/2022 02:52:46 PM script INFO: SUCCESS!@#KODE 1!@#USER_ID 98!@#ACTIVITY_CODE 1
12/21/2022 02:52:46 PM script INFO: SUCCESS!@#KODE 1!@#USER_ID 98!@#ACTIVITY_CODE 1
12/21/2022 02:52:46 PM script INFO: SUCCESS!@#KODE 1!@#USER_ID 98!@#ACTIVITY_CODE 2
12/21/2022 02:52:46 PM script INFO: SUCCESS!@#KODE 1!@#USER_ID 98!@#ACTIVITY_CODE 4
12/21/2022 02:52:46 PM script INFO: SUCCESS!@#KODE 1!@#USER_ID 98!@#ACTIVITY_CODE 3
12/21/2022 02:52:46 PM script INFO: SUCCESS!@#KODE 1!@#USER_ID 98!@#ACTIVITY_CODE 1
12/21/2022 02:52:47 PM script INFO: SUCCESS!@#KODE 1!@#USER_ID 98!@#ACTIVITY_CODE 4
12/21/2022 02:52:47 PM script INFO: SUCCESS!@#KODE 1!@#USER_ID 98!@#ACTIVITY_CODE 2
12/21/2022 02:52:47 PM script INFO: SUCCESS!@#KODE 1!@#USER_ID 98!@#ACTIVITY_CODE 3
12/21/2022 02:52:47 PM script INFO: SUCCESS!@#KODE 1!@#USER_ID 98!@#ACTIVITY_CODE 3
12/21/2022 02:52:47 PM script INFO: SUCCESS!@#KODE 1!@#USER_ID 98!@#ACTIVITY_CODE 3
12/21/2022 02:52:47 PM script INFO: SUCCESS!@#KODE 1!@#USER_ID 98!@#ACTIVITY_CODE 1
12/21/2022 02:52:47 PM script INFO: SUCCESS!@#KODE 1!@#USER_ID 98!@#ACTIVITY_CODE 4
12/21/2022 02:52:47 PM script INFO: SUCCESS!@#KODE 1!@#USER_ID 98!@#ACTIVITY_CODE 1
12/21/2022 02:52:47 PM script INFO: SUCCESS!@#KODE 1!@#USER_ID 98!@#ACTIVITY_CODE 4
12/21/2022 02:52:47 PM script INFO: SUCCESS!@#KODE 1!@#USER_ID 98!@#ACTIVITY_CODE 1
12/21/2022 02:52:47 PM script INFO: SUCCESS!@#KODE 1!@#USER_ID 98!@#ACTIVITY_CODE 4
12/21/2022 02:52:47 PM script INFO: SUCCESS!@#KODE 1!@#USER_ID 98!@#ACTIVITY_CODE 1
12/21/2022 02:52:47 PM script INFO: SUCCESS!@#KODE 1!@#USER_ID 98!@#ACTIVITY_CODE 1
12/21/2022 02:52:47 PM script INFO: SUCCESS!@#KODE 1!@#USER_ID 98!@#ACTIVITY_CODE 4
12/21/2022 02:52:47 PM script INFO: SUCCESS!@#KODE 1!@#USER_ID 98!@#ACTIVITY_CODE 1
12/21/2022 02:52:47 PM script INFO: SUCCESS!@#KODE 1!@#USER_ID 98!@#ACTIVITY_CODE 3
12/21/2022 02:52:47 PM script INFO: SUCCESS!@#KODE 1!@#USER_ID 98!@#ACTIVITY_CODE 1
12/21/2022 02:52:47 PM script INFO: SUCCESS!@#KODE 1!@#USER_ID 98!@#ACTIVITY_CODE 2
12/21/2022 02:52:47 PM script INFO: SUCCESS!@#KODE 1!@#USER_ID 98!@#ACTIVITY_CODE 1
12/21/2022 02:52:48 PM script INFO: SUCCESS!@#KODE 1!@#USER_ID 98!@#ACTIVITY_CODE 2
12/21/2022 02:52:48 PM script INFO: SUCCESS!@#KODE 1!@#USER_ID 98!@#ACTIVITY_CODE 3
12/21/2022 02:52:48 PM script INFO: SUCCESS!@#KODE 1!@#USER_ID 98!@#ACTIVITY_CODE 1
12/21/2022 02:52:48 PM script INFO: SUCCESS!@#KODE 1!@#USER_ID 98!@#ACTIVITY_CODE 2
12/21/2022 02:52:48 PM script INFO: SUCCESS!@#KODE 1!@#USER_ID 98!@#ACTIVITY_CODE 4
12/21/2022 02:52:48 PM script INFO: SUCCESS!@#KODE 1!@#USER_ID 98!@#ACTIVITY_CODE 1
12/21/2022 02:52:48 PM script INFO: SUCCESS!@#KODE 1!@#USER_ID 98!@#ACTIVITY_CODE 1
12/21/2022 02:52:48 PM script INFO: SUCCESS!@#KODE 1!@#USER_ID 98!@#ACTIVITY_CODE 1
12/21/2022 02:52:48 PM script INFO: SUCCESS!@#KODE 1!@#USER_ID 98!@#ACTIVITY_CODE 4
12/21/2022 02:52:48 PM script INFO: SUCCESS!@#KODE 1!@#USER_ID 98!@#ACTIVITY_CODE 2
12/21/2022 02:52:48 PM script INFO: Duration: 122.07874727249146
12/21/2022 02:52:48 PM script INFO: mengakhiri-quiz
12/21/2022 02:52:49 PM script INFO: SUCCESS!@#KODE 1!@#USER_ID 98!@#ACTIVITY_CODE 5
12/21/2022 02:52:49 PM script INFO: berhasil-submit
