12/11/2022 03:52:31 PM script INFO: Prepared chrome options..
12/11/2022 03:52:33 PM script INFO: Initialized chrome browser..
12/11/2022 03:52:33 PM script INFO: mengakses-homepage
12/11/2022 03:53:09 PM script INFO: mengakses-login-page
12/11/2022 03:53:29 PM script INFO: mengakses-site-home
12/11/2022 03:53:30 PM script INFO: mengakses-site-course
12/11/2022 03:53:49 PM script INFO: mengakses-quiz
12/11/2022 03:53:52 PM script INFO: mengakses-start-quiz-page
12/11/2022 03:53:56 PM script INFO: memulai-quiz
12/11/2022 03:53:56 PM script INFO: SUCCESS!@#KODE 1!@#USER_ID 46!@#ACTIVITY_CODE 5
12/11/2022 03:54:07 PM script INFO: SUCCESS!@#KODE 1!@#USER_ID 46!@#ACTIVITY_CODE 5
12/11/2022 03:54:07 PM script INFO: SUCCESS!@#KODE 1!@#USER_ID 46!@#ACTIVITY_CODE 5
12/11/2022 03:54:10 PM script INFO: SUCCESS!@#KODE 1!@#USER_ID 46!@#ACTIVITY_CODE 2
12/11/2022 03:54:10 PM script INFO: SUCCESS!@#KODE 1!@#USER_ID 46!@#ACTIVITY_CODE 1
12/11/2022 03:54:10 PM script INFO: SUCCESS!@#KODE 1!@#USER_ID 46!@#ACTIVITY_CODE 5
12/11/2022 03:54:10 PM script INFO: SUCCESS!@#KODE 1!@#USER_ID 46!@#ACTIVITY_CODE 5
12/11/2022 03:54:12 PM script INFO: SUCCESS!@#KODE 1!@#USER_ID 46!@#ACTIVITY_CODE 1
12/11/2022 03:54:13 PM script INFO: SUCCESS!@#KODE 1!@#USER_ID 46!@#ACTIVITY_CODE 4
12/11/2022 03:54:13 PM script INFO: SUCCESS!@#KODE 1!@#USER_ID 46!@#ACTIVITY_CODE 5
12/11/2022 03:54:13 PM script INFO: SUCCESS!@#KODE 1!@#USER_ID 46!@#ACTIVITY_CODE 5
12/11/2022 03:54:15 PM script INFO: SUCCESS!@#KODE 1!@#USER_ID 46!@#ACTIVITY_CODE 2
12/11/2022 03:54:15 PM script INFO: SUCCESS!@#KODE 1!@#USER_ID 46!@#ACTIVITY_CODE 2
12/11/2022 03:54:15 PM script INFO: SUCCESS!@#KODE 1!@#USER_ID 46!@#ACTIVITY_CODE 5
12/11/2022 03:54:15 PM script INFO: SUCCESS!@#KODE 1!@#USER_ID 46!@#ACTIVITY_CODE 5
12/11/2022 03:54:18 PM script INFO: SUCCESS!@#KODE 1!@#USER_ID 46!@#ACTIVITY_CODE 1
12/11/2022 03:54:18 PM script INFO: SUCCESS!@#KODE 1!@#USER_ID 46!@#ACTIVITY_CODE 5
12/11/2022 03:54:18 PM script INFO: SUCCESS!@#KODE 1!@#USER_ID 46!@#ACTIVITY_CODE 5
12/11/2022 03:54:21 PM script INFO: SUCCESS!@#KODE 1!@#USER_ID 46!@#ACTIVITY_CODE 3
12/11/2022 03:54:21 PM script INFO: SUCCESS!@#KODE 1!@#USER_ID 46!@#ACTIVITY_CODE 5
12/11/2022 03:54:21 PM script INFO: SUCCESS!@#KODE 1!@#USER_ID 46!@#ACTIVITY_CODE 5
12/11/2022 03:54:23 PM script INFO: SUCCESS!@#KODE 1!@#USER_ID 46!@#ACTIVITY_CODE 5
12/11/2022 03:54:23 PM script INFO: SUCCESS!@#KODE 1!@#USER_ID 46!@#ACTIVITY_CODE 5
12/11/2022 03:54:26 PM script INFO: SUCCESS!@#KODE 1!@#USER_ID 46!@#ACTIVITY_CODE 2
12/11/2022 03:54:26 PM script INFO: SUCCESS!@#KODE 1!@#USER_ID 46!@#ACTIVITY_CODE 5
12/11/2022 03:54:26 PM script INFO: SUCCESS!@#KODE 1!@#USER_ID 46!@#ACTIVITY_CODE 5
12/11/2022 03:54:28 PM script INFO: SUCCESS!@#KODE 1!@#USER_ID 46!@#ACTIVITY_CODE 5
12/11/2022 03:54:28 PM script INFO: SUCCESS!@#KODE 1!@#USER_ID 46!@#ACTIVITY_CODE 5
12/11/2022 03:54:31 PM script INFO: SUCCESS!@#KODE 1!@#USER_ID 46!@#ACTIVITY_CODE 1
12/11/2022 03:54:31 PM script INFO: SUCCESS!@#KODE 1!@#USER_ID 46!@#ACTIVITY_CODE 5
12/11/2022 03:54:31 PM script INFO: SUCCESS!@#KODE 1!@#USER_ID 46!@#ACTIVITY_CODE 5
12/11/2022 03:54:33 PM script INFO: SUCCESS!@#KODE 1!@#USER_ID 46!@#ACTIVITY_CODE 1
12/11/2022 03:54:33 PM script INFO: SUCCESS!@#KODE 1!@#USER_ID 46!@#ACTIVITY_CODE 5
12/11/2022 03:54:33 PM script INFO: SUCCESS!@#KODE 1!@#USER_ID 46!@#ACTIVITY_CODE 5
12/11/2022 03:54:36 PM script INFO: SUCCESS!@#KODE 1!@#USER_ID 46!@#ACTIVITY_CODE 2
12/11/2022 03:54:36 PM script INFO: SUCCESS!@#KODE 1!@#USER_ID 46!@#ACTIVITY_CODE 5
12/11/2022 03:54:36 PM script INFO: SUCCESS!@#KODE 1!@#USER_ID 46!@#ACTIVITY_CODE 5
12/11/2022 03:54:39 PM script INFO: SUCCESS!@#KODE 1!@#USER_ID 46!@#ACTIVITY_CODE 5
12/11/2022 03:54:39 PM script INFO: SUCCESS!@#KODE 1!@#USER_ID 46!@#ACTIVITY_CODE 5
12/11/2022 03:54:41 PM script INFO: SUCCESS!@#KODE 1!@#USER_ID 46!@#ACTIVITY_CODE 1
12/11/2022 03:54:41 PM script INFO: SUCCESS!@#KODE 1!@#USER_ID 46!@#ACTIVITY_CODE 5
12/11/2022 03:54:41 PM script INFO: SUCCESS!@#KODE 1!@#USER_ID 46!@#ACTIVITY_CODE 5
12/11/2022 03:54:44 PM script INFO: SUCCESS!@#KODE 1!@#USER_ID 46!@#ACTIVITY_CODE 2
12/11/2022 03:54:44 PM script INFO: SUCCESS!@#KODE 1!@#USER_ID 46!@#ACTIVITY_CODE 2
12/11/2022 03:54:44 PM script INFO: SUCCESS!@#KODE 1!@#USER_ID 46!@#ACTIVITY_CODE 1
12/11/2022 03:54:44 PM script INFO: SUCCESS!@#KODE 1!@#USER_ID 46!@#ACTIVITY_CODE 5
12/11/2022 03:54:44 PM script INFO: SUCCESS!@#KODE 1!@#USER_ID 46!@#ACTIVITY_CODE 5
12/11/2022 03:54:47 PM script INFO: SUCCESS!@#KODE 1!@#USER_ID 46!@#ACTIVITY_CODE 3
12/11/2022 03:54:47 PM script INFO: SUCCESS!@#KODE 1!@#USER_ID 46!@#ACTIVITY_CODE 3
12/11/2022 03:54:47 PM script INFO: SUCCESS!@#KODE 1!@#USER_ID 46!@#ACTIVITY_CODE 2
12/11/2022 03:54:47 PM script INFO: SUCCESS!@#KODE 1!@#USER_ID 46!@#ACTIVITY_CODE 5
12/11/2022 03:54:47 PM script INFO: SUCCESS!@#KODE 1!@#USER_ID 46!@#ACTIVITY_CODE 5
12/11/2022 03:54:49 PM script INFO: SUCCESS!@#KODE 1!@#USER_ID 46!@#ACTIVITY_CODE 1
12/11/2022 03:54:50 PM script INFO: SUCCESS!@#KODE 1!@#USER_ID 46!@#ACTIVITY_CODE 2
12/11/2022 03:54:50 PM script INFO: SUCCESS!@#KODE 1!@#USER_ID 46!@#ACTIVITY_CODE 3
12/11/2022 03:54:50 PM script INFO: SUCCESS!@#KODE 1!@#USER_ID 46!@#ACTIVITY_CODE 3
12/11/2022 03:54:50 PM script INFO: SUCCESS!@#KODE 1!@#USER_ID 46!@#ACTIVITY_CODE 2
12/11/2022 03:54:50 PM script INFO: SUCCESS!@#KODE 1!@#USER_ID 46!@#ACTIVITY_CODE 3
12/11/2022 03:54:50 PM script INFO: SUCCESS!@#KODE 1!@#USER_ID 46!@#ACTIVITY_CODE 2
12/11/2022 03:54:50 PM script INFO: SUCCESS!@#KODE 1!@#USER_ID 46!@#ACTIVITY_CODE 1
12/11/2022 03:54:50 PM script INFO: SUCCESS!@#KODE 1!@#USER_ID 46!@#ACTIVITY_CODE 1
12/11/2022 03:54:50 PM script INFO: SUCCESS!@#KODE 1!@#USER_ID 46!@#ACTIVITY_CODE 2
12/11/2022 03:54:50 PM script INFO: SUCCESS!@#KODE 1!@#USER_ID 46!@#ACTIVITY_CODE 3
12/11/2022 03:54:50 PM script INFO: SUCCESS!@#KODE 1!@#USER_ID 46!@#ACTIVITY_CODE 2
12/11/2022 03:54:51 PM script INFO: SUCCESS!@#KODE 1!@#USER_ID 46!@#ACTIVITY_CODE 3
12/11/2022 03:54:51 PM script INFO: SUCCESS!@#KODE 1!@#USER_ID 46!@#ACTIVITY_CODE 1
12/11/2022 03:54:51 PM script INFO: SUCCESS!@#KODE 1!@#USER_ID 46!@#ACTIVITY_CODE 2
12/11/2022 03:54:51 PM script INFO: SUCCESS!@#KODE 1!@#USER_ID 46!@#ACTIVITY_CODE 1
12/11/2022 03:54:51 PM script INFO: SUCCESS!@#KODE 1!@#USER_ID 46!@#ACTIVITY_CODE 2
12/11/2022 03:54:51 PM script INFO: SUCCESS!@#KODE 1!@#USER_ID 46!@#ACTIVITY_CODE 4
12/11/2022 03:54:51 PM script INFO: SUCCESS!@#KODE 1!@#USER_ID 46!@#ACTIVITY_CODE 2
12/11/2022 03:54:51 PM script INFO: SUCCESS!@#KODE 1!@#USER_ID 46!@#ACTIVITY_CODE 2
12/11/2022 03:54:51 PM script INFO: SUCCESS!@#KODE 1!@#USER_ID 46!@#ACTIVITY_CODE 3
12/11/2022 03:54:51 PM script INFO: SUCCESS!@#KODE 1!@#USER_ID 46!@#ACTIVITY_CODE 1
12/11/2022 03:54:51 PM script INFO: SUCCESS!@#KODE 1!@#USER_ID 46!@#ACTIVITY_CODE 1
12/11/2022 03:54:51 PM script INFO: SUCCESS!@#KODE 1!@#USER_ID 46!@#ACTIVITY_CODE 1
12/11/2022 03:54:52 PM script INFO: SUCCESS!@#KODE 1!@#USER_ID 46!@#ACTIVITY_CODE 2
12/11/2022 03:54:52 PM script INFO: SUCCESS!@#KODE 1!@#USER_ID 46!@#ACTIVITY_CODE 1
12/11/2022 03:54:52 PM script INFO: SUCCESS!@#KODE 1!@#USER_ID 46!@#ACTIVITY_CODE 4
12/11/2022 03:54:52 PM script INFO: SUCCESS!@#KODE 1!@#USER_ID 46!@#ACTIVITY_CODE 1
12/11/2022 03:54:52 PM script INFO: SUCCESS!@#KODE 1!@#USER_ID 46!@#ACTIVITY_CODE 2
12/11/2022 03:54:52 PM script INFO: SUCCESS!@#KODE 1!@#USER_ID 46!@#ACTIVITY_CODE 3
12/11/2022 03:54:52 PM script INFO: SUCCESS!@#KODE 1!@#USER_ID 46!@#ACTIVITY_CODE 2
12/11/2022 03:54:52 PM script INFO: SUCCESS!@#KODE 1!@#USER_ID 46!@#ACTIVITY_CODE 2
12/11/2022 03:54:52 PM script INFO: SUCCESS!@#KODE 1!@#USER_ID 46!@#ACTIVITY_CODE 4
12/11/2022 03:54:52 PM script INFO: SUCCESS!@#KODE 1!@#USER_ID 46!@#ACTIVITY_CODE 3
12/11/2022 03:54:53 PM script INFO: SUCCESS!@#KODE 1!@#USER_ID 46!@#ACTIVITY_CODE 2
12/11/2022 03:54:53 PM script INFO: SUCCESS!@#KODE 1!@#USER_ID 46!@#ACTIVITY_CODE 3
12/11/2022 03:54:53 PM script INFO: SUCCESS!@#KODE 1!@#USER_ID 46!@#ACTIVITY_CODE 2
12/11/2022 03:54:53 PM script INFO: SUCCESS!@#KODE 1!@#USER_ID 46!@#ACTIVITY_CODE 2
12/11/2022 03:54:53 PM script INFO: SUCCESS!@#KODE 1!@#USER_ID 46!@#ACTIVITY_CODE 1
12/11/2022 03:54:53 PM script INFO: SUCCESS!@#KODE 1!@#USER_ID 46!@#ACTIVITY_CODE 3
12/11/2022 03:54:53 PM script INFO: SUCCESS!@#KODE 1!@#USER_ID 46!@#ACTIVITY_CODE 3
12/11/2022 03:54:53 PM script INFO: SUCCESS!@#KODE 1!@#USER_ID 46!@#ACTIVITY_CODE 3
12/11/2022 03:54:53 PM script INFO: SUCCESS!@#KODE 1!@#USER_ID 46!@#ACTIVITY_CODE 3
12/11/2022 03:54:53 PM script INFO: SUCCESS!@#KODE 1!@#USER_ID 46!@#ACTIVITY_CODE 1
12/11/2022 03:54:53 PM script INFO: SUCCESS!@#KODE 1!@#USER_ID 46!@#ACTIVITY_CODE 3
12/11/2022 03:54:53 PM script INFO: SUCCESS!@#KODE 1!@#USER_ID 46!@#ACTIVITY_CODE 1
12/11/2022 03:54:53 PM script INFO: SUCCESS!@#KODE 1!@#USER_ID 46!@#ACTIVITY_CODE 3
12/11/2022 03:54:53 PM script INFO: SUCCESS!@#KODE 1!@#USER_ID 46!@#ACTIVITY_CODE 1
12/11/2022 03:54:53 PM script INFO: SUCCESS!@#KODE 1!@#USER_ID 46!@#ACTIVITY_CODE 3
12/11/2022 03:54:54 PM script INFO: SUCCESS!@#KODE 1!@#USER_ID 46!@#ACTIVITY_CODE 2
12/11/2022 03:54:54 PM script INFO: SUCCESS!@#KODE 1!@#USER_ID 46!@#ACTIVITY_CODE 1
12/11/2022 03:54:54 PM script INFO: SUCCESS!@#KODE 1!@#USER_ID 46!@#ACTIVITY_CODE 2
12/11/2022 03:54:54 PM script INFO: SUCCESS!@#KODE 1!@#USER_ID 46!@#ACTIVITY_CODE 4
12/11/2022 03:54:54 PM script INFO: SUCCESS!@#KODE 1!@#USER_ID 46!@#ACTIVITY_CODE 2
12/11/2022 03:54:54 PM script INFO: SUCCESS!@#KODE 1!@#USER_ID 46!@#ACTIVITY_CODE 3
12/11/2022 03:54:54 PM script INFO: SUCCESS!@#KODE 1!@#USER_ID 46!@#ACTIVITY_CODE 4
12/11/2022 03:54:54 PM script INFO: SUCCESS!@#KODE 1!@#USER_ID 46!@#ACTIVITY_CODE 2
12/11/2022 03:54:54 PM script INFO: SUCCESS!@#KODE 1!@#USER_ID 46!@#ACTIVITY_CODE 2
12/11/2022 03:54:54 PM script INFO: SUCCESS!@#KODE 1!@#USER_ID 46!@#ACTIVITY_CODE 1
12/11/2022 03:54:54 PM script INFO: SUCCESS!@#KODE 1!@#USER_ID 46!@#ACTIVITY_CODE 1
12/11/2022 03:54:54 PM script INFO: SUCCESS!@#KODE 1!@#USER_ID 46!@#ACTIVITY_CODE 2
12/11/2022 03:54:55 PM script INFO: SUCCESS!@#KODE 1!@#USER_ID 46!@#ACTIVITY_CODE 1
12/11/2022 03:54:55 PM script INFO: SUCCESS!@#KODE 1!@#USER_ID 46!@#ACTIVITY_CODE 1
12/11/2022 03:54:55 PM script INFO: SUCCESS!@#KODE 1!@#USER_ID 46!@#ACTIVITY_CODE 2
12/11/2022 03:54:55 PM script INFO: SUCCESS!@#KODE 1!@#USER_ID 46!@#ACTIVITY_CODE 2
12/11/2022 03:54:55 PM script INFO: SUCCESS!@#KODE 1!@#USER_ID 46!@#ACTIVITY_CODE 2
12/11/2022 03:54:55 PM script INFO: SUCCESS!@#KODE 1!@#USER_ID 46!@#ACTIVITY_CODE 2
12/11/2022 03:54:55 PM script INFO: SUCCESS!@#KODE 1!@#USER_ID 46!@#ACTIVITY_CODE 2
12/11/2022 03:54:55 PM script INFO: SUCCESS!@#KODE 1!@#USER_ID 46!@#ACTIVITY_CODE 2
12/11/2022 03:54:55 PM script INFO: SUCCESS!@#KODE 1!@#USER_ID 46!@#ACTIVITY_CODE 1
12/11/2022 03:54:55 PM script INFO: SUCCESS!@#KODE 1!@#USER_ID 46!@#ACTIVITY_CODE 4
12/11/2022 03:54:55 PM script INFO: SUCCESS!@#KODE 1!@#USER_ID 46!@#ACTIVITY_CODE 3
12/11/2022 03:54:55 PM script INFO: SUCCESS!@#KODE 1!@#USER_ID 46!@#ACTIVITY_CODE 3
12/11/2022 03:54:56 PM script INFO: SUCCESS!@#KODE 1!@#USER_ID 46!@#ACTIVITY_CODE 2
12/11/2022 03:54:56 PM script INFO: SUCCESS!@#KODE 1!@#USER_ID 46!@#ACTIVITY_CODE 3
12/11/2022 03:54:56 PM script INFO: SUCCESS!@#KODE 1!@#USER_ID 46!@#ACTIVITY_CODE 3
12/11/2022 03:54:56 PM script INFO: SUCCESS!@#KODE 1!@#USER_ID 46!@#ACTIVITY_CODE 1
12/11/2022 03:54:56 PM script INFO: SUCCESS!@#KODE 1!@#USER_ID 46!@#ACTIVITY_CODE 2
12/11/2022 03:54:56 PM script INFO: SUCCESS!@#KODE 1!@#USER_ID 46!@#ACTIVITY_CODE 3
12/11/2022 03:54:56 PM script INFO: SUCCESS!@#KODE 1!@#USER_ID 46!@#ACTIVITY_CODE 2
12/11/2022 03:54:56 PM script INFO: SUCCESS!@#KODE 1!@#USER_ID 46!@#ACTIVITY_CODE 1
12/11/2022 03:54:56 PM script INFO: SUCCESS!@#KODE 1!@#USER_ID 46!@#ACTIVITY_CODE 1
12/11/2022 03:54:56 PM script INFO: SUCCESS!@#KODE 1!@#USER_ID 46!@#ACTIVITY_CODE 4
12/11/2022 03:54:56 PM script INFO: SUCCESS!@#KODE 1!@#USER_ID 46!@#ACTIVITY_CODE 2
12/11/2022 03:54:56 PM script INFO: SUCCESS!@#KODE 1!@#USER_ID 46!@#ACTIVITY_CODE 2
12/11/2022 03:54:57 PM script INFO: SUCCESS!@#KODE 1!@#USER_ID 46!@#ACTIVITY_CODE 2
12/11/2022 03:54:57 PM script INFO: SUCCESS!@#KODE 1!@#USER_ID 46!@#ACTIVITY_CODE 1
12/11/2022 03:54:57 PM script INFO: SUCCESS!@#KODE 1!@#USER_ID 46!@#ACTIVITY_CODE 2
12/11/2022 03:54:57 PM script INFO: SUCCESS!@#KODE 1!@#USER_ID 46!@#ACTIVITY_CODE 3
12/11/2022 03:54:57 PM script INFO: SUCCESS!@#KODE 1!@#USER_ID 46!@#ACTIVITY_CODE 2
12/11/2022 03:54:57 PM script INFO: SUCCESS!@#KODE 1!@#USER_ID 46!@#ACTIVITY_CODE 3
12/11/2022 03:54:57 PM script INFO: SUCCESS!@#KODE 1!@#USER_ID 46!@#ACTIVITY_CODE 2
12/11/2022 03:54:57 PM script INFO: SUCCESS!@#KODE 1!@#USER_ID 46!@#ACTIVITY_CODE 2
12/11/2022 03:54:57 PM script INFO: SUCCESS!@#KODE 1!@#USER_ID 46!@#ACTIVITY_CODE 2
12/11/2022 03:54:57 PM script INFO: SUCCESS!@#KODE 1!@#USER_ID 46!@#ACTIVITY_CODE 2
12/11/2022 03:54:57 PM script INFO: SUCCESS!@#KODE 1!@#USER_ID 46!@#ACTIVITY_CODE 1
12/11/2022 03:54:57 PM script INFO: SUCCESS!@#KODE 1!@#USER_ID 46!@#ACTIVITY_CODE 3
12/11/2022 03:54:57 PM script INFO: SUCCESS!@#KODE 1!@#USER_ID 46!@#ACTIVITY_CODE 1
12/11/2022 03:54:58 PM script INFO: SUCCESS!@#KODE 1!@#USER_ID 46!@#ACTIVITY_CODE 3
12/11/2022 03:54:58 PM script INFO: SUCCESS!@#KODE 1!@#USER_ID 46!@#ACTIVITY_CODE 1
12/11/2022 03:54:58 PM script INFO: SUCCESS!@#KODE 1!@#USER_ID 46!@#ACTIVITY_CODE 4
12/11/2022 03:54:58 PM script INFO: SUCCESS!@#KODE 1!@#USER_ID 46!@#ACTIVITY_CODE 1
12/11/2022 03:54:58 PM script INFO: SUCCESS!@#KODE 1!@#USER_ID 46!@#ACTIVITY_CODE 4
12/11/2022 03:54:58 PM script INFO: SUCCESS!@#KODE 1!@#USER_ID 46!@#ACTIVITY_CODE 1
12/11/2022 03:54:58 PM script INFO: SUCCESS!@#KODE 1!@#USER_ID 46!@#ACTIVITY_CODE 3
12/11/2022 03:54:58 PM script INFO: SUCCESS!@#KODE 1!@#USER_ID 46!@#ACTIVITY_CODE 3
12/11/2022 03:54:58 PM script INFO: SUCCESS!@#KODE 1!@#USER_ID 46!@#ACTIVITY_CODE 2
12/11/2022 03:54:58 PM script INFO: SUCCESS!@#KODE 1!@#USER_ID 46!@#ACTIVITY_CODE 3
12/11/2022 03:54:58 PM script INFO: SUCCESS!@#KODE 1!@#USER_ID 46!@#ACTIVITY_CODE 1
12/11/2022 03:54:58 PM script INFO: SUCCESS!@#KODE 1!@#USER_ID 46!@#ACTIVITY_CODE 3
12/11/2022 03:54:58 PM script INFO: SUCCESS!@#KODE 1!@#USER_ID 46!@#ACTIVITY_CODE 3
12/11/2022 03:54:58 PM script INFO: SUCCESS!@#KODE 1!@#USER_ID 46!@#ACTIVITY_CODE 1
12/11/2022 03:54:58 PM script INFO: SUCCESS!@#KODE 1!@#USER_ID 46!@#ACTIVITY_CODE 1
12/11/2022 03:54:58 PM script INFO: SUCCESS!@#KODE 1!@#USER_ID 46!@#ACTIVITY_CODE 3
12/11/2022 03:54:58 PM script INFO: SUCCESS!@#KODE 1!@#USER_ID 46!@#ACTIVITY_CODE 2
12/11/2022 03:54:59 PM script INFO: SUCCESS!@#KODE 1!@#USER_ID 46!@#ACTIVITY_CODE 1
12/11/2022 03:54:59 PM script INFO: SUCCESS!@#KODE 1!@#USER_ID 46!@#ACTIVITY_CODE 3
12/11/2022 03:54:59 PM script INFO: SUCCESS!@#KODE 1!@#USER_ID 46!@#ACTIVITY_CODE 1
12/11/2022 03:54:59 PM script INFO: SUCCESS!@#KODE 1!@#USER_ID 46!@#ACTIVITY_CODE 3
12/11/2022 03:54:59 PM script INFO: SUCCESS!@#KODE 1!@#USER_ID 46!@#ACTIVITY_CODE 4
12/11/2022 03:54:59 PM script INFO: SUCCESS!@#KODE 1!@#USER_ID 46!@#ACTIVITY_CODE 3
12/11/2022 03:54:59 PM script INFO: SUCCESS!@#KODE 1!@#USER_ID 46!@#ACTIVITY_CODE 2
12/11/2022 03:54:59 PM script INFO: SUCCESS!@#KODE 1!@#USER_ID 46!@#ACTIVITY_CODE 1
12/11/2022 03:54:59 PM script INFO: SUCCESS!@#KODE 1!@#USER_ID 46!@#ACTIVITY_CODE 2
12/11/2022 03:54:59 PM script INFO: SUCCESS!@#KODE 1!@#USER_ID 46!@#ACTIVITY_CODE 3
12/11/2022 03:54:59 PM script INFO: SUCCESS!@#KODE 1!@#USER_ID 46!@#ACTIVITY_CODE 1
12/11/2022 03:54:59 PM script INFO: SUCCESS!@#KODE 1!@#USER_ID 46!@#ACTIVITY_CODE 1
12/11/2022 03:54:59 PM script INFO: SUCCESS!@#KODE 1!@#USER_ID 46!@#ACTIVITY_CODE 4
12/11/2022 03:54:59 PM script INFO: SUCCESS!@#KODE 1!@#USER_ID 46!@#ACTIVITY_CODE 1
12/11/2022 03:54:59 PM script INFO: SUCCESS!@#KODE 1!@#USER_ID 46!@#ACTIVITY_CODE 3
12/11/2022 03:54:59 PM script INFO: SUCCESS!@#KODE 1!@#USER_ID 46!@#ACTIVITY_CODE 3
12/11/2022 03:54:59 PM script INFO: SUCCESS!@#KODE 1!@#USER_ID 46!@#ACTIVITY_CODE 1
12/11/2022 03:54:59 PM script INFO: SUCCESS!@#KODE 1!@#USER_ID 46!@#ACTIVITY_CODE 4
12/11/2022 03:54:59 PM script INFO: SUCCESS!@#KODE 1!@#USER_ID 46!@#ACTIVITY_CODE 1
12/11/2022 03:55:00 PM script INFO: SUCCESS!@#KODE 1!@#USER_ID 46!@#ACTIVITY_CODE 2
12/11/2022 03:55:00 PM script INFO: SUCCESS!@#KODE 1!@#USER_ID 46!@#ACTIVITY_CODE 3
12/11/2022 03:55:00 PM script INFO: SUCCESS!@#KODE 1!@#USER_ID 46!@#ACTIVITY_CODE 3
12/11/2022 03:55:00 PM script INFO: SUCCESS!@#KODE 1!@#USER_ID 46!@#ACTIVITY_CODE 3
12/11/2022 03:55:00 PM script INFO: SUCCESS!@#KODE 1!@#USER_ID 46!@#ACTIVITY_CODE 1
12/11/2022 03:55:00 PM script INFO: SUCCESS!@#KODE 1!@#USER_ID 46!@#ACTIVITY_CODE 4
12/11/2022 03:55:00 PM script INFO: SUCCESS!@#KODE 1!@#USER_ID 46!@#ACTIVITY_CODE 1
12/11/2022 03:55:00 PM script INFO: SUCCESS!@#KODE 1!@#USER_ID 46!@#ACTIVITY_CODE 3
12/11/2022 03:55:00 PM script INFO: SUCCESS!@#KODE 1!@#USER_ID 46!@#ACTIVITY_CODE 1
12/11/2022 03:55:00 PM script INFO: SUCCESS!@#KODE 1!@#USER_ID 46!@#ACTIVITY_CODE 3
12/11/2022 03:55:00 PM script INFO: SUCCESS!@#KODE 1!@#USER_ID 46!@#ACTIVITY_CODE 3
12/11/2022 03:55:00 PM script INFO: SUCCESS!@#KODE 1!@#USER_ID 46!@#ACTIVITY_CODE 1
12/11/2022 03:55:00 PM script INFO: SUCCESS!@#KODE 1!@#USER_ID 46!@#ACTIVITY_CODE 1
12/11/2022 03:55:00 PM script INFO: SUCCESS!@#KODE 1!@#USER_ID 46!@#ACTIVITY_CODE 4
12/11/2022 03:55:00 PM script INFO: SUCCESS!@#KODE 1!@#USER_ID 46!@#ACTIVITY_CODE 2
12/11/2022 03:55:00 PM script INFO: SUCCESS!@#KODE 1!@#USER_ID 46!@#ACTIVITY_CODE 1
12/11/2022 03:55:00 PM script INFO: SUCCESS!@#KODE 1!@#USER_ID 46!@#ACTIVITY_CODE 3
12/11/2022 03:55:00 PM script INFO: SUCCESS!@#KODE 1!@#USER_ID 46!@#ACTIVITY_CODE 1
12/11/2022 03:55:00 PM script INFO: SUCCESS!@#KODE 1!@#USER_ID 46!@#ACTIVITY_CODE 3
12/11/2022 03:55:01 PM script INFO: SUCCESS!@#KODE 1!@#USER_ID 46!@#ACTIVITY_CODE 1
12/11/2022 03:55:01 PM script INFO: SUCCESS!@#KODE 1!@#USER_ID 46!@#ACTIVITY_CODE 1
12/11/2022 03:55:01 PM script INFO: SUCCESS!@#KODE 1!@#USER_ID 46!@#ACTIVITY_CODE 3
12/11/2022 03:55:01 PM script INFO: SUCCESS!@#KODE 1!@#USER_ID 46!@#ACTIVITY_CODE 2
12/11/2022 03:55:01 PM script INFO: SUCCESS!@#KODE 1!@#USER_ID 46!@#ACTIVITY_CODE 3
12/11/2022 03:55:01 PM script INFO: SUCCESS!@#KODE 1!@#USER_ID 46!@#ACTIVITY_CODE 3
12/11/2022 03:55:01 PM script INFO: SUCCESS!@#KODE 1!@#USER_ID 46!@#ACTIVITY_CODE 2
12/11/2022 03:55:01 PM script INFO: SUCCESS!@#KODE 1!@#USER_ID 46!@#ACTIVITY_CODE 2
12/11/2022 03:55:01 PM script INFO: SUCCESS!@#KODE 1!@#USER_ID 46!@#ACTIVITY_CODE 1
12/11/2022 03:55:01 PM script INFO: SUCCESS!@#KODE 1!@#USER_ID 46!@#ACTIVITY_CODE 2
12/11/2022 03:55:01 PM script INFO: SUCCESS!@#KODE 1!@#USER_ID 46!@#ACTIVITY_CODE 3
12/11/2022 03:55:01 PM script INFO: SUCCESS!@#KODE 1!@#USER_ID 46!@#ACTIVITY_CODE 2
12/11/2022 03:55:01 PM script INFO: SUCCESS!@#KODE 1!@#USER_ID 46!@#ACTIVITY_CODE 4
12/11/2022 03:55:01 PM script INFO: SUCCESS!@#KODE 1!@#USER_ID 46!@#ACTIVITY_CODE 1
12/11/2022 03:55:01 PM script INFO: SUCCESS!@#KODE 1!@#USER_ID 46!@#ACTIVITY_CODE 2
12/11/2022 03:55:02 PM script INFO: SUCCESS!@#KODE 1!@#USER_ID 46!@#ACTIVITY_CODE 3
12/11/2022 03:55:02 PM script INFO: SUCCESS!@#KODE 1!@#USER_ID 46!@#ACTIVITY_CODE 3
12/11/2022 03:55:02 PM script INFO: SUCCESS!@#KODE 1!@#USER_ID 46!@#ACTIVITY_CODE 3
12/11/2022 03:55:02 PM script INFO: SUCCESS!@#KODE 1!@#USER_ID 46!@#ACTIVITY_CODE 3
12/11/2022 03:55:02 PM script INFO: SUCCESS!@#KODE 1!@#USER_ID 46!@#ACTIVITY_CODE 1
12/11/2022 03:55:02 PM script INFO: SUCCESS!@#KODE 1!@#USER_ID 46!@#ACTIVITY_CODE 2
12/11/2022 03:55:02 PM script INFO: SUCCESS!@#KODE 1!@#USER_ID 46!@#ACTIVITY_CODE 2
12/11/2022 03:55:02 PM script INFO: SUCCESS!@#KODE 1!@#USER_ID 46!@#ACTIVITY_CODE 4
12/11/2022 03:55:02 PM script INFO: SUCCESS!@#KODE 1!@#USER_ID 46!@#ACTIVITY_CODE 1
12/11/2022 03:55:02 PM script INFO: SUCCESS!@#KODE 1!@#USER_ID 46!@#ACTIVITY_CODE 1
12/11/2022 03:55:02 PM script INFO: SUCCESS!@#KODE 1!@#USER_ID 46!@#ACTIVITY_CODE 2
12/11/2022 03:55:02 PM script INFO: SUCCESS!@#KODE 1!@#USER_ID 46!@#ACTIVITY_CODE 1
12/11/2022 03:55:02 PM script INFO: SUCCESS!@#KODE 1!@#USER_ID 46!@#ACTIVITY_CODE 4
12/11/2022 03:55:02 PM script INFO: SUCCESS!@#KODE 1!@#USER_ID 46!@#ACTIVITY_CODE 2
12/11/2022 03:55:02 PM script INFO: SUCCESS!@#KODE 1!@#USER_ID 46!@#ACTIVITY_CODE 3
12/11/2022 03:55:02 PM script INFO: SUCCESS!@#KODE 1!@#USER_ID 46!@#ACTIVITY_CODE 1
12/11/2022 03:55:02 PM script INFO: SUCCESS!@#KODE 1!@#USER_ID 46!@#ACTIVITY_CODE 3
12/11/2022 03:55:03 PM script INFO: SUCCESS!@#KODE 1!@#USER_ID 46!@#ACTIVITY_CODE 4
12/11/2022 03:55:03 PM script INFO: SUCCESS!@#KODE 1!@#USER_ID 46!@#ACTIVITY_CODE 3
12/11/2022 03:55:03 PM script INFO: SUCCESS!@#KODE 1!@#USER_ID 46!@#ACTIVITY_CODE 1
12/11/2022 03:55:03 PM script INFO: SUCCESS!@#KODE 1!@#USER_ID 46!@#ACTIVITY_CODE 2
12/11/2022 03:55:03 PM script INFO: SUCCESS!@#KODE 1!@#USER_ID 46!@#ACTIVITY_CODE 1
12/11/2022 03:55:03 PM script INFO: SUCCESS!@#KODE 1!@#USER_ID 46!@#ACTIVITY_CODE 4
12/11/2022 03:55:03 PM script INFO: SUCCESS!@#KODE 1!@#USER_ID 46!@#ACTIVITY_CODE 1
12/11/2022 03:55:03 PM script INFO: SUCCESS!@#KODE 1!@#USER_ID 46!@#ACTIVITY_CODE 4
12/11/2022 03:55:03 PM script INFO: SUCCESS!@#KODE 1!@#USER_ID 46!@#ACTIVITY_CODE 2
12/11/2022 03:55:03 PM script INFO: SUCCESS!@#KODE 1!@#USER_ID 46!@#ACTIVITY_CODE 4
12/11/2022 03:55:03 PM script INFO: SUCCESS!@#KODE 1!@#USER_ID 46!@#ACTIVITY_CODE 2
12/11/2022 03:55:03 PM script INFO: SUCCESS!@#KODE 1!@#USER_ID 46!@#ACTIVITY_CODE 2
12/11/2022 03:55:03 PM script INFO: Duration: 56.46051621437073
12/11/2022 03:55:03 PM script INFO: mengakhiri-quiz
12/11/2022 03:55:18 PM script INFO: SUCCESS!@#KODE 1!@#USER_ID 46!@#ACTIVITY_CODE 5
12/11/2022 03:55:18 PM script INFO: berhasil-submit
