12/23/2022 03:16:01 AM script INFO: Prepared chrome options..
12/23/2022 03:16:03 AM script INFO: Initialized chrome browser..
12/23/2022 03:16:03 AM script INFO: mengakses-homepage
12/23/2022 03:16:29 AM script INFO: mengakses-login-page
12/23/2022 03:16:31 AM script INFO: mengakses-site-home
12/23/2022 03:16:31 AM script INFO: mengakses-site-course
12/23/2022 03:16:32 AM script INFO: mengakses-quiz
12/23/2022 03:16:33 AM script INFO: mengakses-start-quiz-page
12/23/2022 03:16:34 AM script INFO: memulai-quiz
12/23/2022 03:16:34 AM script INFO: SUCCESS!@#KODE 1!@#USER_ID 31!@#ACTIVITY_CODE 5
12/23/2022 03:16:45 AM script INFO: SUCCESS!@#KODE 1!@#USER_ID 31!@#ACTIVITY_CODE 5
12/23/2022 03:16:45 AM script INFO: SUCCESS!@#KODE 1!@#USER_ID 31!@#ACTIVITY_CODE 5
12/23/2022 03:16:47 AM script INFO: SUCCESS!@#KODE 1!@#USER_ID 31!@#ACTIVITY_CODE 2
12/23/2022 03:16:47 AM script INFO: SUCCESS!@#KODE 1!@#USER_ID 31!@#ACTIVITY_CODE 3
12/23/2022 03:16:48 AM script INFO: SUCCESS!@#KODE 1!@#USER_ID 31!@#ACTIVITY_CODE 1
12/23/2022 03:16:48 AM script INFO: SUCCESS!@#KODE 1!@#USER_ID 31!@#ACTIVITY_CODE 3
12/23/2022 03:16:48 AM script INFO: SUCCESS!@#KODE 1!@#USER_ID 31!@#ACTIVITY_CODE 5
12/23/2022 03:16:48 AM script INFO: SUCCESS!@#KODE 1!@#USER_ID 31!@#ACTIVITY_CODE 5
12/23/2022 03:16:50 AM script INFO: SUCCESS!@#KODE 1!@#USER_ID 31!@#ACTIVITY_CODE 5
12/23/2022 03:16:50 AM script INFO: SUCCESS!@#KODE 1!@#USER_ID 31!@#ACTIVITY_CODE 5
12/23/2022 03:16:53 AM script INFO: SUCCESS!@#KODE 1!@#USER_ID 31!@#ACTIVITY_CODE 3
12/23/2022 03:16:53 AM script INFO: SUCCESS!@#KODE 1!@#USER_ID 31!@#ACTIVITY_CODE 1
12/23/2022 03:16:53 AM script INFO: SUCCESS!@#KODE 1!@#USER_ID 31!@#ACTIVITY_CODE 2
12/23/2022 03:16:53 AM script INFO: SUCCESS!@#KODE 1!@#USER_ID 31!@#ACTIVITY_CODE 3
12/23/2022 03:16:53 AM script INFO: SUCCESS!@#KODE 1!@#USER_ID 31!@#ACTIVITY_CODE 2
12/23/2022 03:16:54 AM script INFO: SUCCESS!@#KODE 1!@#USER_ID 31!@#ACTIVITY_CODE 3
12/23/2022 03:16:54 AM script INFO: SUCCESS!@#KODE 1!@#USER_ID 31!@#ACTIVITY_CODE 1
12/23/2022 03:16:54 AM script INFO: SUCCESS!@#KODE 1!@#USER_ID 31!@#ACTIVITY_CODE 2
12/23/2022 03:16:54 AM script INFO: SUCCESS!@#KODE 1!@#USER_ID 31!@#ACTIVITY_CODE 2
12/23/2022 03:16:54 AM script INFO: SUCCESS!@#KODE 1!@#USER_ID 31!@#ACTIVITY_CODE 1
12/23/2022 03:16:54 AM script INFO: SUCCESS!@#KODE 1!@#USER_ID 31!@#ACTIVITY_CODE 2
12/23/2022 03:16:54 AM script INFO: SUCCESS!@#KODE 1!@#USER_ID 31!@#ACTIVITY_CODE 3
12/23/2022 03:16:54 AM script INFO: SUCCESS!@#KODE 1!@#USER_ID 31!@#ACTIVITY_CODE 5
12/23/2022 03:16:54 AM script INFO: SUCCESS!@#KODE 1!@#USER_ID 31!@#ACTIVITY_CODE 5
12/23/2022 03:16:57 AM script INFO: SUCCESS!@#KODE 1!@#USER_ID 31!@#ACTIVITY_CODE 3
12/23/2022 03:16:57 AM script INFO: SUCCESS!@#KODE 1!@#USER_ID 31!@#ACTIVITY_CODE 1
12/23/2022 03:16:57 AM script INFO: SUCCESS!@#KODE 1!@#USER_ID 31!@#ACTIVITY_CODE 5
12/23/2022 03:16:57 AM script INFO: SUCCESS!@#KODE 1!@#USER_ID 31!@#ACTIVITY_CODE 5
12/23/2022 03:17:00 AM script INFO: SUCCESS!@#KODE 1!@#USER_ID 31!@#ACTIVITY_CODE 2
12/23/2022 03:17:00 AM script INFO: SUCCESS!@#KODE 1!@#USER_ID 31!@#ACTIVITY_CODE 3
12/23/2022 03:17:00 AM script INFO: SUCCESS!@#KODE 1!@#USER_ID 31!@#ACTIVITY_CODE 2
12/23/2022 03:17:00 AM script INFO: SUCCESS!@#KODE 1!@#USER_ID 31!@#ACTIVITY_CODE 5
12/23/2022 03:17:00 AM script INFO: SUCCESS!@#KODE 1!@#USER_ID 31!@#ACTIVITY_CODE 5
12/23/2022 03:17:03 AM script INFO: SUCCESS!@#KODE 1!@#USER_ID 31!@#ACTIVITY_CODE 2
12/23/2022 03:17:03 AM script INFO: SUCCESS!@#KODE 1!@#USER_ID 31!@#ACTIVITY_CODE 1
12/23/2022 03:17:03 AM script INFO: SUCCESS!@#KODE 1!@#USER_ID 31!@#ACTIVITY_CODE 2
12/23/2022 03:17:03 AM script INFO: SUCCESS!@#KODE 1!@#USER_ID 31!@#ACTIVITY_CODE 2
12/23/2022 03:17:03 AM script INFO: SUCCESS!@#KODE 1!@#USER_ID 31!@#ACTIVITY_CODE 1
12/23/2022 03:17:04 AM script INFO: SUCCESS!@#KODE 1!@#USER_ID 31!@#ACTIVITY_CODE 1
12/23/2022 03:17:04 AM script INFO: SUCCESS!@#KODE 1!@#USER_ID 31!@#ACTIVITY_CODE 3
12/23/2022 03:17:04 AM script INFO: SUCCESS!@#KODE 1!@#USER_ID 31!@#ACTIVITY_CODE 3
12/23/2022 03:17:04 AM script INFO: SUCCESS!@#KODE 1!@#USER_ID 31!@#ACTIVITY_CODE 1
12/23/2022 03:17:04 AM script INFO: SUCCESS!@#KODE 1!@#USER_ID 31!@#ACTIVITY_CODE 2
12/23/2022 03:17:04 AM script INFO: SUCCESS!@#KODE 1!@#USER_ID 31!@#ACTIVITY_CODE 3
12/23/2022 03:17:04 AM script INFO: SUCCESS!@#KODE 1!@#USER_ID 31!@#ACTIVITY_CODE 3
12/23/2022 03:17:04 AM script INFO: SUCCESS!@#KODE 1!@#USER_ID 31!@#ACTIVITY_CODE 2
12/23/2022 03:17:05 AM script INFO: SUCCESS!@#KODE 1!@#USER_ID 31!@#ACTIVITY_CODE 2
12/23/2022 03:17:05 AM script INFO: SUCCESS!@#KODE 1!@#USER_ID 31!@#ACTIVITY_CODE 2
12/23/2022 03:17:05 AM script INFO: Duration: 20.28768563270569
12/23/2022 03:17:05 AM script INFO: mengakhiri-quiz
12/23/2022 03:17:06 AM script INFO: SUCCESS!@#KODE 1!@#USER_ID 31!@#ACTIVITY_CODE 5
12/23/2022 03:17:06 AM script INFO: berhasil-submit
