12/23/2022 07:11:46 AM script INFO: Prepared chrome options..
12/23/2022 07:11:48 AM script INFO: Initialized chrome browser..
12/23/2022 07:11:48 AM script INFO: mengakses-homepage
12/23/2022 07:12:01 AM script INFO: mengakses-login-page
12/23/2022 07:12:02 AM script INFO: mengakses-site-home
12/23/2022 07:12:03 AM script INFO: mengakses-site-course
12/23/2022 07:12:04 AM script INFO: mengakses-quiz
12/23/2022 07:12:04 AM script INFO: mengakses-start-quiz-page
12/23/2022 07:12:05 AM script INFO: memulai-quiz
12/23/2022 07:12:05 AM script INFO: SUCCESS!@#KODE 1!@#USER_ID 29!@#ACTIVITY_CODE 5
12/23/2022 07:12:16 AM script INFO: SUCCESS!@#KODE 1!@#USER_ID 29!@#ACTIVITY_CODE 5
12/23/2022 07:12:16 AM script INFO: SUCCESS!@#KODE 1!@#USER_ID 29!@#ACTIVITY_CODE 5
12/23/2022 07:12:19 AM script INFO: SUCCESS!@#KODE 1!@#USER_ID 29!@#ACTIVITY_CODE 1
12/23/2022 07:12:19 AM script INFO: SUCCESS!@#KODE 1!@#USER_ID 29!@#ACTIVITY_CODE 2
12/23/2022 07:12:19 AM script INFO: SUCCESS!@#KODE 1!@#USER_ID 29!@#ACTIVITY_CODE 2
12/23/2022 07:12:19 AM script INFO: SUCCESS!@#KODE 1!@#USER_ID 29!@#ACTIVITY_CODE 5
12/23/2022 07:12:19 AM script INFO: SUCCESS!@#KODE 1!@#USER_ID 29!@#ACTIVITY_CODE 5
12/23/2022 07:12:22 AM script INFO: SUCCESS!@#KODE 1!@#USER_ID 29!@#ACTIVITY_CODE 3
12/23/2022 07:12:22 AM script INFO: SUCCESS!@#KODE 1!@#USER_ID 29!@#ACTIVITY_CODE 4
12/23/2022 07:12:22 AM script INFO: SUCCESS!@#KODE 1!@#USER_ID 29!@#ACTIVITY_CODE 1
12/23/2022 07:12:22 AM script INFO: SUCCESS!@#KODE 1!@#USER_ID 29!@#ACTIVITY_CODE 3
12/23/2022 07:12:22 AM script INFO: SUCCESS!@#KODE 1!@#USER_ID 29!@#ACTIVITY_CODE 4
12/23/2022 07:12:22 AM script INFO: SUCCESS!@#KODE 1!@#USER_ID 29!@#ACTIVITY_CODE 5
12/23/2022 07:12:22 AM script INFO: SUCCESS!@#KODE 1!@#USER_ID 29!@#ACTIVITY_CODE 5
12/23/2022 07:12:25 AM script INFO: SUCCESS!@#KODE 1!@#USER_ID 29!@#ACTIVITY_CODE 3
12/23/2022 07:12:25 AM script INFO: SUCCESS!@#KODE 1!@#USER_ID 29!@#ACTIVITY_CODE 1
12/23/2022 07:12:25 AM script INFO: SUCCESS!@#KODE 1!@#USER_ID 29!@#ACTIVITY_CODE 4
12/23/2022 07:12:25 AM script INFO: SUCCESS!@#KODE 1!@#USER_ID 29!@#ACTIVITY_CODE 1
12/23/2022 07:12:25 AM script INFO: SUCCESS!@#KODE 1!@#USER_ID 29!@#ACTIVITY_CODE 2
12/23/2022 07:12:25 AM script INFO: SUCCESS!@#KODE 1!@#USER_ID 29!@#ACTIVITY_CODE 5
12/23/2022 07:12:25 AM script INFO: SUCCESS!@#KODE 1!@#USER_ID 29!@#ACTIVITY_CODE 5
12/23/2022 07:12:28 AM script INFO: SUCCESS!@#KODE 1!@#USER_ID 29!@#ACTIVITY_CODE 5
12/23/2022 07:12:28 AM script INFO: SUCCESS!@#KODE 1!@#USER_ID 29!@#ACTIVITY_CODE 5
12/23/2022 07:12:30 AM script INFO: SUCCESS!@#KODE 1!@#USER_ID 29!@#ACTIVITY_CODE 1
12/23/2022 07:12:30 AM script INFO: SUCCESS!@#KODE 1!@#USER_ID 29!@#ACTIVITY_CODE 2
12/23/2022 07:12:30 AM script INFO: SUCCESS!@#KODE 1!@#USER_ID 29!@#ACTIVITY_CODE 3
12/23/2022 07:12:31 AM script INFO: SUCCESS!@#KODE 1!@#USER_ID 29!@#ACTIVITY_CODE 3
12/23/2022 07:12:31 AM script INFO: SUCCESS!@#KODE 1!@#USER_ID 29!@#ACTIVITY_CODE 5
12/23/2022 07:12:31 AM script INFO: SUCCESS!@#KODE 1!@#USER_ID 29!@#ACTIVITY_CODE 5
12/23/2022 07:12:33 AM script INFO: SUCCESS!@#KODE 1!@#USER_ID 29!@#ACTIVITY_CODE 2
12/23/2022 07:12:33 AM script INFO: SUCCESS!@#KODE 1!@#USER_ID 29!@#ACTIVITY_CODE 1
12/23/2022 07:12:33 AM script INFO: SUCCESS!@#KODE 1!@#USER_ID 29!@#ACTIVITY_CODE 5
12/23/2022 07:12:33 AM script INFO: SUCCESS!@#KODE 1!@#USER_ID 29!@#ACTIVITY_CODE 5
12/23/2022 07:12:36 AM script INFO: SUCCESS!@#KODE 1!@#USER_ID 29!@#ACTIVITY_CODE 4
12/23/2022 07:12:36 AM script INFO: SUCCESS!@#KODE 1!@#USER_ID 29!@#ACTIVITY_CODE 3
12/23/2022 07:12:36 AM script INFO: SUCCESS!@#KODE 1!@#USER_ID 29!@#ACTIVITY_CODE 3
12/23/2022 07:12:36 AM script INFO: SUCCESS!@#KODE 1!@#USER_ID 29!@#ACTIVITY_CODE 2
12/23/2022 07:12:36 AM script INFO: SUCCESS!@#KODE 1!@#USER_ID 29!@#ACTIVITY_CODE 5
12/23/2022 07:12:36 AM script INFO: SUCCESS!@#KODE 1!@#USER_ID 29!@#ACTIVITY_CODE 5
12/23/2022 07:12:39 AM script INFO: SUCCESS!@#KODE 1!@#USER_ID 29!@#ACTIVITY_CODE 2
12/23/2022 07:12:39 AM script INFO: SUCCESS!@#KODE 1!@#USER_ID 29!@#ACTIVITY_CODE 5
12/23/2022 07:12:39 AM script INFO: SUCCESS!@#KODE 1!@#USER_ID 29!@#ACTIVITY_CODE 5
12/23/2022 07:12:42 AM script INFO: SUCCESS!@#KODE 1!@#USER_ID 29!@#ACTIVITY_CODE 3
12/23/2022 07:12:42 AM script INFO: SUCCESS!@#KODE 1!@#USER_ID 29!@#ACTIVITY_CODE 3
12/23/2022 07:12:42 AM script INFO: SUCCESS!@#KODE 1!@#USER_ID 29!@#ACTIVITY_CODE 5
12/23/2022 07:12:42 AM script INFO: SUCCESS!@#KODE 1!@#USER_ID 29!@#ACTIVITY_CODE 5
12/23/2022 07:12:44 AM script INFO: SUCCESS!@#KODE 1!@#USER_ID 29!@#ACTIVITY_CODE 1
12/23/2022 07:12:44 AM script INFO: SUCCESS!@#KODE 1!@#USER_ID 29!@#ACTIVITY_CODE 5
12/23/2022 07:12:44 AM script INFO: SUCCESS!@#KODE 1!@#USER_ID 29!@#ACTIVITY_CODE 5
12/23/2022 07:12:47 AM script INFO: SUCCESS!@#KODE 1!@#USER_ID 29!@#ACTIVITY_CODE 1
12/23/2022 07:12:47 AM script INFO: SUCCESS!@#KODE 1!@#USER_ID 29!@#ACTIVITY_CODE 1
12/23/2022 07:12:47 AM script INFO: SUCCESS!@#KODE 1!@#USER_ID 29!@#ACTIVITY_CODE 1
12/23/2022 07:12:47 AM script INFO: SUCCESS!@#KODE 1!@#USER_ID 29!@#ACTIVITY_CODE 2
12/23/2022 07:12:47 AM script INFO: SUCCESS!@#KODE 1!@#USER_ID 29!@#ACTIVITY_CODE 4
12/23/2022 07:12:47 AM script INFO: SUCCESS!@#KODE 1!@#USER_ID 29!@#ACTIVITY_CODE 3
12/23/2022 07:12:48 AM script INFO: SUCCESS!@#KODE 1!@#USER_ID 29!@#ACTIVITY_CODE 2
12/23/2022 07:12:48 AM script INFO: SUCCESS!@#KODE 1!@#USER_ID 29!@#ACTIVITY_CODE 2
12/23/2022 07:12:48 AM script INFO: SUCCESS!@#KODE 1!@#USER_ID 29!@#ACTIVITY_CODE 1
12/23/2022 07:12:48 AM script INFO: SUCCESS!@#KODE 1!@#USER_ID 29!@#ACTIVITY_CODE 2
12/23/2022 07:12:48 AM script INFO: SUCCESS!@#KODE 1!@#USER_ID 29!@#ACTIVITY_CODE 3
12/23/2022 07:12:48 AM script INFO: SUCCESS!@#KODE 1!@#USER_ID 29!@#ACTIVITY_CODE 1
12/23/2022 07:12:48 AM script INFO: SUCCESS!@#KODE 1!@#USER_ID 29!@#ACTIVITY_CODE 3
12/23/2022 07:12:49 AM script INFO: SUCCESS!@#KODE 1!@#USER_ID 29!@#ACTIVITY_CODE 4
12/23/2022 07:12:49 AM script INFO: SUCCESS!@#KODE 1!@#USER_ID 29!@#ACTIVITY_CODE 2
12/23/2022 07:12:49 AM script INFO: SUCCESS!@#KODE 1!@#USER_ID 29!@#ACTIVITY_CODE 3
12/23/2022 07:12:49 AM script INFO: SUCCESS!@#KODE 1!@#USER_ID 29!@#ACTIVITY_CODE 1
12/23/2022 07:12:49 AM script INFO: SUCCESS!@#KODE 1!@#USER_ID 29!@#ACTIVITY_CODE 4
12/23/2022 07:12:49 AM script INFO: SUCCESS!@#KODE 1!@#USER_ID 29!@#ACTIVITY_CODE 3
12/23/2022 07:12:49 AM script INFO: SUCCESS!@#KODE 1!@#USER_ID 29!@#ACTIVITY_CODE 2
12/23/2022 07:12:49 AM script INFO: SUCCESS!@#KODE 1!@#USER_ID 29!@#ACTIVITY_CODE 1
12/23/2022 07:12:49 AM script INFO: SUCCESS!@#KODE 1!@#USER_ID 29!@#ACTIVITY_CODE 3
12/23/2022 07:12:50 AM script INFO: SUCCESS!@#KODE 1!@#USER_ID 29!@#ACTIVITY_CODE 3
12/23/2022 07:12:50 AM script INFO: SUCCESS!@#KODE 1!@#USER_ID 29!@#ACTIVITY_CODE 1
12/23/2022 07:12:50 AM script INFO: SUCCESS!@#KODE 1!@#USER_ID 29!@#ACTIVITY_CODE 2
12/23/2022 07:12:50 AM script INFO: SUCCESS!@#KODE 1!@#USER_ID 29!@#ACTIVITY_CODE 1
12/23/2022 07:12:50 AM script INFO: SUCCESS!@#KODE 1!@#USER_ID 29!@#ACTIVITY_CODE 3
12/23/2022 07:12:50 AM script INFO: SUCCESS!@#KODE 1!@#USER_ID 29!@#ACTIVITY_CODE 2
12/23/2022 07:12:50 AM script INFO: SUCCESS!@#KODE 1!@#USER_ID 29!@#ACTIVITY_CODE 2
12/23/2022 07:12:50 AM script INFO: SUCCESS!@#KODE 1!@#USER_ID 29!@#ACTIVITY_CODE 1
12/23/2022 07:12:50 AM script INFO: SUCCESS!@#KODE 1!@#USER_ID 29!@#ACTIVITY_CODE 1
12/23/2022 07:12:51 AM script INFO: SUCCESS!@#KODE 1!@#USER_ID 29!@#ACTIVITY_CODE 2
12/23/2022 07:12:51 AM script INFO: SUCCESS!@#KODE 1!@#USER_ID 29!@#ACTIVITY_CODE 2
12/23/2022 07:12:51 AM script INFO: SUCCESS!@#KODE 1!@#USER_ID 29!@#ACTIVITY_CODE 2
12/23/2022 07:12:51 AM script INFO: SUCCESS!@#KODE 1!@#USER_ID 29!@#ACTIVITY_CODE 3
12/23/2022 07:12:51 AM script INFO: SUCCESS!@#KODE 1!@#USER_ID 29!@#ACTIVITY_CODE 4
12/23/2022 07:12:51 AM script INFO: SUCCESS!@#KODE 1!@#USER_ID 29!@#ACTIVITY_CODE 1
12/23/2022 07:12:51 AM script INFO: SUCCESS!@#KODE 1!@#USER_ID 29!@#ACTIVITY_CODE 4
12/23/2022 07:12:52 AM script INFO: SUCCESS!@#KODE 1!@#USER_ID 29!@#ACTIVITY_CODE 3
12/23/2022 07:12:52 AM script INFO: SUCCESS!@#KODE 1!@#USER_ID 29!@#ACTIVITY_CODE 3
12/23/2022 07:12:52 AM script INFO: SUCCESS!@#KODE 1!@#USER_ID 29!@#ACTIVITY_CODE 2
12/23/2022 07:12:52 AM script INFO: SUCCESS!@#KODE 1!@#USER_ID 29!@#ACTIVITY_CODE 2
12/23/2022 07:12:52 AM script INFO: SUCCESS!@#KODE 1!@#USER_ID 29!@#ACTIVITY_CODE 2
12/23/2022 07:12:52 AM script INFO: SUCCESS!@#KODE 1!@#USER_ID 29!@#ACTIVITY_CODE 2
12/23/2022 07:12:52 AM script INFO: SUCCESS!@#KODE 1!@#USER_ID 29!@#ACTIVITY_CODE 2
12/23/2022 07:12:53 AM script INFO: SUCCESS!@#KODE 1!@#USER_ID 29!@#ACTIVITY_CODE 2
12/23/2022 07:12:53 AM script INFO: SUCCESS!@#KODE 1!@#USER_ID 29!@#ACTIVITY_CODE 3
12/23/2022 07:12:53 AM script INFO: SUCCESS!@#KODE 1!@#USER_ID 29!@#ACTIVITY_CODE 2
12/23/2022 07:12:53 AM script INFO: SUCCESS!@#KODE 1!@#USER_ID 29!@#ACTIVITY_CODE 2
12/23/2022 07:12:53 AM script INFO: Duration: 36.91288208961487
12/23/2022 07:12:53 AM script INFO: mengakhiri-quiz
12/23/2022 07:13:02 AM script INFO: SUCCESS!@#KODE 1!@#USER_ID 29!@#ACTIVITY_CODE 5
12/23/2022 07:13:02 AM script INFO: berhasil-submit
