12/12/2022 01:32:05 AM script INFO: Prepared chrome options..
12/12/2022 01:32:07 AM script INFO: Initialized chrome browser..
12/12/2022 01:32:07 AM script INFO: mengakses-homepage
12/12/2022 01:32:44 AM script INFO: mengakses-login-page
12/12/2022 01:32:45 AM script INFO: mengakses-site-home
12/12/2022 01:32:45 AM script INFO: mengakses-site-course
12/12/2022 01:32:46 AM script INFO: mengakses-quiz
12/12/2022 01:32:47 AM script INFO: mengakses-start-quiz-page
12/12/2022 01:32:49 AM script INFO: memulai-quiz
12/12/2022 01:32:49 AM script INFO: SUCCESS!@#KODE 1!@#USER_ID 47!@#ACTIVITY_CODE 5
12/12/2022 01:33:00 AM script INFO: SUCCESS!@#KODE 1!@#USER_ID 47!@#ACTIVITY_CODE 2
12/12/2022 01:33:00 AM script INFO: SUCCESS!@#KODE 1!@#USER_ID 47!@#ACTIVITY_CODE 5
12/12/2022 01:33:00 AM script INFO: SUCCESS!@#KODE 1!@#USER_ID 47!@#ACTIVITY_CODE 5
12/12/2022 01:33:02 AM script INFO: SUCCESS!@#KODE 1!@#USER_ID 47!@#ACTIVITY_CODE 2
12/12/2022 01:33:02 AM script INFO: SUCCESS!@#KODE 1!@#USER_ID 47!@#ACTIVITY_CODE 1
12/12/2022 01:33:02 AM script INFO: SUCCESS!@#KODE 1!@#USER_ID 47!@#ACTIVITY_CODE 1
12/12/2022 01:33:03 AM script INFO: SUCCESS!@#KODE 1!@#USER_ID 47!@#ACTIVITY_CODE 2
12/12/2022 01:33:03 AM script INFO: SUCCESS!@#KODE 1!@#USER_ID 47!@#ACTIVITY_CODE 2
12/12/2022 01:33:03 AM script INFO: SUCCESS!@#KODE 1!@#USER_ID 47!@#ACTIVITY_CODE 1
12/12/2022 01:33:03 AM script INFO: SUCCESS!@#KODE 1!@#USER_ID 47!@#ACTIVITY_CODE 3
12/12/2022 01:33:03 AM script INFO: SUCCESS!@#KODE 1!@#USER_ID 47!@#ACTIVITY_CODE 5
12/12/2022 01:33:03 AM script INFO: SUCCESS!@#KODE 1!@#USER_ID 47!@#ACTIVITY_CODE 5
12/12/2022 01:33:06 AM script INFO: SUCCESS!@#KODE 1!@#USER_ID 47!@#ACTIVITY_CODE 2
12/12/2022 01:33:06 AM script INFO: SUCCESS!@#KODE 1!@#USER_ID 47!@#ACTIVITY_CODE 2
12/12/2022 01:33:06 AM script INFO: SUCCESS!@#KODE 1!@#USER_ID 47!@#ACTIVITY_CODE 1
12/12/2022 01:33:06 AM script INFO: SUCCESS!@#KODE 1!@#USER_ID 47!@#ACTIVITY_CODE 2
12/12/2022 01:33:06 AM script INFO: SUCCESS!@#KODE 1!@#USER_ID 47!@#ACTIVITY_CODE 3
12/12/2022 01:33:06 AM script INFO: SUCCESS!@#KODE 1!@#USER_ID 47!@#ACTIVITY_CODE 5
12/12/2022 01:33:06 AM script INFO: SUCCESS!@#KODE 1!@#USER_ID 47!@#ACTIVITY_CODE 5
12/12/2022 01:33:09 AM script INFO: SUCCESS!@#KODE 1!@#USER_ID 47!@#ACTIVITY_CODE 1
12/12/2022 01:33:09 AM script INFO: SUCCESS!@#KODE 1!@#USER_ID 47!@#ACTIVITY_CODE 1
12/12/2022 01:33:09 AM script INFO: SUCCESS!@#KODE 1!@#USER_ID 47!@#ACTIVITY_CODE 5
12/12/2022 01:33:09 AM script INFO: SUCCESS!@#KODE 1!@#USER_ID 47!@#ACTIVITY_CODE 5
12/12/2022 01:33:11 AM script INFO: SUCCESS!@#KODE 1!@#USER_ID 47!@#ACTIVITY_CODE 2
12/12/2022 01:33:11 AM script INFO: SUCCESS!@#KODE 1!@#USER_ID 47!@#ACTIVITY_CODE 2
12/12/2022 01:33:11 AM script INFO: SUCCESS!@#KODE 1!@#USER_ID 47!@#ACTIVITY_CODE 5
12/12/2022 01:33:11 AM script INFO: SUCCESS!@#KODE 1!@#USER_ID 47!@#ACTIVITY_CODE 5
12/12/2022 01:33:14 AM script INFO: SUCCESS!@#KODE 1!@#USER_ID 47!@#ACTIVITY_CODE 2
12/12/2022 01:33:14 AM script INFO: SUCCESS!@#KODE 1!@#USER_ID 47!@#ACTIVITY_CODE 5
12/12/2022 01:33:14 AM script INFO: SUCCESS!@#KODE 1!@#USER_ID 47!@#ACTIVITY_CODE 5
12/12/2022 01:33:17 AM script INFO: SUCCESS!@#KODE 1!@#USER_ID 47!@#ACTIVITY_CODE 5
12/12/2022 01:33:17 AM script INFO: SUCCESS!@#KODE 1!@#USER_ID 47!@#ACTIVITY_CODE 5
12/12/2022 01:33:19 AM script INFO: SUCCESS!@#KODE 1!@#USER_ID 47!@#ACTIVITY_CODE 3
12/12/2022 01:33:19 AM script INFO: SUCCESS!@#KODE 1!@#USER_ID 47!@#ACTIVITY_CODE 2
12/12/2022 01:33:19 AM script INFO: SUCCESS!@#KODE 1!@#USER_ID 47!@#ACTIVITY_CODE 4
12/12/2022 01:33:20 AM script INFO: SUCCESS!@#KODE 1!@#USER_ID 47!@#ACTIVITY_CODE 2
12/12/2022 01:33:20 AM script INFO: SUCCESS!@#KODE 1!@#USER_ID 47!@#ACTIVITY_CODE 5
12/12/2022 01:33:20 AM script INFO: SUCCESS!@#KODE 1!@#USER_ID 47!@#ACTIVITY_CODE 5
12/12/2022 01:33:22 AM script INFO: SUCCESS!@#KODE 1!@#USER_ID 47!@#ACTIVITY_CODE 5
12/12/2022 01:33:22 AM script INFO: SUCCESS!@#KODE 1!@#USER_ID 47!@#ACTIVITY_CODE 5
12/12/2022 01:33:25 AM script INFO: SUCCESS!@#KODE 1!@#USER_ID 47!@#ACTIVITY_CODE 2
12/12/2022 01:33:25 AM script INFO: SUCCESS!@#KODE 1!@#USER_ID 47!@#ACTIVITY_CODE 2
12/12/2022 01:33:25 AM script INFO: SUCCESS!@#KODE 1!@#USER_ID 47!@#ACTIVITY_CODE 2
12/12/2022 01:33:25 AM script INFO: SUCCESS!@#KODE 1!@#USER_ID 47!@#ACTIVITY_CODE 2
12/12/2022 01:33:25 AM script INFO: SUCCESS!@#KODE 1!@#USER_ID 47!@#ACTIVITY_CODE 2
12/12/2022 01:33:26 AM script INFO: SUCCESS!@#KODE 1!@#USER_ID 47!@#ACTIVITY_CODE 2
12/12/2022 01:33:26 AM script INFO: SUCCESS!@#KODE 1!@#USER_ID 47!@#ACTIVITY_CODE 1
12/12/2022 01:33:26 AM script INFO: SUCCESS!@#KODE 1!@#USER_ID 47!@#ACTIVITY_CODE 2
12/12/2022 01:33:26 AM script INFO: SUCCESS!@#KODE 1!@#USER_ID 47!@#ACTIVITY_CODE 5
12/12/2022 01:33:26 AM script INFO: SUCCESS!@#KODE 1!@#USER_ID 47!@#ACTIVITY_CODE 5
12/12/2022 01:33:28 AM script INFO: SUCCESS!@#KODE 1!@#USER_ID 47!@#ACTIVITY_CODE 3
12/12/2022 01:33:28 AM script INFO: SUCCESS!@#KODE 1!@#USER_ID 47!@#ACTIVITY_CODE 5
12/12/2022 01:33:28 AM script INFO: SUCCESS!@#KODE 1!@#USER_ID 47!@#ACTIVITY_CODE 5
12/12/2022 01:33:31 AM script INFO: SUCCESS!@#KODE 1!@#USER_ID 47!@#ACTIVITY_CODE 2
12/12/2022 01:33:31 AM script INFO: SUCCESS!@#KODE 1!@#USER_ID 47!@#ACTIVITY_CODE 3
12/12/2022 01:33:31 AM script INFO: SUCCESS!@#KODE 1!@#USER_ID 47!@#ACTIVITY_CODE 2
12/12/2022 01:33:31 AM script INFO: SUCCESS!@#KODE 1!@#USER_ID 47!@#ACTIVITY_CODE 1
12/12/2022 01:33:32 AM script INFO: SUCCESS!@#KODE 1!@#USER_ID 47!@#ACTIVITY_CODE 4
12/12/2022 01:33:32 AM script INFO: SUCCESS!@#KODE 1!@#USER_ID 47!@#ACTIVITY_CODE 5
12/12/2022 01:33:32 AM script INFO: SUCCESS!@#KODE 1!@#USER_ID 47!@#ACTIVITY_CODE 5
12/12/2022 01:33:34 AM script INFO: SUCCESS!@#KODE 1!@#USER_ID 47!@#ACTIVITY_CODE 2
12/12/2022 01:33:34 AM script INFO: SUCCESS!@#KODE 1!@#USER_ID 47!@#ACTIVITY_CODE 1
12/12/2022 01:33:34 AM script INFO: SUCCESS!@#KODE 1!@#USER_ID 47!@#ACTIVITY_CODE 5
12/12/2022 01:33:34 AM script INFO: SUCCESS!@#KODE 1!@#USER_ID 47!@#ACTIVITY_CODE 5
12/12/2022 01:33:37 AM script INFO: SUCCESS!@#KODE 1!@#USER_ID 47!@#ACTIVITY_CODE 3
12/12/2022 01:33:37 AM script INFO: SUCCESS!@#KODE 1!@#USER_ID 47!@#ACTIVITY_CODE 2
12/12/2022 01:33:37 AM script INFO: SUCCESS!@#KODE 1!@#USER_ID 47!@#ACTIVITY_CODE 3
12/12/2022 01:33:37 AM script INFO: SUCCESS!@#KODE 1!@#USER_ID 47!@#ACTIVITY_CODE 4
12/12/2022 01:33:37 AM script INFO: SUCCESS!@#KODE 1!@#USER_ID 47!@#ACTIVITY_CODE 5
12/12/2022 01:33:37 AM script INFO: SUCCESS!@#KODE 1!@#USER_ID 47!@#ACTIVITY_CODE 5
12/12/2022 01:33:40 AM script INFO: SUCCESS!@#KODE 1!@#USER_ID 47!@#ACTIVITY_CODE 2
12/12/2022 01:33:40 AM script INFO: SUCCESS!@#KODE 1!@#USER_ID 47!@#ACTIVITY_CODE 2
12/12/2022 01:33:40 AM script INFO: SUCCESS!@#KODE 1!@#USER_ID 47!@#ACTIVITY_CODE 2
12/12/2022 01:33:40 AM script INFO: SUCCESS!@#KODE 1!@#USER_ID 47!@#ACTIVITY_CODE 5
12/12/2022 01:33:40 AM script INFO: SUCCESS!@#KODE 1!@#USER_ID 47!@#ACTIVITY_CODE 5
12/12/2022 01:33:43 AM script INFO: SUCCESS!@#KODE 1!@#USER_ID 47!@#ACTIVITY_CODE 2
12/12/2022 01:33:44 AM script INFO: SUCCESS!@#KODE 1!@#USER_ID 47!@#ACTIVITY_CODE 2
12/12/2022 01:33:44 AM script INFO: SUCCESS!@#KODE 1!@#USER_ID 47!@#ACTIVITY_CODE 2
12/12/2022 01:33:44 AM script INFO: SUCCESS!@#KODE 1!@#USER_ID 47!@#ACTIVITY_CODE 3
12/12/2022 01:33:44 AM script INFO: SUCCESS!@#KODE 1!@#USER_ID 47!@#ACTIVITY_CODE 3
12/12/2022 01:33:44 AM script INFO: SUCCESS!@#KODE 1!@#USER_ID 47!@#ACTIVITY_CODE 2
12/12/2022 01:33:44 AM script INFO: SUCCESS!@#KODE 1!@#USER_ID 47!@#ACTIVITY_CODE 1
12/12/2022 01:33:45 AM script INFO: SUCCESS!@#KODE 1!@#USER_ID 47!@#ACTIVITY_CODE 3
12/12/2022 01:33:45 AM script INFO: SUCCESS!@#KODE 1!@#USER_ID 47!@#ACTIVITY_CODE 3
12/12/2022 01:33:45 AM script INFO: SUCCESS!@#KODE 1!@#USER_ID 47!@#ACTIVITY_CODE 3
12/12/2022 01:33:45 AM script INFO: SUCCESS!@#KODE 1!@#USER_ID 47!@#ACTIVITY_CODE 4
12/12/2022 01:33:45 AM script INFO: SUCCESS!@#KODE 1!@#USER_ID 47!@#ACTIVITY_CODE 5
12/12/2022 01:33:45 AM script INFO: SUCCESS!@#KODE 1!@#USER_ID 47!@#ACTIVITY_CODE 5
12/12/2022 01:33:48 AM script INFO: SUCCESS!@#KODE 1!@#USER_ID 47!@#ACTIVITY_CODE 2
12/12/2022 01:33:48 AM script INFO: SUCCESS!@#KODE 1!@#USER_ID 47!@#ACTIVITY_CODE 2
12/12/2022 01:33:48 AM script INFO: SUCCESS!@#KODE 1!@#USER_ID 47!@#ACTIVITY_CODE 1
12/12/2022 01:33:48 AM script INFO: SUCCESS!@#KODE 1!@#USER_ID 47!@#ACTIVITY_CODE 3
12/12/2022 01:33:48 AM script INFO: SUCCESS!@#KODE 1!@#USER_ID 47!@#ACTIVITY_CODE 1
12/12/2022 01:33:49 AM script INFO: SUCCESS!@#KODE 1!@#USER_ID 47!@#ACTIVITY_CODE 3
12/12/2022 01:33:49 AM script INFO: SUCCESS!@#KODE 1!@#USER_ID 47!@#ACTIVITY_CODE 4
12/12/2022 01:33:49 AM script INFO: SUCCESS!@#KODE 1!@#USER_ID 47!@#ACTIVITY_CODE 2
12/12/2022 01:33:49 AM script INFO: SUCCESS!@#KODE 1!@#USER_ID 47!@#ACTIVITY_CODE 1
12/12/2022 01:33:49 AM script INFO: SUCCESS!@#KODE 1!@#USER_ID 47!@#ACTIVITY_CODE 4
12/12/2022 01:33:49 AM script INFO: SUCCESS!@#KODE 1!@#USER_ID 47!@#ACTIVITY_CODE 1
12/12/2022 01:33:50 AM script INFO: SUCCESS!@#KODE 1!@#USER_ID 47!@#ACTIVITY_CODE 2
12/12/2022 01:33:50 AM script INFO: SUCCESS!@#KODE 1!@#USER_ID 47!@#ACTIVITY_CODE 2
12/12/2022 01:33:50 AM script INFO: SUCCESS!@#KODE 1!@#USER_ID 47!@#ACTIVITY_CODE 2
12/12/2022 01:33:51 AM script INFO: SUCCESS!@#KODE 1!@#USER_ID 47!@#ACTIVITY_CODE 2
12/12/2022 01:33:51 AM script INFO: SUCCESS!@#KODE 1!@#USER_ID 47!@#ACTIVITY_CODE 3
12/12/2022 01:33:51 AM script INFO: SUCCESS!@#KODE 1!@#USER_ID 47!@#ACTIVITY_CODE 2
12/12/2022 01:33:51 AM script INFO: SUCCESS!@#KODE 1!@#USER_ID 47!@#ACTIVITY_CODE 2
12/12/2022 01:33:51 AM script INFO: SUCCESS!@#KODE 1!@#USER_ID 47!@#ACTIVITY_CODE 1
12/12/2022 01:33:52 AM script INFO: SUCCESS!@#KODE 1!@#USER_ID 47!@#ACTIVITY_CODE 1
12/12/2022 01:33:52 AM script INFO: SUCCESS!@#KODE 1!@#USER_ID 47!@#ACTIVITY_CODE 3
12/12/2022 01:33:52 AM script INFO: SUCCESS!@#KODE 1!@#USER_ID 47!@#ACTIVITY_CODE 1
12/12/2022 01:33:52 AM script INFO: SUCCESS!@#KODE 1!@#USER_ID 47!@#ACTIVITY_CODE 3
12/12/2022 01:33:52 AM script INFO: SUCCESS!@#KODE 1!@#USER_ID 47!@#ACTIVITY_CODE 1
12/12/2022 01:33:52 AM script INFO: SUCCESS!@#KODE 1!@#USER_ID 47!@#ACTIVITY_CODE 3
12/12/2022 01:33:52 AM script INFO: SUCCESS!@#KODE 1!@#USER_ID 47!@#ACTIVITY_CODE 2
12/12/2022 01:33:52 AM script INFO: SUCCESS!@#KODE 1!@#USER_ID 47!@#ACTIVITY_CODE 1
12/12/2022 01:33:52 AM script INFO: SUCCESS!@#KODE 1!@#USER_ID 47!@#ACTIVITY_CODE 4
12/12/2022 01:33:53 AM script INFO: SUCCESS!@#KODE 1!@#USER_ID 47!@#ACTIVITY_CODE 1
12/12/2022 01:33:53 AM script INFO: SUCCESS!@#KODE 1!@#USER_ID 47!@#ACTIVITY_CODE 2
12/12/2022 01:33:53 AM script INFO: SUCCESS!@#KODE 1!@#USER_ID 47!@#ACTIVITY_CODE 2
12/12/2022 01:33:53 AM script INFO: SUCCESS!@#KODE 1!@#USER_ID 47!@#ACTIVITY_CODE 1
12/12/2022 01:33:53 AM script INFO: SUCCESS!@#KODE 1!@#USER_ID 47!@#ACTIVITY_CODE 1
12/12/2022 01:33:54 AM script INFO: SUCCESS!@#KODE 1!@#USER_ID 47!@#ACTIVITY_CODE 4
12/12/2022 01:33:54 AM script INFO: SUCCESS!@#KODE 1!@#USER_ID 47!@#ACTIVITY_CODE 1
12/12/2022 01:33:54 AM script INFO: SUCCESS!@#KODE 1!@#USER_ID 47!@#ACTIVITY_CODE 4
12/12/2022 01:33:54 AM script INFO: SUCCESS!@#KODE 1!@#USER_ID 47!@#ACTIVITY_CODE 1
12/12/2022 01:33:54 AM script INFO: SUCCESS!@#KODE 1!@#USER_ID 47!@#ACTIVITY_CODE 1
12/12/2022 01:33:54 AM script INFO: SUCCESS!@#KODE 1!@#USER_ID 47!@#ACTIVITY_CODE 3
12/12/2022 01:33:54 AM script INFO: SUCCESS!@#KODE 1!@#USER_ID 47!@#ACTIVITY_CODE 2
12/12/2022 01:33:55 AM script INFO: SUCCESS!@#KODE 1!@#USER_ID 47!@#ACTIVITY_CODE 2
12/12/2022 01:33:55 AM script INFO: SUCCESS!@#KODE 1!@#USER_ID 47!@#ACTIVITY_CODE 3
12/12/2022 01:33:55 AM script INFO: SUCCESS!@#KODE 1!@#USER_ID 47!@#ACTIVITY_CODE 2
12/12/2022 01:33:55 AM script INFO: SUCCESS!@#KODE 1!@#USER_ID 47!@#ACTIVITY_CODE 3
12/12/2022 01:33:55 AM script INFO: SUCCESS!@#KODE 1!@#USER_ID 47!@#ACTIVITY_CODE 3
12/12/2022 01:33:55 AM script INFO: SUCCESS!@#KODE 1!@#USER_ID 47!@#ACTIVITY_CODE 3
12/12/2022 01:33:56 AM script INFO: SUCCESS!@#KODE 1!@#USER_ID 47!@#ACTIVITY_CODE 3
12/12/2022 01:33:56 AM script INFO: SUCCESS!@#KODE 1!@#USER_ID 47!@#ACTIVITY_CODE 1
12/12/2022 01:33:56 AM script INFO: SUCCESS!@#KODE 1!@#USER_ID 47!@#ACTIVITY_CODE 4
12/12/2022 01:33:56 AM script INFO: SUCCESS!@#KODE 1!@#USER_ID 47!@#ACTIVITY_CODE 1
12/12/2022 01:33:56 AM script INFO: SUCCESS!@#KODE 1!@#USER_ID 47!@#ACTIVITY_CODE 2
12/12/2022 01:33:56 AM script INFO: SUCCESS!@#KODE 1!@#USER_ID 47!@#ACTIVITY_CODE 2
12/12/2022 01:33:56 AM script INFO: SUCCESS!@#KODE 1!@#USER_ID 47!@#ACTIVITY_CODE 3
12/12/2022 01:33:57 AM script INFO: SUCCESS!@#KODE 1!@#USER_ID 47!@#ACTIVITY_CODE 2
12/12/2022 01:33:57 AM script INFO: SUCCESS!@#KODE 1!@#USER_ID 47!@#ACTIVITY_CODE 3
12/12/2022 01:33:57 AM script INFO: SUCCESS!@#KODE 1!@#USER_ID 47!@#ACTIVITY_CODE 4
12/12/2022 01:33:57 AM script INFO: SUCCESS!@#KODE 1!@#USER_ID 47!@#ACTIVITY_CODE 3
12/12/2022 01:33:57 AM script INFO: SUCCESS!@#KODE 1!@#USER_ID 47!@#ACTIVITY_CODE 3
12/12/2022 01:33:58 AM script INFO: SUCCESS!@#KODE 1!@#USER_ID 47!@#ACTIVITY_CODE 2
12/12/2022 01:33:58 AM script INFO: SUCCESS!@#KODE 1!@#USER_ID 47!@#ACTIVITY_CODE 3
12/12/2022 01:33:58 AM script INFO: SUCCESS!@#KODE 1!@#USER_ID 47!@#ACTIVITY_CODE 4
12/12/2022 01:33:58 AM script INFO: SUCCESS!@#KODE 1!@#USER_ID 47!@#ACTIVITY_CODE 2
12/12/2022 01:33:58 AM script INFO: SUCCESS!@#KODE 1!@#USER_ID 47!@#ACTIVITY_CODE 3
12/12/2022 01:33:58 AM script INFO: SUCCESS!@#KODE 1!@#USER_ID 47!@#ACTIVITY_CODE 3
12/12/2022 01:33:58 AM script INFO: SUCCESS!@#KODE 1!@#USER_ID 47!@#ACTIVITY_CODE 1
12/12/2022 01:33:58 AM script INFO: SUCCESS!@#KODE 1!@#USER_ID 47!@#ACTIVITY_CODE 2
12/12/2022 01:33:59 AM script INFO: SUCCESS!@#KODE 1!@#USER_ID 47!@#ACTIVITY_CODE 3
12/12/2022 01:33:59 AM script INFO: SUCCESS!@#KODE 1!@#USER_ID 47!@#ACTIVITY_CODE 3
12/12/2022 01:33:59 AM script INFO: SUCCESS!@#KODE 1!@#USER_ID 47!@#ACTIVITY_CODE 4
12/12/2022 01:33:59 AM script INFO: SUCCESS!@#KODE 1!@#USER_ID 47!@#ACTIVITY_CODE 1
12/12/2022 01:33:59 AM script INFO: SUCCESS!@#KODE 1!@#USER_ID 47!@#ACTIVITY_CODE 3
12/12/2022 01:33:59 AM script INFO: SUCCESS!@#KODE 1!@#USER_ID 47!@#ACTIVITY_CODE 1
12/12/2022 01:33:59 AM script INFO: SUCCESS!@#KODE 1!@#USER_ID 47!@#ACTIVITY_CODE 3
12/12/2022 01:33:59 AM script INFO: SUCCESS!@#KODE 1!@#USER_ID 47!@#ACTIVITY_CODE 3
12/12/2022 01:33:59 AM script INFO: SUCCESS!@#KODE 1!@#USER_ID 47!@#ACTIVITY_CODE 1
12/12/2022 01:33:59 AM script INFO: SUCCESS!@#KODE 1!@#USER_ID 47!@#ACTIVITY_CODE 1
12/12/2022 01:34:00 AM script INFO: SUCCESS!@#KODE 1!@#USER_ID 47!@#ACTIVITY_CODE 2
12/12/2022 01:34:00 AM script INFO: SUCCESS!@#KODE 1!@#USER_ID 47!@#ACTIVITY_CODE 1
12/12/2022 01:34:00 AM script INFO: SUCCESS!@#KODE 1!@#USER_ID 47!@#ACTIVITY_CODE 2
12/12/2022 01:34:00 AM script INFO: SUCCESS!@#KODE 1!@#USER_ID 47!@#ACTIVITY_CODE 2
12/12/2022 01:34:00 AM script INFO: SUCCESS!@#KODE 1!@#USER_ID 47!@#ACTIVITY_CODE 4
12/12/2022 01:34:00 AM script INFO: SUCCESS!@#KODE 1!@#USER_ID 47!@#ACTIVITY_CODE 3
12/12/2022 01:34:01 AM script INFO: SUCCESS!@#KODE 1!@#USER_ID 47!@#ACTIVITY_CODE 2
12/12/2022 01:34:01 AM script INFO: SUCCESS!@#KODE 1!@#USER_ID 47!@#ACTIVITY_CODE 1
12/12/2022 01:34:01 AM script INFO: SUCCESS!@#KODE 1!@#USER_ID 47!@#ACTIVITY_CODE 3
12/12/2022 01:34:01 AM script INFO: SUCCESS!@#KODE 1!@#USER_ID 47!@#ACTIVITY_CODE 2
12/12/2022 01:34:01 AM script INFO: SUCCESS!@#KODE 1!@#USER_ID 47!@#ACTIVITY_CODE 3
12/12/2022 01:34:01 AM script INFO: SUCCESS!@#KODE 1!@#USER_ID 47!@#ACTIVITY_CODE 1
12/12/2022 01:34:01 AM script INFO: SUCCESS!@#KODE 1!@#USER_ID 47!@#ACTIVITY_CODE 2
12/12/2022 01:34:01 AM script INFO: SUCCESS!@#KODE 1!@#USER_ID 47!@#ACTIVITY_CODE 3
12/12/2022 01:34:01 AM script INFO: SUCCESS!@#KODE 1!@#USER_ID 47!@#ACTIVITY_CODE 3
12/12/2022 01:34:01 AM script INFO: SUCCESS!@#KODE 1!@#USER_ID 47!@#ACTIVITY_CODE 1
12/12/2022 01:34:02 AM script INFO: SUCCESS!@#KODE 1!@#USER_ID 47!@#ACTIVITY_CODE 4
12/12/2022 01:34:02 AM script INFO: SUCCESS!@#KODE 1!@#USER_ID 47!@#ACTIVITY_CODE 1
12/12/2022 01:34:02 AM script INFO: SUCCESS!@#KODE 1!@#USER_ID 47!@#ACTIVITY_CODE 4
12/12/2022 01:34:02 AM script INFO: SUCCESS!@#KODE 1!@#USER_ID 47!@#ACTIVITY_CODE 3
12/12/2022 01:34:02 AM script INFO: SUCCESS!@#KODE 1!@#USER_ID 47!@#ACTIVITY_CODE 3
12/12/2022 01:34:02 AM script INFO: SUCCESS!@#KODE 1!@#USER_ID 47!@#ACTIVITY_CODE 2
12/12/2022 01:34:02 AM script INFO: SUCCESS!@#KODE 1!@#USER_ID 47!@#ACTIVITY_CODE 2
12/12/2022 01:34:02 AM script INFO: SUCCESS!@#KODE 1!@#USER_ID 47!@#ACTIVITY_CODE 2
12/12/2022 01:34:03 AM script INFO: SUCCESS!@#KODE 1!@#USER_ID 47!@#ACTIVITY_CODE 2
12/12/2022 01:34:03 AM script INFO: SUCCESS!@#KODE 1!@#USER_ID 47!@#ACTIVITY_CODE 2
12/12/2022 01:34:03 AM script INFO: SUCCESS!@#KODE 1!@#USER_ID 47!@#ACTIVITY_CODE 3
12/12/2022 01:34:03 AM script INFO: SUCCESS!@#KODE 1!@#USER_ID 47!@#ACTIVITY_CODE 3
12/12/2022 01:34:03 AM script INFO: SUCCESS!@#KODE 1!@#USER_ID 47!@#ACTIVITY_CODE 1
12/12/2022 01:34:03 AM script INFO: SUCCESS!@#KODE 1!@#USER_ID 47!@#ACTIVITY_CODE 3
12/12/2022 01:34:03 AM script INFO: SUCCESS!@#KODE 1!@#USER_ID 47!@#ACTIVITY_CODE 1
12/12/2022 01:34:03 AM script INFO: SUCCESS!@#KODE 1!@#USER_ID 47!@#ACTIVITY_CODE 2
12/12/2022 01:34:03 AM script INFO: SUCCESS!@#KODE 1!@#USER_ID 47!@#ACTIVITY_CODE 1
12/12/2022 01:34:03 AM script INFO: SUCCESS!@#KODE 1!@#USER_ID 47!@#ACTIVITY_CODE 1
12/12/2022 01:34:03 AM script INFO: SUCCESS!@#KODE 1!@#USER_ID 47!@#ACTIVITY_CODE 1
12/12/2022 01:34:03 AM script INFO: SUCCESS!@#KODE 1!@#USER_ID 47!@#ACTIVITY_CODE 3
12/12/2022 01:34:04 AM script INFO: SUCCESS!@#KODE 1!@#USER_ID 47!@#ACTIVITY_CODE 2
12/12/2022 01:34:04 AM script INFO: SUCCESS!@#KODE 1!@#USER_ID 47!@#ACTIVITY_CODE 1
12/12/2022 01:34:04 AM script INFO: SUCCESS!@#KODE 1!@#USER_ID 47!@#ACTIVITY_CODE 4
12/12/2022 01:34:04 AM script INFO: SUCCESS!@#KODE 1!@#USER_ID 47!@#ACTIVITY_CODE 1
12/12/2022 01:34:04 AM script INFO: SUCCESS!@#KODE 1!@#USER_ID 47!@#ACTIVITY_CODE 4
12/12/2022 01:34:04 AM script INFO: SUCCESS!@#KODE 1!@#USER_ID 47!@#ACTIVITY_CODE 2
12/12/2022 01:34:04 AM script INFO: SUCCESS!@#KODE 1!@#USER_ID 47!@#ACTIVITY_CODE 3
12/12/2022 01:34:04 AM script INFO: SUCCESS!@#KODE 1!@#USER_ID 47!@#ACTIVITY_CODE 3
12/12/2022 01:34:04 AM script INFO: SUCCESS!@#KODE 1!@#USER_ID 47!@#ACTIVITY_CODE 2
12/12/2022 01:34:04 AM script INFO: SUCCESS!@#KODE 1!@#USER_ID 47!@#ACTIVITY_CODE 3
12/12/2022 01:34:04 AM script INFO: SUCCESS!@#KODE 1!@#USER_ID 47!@#ACTIVITY_CODE 3
12/12/2022 01:34:05 AM script INFO: SUCCESS!@#KODE 1!@#USER_ID 47!@#ACTIVITY_CODE 3
12/12/2022 01:34:05 AM script INFO: SUCCESS!@#KODE 1!@#USER_ID 47!@#ACTIVITY_CODE 1
12/12/2022 01:34:05 AM script INFO: SUCCESS!@#KODE 1!@#USER_ID 47!@#ACTIVITY_CODE 2
12/12/2022 01:34:05 AM script INFO: SUCCESS!@#KODE 1!@#USER_ID 47!@#ACTIVITY_CODE 3
12/12/2022 01:34:05 AM script INFO: SUCCESS!@#KODE 1!@#USER_ID 47!@#ACTIVITY_CODE 2
12/12/2022 01:34:05 AM script INFO: SUCCESS!@#KODE 1!@#USER_ID 47!@#ACTIVITY_CODE 4
12/12/2022 01:34:05 AM script INFO: SUCCESS!@#KODE 1!@#USER_ID 47!@#ACTIVITY_CODE 2
12/12/2022 01:34:05 AM script INFO: SUCCESS!@#KODE 1!@#USER_ID 47!@#ACTIVITY_CODE 4
12/12/2022 01:34:05 AM script INFO: SUCCESS!@#KODE 1!@#USER_ID 47!@#ACTIVITY_CODE 1
12/12/2022 01:34:05 AM script INFO: SUCCESS!@#KODE 1!@#USER_ID 47!@#ACTIVITY_CODE 4
12/12/2022 01:34:06 AM script INFO: SUCCESS!@#KODE 1!@#USER_ID 47!@#ACTIVITY_CODE 2
12/12/2022 01:34:06 AM script INFO: SUCCESS!@#KODE 1!@#USER_ID 47!@#ACTIVITY_CODE 1
12/12/2022 01:34:06 AM script INFO: SUCCESS!@#KODE 1!@#USER_ID 47!@#ACTIVITY_CODE 2
12/12/2022 01:34:06 AM script INFO: SUCCESS!@#KODE 1!@#USER_ID 47!@#ACTIVITY_CODE 2
12/12/2022 01:34:06 AM script INFO: SUCCESS!@#KODE 1!@#USER_ID 47!@#ACTIVITY_CODE 1
12/12/2022 01:34:06 AM script INFO: SUCCESS!@#KODE 1!@#USER_ID 47!@#ACTIVITY_CODE 1
12/12/2022 01:34:06 AM script INFO: SUCCESS!@#KODE 1!@#USER_ID 47!@#ACTIVITY_CODE 4
12/12/2022 01:34:06 AM script INFO: SUCCESS!@#KODE 1!@#USER_ID 47!@#ACTIVITY_CODE 2
12/12/2022 01:34:06 AM script INFO: SUCCESS!@#KODE 1!@#USER_ID 47!@#ACTIVITY_CODE 2
12/12/2022 01:34:06 AM script INFO: SUCCESS!@#KODE 1!@#USER_ID 47!@#ACTIVITY_CODE 1
12/12/2022 01:34:06 AM script INFO: SUCCESS!@#KODE 1!@#USER_ID 47!@#ACTIVITY_CODE 2
12/12/2022 01:34:07 AM script INFO: SUCCESS!@#KODE 1!@#USER_ID 47!@#ACTIVITY_CODE 3
12/12/2022 01:34:07 AM script INFO: SUCCESS!@#KODE 1!@#USER_ID 47!@#ACTIVITY_CODE 1
12/12/2022 01:34:07 AM script INFO: SUCCESS!@#KODE 1!@#USER_ID 47!@#ACTIVITY_CODE 2
12/12/2022 01:34:07 AM script INFO: SUCCESS!@#KODE 1!@#USER_ID 47!@#ACTIVITY_CODE 3
12/12/2022 01:34:07 AM script INFO: SUCCESS!@#KODE 1!@#USER_ID 47!@#ACTIVITY_CODE 2
12/12/2022 01:34:07 AM script INFO: SUCCESS!@#KODE 1!@#USER_ID 47!@#ACTIVITY_CODE 1
12/12/2022 01:34:07 AM script INFO: SUCCESS!@#KODE 1!@#USER_ID 47!@#ACTIVITY_CODE 1
12/12/2022 01:34:07 AM script INFO: SUCCESS!@#KODE 1!@#USER_ID 47!@#ACTIVITY_CODE 1
12/12/2022 01:34:07 AM script INFO: SUCCESS!@#KODE 1!@#USER_ID 47!@#ACTIVITY_CODE 1
12/12/2022 01:34:07 AM script INFO: SUCCESS!@#KODE 1!@#USER_ID 47!@#ACTIVITY_CODE 2
12/12/2022 01:34:07 AM script INFO: SUCCESS!@#KODE 1!@#USER_ID 47!@#ACTIVITY_CODE 2
12/12/2022 01:34:07 AM script INFO: SUCCESS!@#KODE 1!@#USER_ID 47!@#ACTIVITY_CODE 1
12/12/2022 01:34:07 AM script INFO: SUCCESS!@#KODE 1!@#USER_ID 47!@#ACTIVITY_CODE 4
12/12/2022 01:34:08 AM script INFO: SUCCESS!@#KODE 1!@#USER_ID 47!@#ACTIVITY_CODE 2
12/12/2022 01:34:08 AM script INFO: SUCCESS!@#KODE 1!@#USER_ID 47!@#ACTIVITY_CODE 3
12/12/2022 01:34:08 AM script INFO: SUCCESS!@#KODE 1!@#USER_ID 47!@#ACTIVITY_CODE 1
12/12/2022 01:34:08 AM script INFO: Duration: 68.22182941436768
12/12/2022 01:34:08 AM script INFO: mengakhiri-quiz
12/12/2022 01:34:09 AM script INFO: SUCCESS!@#KODE 1!@#USER_ID 47!@#ACTIVITY_CODE 5
12/12/2022 01:34:09 AM script INFO: berhasil-submit
