12/23/2022 02:03:35 AM script INFO: Prepared chrome options..
12/23/2022 02:03:37 AM script INFO: Initialized chrome browser..
12/23/2022 02:03:37 AM script INFO: mengakses-homepage
12/23/2022 02:03:54 AM script INFO: mengakses-login-page
12/23/2022 02:04:41 AM script INFO: mengakses-site-home
12/23/2022 02:04:53 AM script INFO: mengakses-site-course
12/23/2022 02:05:29 AM script INFO: mengakses-quiz
12/23/2022 02:05:45 AM script INFO: mengakses-start-quiz-page
12/23/2022 02:06:10 AM script INFO: memulai-quiz
12/23/2022 02:06:10 AM script INFO: SUCCESS!@#KODE 1!@#USER_ID 17!@#ACTIVITY_CODE 5
12/23/2022 02:06:21 AM script INFO: SUCCESS!@#KODE 1!@#USER_ID 17!@#ACTIVITY_CODE 5
12/23/2022 02:06:21 AM script INFO: SUCCESS!@#KODE 1!@#USER_ID 17!@#ACTIVITY_CODE 5
12/23/2022 02:06:24 AM script INFO: SUCCESS!@#KODE 1!@#USER_ID 17!@#ACTIVITY_CODE 5
12/23/2022 02:06:24 AM script INFO: SUCCESS!@#KODE 1!@#USER_ID 17!@#ACTIVITY_CODE 5
12/23/2022 02:06:26 AM script INFO: SUCCESS!@#KODE 1!@#USER_ID 17!@#ACTIVITY_CODE 1
12/23/2022 02:06:26 AM script INFO: SUCCESS!@#KODE 1!@#USER_ID 17!@#ACTIVITY_CODE 5
12/23/2022 02:06:26 AM script INFO: SUCCESS!@#KODE 1!@#USER_ID 17!@#ACTIVITY_CODE 5
12/23/2022 02:06:29 AM script INFO: SUCCESS!@#KODE 1!@#USER_ID 17!@#ACTIVITY_CODE 1
12/23/2022 02:06:29 AM script INFO: SUCCESS!@#KODE 1!@#USER_ID 17!@#ACTIVITY_CODE 4
12/23/2022 02:06:29 AM script INFO: SUCCESS!@#KODE 1!@#USER_ID 17!@#ACTIVITY_CODE 5
12/23/2022 02:06:29 AM script INFO: SUCCESS!@#KODE 1!@#USER_ID 17!@#ACTIVITY_CODE 5
12/23/2022 02:06:31 AM script INFO: SUCCESS!@#KODE 1!@#USER_ID 17!@#ACTIVITY_CODE 1
12/23/2022 02:06:31 AM script INFO: SUCCESS!@#KODE 1!@#USER_ID 17!@#ACTIVITY_CODE 1
12/23/2022 02:06:31 AM script INFO: SUCCESS!@#KODE 1!@#USER_ID 17!@#ACTIVITY_CODE 5
12/23/2022 02:06:31 AM script INFO: SUCCESS!@#KODE 1!@#USER_ID 17!@#ACTIVITY_CODE 5
12/23/2022 02:06:34 AM script INFO: SUCCESS!@#KODE 1!@#USER_ID 17!@#ACTIVITY_CODE 1
12/23/2022 02:06:34 AM script INFO: SUCCESS!@#KODE 1!@#USER_ID 17!@#ACTIVITY_CODE 3
12/23/2022 02:06:34 AM script INFO: SUCCESS!@#KODE 1!@#USER_ID 17!@#ACTIVITY_CODE 3
12/23/2022 02:06:34 AM script INFO: SUCCESS!@#KODE 1!@#USER_ID 17!@#ACTIVITY_CODE 2
12/23/2022 02:06:34 AM script INFO: SUCCESS!@#KODE 1!@#USER_ID 17!@#ACTIVITY_CODE 1
12/23/2022 02:06:34 AM script INFO: SUCCESS!@#KODE 1!@#USER_ID 17!@#ACTIVITY_CODE 3
12/23/2022 02:06:35 AM script INFO: SUCCESS!@#KODE 1!@#USER_ID 17!@#ACTIVITY_CODE 2
12/23/2022 02:06:35 AM script INFO: SUCCESS!@#KODE 1!@#USER_ID 17!@#ACTIVITY_CODE 3
12/23/2022 02:06:35 AM script INFO: SUCCESS!@#KODE 1!@#USER_ID 17!@#ACTIVITY_CODE 3
12/23/2022 02:06:35 AM script INFO: SUCCESS!@#KODE 1!@#USER_ID 17!@#ACTIVITY_CODE 2
12/23/2022 02:06:35 AM script INFO: SUCCESS!@#KODE 1!@#USER_ID 17!@#ACTIVITY_CODE 1
12/23/2022 02:06:35 AM script INFO: SUCCESS!@#KODE 1!@#USER_ID 17!@#ACTIVITY_CODE 3
12/23/2022 02:06:35 AM script INFO: SUCCESS!@#KODE 1!@#USER_ID 17!@#ACTIVITY_CODE 3
12/23/2022 02:06:35 AM script INFO: SUCCESS!@#KODE 1!@#USER_ID 17!@#ACTIVITY_CODE 2
12/23/2022 02:06:35 AM script INFO: SUCCESS!@#KODE 1!@#USER_ID 17!@#ACTIVITY_CODE 5
12/23/2022 02:06:35 AM script INFO: SUCCESS!@#KODE 1!@#USER_ID 17!@#ACTIVITY_CODE 5
12/23/2022 02:06:38 AM script INFO: SUCCESS!@#KODE 1!@#USER_ID 17!@#ACTIVITY_CODE 1
12/23/2022 02:06:38 AM script INFO: SUCCESS!@#KODE 1!@#USER_ID 17!@#ACTIVITY_CODE 5
12/23/2022 02:06:38 AM script INFO: SUCCESS!@#KODE 1!@#USER_ID 17!@#ACTIVITY_CODE 5
12/23/2022 02:06:40 AM script INFO: SUCCESS!@#KODE 1!@#USER_ID 17!@#ACTIVITY_CODE 4
12/23/2022 02:06:40 AM script INFO: SUCCESS!@#KODE 1!@#USER_ID 17!@#ACTIVITY_CODE 2
12/23/2022 02:06:40 AM script INFO: SUCCESS!@#KODE 1!@#USER_ID 17!@#ACTIVITY_CODE 5
12/23/2022 02:06:40 AM script INFO: SUCCESS!@#KODE 1!@#USER_ID 17!@#ACTIVITY_CODE 5
12/23/2022 02:06:43 AM script INFO: SUCCESS!@#KODE 1!@#USER_ID 17!@#ACTIVITY_CODE 1
12/23/2022 02:06:43 AM script INFO: SUCCESS!@#KODE 1!@#USER_ID 17!@#ACTIVITY_CODE 1
12/23/2022 02:06:43 AM script INFO: SUCCESS!@#KODE 1!@#USER_ID 17!@#ACTIVITY_CODE 5
12/23/2022 02:06:43 AM script INFO: SUCCESS!@#KODE 1!@#USER_ID 17!@#ACTIVITY_CODE 5
12/23/2022 02:06:46 AM script INFO: SUCCESS!@#KODE 1!@#USER_ID 17!@#ACTIVITY_CODE 4
12/23/2022 02:06:46 AM script INFO: SUCCESS!@#KODE 1!@#USER_ID 17!@#ACTIVITY_CODE 3
12/23/2022 02:06:46 AM script INFO: SUCCESS!@#KODE 1!@#USER_ID 17!@#ACTIVITY_CODE 2
12/23/2022 02:06:46 AM script INFO: SUCCESS!@#KODE 1!@#USER_ID 17!@#ACTIVITY_CODE 2
12/23/2022 02:06:46 AM script INFO: SUCCESS!@#KODE 1!@#USER_ID 17!@#ACTIVITY_CODE 2
12/23/2022 02:06:46 AM script INFO: SUCCESS!@#KODE 1!@#USER_ID 17!@#ACTIVITY_CODE 1
12/23/2022 02:06:46 AM script INFO: SUCCESS!@#KODE 1!@#USER_ID 17!@#ACTIVITY_CODE 4
12/23/2022 02:06:46 AM script INFO: SUCCESS!@#KODE 1!@#USER_ID 17!@#ACTIVITY_CODE 5
12/23/2022 02:06:46 AM script INFO: SUCCESS!@#KODE 1!@#USER_ID 17!@#ACTIVITY_CODE 5
12/23/2022 02:06:49 AM script INFO: SUCCESS!@#KODE 1!@#USER_ID 17!@#ACTIVITY_CODE 3
12/23/2022 02:06:49 AM script INFO: SUCCESS!@#KODE 1!@#USER_ID 17!@#ACTIVITY_CODE 2
12/23/2022 02:06:49 AM script INFO: SUCCESS!@#KODE 1!@#USER_ID 17!@#ACTIVITY_CODE 3
12/23/2022 02:06:49 AM script INFO: SUCCESS!@#KODE 1!@#USER_ID 17!@#ACTIVITY_CODE 3
12/23/2022 02:06:49 AM script INFO: SUCCESS!@#KODE 1!@#USER_ID 17!@#ACTIVITY_CODE 2
12/23/2022 02:06:49 AM script INFO: SUCCESS!@#KODE 1!@#USER_ID 17!@#ACTIVITY_CODE 1
12/23/2022 02:06:49 AM script INFO: SUCCESS!@#KODE 1!@#USER_ID 17!@#ACTIVITY_CODE 5
12/23/2022 02:06:49 AM script INFO: SUCCESS!@#KODE 1!@#USER_ID 17!@#ACTIVITY_CODE 5
12/23/2022 02:06:52 AM script INFO: SUCCESS!@#KODE 1!@#USER_ID 17!@#ACTIVITY_CODE 5
12/23/2022 02:06:52 AM script INFO: SUCCESS!@#KODE 1!@#USER_ID 17!@#ACTIVITY_CODE 5
12/23/2022 02:06:54 AM script INFO: SUCCESS!@#KODE 1!@#USER_ID 17!@#ACTIVITY_CODE 3
12/23/2022 02:06:54 AM script INFO: SUCCESS!@#KODE 1!@#USER_ID 17!@#ACTIVITY_CODE 5
12/23/2022 02:06:54 AM script INFO: SUCCESS!@#KODE 1!@#USER_ID 17!@#ACTIVITY_CODE 5
12/23/2022 02:06:57 AM script INFO: SUCCESS!@#KODE 1!@#USER_ID 17!@#ACTIVITY_CODE 1
12/23/2022 02:06:57 AM script INFO: SUCCESS!@#KODE 1!@#USER_ID 17!@#ACTIVITY_CODE 5
12/23/2022 02:06:57 AM script INFO: SUCCESS!@#KODE 1!@#USER_ID 17!@#ACTIVITY_CODE 5
12/23/2022 02:07:00 AM script INFO: SUCCESS!@#KODE 1!@#USER_ID 17!@#ACTIVITY_CODE 2
12/23/2022 02:07:00 AM script INFO: SUCCESS!@#KODE 1!@#USER_ID 17!@#ACTIVITY_CODE 2
12/23/2022 02:07:00 AM script INFO: SUCCESS!@#KODE 1!@#USER_ID 17!@#ACTIVITY_CODE 3
12/23/2022 02:07:00 AM script INFO: SUCCESS!@#KODE 1!@#USER_ID 17!@#ACTIVITY_CODE 2
12/23/2022 02:07:00 AM script INFO: SUCCESS!@#KODE 1!@#USER_ID 17!@#ACTIVITY_CODE 1
12/23/2022 02:07:00 AM script INFO: SUCCESS!@#KODE 1!@#USER_ID 17!@#ACTIVITY_CODE 2
12/23/2022 02:07:00 AM script INFO: SUCCESS!@#KODE 1!@#USER_ID 17!@#ACTIVITY_CODE 4
12/23/2022 02:07:00 AM script INFO: SUCCESS!@#KODE 1!@#USER_ID 17!@#ACTIVITY_CODE 2
12/23/2022 02:07:00 AM script INFO: SUCCESS!@#KODE 1!@#USER_ID 17!@#ACTIVITY_CODE 1
12/23/2022 02:07:00 AM script INFO: SUCCESS!@#KODE 1!@#USER_ID 17!@#ACTIVITY_CODE 5
12/23/2022 02:07:00 AM script INFO: SUCCESS!@#KODE 1!@#USER_ID 17!@#ACTIVITY_CODE 5
12/23/2022 02:07:03 AM script INFO: SUCCESS!@#KODE 1!@#USER_ID 17!@#ACTIVITY_CODE 2
12/23/2022 02:07:03 AM script INFO: SUCCESS!@#KODE 1!@#USER_ID 17!@#ACTIVITY_CODE 2
12/23/2022 02:07:03 AM script INFO: SUCCESS!@#KODE 1!@#USER_ID 17!@#ACTIVITY_CODE 3
12/23/2022 02:07:03 AM script INFO: SUCCESS!@#KODE 1!@#USER_ID 17!@#ACTIVITY_CODE 1
12/23/2022 02:07:03 AM script INFO: SUCCESS!@#KODE 1!@#USER_ID 17!@#ACTIVITY_CODE 3
12/23/2022 02:07:03 AM script INFO: SUCCESS!@#KODE 1!@#USER_ID 17!@#ACTIVITY_CODE 2
12/23/2022 02:07:04 AM script INFO: SUCCESS!@#KODE 1!@#USER_ID 17!@#ACTIVITY_CODE 2
12/23/2022 02:07:04 AM script INFO: SUCCESS!@#KODE 1!@#USER_ID 17!@#ACTIVITY_CODE 3
12/23/2022 02:07:04 AM script INFO: SUCCESS!@#KODE 1!@#USER_ID 17!@#ACTIVITY_CODE 3
12/23/2022 02:07:04 AM script INFO: SUCCESS!@#KODE 1!@#USER_ID 17!@#ACTIVITY_CODE 5
12/23/2022 02:07:04 AM script INFO: SUCCESS!@#KODE 1!@#USER_ID 17!@#ACTIVITY_CODE 5
12/23/2022 02:07:06 AM script INFO: SUCCESS!@#KODE 1!@#USER_ID 17!@#ACTIVITY_CODE 3
12/23/2022 02:07:06 AM script INFO: SUCCESS!@#KODE 1!@#USER_ID 17!@#ACTIVITY_CODE 2
12/23/2022 02:07:06 AM script INFO: SUCCESS!@#KODE 1!@#USER_ID 17!@#ACTIVITY_CODE 3
12/23/2022 02:07:06 AM script INFO: SUCCESS!@#KODE 1!@#USER_ID 17!@#ACTIVITY_CODE 1
12/23/2022 02:07:06 AM script INFO: SUCCESS!@#KODE 1!@#USER_ID 17!@#ACTIVITY_CODE 1
12/23/2022 02:07:07 AM script INFO: SUCCESS!@#KODE 1!@#USER_ID 17!@#ACTIVITY_CODE 3
12/23/2022 02:07:07 AM script INFO: SUCCESS!@#KODE 1!@#USER_ID 17!@#ACTIVITY_CODE 2
12/23/2022 02:07:07 AM script INFO: SUCCESS!@#KODE 1!@#USER_ID 17!@#ACTIVITY_CODE 3
12/23/2022 02:07:07 AM script INFO: SUCCESS!@#KODE 1!@#USER_ID 17!@#ACTIVITY_CODE 3
12/23/2022 02:07:07 AM script INFO: SUCCESS!@#KODE 1!@#USER_ID 17!@#ACTIVITY_CODE 3
12/23/2022 02:07:07 AM script INFO: SUCCESS!@#KODE 1!@#USER_ID 17!@#ACTIVITY_CODE 3
12/23/2022 02:07:07 AM script INFO: SUCCESS!@#KODE 1!@#USER_ID 17!@#ACTIVITY_CODE 1
12/23/2022 02:07:07 AM script INFO: SUCCESS!@#KODE 1!@#USER_ID 17!@#ACTIVITY_CODE 2
12/23/2022 02:07:07 AM script INFO: SUCCESS!@#KODE 1!@#USER_ID 17!@#ACTIVITY_CODE 5
12/23/2022 02:07:07 AM script INFO: SUCCESS!@#KODE 1!@#USER_ID 17!@#ACTIVITY_CODE 5
12/23/2022 02:07:10 AM script INFO: SUCCESS!@#KODE 1!@#USER_ID 17!@#ACTIVITY_CODE 3
12/23/2022 02:07:10 AM script INFO: SUCCESS!@#KODE 1!@#USER_ID 17!@#ACTIVITY_CODE 1
12/23/2022 02:07:10 AM script INFO: SUCCESS!@#KODE 1!@#USER_ID 17!@#ACTIVITY_CODE 2
12/23/2022 02:07:10 AM script INFO: SUCCESS!@#KODE 1!@#USER_ID 17!@#ACTIVITY_CODE 1
12/23/2022 02:07:10 AM script INFO: SUCCESS!@#KODE 1!@#USER_ID 17!@#ACTIVITY_CODE 1
12/23/2022 02:07:10 AM script INFO: SUCCESS!@#KODE 1!@#USER_ID 17!@#ACTIVITY_CODE 1
12/23/2022 02:07:10 AM script INFO: SUCCESS!@#KODE 1!@#USER_ID 17!@#ACTIVITY_CODE 3
12/23/2022 02:07:10 AM script INFO: SUCCESS!@#KODE 1!@#USER_ID 17!@#ACTIVITY_CODE 3
12/23/2022 02:07:10 AM script INFO: SUCCESS!@#KODE 1!@#USER_ID 17!@#ACTIVITY_CODE 2
12/23/2022 02:07:10 AM script INFO: SUCCESS!@#KODE 1!@#USER_ID 17!@#ACTIVITY_CODE 3
12/23/2022 02:07:10 AM script INFO: SUCCESS!@#KODE 1!@#USER_ID 17!@#ACTIVITY_CODE 3
12/23/2022 02:07:10 AM script INFO: SUCCESS!@#KODE 1!@#USER_ID 17!@#ACTIVITY_CODE 5
12/23/2022 02:07:10 AM script INFO: SUCCESS!@#KODE 1!@#USER_ID 17!@#ACTIVITY_CODE 5
12/23/2022 02:07:13 AM script INFO: SUCCESS!@#KODE 1!@#USER_ID 17!@#ACTIVITY_CODE 3
12/23/2022 02:07:13 AM script INFO: SUCCESS!@#KODE 1!@#USER_ID 17!@#ACTIVITY_CODE 4
12/23/2022 02:07:13 AM script INFO: SUCCESS!@#KODE 1!@#USER_ID 17!@#ACTIVITY_CODE 1
12/23/2022 02:07:13 AM script INFO: SUCCESS!@#KODE 1!@#USER_ID 17!@#ACTIVITY_CODE 3
12/23/2022 02:07:13 AM script INFO: SUCCESS!@#KODE 1!@#USER_ID 17!@#ACTIVITY_CODE 5
12/23/2022 02:07:13 AM script INFO: SUCCESS!@#KODE 1!@#USER_ID 17!@#ACTIVITY_CODE 5
12/23/2022 02:07:16 AM script INFO: SUCCESS!@#KODE 1!@#USER_ID 17!@#ACTIVITY_CODE 2
12/23/2022 02:07:16 AM script INFO: SUCCESS!@#KODE 1!@#USER_ID 17!@#ACTIVITY_CODE 1
12/23/2022 02:07:16 AM script INFO: SUCCESS!@#KODE 1!@#USER_ID 17!@#ACTIVITY_CODE 2
12/23/2022 02:07:16 AM script INFO: SUCCESS!@#KODE 1!@#USER_ID 17!@#ACTIVITY_CODE 1
12/23/2022 02:07:16 AM script INFO: SUCCESS!@#KODE 1!@#USER_ID 17!@#ACTIVITY_CODE 2
12/23/2022 02:07:16 AM script INFO: SUCCESS!@#KODE 1!@#USER_ID 17!@#ACTIVITY_CODE 3
12/23/2022 02:07:16 AM script INFO: SUCCESS!@#KODE 1!@#USER_ID 17!@#ACTIVITY_CODE 2
12/23/2022 02:07:16 AM script INFO: SUCCESS!@#KODE 1!@#USER_ID 17!@#ACTIVITY_CODE 5
12/23/2022 02:07:16 AM script INFO: SUCCESS!@#KODE 1!@#USER_ID 17!@#ACTIVITY_CODE 5
12/23/2022 02:07:19 AM script INFO: SUCCESS!@#KODE 1!@#USER_ID 17!@#ACTIVITY_CODE 2
12/23/2022 02:07:19 AM script INFO: SUCCESS!@#KODE 1!@#USER_ID 17!@#ACTIVITY_CODE 1
12/23/2022 02:07:19 AM script INFO: SUCCESS!@#KODE 1!@#USER_ID 17!@#ACTIVITY_CODE 5
12/23/2022 02:07:19 AM script INFO: SUCCESS!@#KODE 1!@#USER_ID 17!@#ACTIVITY_CODE 5
12/23/2022 02:07:22 AM script INFO: SUCCESS!@#KODE 1!@#USER_ID 17!@#ACTIVITY_CODE 4
12/23/2022 02:07:22 AM script INFO: SUCCESS!@#KODE 1!@#USER_ID 17!@#ACTIVITY_CODE 1
12/23/2022 02:07:22 AM script INFO: SUCCESS!@#KODE 1!@#USER_ID 17!@#ACTIVITY_CODE 4
12/23/2022 02:07:22 AM script INFO: SUCCESS!@#KODE 1!@#USER_ID 17!@#ACTIVITY_CODE 1
12/23/2022 02:07:22 AM script INFO: SUCCESS!@#KODE 1!@#USER_ID 17!@#ACTIVITY_CODE 1
12/23/2022 02:07:22 AM script INFO: SUCCESS!@#KODE 1!@#USER_ID 17!@#ACTIVITY_CODE 2
12/23/2022 02:07:22 AM script INFO: SUCCESS!@#KODE 1!@#USER_ID 17!@#ACTIVITY_CODE 2
12/23/2022 02:07:22 AM script INFO: SUCCESS!@#KODE 1!@#USER_ID 17!@#ACTIVITY_CODE 1
12/23/2022 02:07:22 AM script INFO: SUCCESS!@#KODE 1!@#USER_ID 17!@#ACTIVITY_CODE 4
12/23/2022 02:07:22 AM script INFO: SUCCESS!@#KODE 1!@#USER_ID 17!@#ACTIVITY_CODE 3
12/23/2022 02:07:23 AM script INFO: SUCCESS!@#KODE 1!@#USER_ID 17!@#ACTIVITY_CODE 3
12/23/2022 02:07:23 AM script INFO: SUCCESS!@#KODE 1!@#USER_ID 17!@#ACTIVITY_CODE 1
12/23/2022 02:07:23 AM script INFO: SUCCESS!@#KODE 1!@#USER_ID 17!@#ACTIVITY_CODE 3
12/23/2022 02:07:23 AM script INFO: SUCCESS!@#KODE 1!@#USER_ID 17!@#ACTIVITY_CODE 4
12/23/2022 02:07:23 AM script INFO: SUCCESS!@#KODE 1!@#USER_ID 17!@#ACTIVITY_CODE 2
12/23/2022 02:07:23 AM script INFO: SUCCESS!@#KODE 1!@#USER_ID 17!@#ACTIVITY_CODE 3
12/23/2022 02:07:23 AM script INFO: SUCCESS!@#KODE 1!@#USER_ID 17!@#ACTIVITY_CODE 3
12/23/2022 02:07:23 AM script INFO: SUCCESS!@#KODE 1!@#USER_ID 17!@#ACTIVITY_CODE 4
12/23/2022 02:07:23 AM script INFO: SUCCESS!@#KODE 1!@#USER_ID 17!@#ACTIVITY_CODE 3
12/23/2022 02:07:23 AM script INFO: SUCCESS!@#KODE 1!@#USER_ID 17!@#ACTIVITY_CODE 2
12/23/2022 02:07:24 AM script INFO: SUCCESS!@#KODE 1!@#USER_ID 17!@#ACTIVITY_CODE 3
12/23/2022 02:07:24 AM script INFO: SUCCESS!@#KODE 1!@#USER_ID 17!@#ACTIVITY_CODE 1
12/23/2022 02:07:24 AM script INFO: SUCCESS!@#KODE 1!@#USER_ID 17!@#ACTIVITY_CODE 1
12/23/2022 02:07:24 AM script INFO: SUCCESS!@#KODE 1!@#USER_ID 17!@#ACTIVITY_CODE 4
12/23/2022 02:07:24 AM script INFO: SUCCESS!@#KODE 1!@#USER_ID 17!@#ACTIVITY_CODE 1
12/23/2022 02:07:24 AM script INFO: SUCCESS!@#KODE 1!@#USER_ID 17!@#ACTIVITY_CODE 3
12/23/2022 02:07:24 AM script INFO: SUCCESS!@#KODE 1!@#USER_ID 17!@#ACTIVITY_CODE 2
12/23/2022 02:07:24 AM script INFO: SUCCESS!@#KODE 1!@#USER_ID 17!@#ACTIVITY_CODE 1
12/23/2022 02:07:24 AM script INFO: SUCCESS!@#KODE 1!@#USER_ID 17!@#ACTIVITY_CODE 3
12/23/2022 02:07:24 AM script INFO: SUCCESS!@#KODE 1!@#USER_ID 17!@#ACTIVITY_CODE 4
12/23/2022 02:07:24 AM script INFO: SUCCESS!@#KODE 1!@#USER_ID 17!@#ACTIVITY_CODE 1
12/23/2022 02:07:25 AM script INFO: SUCCESS!@#KODE 1!@#USER_ID 17!@#ACTIVITY_CODE 1
12/23/2022 02:07:25 AM script INFO: SUCCESS!@#KODE 1!@#USER_ID 17!@#ACTIVITY_CODE 3
12/23/2022 02:07:25 AM script INFO: SUCCESS!@#KODE 1!@#USER_ID 17!@#ACTIVITY_CODE 2
12/23/2022 02:07:25 AM script INFO: SUCCESS!@#KODE 1!@#USER_ID 17!@#ACTIVITY_CODE 2
12/23/2022 02:07:25 AM script INFO: SUCCESS!@#KODE 1!@#USER_ID 17!@#ACTIVITY_CODE 1
12/23/2022 02:07:25 AM script INFO: SUCCESS!@#KODE 1!@#USER_ID 17!@#ACTIVITY_CODE 1
12/23/2022 02:07:25 AM script INFO: SUCCESS!@#KODE 1!@#USER_ID 17!@#ACTIVITY_CODE 2
12/23/2022 02:07:25 AM script INFO: SUCCESS!@#KODE 1!@#USER_ID 17!@#ACTIVITY_CODE 3
12/23/2022 02:07:25 AM script INFO: SUCCESS!@#KODE 1!@#USER_ID 17!@#ACTIVITY_CODE 3
12/23/2022 02:07:25 AM script INFO: SUCCESS!@#KODE 1!@#USER_ID 17!@#ACTIVITY_CODE 1
12/23/2022 02:07:26 AM script INFO: SUCCESS!@#KODE 1!@#USER_ID 17!@#ACTIVITY_CODE 4
12/23/2022 02:07:26 AM script INFO: SUCCESS!@#KODE 1!@#USER_ID 17!@#ACTIVITY_CODE 2
12/23/2022 02:07:26 AM script INFO: SUCCESS!@#KODE 1!@#USER_ID 17!@#ACTIVITY_CODE 3
12/23/2022 02:07:26 AM script INFO: SUCCESS!@#KODE 1!@#USER_ID 17!@#ACTIVITY_CODE 1
12/23/2022 02:07:26 AM script INFO: SUCCESS!@#KODE 1!@#USER_ID 17!@#ACTIVITY_CODE 1
12/23/2022 02:07:26 AM script INFO: SUCCESS!@#KODE 1!@#USER_ID 17!@#ACTIVITY_CODE 2
12/23/2022 02:07:26 AM script INFO: SUCCESS!@#KODE 1!@#USER_ID 17!@#ACTIVITY_CODE 4
12/23/2022 02:07:26 AM script INFO: SUCCESS!@#KODE 1!@#USER_ID 17!@#ACTIVITY_CODE 1
12/23/2022 02:07:26 AM script INFO: SUCCESS!@#KODE 1!@#USER_ID 17!@#ACTIVITY_CODE 3
12/23/2022 02:07:27 AM script INFO: SUCCESS!@#KODE 1!@#USER_ID 17!@#ACTIVITY_CODE 3
12/23/2022 02:07:27 AM script INFO: SUCCESS!@#KODE 1!@#USER_ID 17!@#ACTIVITY_CODE 2
12/23/2022 02:07:27 AM script INFO: SUCCESS!@#KODE 1!@#USER_ID 17!@#ACTIVITY_CODE 2
12/23/2022 02:07:27 AM script INFO: SUCCESS!@#KODE 1!@#USER_ID 17!@#ACTIVITY_CODE 4
12/23/2022 02:07:27 AM script INFO: SUCCESS!@#KODE 1!@#USER_ID 17!@#ACTIVITY_CODE 2
12/23/2022 02:07:27 AM script INFO: SUCCESS!@#KODE 1!@#USER_ID 17!@#ACTIVITY_CODE 2
12/23/2022 02:07:28 AM script INFO: SUCCESS!@#KODE 1!@#USER_ID 17!@#ACTIVITY_CODE 2
12/23/2022 02:07:28 AM script INFO: SUCCESS!@#KODE 1!@#USER_ID 17!@#ACTIVITY_CODE 1
12/23/2022 02:07:28 AM script INFO: SUCCESS!@#KODE 1!@#USER_ID 17!@#ACTIVITY_CODE 2
12/23/2022 02:07:28 AM script INFO: SUCCESS!@#KODE 1!@#USER_ID 17!@#ACTIVITY_CODE 2
12/23/2022 02:07:28 AM script INFO: SUCCESS!@#KODE 1!@#USER_ID 17!@#ACTIVITY_CODE 2
12/23/2022 02:07:29 AM script INFO: SUCCESS!@#KODE 1!@#USER_ID 17!@#ACTIVITY_CODE 2
12/23/2022 02:07:29 AM script INFO: SUCCESS!@#KODE 1!@#USER_ID 17!@#ACTIVITY_CODE 1
12/23/2022 02:07:29 AM script INFO: SUCCESS!@#KODE 1!@#USER_ID 17!@#ACTIVITY_CODE 1
12/23/2022 02:07:29 AM script INFO: SUCCESS!@#KODE 1!@#USER_ID 17!@#ACTIVITY_CODE 4
12/23/2022 02:07:29 AM script INFO: SUCCESS!@#KODE 1!@#USER_ID 17!@#ACTIVITY_CODE 1
12/23/2022 02:07:29 AM script INFO: SUCCESS!@#KODE 1!@#USER_ID 17!@#ACTIVITY_CODE 1
12/23/2022 02:07:29 AM script INFO: SUCCESS!@#KODE 1!@#USER_ID 17!@#ACTIVITY_CODE 1
12/23/2022 02:07:29 AM script INFO: SUCCESS!@#KODE 1!@#USER_ID 17!@#ACTIVITY_CODE 3
12/23/2022 02:07:29 AM script INFO: SUCCESS!@#KODE 1!@#USER_ID 17!@#ACTIVITY_CODE 3
12/23/2022 02:07:29 AM script INFO: SUCCESS!@#KODE 1!@#USER_ID 17!@#ACTIVITY_CODE 2
12/23/2022 02:07:29 AM script INFO: SUCCESS!@#KODE 1!@#USER_ID 17!@#ACTIVITY_CODE 1
12/23/2022 02:07:30 AM script INFO: SUCCESS!@#KODE 1!@#USER_ID 17!@#ACTIVITY_CODE 4
12/23/2022 02:07:30 AM script INFO: SUCCESS!@#KODE 1!@#USER_ID 17!@#ACTIVITY_CODE 1
12/23/2022 02:07:30 AM script INFO: SUCCESS!@#KODE 1!@#USER_ID 17!@#ACTIVITY_CODE 3
12/23/2022 02:07:30 AM script INFO: SUCCESS!@#KODE 1!@#USER_ID 17!@#ACTIVITY_CODE 4
12/23/2022 02:07:30 AM script INFO: SUCCESS!@#KODE 1!@#USER_ID 17!@#ACTIVITY_CODE 2
12/23/2022 02:07:30 AM script INFO: SUCCESS!@#KODE 1!@#USER_ID 17!@#ACTIVITY_CODE 1
12/23/2022 02:07:30 AM script INFO: SUCCESS!@#KODE 1!@#USER_ID 17!@#ACTIVITY_CODE 3
12/23/2022 02:07:30 AM script INFO: SUCCESS!@#KODE 1!@#USER_ID 17!@#ACTIVITY_CODE 1
12/23/2022 02:07:30 AM script INFO: SUCCESS!@#KODE 1!@#USER_ID 17!@#ACTIVITY_CODE 4
12/23/2022 02:07:30 AM script INFO: SUCCESS!@#KODE 1!@#USER_ID 17!@#ACTIVITY_CODE 3
12/23/2022 02:07:31 AM script INFO: SUCCESS!@#KODE 1!@#USER_ID 17!@#ACTIVITY_CODE 2
12/23/2022 02:07:31 AM script INFO: SUCCESS!@#KODE 1!@#USER_ID 17!@#ACTIVITY_CODE 3
12/23/2022 02:07:31 AM script INFO: SUCCESS!@#KODE 1!@#USER_ID 17!@#ACTIVITY_CODE 2
12/23/2022 02:07:31 AM script INFO: SUCCESS!@#KODE 1!@#USER_ID 17!@#ACTIVITY_CODE 1
12/23/2022 02:07:31 AM script INFO: SUCCESS!@#KODE 1!@#USER_ID 17!@#ACTIVITY_CODE 1
12/23/2022 02:07:31 AM script INFO: SUCCESS!@#KODE 1!@#USER_ID 17!@#ACTIVITY_CODE 2
12/23/2022 02:07:31 AM script INFO: SUCCESS!@#KODE 1!@#USER_ID 17!@#ACTIVITY_CODE 3
12/23/2022 02:07:32 AM script INFO: SUCCESS!@#KODE 1!@#USER_ID 17!@#ACTIVITY_CODE 2
12/23/2022 02:07:32 AM script INFO: SUCCESS!@#KODE 1!@#USER_ID 17!@#ACTIVITY_CODE 4
12/23/2022 02:07:32 AM script INFO: SUCCESS!@#KODE 1!@#USER_ID 17!@#ACTIVITY_CODE 1
12/23/2022 02:07:32 AM script INFO: SUCCESS!@#KODE 1!@#USER_ID 17!@#ACTIVITY_CODE 3
12/23/2022 02:07:32 AM script INFO: SUCCESS!@#KODE 1!@#USER_ID 17!@#ACTIVITY_CODE 4
12/23/2022 02:07:32 AM script INFO: SUCCESS!@#KODE 1!@#USER_ID 17!@#ACTIVITY_CODE 3
12/23/2022 02:07:32 AM script INFO: SUCCESS!@#KODE 1!@#USER_ID 17!@#ACTIVITY_CODE 3
12/23/2022 02:07:32 AM script INFO: SUCCESS!@#KODE 1!@#USER_ID 17!@#ACTIVITY_CODE 1
12/23/2022 02:07:32 AM script INFO: SUCCESS!@#KODE 1!@#USER_ID 17!@#ACTIVITY_CODE 3
12/23/2022 02:07:32 AM script INFO: SUCCESS!@#KODE 1!@#USER_ID 17!@#ACTIVITY_CODE 4
12/23/2022 02:07:32 AM script INFO: SUCCESS!@#KODE 1!@#USER_ID 17!@#ACTIVITY_CODE 3
12/23/2022 02:07:33 AM script INFO: SUCCESS!@#KODE 1!@#USER_ID 17!@#ACTIVITY_CODE 1
12/23/2022 02:07:33 AM script INFO: SUCCESS!@#KODE 1!@#USER_ID 17!@#ACTIVITY_CODE 4
12/23/2022 02:07:33 AM script INFO: SUCCESS!@#KODE 1!@#USER_ID 17!@#ACTIVITY_CODE 2
12/23/2022 02:07:33 AM script INFO: SUCCESS!@#KODE 1!@#USER_ID 17!@#ACTIVITY_CODE 1
12/23/2022 02:07:33 AM script INFO: SUCCESS!@#KODE 1!@#USER_ID 17!@#ACTIVITY_CODE 4
12/23/2022 02:07:33 AM script INFO: SUCCESS!@#KODE 1!@#USER_ID 17!@#ACTIVITY_CODE 1
12/23/2022 02:07:33 AM script INFO: SUCCESS!@#KODE 1!@#USER_ID 17!@#ACTIVITY_CODE 3
12/23/2022 02:07:33 AM script INFO: SUCCESS!@#KODE 1!@#USER_ID 17!@#ACTIVITY_CODE 3
12/23/2022 02:07:33 AM script INFO: SUCCESS!@#KODE 1!@#USER_ID 17!@#ACTIVITY_CODE 4
12/23/2022 02:07:34 AM script INFO: SUCCESS!@#KODE 1!@#USER_ID 17!@#ACTIVITY_CODE 2
12/23/2022 02:07:34 AM script INFO: SUCCESS!@#KODE 1!@#USER_ID 17!@#ACTIVITY_CODE 1
12/23/2022 02:07:34 AM script INFO: SUCCESS!@#KODE 1!@#USER_ID 17!@#ACTIVITY_CODE 1
12/23/2022 02:07:34 AM script INFO: SUCCESS!@#KODE 1!@#USER_ID 17!@#ACTIVITY_CODE 1
12/23/2022 02:07:34 AM script INFO: SUCCESS!@#KODE 1!@#USER_ID 17!@#ACTIVITY_CODE 4
12/23/2022 02:07:34 AM script INFO: SUCCESS!@#KODE 1!@#USER_ID 17!@#ACTIVITY_CODE 3
12/23/2022 02:07:34 AM script INFO: SUCCESS!@#KODE 1!@#USER_ID 17!@#ACTIVITY_CODE 1
12/23/2022 02:07:34 AM script INFO: SUCCESS!@#KODE 1!@#USER_ID 17!@#ACTIVITY_CODE 2
12/23/2022 02:07:34 AM script INFO: SUCCESS!@#KODE 1!@#USER_ID 17!@#ACTIVITY_CODE 1
12/23/2022 02:07:35 AM script INFO: SUCCESS!@#KODE 1!@#USER_ID 17!@#ACTIVITY_CODE 2
12/23/2022 02:07:35 AM script INFO: SUCCESS!@#KODE 1!@#USER_ID 17!@#ACTIVITY_CODE 2
12/23/2022 02:07:35 AM script INFO: SUCCESS!@#KODE 1!@#USER_ID 17!@#ACTIVITY_CODE 1
12/23/2022 02:07:35 AM script INFO: SUCCESS!@#KODE 1!@#USER_ID 17!@#ACTIVITY_CODE 2
12/23/2022 02:07:35 AM script INFO: SUCCESS!@#KODE 1!@#USER_ID 17!@#ACTIVITY_CODE 1
12/23/2022 02:07:36 AM script INFO: SUCCESS!@#KODE 1!@#USER_ID 17!@#ACTIVITY_CODE 2
12/23/2022 02:07:36 AM script INFO: SUCCESS!@#KODE 1!@#USER_ID 17!@#ACTIVITY_CODE 3
12/23/2022 02:07:36 AM script INFO: SUCCESS!@#KODE 1!@#USER_ID 17!@#ACTIVITY_CODE 3
12/23/2022 02:07:36 AM script INFO: SUCCESS!@#KODE 1!@#USER_ID 17!@#ACTIVITY_CODE 1
12/23/2022 02:07:37 AM script INFO: SUCCESS!@#KODE 1!@#USER_ID 17!@#ACTIVITY_CODE 2
12/23/2022 02:07:37 AM script INFO: SUCCESS!@#KODE 1!@#USER_ID 17!@#ACTIVITY_CODE 4
12/23/2022 02:07:37 AM script INFO: SUCCESS!@#KODE 1!@#USER_ID 17!@#ACTIVITY_CODE 1
12/23/2022 02:07:37 AM script INFO: SUCCESS!@#KODE 1!@#USER_ID 17!@#ACTIVITY_CODE 1
12/23/2022 02:07:37 AM script INFO: SUCCESS!@#KODE 1!@#USER_ID 17!@#ACTIVITY_CODE 4
12/23/2022 02:07:37 AM script INFO: SUCCESS!@#KODE 1!@#USER_ID 17!@#ACTIVITY_CODE 1
12/23/2022 02:07:38 AM script INFO: SUCCESS!@#KODE 1!@#USER_ID 17!@#ACTIVITY_CODE 4
12/23/2022 02:07:38 AM script INFO: SUCCESS!@#KODE 1!@#USER_ID 17!@#ACTIVITY_CODE 1
12/23/2022 02:07:38 AM script INFO: SUCCESS!@#KODE 1!@#USER_ID 17!@#ACTIVITY_CODE 3
12/23/2022 02:07:38 AM script INFO: SUCCESS!@#KODE 1!@#USER_ID 17!@#ACTIVITY_CODE 3
12/23/2022 02:07:38 AM script INFO: SUCCESS!@#KODE 1!@#USER_ID 17!@#ACTIVITY_CODE 1
12/23/2022 02:07:38 AM script INFO: SUCCESS!@#KODE 1!@#USER_ID 17!@#ACTIVITY_CODE 4
12/23/2022 02:07:38 AM script INFO: SUCCESS!@#KODE 1!@#USER_ID 17!@#ACTIVITY_CODE 1
12/23/2022 02:07:39 AM script INFO: SUCCESS!@#KODE 1!@#USER_ID 17!@#ACTIVITY_CODE 3
12/23/2022 02:07:39 AM script INFO: SUCCESS!@#KODE 1!@#USER_ID 17!@#ACTIVITY_CODE 1
12/23/2022 02:07:39 AM script INFO: SUCCESS!@#KODE 1!@#USER_ID 17!@#ACTIVITY_CODE 4
12/23/2022 02:07:39 AM script INFO: SUCCESS!@#KODE 1!@#USER_ID 17!@#ACTIVITY_CODE 1
12/23/2022 02:07:39 AM script INFO: SUCCESS!@#KODE 1!@#USER_ID 17!@#ACTIVITY_CODE 4
12/23/2022 02:07:40 AM script INFO: SUCCESS!@#KODE 1!@#USER_ID 17!@#ACTIVITY_CODE 2
12/23/2022 02:07:40 AM script INFO: SUCCESS!@#KODE 1!@#USER_ID 17!@#ACTIVITY_CODE 3
12/23/2022 02:07:40 AM script INFO: SUCCESS!@#KODE 1!@#USER_ID 17!@#ACTIVITY_CODE 3
12/23/2022 02:07:41 AM script INFO: SUCCESS!@#KODE 1!@#USER_ID 17!@#ACTIVITY_CODE 3
12/23/2022 02:07:41 AM script INFO: SUCCESS!@#KODE 1!@#USER_ID 17!@#ACTIVITY_CODE 3
12/23/2022 02:07:41 AM script INFO: SUCCESS!@#KODE 1!@#USER_ID 17!@#ACTIVITY_CODE 2
12/23/2022 02:07:41 AM script INFO: SUCCESS!@#KODE 1!@#USER_ID 17!@#ACTIVITY_CODE 1
12/23/2022 02:07:41 AM script INFO: SUCCESS!@#KODE 1!@#USER_ID 17!@#ACTIVITY_CODE 4
12/23/2022 02:07:42 AM script INFO: SUCCESS!@#KODE 1!@#USER_ID 17!@#ACTIVITY_CODE 2
12/23/2022 02:07:42 AM script INFO: SUCCESS!@#KODE 1!@#USER_ID 17!@#ACTIVITY_CODE 3
12/23/2022 02:07:42 AM script INFO: SUCCESS!@#KODE 1!@#USER_ID 17!@#ACTIVITY_CODE 3
12/23/2022 02:07:43 AM script INFO: SUCCESS!@#KODE 1!@#USER_ID 17!@#ACTIVITY_CODE 2
12/23/2022 02:07:43 AM script INFO: SUCCESS!@#KODE 1!@#USER_ID 17!@#ACTIVITY_CODE 3
12/23/2022 02:07:43 AM script INFO: SUCCESS!@#KODE 1!@#USER_ID 17!@#ACTIVITY_CODE 3
12/23/2022 02:07:43 AM script INFO: SUCCESS!@#KODE 1!@#USER_ID 17!@#ACTIVITY_CODE 2
12/23/2022 02:07:43 AM script INFO: SUCCESS!@#KODE 1!@#USER_ID 17!@#ACTIVITY_CODE 1
12/23/2022 02:07:44 AM script INFO: SUCCESS!@#KODE 1!@#USER_ID 17!@#ACTIVITY_CODE 2
12/23/2022 02:07:44 AM script INFO: SUCCESS!@#KODE 1!@#USER_ID 17!@#ACTIVITY_CODE 3
12/23/2022 02:07:44 AM script INFO: SUCCESS!@#KODE 1!@#USER_ID 17!@#ACTIVITY_CODE 3
12/23/2022 02:07:44 AM script INFO: SUCCESS!@#KODE 1!@#USER_ID 17!@#ACTIVITY_CODE 2
12/23/2022 02:07:45 AM script INFO: SUCCESS!@#KODE 1!@#USER_ID 17!@#ACTIVITY_CODE 4
12/23/2022 02:07:45 AM script INFO: SUCCESS!@#KODE 1!@#USER_ID 17!@#ACTIVITY_CODE 1
12/23/2022 02:07:45 AM script INFO: SUCCESS!@#KODE 1!@#USER_ID 17!@#ACTIVITY_CODE 4
12/23/2022 02:07:45 AM script INFO: SUCCESS!@#KODE 1!@#USER_ID 17!@#ACTIVITY_CODE 3
12/23/2022 02:07:45 AM script INFO: SUCCESS!@#KODE 1!@#USER_ID 17!@#ACTIVITY_CODE 3
12/23/2022 02:07:46 AM script INFO: SUCCESS!@#KODE 1!@#USER_ID 17!@#ACTIVITY_CODE 3
12/23/2022 02:07:46 AM script INFO: SUCCESS!@#KODE 1!@#USER_ID 17!@#ACTIVITY_CODE 1
12/23/2022 02:07:46 AM script INFO: SUCCESS!@#KODE 1!@#USER_ID 17!@#ACTIVITY_CODE 2
12/23/2022 02:07:46 AM script INFO: SUCCESS!@#KODE 1!@#USER_ID 17!@#ACTIVITY_CODE 4
12/23/2022 02:07:46 AM script INFO: SUCCESS!@#KODE 1!@#USER_ID 17!@#ACTIVITY_CODE 2
12/23/2022 02:07:46 AM script INFO: SUCCESS!@#KODE 1!@#USER_ID 17!@#ACTIVITY_CODE 2
12/23/2022 02:07:47 AM script INFO: SUCCESS!@#KODE 1!@#USER_ID 17!@#ACTIVITY_CODE 3
12/23/2022 02:07:47 AM script INFO: SUCCESS!@#KODE 1!@#USER_ID 17!@#ACTIVITY_CODE 3
12/23/2022 02:07:47 AM script INFO: SUCCESS!@#KODE 1!@#USER_ID 17!@#ACTIVITY_CODE 1
12/23/2022 02:07:47 AM script INFO: SUCCESS!@#KODE 1!@#USER_ID 17!@#ACTIVITY_CODE 3
12/23/2022 02:07:47 AM script INFO: SUCCESS!@#KODE 1!@#USER_ID 17!@#ACTIVITY_CODE 2
12/23/2022 02:07:47 AM script INFO: SUCCESS!@#KODE 1!@#USER_ID 17!@#ACTIVITY_CODE 2
12/23/2022 02:07:47 AM script INFO: SUCCESS!@#KODE 1!@#USER_ID 17!@#ACTIVITY_CODE 3
12/23/2022 02:07:48 AM script INFO: SUCCESS!@#KODE 1!@#USER_ID 17!@#ACTIVITY_CODE 1
12/23/2022 02:07:48 AM script INFO: SUCCESS!@#KODE 1!@#USER_ID 17!@#ACTIVITY_CODE 4
12/23/2022 02:07:48 AM script INFO: SUCCESS!@#KODE 1!@#USER_ID 17!@#ACTIVITY_CODE 1
12/23/2022 02:07:48 AM script INFO: SUCCESS!@#KODE 1!@#USER_ID 17!@#ACTIVITY_CODE 4
12/23/2022 02:07:48 AM script INFO: SUCCESS!@#KODE 1!@#USER_ID 17!@#ACTIVITY_CODE 1
12/23/2022 02:07:48 AM script INFO: SUCCESS!@#KODE 1!@#USER_ID 17!@#ACTIVITY_CODE 1
12/23/2022 02:07:48 AM script INFO: SUCCESS!@#KODE 1!@#USER_ID 17!@#ACTIVITY_CODE 1
12/23/2022 02:07:48 AM script INFO: SUCCESS!@#KODE 1!@#USER_ID 17!@#ACTIVITY_CODE 1
12/23/2022 02:07:48 AM script INFO: SUCCESS!@#KODE 1!@#USER_ID 17!@#ACTIVITY_CODE 3
12/23/2022 02:07:48 AM script INFO: SUCCESS!@#KODE 1!@#USER_ID 17!@#ACTIVITY_CODE 4
12/23/2022 02:07:48 AM script INFO: SUCCESS!@#KODE 1!@#USER_ID 17!@#ACTIVITY_CODE 3
12/23/2022 02:07:49 AM script INFO: SUCCESS!@#KODE 1!@#USER_ID 17!@#ACTIVITY_CODE 2
12/23/2022 02:07:49 AM script INFO: SUCCESS!@#KODE 1!@#USER_ID 17!@#ACTIVITY_CODE 1
12/23/2022 02:07:49 AM script INFO: SUCCESS!@#KODE 1!@#USER_ID 17!@#ACTIVITY_CODE 1
12/23/2022 02:07:49 AM script INFO: SUCCESS!@#KODE 1!@#USER_ID 17!@#ACTIVITY_CODE 3
12/23/2022 02:07:49 AM script INFO: SUCCESS!@#KODE 1!@#USER_ID 17!@#ACTIVITY_CODE 1
12/23/2022 02:07:49 AM script INFO: SUCCESS!@#KODE 1!@#USER_ID 17!@#ACTIVITY_CODE 3
12/23/2022 02:07:49 AM script INFO: SUCCESS!@#KODE 1!@#USER_ID 17!@#ACTIVITY_CODE 2
12/23/2022 02:07:50 AM script INFO: SUCCESS!@#KODE 1!@#USER_ID 17!@#ACTIVITY_CODE 2
12/23/2022 02:07:50 AM script INFO: SUCCESS!@#KODE 1!@#USER_ID 17!@#ACTIVITY_CODE 2
12/23/2022 02:07:50 AM script INFO: SUCCESS!@#KODE 1!@#USER_ID 17!@#ACTIVITY_CODE 2
12/23/2022 02:07:50 AM script INFO: SUCCESS!@#KODE 1!@#USER_ID 17!@#ACTIVITY_CODE 2
12/23/2022 02:07:50 AM script INFO: SUCCESS!@#KODE 1!@#USER_ID 17!@#ACTIVITY_CODE 1
12/23/2022 02:07:50 AM script INFO: SUCCESS!@#KODE 1!@#USER_ID 17!@#ACTIVITY_CODE 2
12/23/2022 02:07:51 AM script INFO: SUCCESS!@#KODE 1!@#USER_ID 17!@#ACTIVITY_CODE 1
12/23/2022 02:07:51 AM script INFO: SUCCESS!@#KODE 1!@#USER_ID 17!@#ACTIVITY_CODE 3
12/23/2022 02:07:51 AM script INFO: SUCCESS!@#KODE 1!@#USER_ID 17!@#ACTIVITY_CODE 4
12/23/2022 02:07:51 AM script INFO: SUCCESS!@#KODE 1!@#USER_ID 17!@#ACTIVITY_CODE 1
12/23/2022 02:07:51 AM script INFO: SUCCESS!@#KODE 1!@#USER_ID 17!@#ACTIVITY_CODE 4
12/23/2022 02:07:51 AM script INFO: SUCCESS!@#KODE 1!@#USER_ID 17!@#ACTIVITY_CODE 2
12/23/2022 02:07:52 AM script INFO: SUCCESS!@#KODE 1!@#USER_ID 17!@#ACTIVITY_CODE 2
12/23/2022 02:07:52 AM script INFO: SUCCESS!@#KODE 1!@#USER_ID 17!@#ACTIVITY_CODE 3
12/23/2022 02:07:52 AM script INFO: SUCCESS!@#KODE 1!@#USER_ID 17!@#ACTIVITY_CODE 4
12/23/2022 02:07:52 AM script INFO: SUCCESS!@#KODE 1!@#USER_ID 17!@#ACTIVITY_CODE 2
12/23/2022 02:07:52 AM script INFO: SUCCESS!@#KODE 1!@#USER_ID 17!@#ACTIVITY_CODE 3
12/23/2022 02:07:52 AM script INFO: SUCCESS!@#KODE 1!@#USER_ID 17!@#ACTIVITY_CODE 2
12/23/2022 02:07:52 AM script INFO: SUCCESS!@#KODE 1!@#USER_ID 17!@#ACTIVITY_CODE 1
12/23/2022 02:07:52 AM script INFO: SUCCESS!@#KODE 1!@#USER_ID 17!@#ACTIVITY_CODE 1
12/23/2022 02:07:53 AM script INFO: SUCCESS!@#KODE 1!@#USER_ID 17!@#ACTIVITY_CODE 2
12/23/2022 02:07:53 AM script INFO: SUCCESS!@#KODE 1!@#USER_ID 17!@#ACTIVITY_CODE 1
12/23/2022 02:07:53 AM script INFO: SUCCESS!@#KODE 1!@#USER_ID 17!@#ACTIVITY_CODE 1
12/23/2022 02:07:53 AM script INFO: SUCCESS!@#KODE 1!@#USER_ID 17!@#ACTIVITY_CODE 1
12/23/2022 02:07:53 AM script INFO: SUCCESS!@#KODE 1!@#USER_ID 17!@#ACTIVITY_CODE 1
12/23/2022 02:07:53 AM script INFO: SUCCESS!@#KODE 1!@#USER_ID 17!@#ACTIVITY_CODE 4
12/23/2022 02:07:53 AM script INFO: SUCCESS!@#KODE 1!@#USER_ID 17!@#ACTIVITY_CODE 3
12/23/2022 02:07:53 AM script INFO: SUCCESS!@#KODE 1!@#USER_ID 17!@#ACTIVITY_CODE 3
12/23/2022 02:07:53 AM script INFO: SUCCESS!@#KODE 1!@#USER_ID 17!@#ACTIVITY_CODE 3
12/23/2022 02:07:54 AM script INFO: SUCCESS!@#KODE 1!@#USER_ID 17!@#ACTIVITY_CODE 2
12/23/2022 02:07:54 AM script INFO: SUCCESS!@#KODE 1!@#USER_ID 17!@#ACTIVITY_CODE 1
12/23/2022 02:07:54 AM script INFO: SUCCESS!@#KODE 1!@#USER_ID 17!@#ACTIVITY_CODE 3
12/23/2022 02:07:54 AM script INFO: SUCCESS!@#KODE 1!@#USER_ID 17!@#ACTIVITY_CODE 1
12/23/2022 02:07:54 AM script INFO: SUCCESS!@#KODE 1!@#USER_ID 17!@#ACTIVITY_CODE 1
12/23/2022 02:07:54 AM script INFO: SUCCESS!@#KODE 1!@#USER_ID 17!@#ACTIVITY_CODE 2
12/23/2022 02:07:54 AM script INFO: SUCCESS!@#KODE 1!@#USER_ID 17!@#ACTIVITY_CODE 2
12/23/2022 02:07:55 AM script INFO: SUCCESS!@#KODE 1!@#USER_ID 17!@#ACTIVITY_CODE 2
12/23/2022 02:07:55 AM script INFO: SUCCESS!@#KODE 1!@#USER_ID 17!@#ACTIVITY_CODE 2
12/23/2022 02:07:55 AM script INFO: SUCCESS!@#KODE 1!@#USER_ID 17!@#ACTIVITY_CODE 2
12/23/2022 02:07:55 AM script INFO: SUCCESS!@#KODE 1!@#USER_ID 17!@#ACTIVITY_CODE 2
12/23/2022 02:07:56 AM script INFO: SUCCESS!@#KODE 1!@#USER_ID 17!@#ACTIVITY_CODE 2
12/23/2022 02:07:56 AM script INFO: SUCCESS!@#KODE 1!@#USER_ID 17!@#ACTIVITY_CODE 3
12/23/2022 02:07:56 AM script INFO: SUCCESS!@#KODE 1!@#USER_ID 17!@#ACTIVITY_CODE 3
12/23/2022 02:07:56 AM script INFO: SUCCESS!@#KODE 1!@#USER_ID 17!@#ACTIVITY_CODE 1
12/23/2022 02:07:56 AM script INFO: SUCCESS!@#KODE 1!@#USER_ID 17!@#ACTIVITY_CODE 2
12/23/2022 02:07:56 AM script INFO: SUCCESS!@#KODE 1!@#USER_ID 17!@#ACTIVITY_CODE 3
12/23/2022 02:07:56 AM script INFO: SUCCESS!@#KODE 1!@#USER_ID 17!@#ACTIVITY_CODE 3
12/23/2022 02:07:56 AM script INFO: SUCCESS!@#KODE 1!@#USER_ID 17!@#ACTIVITY_CODE 1
12/23/2022 02:07:57 AM script INFO: SUCCESS!@#KODE 1!@#USER_ID 17!@#ACTIVITY_CODE 3
12/23/2022 02:07:57 AM script INFO: SUCCESS!@#KODE 1!@#USER_ID 17!@#ACTIVITY_CODE 3
12/23/2022 02:07:57 AM script INFO: SUCCESS!@#KODE 1!@#USER_ID 17!@#ACTIVITY_CODE 4
12/23/2022 02:07:57 AM script INFO: SUCCESS!@#KODE 1!@#USER_ID 17!@#ACTIVITY_CODE 3
12/23/2022 02:07:57 AM script INFO: SUCCESS!@#KODE 1!@#USER_ID 17!@#ACTIVITY_CODE 2
12/23/2022 02:07:57 AM script INFO: SUCCESS!@#KODE 1!@#USER_ID 17!@#ACTIVITY_CODE 2
12/23/2022 02:07:57 AM script INFO: SUCCESS!@#KODE 1!@#USER_ID 17!@#ACTIVITY_CODE 1
12/23/2022 02:07:57 AM script INFO: SUCCESS!@#KODE 1!@#USER_ID 17!@#ACTIVITY_CODE 3
12/23/2022 02:07:58 AM script INFO: SUCCESS!@#KODE 1!@#USER_ID 17!@#ACTIVITY_CODE 1
12/23/2022 02:07:58 AM script INFO: SUCCESS!@#KODE 1!@#USER_ID 17!@#ACTIVITY_CODE 1
12/23/2022 02:07:58 AM script INFO: SUCCESS!@#KODE 1!@#USER_ID 17!@#ACTIVITY_CODE 4
12/23/2022 02:07:58 AM script INFO: SUCCESS!@#KODE 1!@#USER_ID 17!@#ACTIVITY_CODE 2
12/23/2022 02:07:58 AM script INFO: SUCCESS!@#KODE 1!@#USER_ID 17!@#ACTIVITY_CODE 1
12/23/2022 02:07:58 AM script INFO: SUCCESS!@#KODE 1!@#USER_ID 17!@#ACTIVITY_CODE 2
12/23/2022 02:07:58 AM script INFO: SUCCESS!@#KODE 1!@#USER_ID 17!@#ACTIVITY_CODE 3
12/23/2022 02:07:59 AM script INFO: SUCCESS!@#KODE 1!@#USER_ID 17!@#ACTIVITY_CODE 2
12/23/2022 02:07:59 AM script INFO: SUCCESS!@#KODE 1!@#USER_ID 17!@#ACTIVITY_CODE 4
12/23/2022 02:07:59 AM script INFO: SUCCESS!@#KODE 1!@#USER_ID 17!@#ACTIVITY_CODE 3
12/23/2022 02:07:59 AM script INFO: SUCCESS!@#KODE 1!@#USER_ID 17!@#ACTIVITY_CODE 3
12/23/2022 02:07:59 AM script INFO: SUCCESS!@#KODE 1!@#USER_ID 17!@#ACTIVITY_CODE 3
12/23/2022 02:07:59 AM script INFO: SUCCESS!@#KODE 1!@#USER_ID 17!@#ACTIVITY_CODE 3
12/23/2022 02:07:59 AM script INFO: SUCCESS!@#KODE 1!@#USER_ID 17!@#ACTIVITY_CODE 3
12/23/2022 02:07:59 AM script INFO: SUCCESS!@#KODE 1!@#USER_ID 17!@#ACTIVITY_CODE 2
12/23/2022 02:08:00 AM script INFO: SUCCESS!@#KODE 1!@#USER_ID 17!@#ACTIVITY_CODE 2
12/23/2022 02:08:00 AM script INFO: SUCCESS!@#KODE 1!@#USER_ID 17!@#ACTIVITY_CODE 2
12/23/2022 02:08:00 AM script INFO: SUCCESS!@#KODE 1!@#USER_ID 17!@#ACTIVITY_CODE 2
12/23/2022 02:08:00 AM script INFO: SUCCESS!@#KODE 1!@#USER_ID 17!@#ACTIVITY_CODE 1
12/23/2022 02:08:00 AM script INFO: SUCCESS!@#KODE 1!@#USER_ID 17!@#ACTIVITY_CODE 4
12/23/2022 02:08:01 AM script INFO: SUCCESS!@#KODE 1!@#USER_ID 17!@#ACTIVITY_CODE 3
12/23/2022 02:08:01 AM script INFO: SUCCESS!@#KODE 1!@#USER_ID 17!@#ACTIVITY_CODE 3
12/23/2022 02:08:01 AM script INFO: SUCCESS!@#KODE 1!@#USER_ID 17!@#ACTIVITY_CODE 1
12/23/2022 02:08:01 AM script INFO: SUCCESS!@#KODE 1!@#USER_ID 17!@#ACTIVITY_CODE 3
12/23/2022 02:08:01 AM script INFO: SUCCESS!@#KODE 1!@#USER_ID 17!@#ACTIVITY_CODE 1
12/23/2022 02:08:01 AM script INFO: SUCCESS!@#KODE 1!@#USER_ID 17!@#ACTIVITY_CODE 2
12/23/2022 02:08:01 AM script INFO: SUCCESS!@#KODE 1!@#USER_ID 17!@#ACTIVITY_CODE 1
12/23/2022 02:08:01 AM script INFO: SUCCESS!@#KODE 1!@#USER_ID 17!@#ACTIVITY_CODE 3
12/23/2022 02:08:01 AM script INFO: SUCCESS!@#KODE 1!@#USER_ID 17!@#ACTIVITY_CODE 3
12/23/2022 02:08:02 AM script INFO: SUCCESS!@#KODE 1!@#USER_ID 17!@#ACTIVITY_CODE 3
12/23/2022 02:08:02 AM script INFO: SUCCESS!@#KODE 1!@#USER_ID 17!@#ACTIVITY_CODE 2
12/23/2022 02:08:02 AM script INFO: SUCCESS!@#KODE 1!@#USER_ID 17!@#ACTIVITY_CODE 1
12/23/2022 02:08:02 AM script INFO: SUCCESS!@#KODE 1!@#USER_ID 17!@#ACTIVITY_CODE 3
12/23/2022 02:08:02 AM script INFO: SUCCESS!@#KODE 1!@#USER_ID 17!@#ACTIVITY_CODE 3
12/23/2022 02:08:02 AM script INFO: SUCCESS!@#KODE 1!@#USER_ID 17!@#ACTIVITY_CODE 1
12/23/2022 02:08:02 AM script INFO: SUCCESS!@#KODE 1!@#USER_ID 17!@#ACTIVITY_CODE 1
12/23/2022 02:08:02 AM script INFO: SUCCESS!@#KODE 1!@#USER_ID 17!@#ACTIVITY_CODE 3
12/23/2022 02:08:02 AM script INFO: SUCCESS!@#KODE 1!@#USER_ID 17!@#ACTIVITY_CODE 1
12/23/2022 02:08:02 AM script INFO: SUCCESS!@#KODE 1!@#USER_ID 17!@#ACTIVITY_CODE 1
12/23/2022 02:08:02 AM script INFO: SUCCESS!@#KODE 1!@#USER_ID 17!@#ACTIVITY_CODE 1
12/23/2022 02:08:03 AM script INFO: SUCCESS!@#KODE 1!@#USER_ID 17!@#ACTIVITY_CODE 4
12/23/2022 02:08:03 AM script INFO: SUCCESS!@#KODE 1!@#USER_ID 17!@#ACTIVITY_CODE 1
12/23/2022 02:08:03 AM script INFO: SUCCESS!@#KODE 1!@#USER_ID 17!@#ACTIVITY_CODE 2
12/23/2022 02:08:03 AM script INFO: SUCCESS!@#KODE 1!@#USER_ID 17!@#ACTIVITY_CODE 3
12/23/2022 02:08:03 AM script INFO: SUCCESS!@#KODE 1!@#USER_ID 17!@#ACTIVITY_CODE 2
12/23/2022 02:08:04 AM script INFO: SUCCESS!@#KODE 1!@#USER_ID 17!@#ACTIVITY_CODE 2
12/23/2022 02:08:04 AM script INFO: SUCCESS!@#KODE 1!@#USER_ID 17!@#ACTIVITY_CODE 4
12/23/2022 02:08:04 AM script INFO: SUCCESS!@#KODE 1!@#USER_ID 17!@#ACTIVITY_CODE 1
12/23/2022 02:08:04 AM script INFO: SUCCESS!@#KODE 1!@#USER_ID 17!@#ACTIVITY_CODE 4
12/23/2022 02:08:04 AM script INFO: SUCCESS!@#KODE 1!@#USER_ID 17!@#ACTIVITY_CODE 3
12/23/2022 02:08:04 AM script INFO: SUCCESS!@#KODE 1!@#USER_ID 17!@#ACTIVITY_CODE 2
12/23/2022 02:08:04 AM script INFO: SUCCESS!@#KODE 1!@#USER_ID 17!@#ACTIVITY_CODE 2
12/23/2022 02:08:05 AM script INFO: SUCCESS!@#KODE 1!@#USER_ID 17!@#ACTIVITY_CODE 2
12/23/2022 02:08:05 AM script INFO: SUCCESS!@#KODE 1!@#USER_ID 17!@#ACTIVITY_CODE 3
12/23/2022 02:08:05 AM script INFO: SUCCESS!@#KODE 1!@#USER_ID 17!@#ACTIVITY_CODE 3
12/23/2022 02:08:05 AM script INFO: SUCCESS!@#KODE 1!@#USER_ID 17!@#ACTIVITY_CODE 2
12/23/2022 02:08:05 AM script INFO: SUCCESS!@#KODE 1!@#USER_ID 17!@#ACTIVITY_CODE 2
12/23/2022 02:08:05 AM script INFO: SUCCESS!@#KODE 1!@#USER_ID 17!@#ACTIVITY_CODE 4
12/23/2022 02:08:05 AM script INFO: SUCCESS!@#KODE 1!@#USER_ID 17!@#ACTIVITY_CODE 1
12/23/2022 02:08:06 AM script INFO: SUCCESS!@#KODE 1!@#USER_ID 17!@#ACTIVITY_CODE 3
12/23/2022 02:08:06 AM script INFO: SUCCESS!@#KODE 1!@#USER_ID 17!@#ACTIVITY_CODE 2
12/23/2022 02:08:06 AM script INFO: SUCCESS!@#KODE 1!@#USER_ID 17!@#ACTIVITY_CODE 3
12/23/2022 02:08:06 AM script INFO: SUCCESS!@#KODE 1!@#USER_ID 17!@#ACTIVITY_CODE 2
12/23/2022 02:08:06 AM script INFO: SUCCESS!@#KODE 1!@#USER_ID 17!@#ACTIVITY_CODE 1
12/23/2022 02:08:06 AM script INFO: SUCCESS!@#KODE 1!@#USER_ID 17!@#ACTIVITY_CODE 4
12/23/2022 02:08:06 AM script INFO: SUCCESS!@#KODE 1!@#USER_ID 17!@#ACTIVITY_CODE 3
12/23/2022 02:08:07 AM script INFO: SUCCESS!@#KODE 1!@#USER_ID 17!@#ACTIVITY_CODE 1
12/23/2022 02:08:07 AM script INFO: SUCCESS!@#KODE 1!@#USER_ID 17!@#ACTIVITY_CODE 3
12/23/2022 02:08:07 AM script INFO: SUCCESS!@#KODE 1!@#USER_ID 17!@#ACTIVITY_CODE 3
12/23/2022 02:08:07 AM script INFO: SUCCESS!@#KODE 1!@#USER_ID 17!@#ACTIVITY_CODE 1
12/23/2022 02:08:07 AM script INFO: SUCCESS!@#KODE 1!@#USER_ID 17!@#ACTIVITY_CODE 2
12/23/2022 02:08:07 AM script INFO: SUCCESS!@#KODE 1!@#USER_ID 17!@#ACTIVITY_CODE 4
12/23/2022 02:08:07 AM script INFO: SUCCESS!@#KODE 1!@#USER_ID 17!@#ACTIVITY_CODE 3
12/23/2022 02:08:07 AM script INFO: SUCCESS!@#KODE 1!@#USER_ID 17!@#ACTIVITY_CODE 3
12/23/2022 02:08:07 AM script INFO: SUCCESS!@#KODE 1!@#USER_ID 17!@#ACTIVITY_CODE 3
12/23/2022 02:08:08 AM script INFO: SUCCESS!@#KODE 1!@#USER_ID 17!@#ACTIVITY_CODE 2
12/23/2022 02:08:08 AM script INFO: SUCCESS!@#KODE 1!@#USER_ID 17!@#ACTIVITY_CODE 1
12/23/2022 02:08:08 AM script INFO: SUCCESS!@#KODE 1!@#USER_ID 17!@#ACTIVITY_CODE 3
12/23/2022 02:08:08 AM script INFO: SUCCESS!@#KODE 1!@#USER_ID 17!@#ACTIVITY_CODE 1
12/23/2022 02:08:08 AM script INFO: SUCCESS!@#KODE 1!@#USER_ID 17!@#ACTIVITY_CODE 2
12/23/2022 02:08:08 AM script INFO: SUCCESS!@#KODE 1!@#USER_ID 17!@#ACTIVITY_CODE 4
12/23/2022 02:08:08 AM script INFO: SUCCESS!@#KODE 1!@#USER_ID 17!@#ACTIVITY_CODE 3
12/23/2022 02:08:08 AM script INFO: SUCCESS!@#KODE 1!@#USER_ID 17!@#ACTIVITY_CODE 2
12/23/2022 02:08:09 AM script INFO: SUCCESS!@#KODE 1!@#USER_ID 17!@#ACTIVITY_CODE 2
12/23/2022 02:08:09 AM script INFO: SUCCESS!@#KODE 1!@#USER_ID 17!@#ACTIVITY_CODE 4
12/23/2022 02:08:09 AM script INFO: SUCCESS!@#KODE 1!@#USER_ID 17!@#ACTIVITY_CODE 1
12/23/2022 02:08:09 AM script INFO: SUCCESS!@#KODE 1!@#USER_ID 17!@#ACTIVITY_CODE 3
12/23/2022 02:08:09 AM script INFO: SUCCESS!@#KODE 1!@#USER_ID 17!@#ACTIVITY_CODE 2
12/23/2022 02:08:09 AM script INFO: SUCCESS!@#KODE 1!@#USER_ID 17!@#ACTIVITY_CODE 3
12/23/2022 02:08:09 AM script INFO: SUCCESS!@#KODE 1!@#USER_ID 17!@#ACTIVITY_CODE 3
12/23/2022 02:08:09 AM script INFO: SUCCESS!@#KODE 1!@#USER_ID 17!@#ACTIVITY_CODE 3
12/23/2022 02:08:10 AM script INFO: SUCCESS!@#KODE 1!@#USER_ID 17!@#ACTIVITY_CODE 2
12/23/2022 02:08:10 AM script INFO: SUCCESS!@#KODE 1!@#USER_ID 17!@#ACTIVITY_CODE 3
12/23/2022 02:08:10 AM script INFO: SUCCESS!@#KODE 1!@#USER_ID 17!@#ACTIVITY_CODE 1
12/23/2022 02:08:10 AM script INFO: SUCCESS!@#KODE 1!@#USER_ID 17!@#ACTIVITY_CODE 1
12/23/2022 02:08:10 AM script INFO: SUCCESS!@#KODE 1!@#USER_ID 17!@#ACTIVITY_CODE 1
12/23/2022 02:08:10 AM script INFO: SUCCESS!@#KODE 1!@#USER_ID 17!@#ACTIVITY_CODE 1
12/23/2022 02:08:10 AM script INFO: SUCCESS!@#KODE 1!@#USER_ID 17!@#ACTIVITY_CODE 2
12/23/2022 02:08:10 AM script INFO: SUCCESS!@#KODE 1!@#USER_ID 17!@#ACTIVITY_CODE 1
12/23/2022 02:08:10 AM script INFO: SUCCESS!@#KODE 1!@#USER_ID 17!@#ACTIVITY_CODE 2
12/23/2022 02:08:11 AM script INFO: SUCCESS!@#KODE 1!@#USER_ID 17!@#ACTIVITY_CODE 2
12/23/2022 02:08:11 AM script INFO: SUCCESS!@#KODE 1!@#USER_ID 17!@#ACTIVITY_CODE 1
12/23/2022 02:08:11 AM script INFO: SUCCESS!@#KODE 1!@#USER_ID 17!@#ACTIVITY_CODE 4
12/23/2022 02:08:11 AM script INFO: SUCCESS!@#KODE 1!@#USER_ID 17!@#ACTIVITY_CODE 3
12/23/2022 02:08:11 AM script INFO: SUCCESS!@#KODE 1!@#USER_ID 17!@#ACTIVITY_CODE 3
12/23/2022 02:08:11 AM script INFO: Duration: 109.85168933868408
12/23/2022 02:08:11 AM script INFO: mengakhiri-quiz
12/23/2022 02:08:42 AM script INFO: SUCCESS!@#KODE 1!@#USER_ID 17!@#ACTIVITY_CODE 5
12/23/2022 02:08:42 AM script INFO: berhasil-submit
