12/23/2022 04:20:19 AM script INFO: Prepared chrome options..
12/23/2022 04:20:21 AM script INFO: Initialized chrome browser..
12/23/2022 04:20:21 AM script INFO: mengakses-homepage
12/23/2022 04:20:47 AM script INFO: mengakses-login-page
12/23/2022 04:22:00 AM script INFO: mengakses-site-home
12/23/2022 04:22:01 AM main_worker ERROR: Message: element click intercepted: Element <a class="list-group-item list-group-item-action  " href="http://35.238.154.97/?redirect=0" data-key="home" data-isexpandable="0" data-indent="0" data-showdivider="0" data-type="70" data-nodetype="0" data-collapse="0" data-forceopen="0" data-isactive="0" data-hidden="0" data-preceedwithhr="0" data-parent-key="myhome">...</a> is not clickable at point (142, 141). Other element would receive the click: <div class="yui3-widget-mask" style="position: fixed; width: 100%; height: 100%; top: 0px; left: 0px; z-index: 1041;"></div>
  (Session info: headless chrome=107.0.5304.87)
Stacktrace:
#0 0x56394e19f463 <unknown>
#1 0x56394df638d8 <unknown>
#2 0x56394dfa923b <unknown>
#3 0x56394dfa6a79 <unknown>
#4 0x56394dfa3fe4 <unknown>
#5 0x56394dfa2b21 <unknown>
#6 0x56394df95421 <unknown>
#7 0x56394dfc2622 <unknown>
#8 0x56394df94ba7 <unknown>
#9 0x56394dfc278e <unknown>
#10 0x56394dfdb30f <unknown>
#11 0x56394dfc2443 <unknown>
#12 0x56394df933c5 <unknown>
#13 0x56394df94531 <unknown>
#14 0x56394e1f1dce <unknown>
#15 0x56394e1f5192 <unknown>
#16 0x56394e1d693e <unknown>
#17 0x56394e1f6103 <unknown>
#18 0x56394e1c9d85 <unknown>
#19 0x56394e2170a8 <unknown>
#20 0x56394e217239 <unknown>
#21 0x56394e232492 <unknown>
#22 0x7f411f364609 start_thread

