12/23/2022 05:37:36 AM script INFO: Prepared chrome options..
12/23/2022 05:37:38 AM script INFO: Initialized chrome browser..
12/23/2022 05:37:38 AM script INFO: mengakses-homepage
12/23/2022 05:38:23 AM script INFO: mengakses-login-page
12/23/2022 05:38:55 AM script INFO: mengakses-site-home
12/23/2022 05:39:16 AM script INFO: mengakses-site-course
12/23/2022 05:40:47 AM script ERROR: TIMEOUT EXCEPTION!@#KODE 0!@#LOCATION mengakses-site-course
12/23/2022 05:40:47 AM main_worker ERROR: Message: None

