12/12/2022 01:44:27 AM script INFO: Prepared chrome options..
12/12/2022 01:44:29 AM script INFO: Initialized chrome browser..
12/12/2022 01:44:29 AM script INFO: mengakses-homepage
12/12/2022 01:45:05 AM script INFO: mengakses-login-page
12/12/2022 01:45:07 AM script INFO: mengakses-site-home
12/12/2022 01:45:07 AM script INFO: mengakses-site-course
12/12/2022 01:45:08 AM script INFO: mengakses-quiz
12/12/2022 01:45:09 AM script INFO: mengakses-start-quiz-page
12/12/2022 01:45:10 AM script INFO: memulai-quiz
12/12/2022 01:45:10 AM script INFO: SUCCESS!@#KODE 1!@#USER_ID 82!@#ACTIVITY_CODE 5
12/12/2022 01:45:21 AM script INFO: SUCCESS!@#KODE 1!@#USER_ID 82!@#ACTIVITY_CODE 3
12/12/2022 01:45:21 AM script INFO: SUCCESS!@#KODE 1!@#USER_ID 82!@#ACTIVITY_CODE 5
12/12/2022 01:45:21 AM script INFO: SUCCESS!@#KODE 1!@#USER_ID 82!@#ACTIVITY_CODE 5
12/12/2022 01:45:23 AM script INFO: SUCCESS!@#KODE 1!@#USER_ID 82!@#ACTIVITY_CODE 5
12/12/2022 01:45:23 AM script INFO: SUCCESS!@#KODE 1!@#USER_ID 82!@#ACTIVITY_CODE 5
12/12/2022 01:45:26 AM script INFO: SUCCESS!@#KODE 1!@#USER_ID 82!@#ACTIVITY_CODE 3
12/12/2022 01:45:26 AM script INFO: SUCCESS!@#KODE 1!@#USER_ID 82!@#ACTIVITY_CODE 2
12/12/2022 01:45:26 AM script INFO: SUCCESS!@#KODE 1!@#USER_ID 82!@#ACTIVITY_CODE 1
12/12/2022 01:45:26 AM script INFO: SUCCESS!@#KODE 1!@#USER_ID 82!@#ACTIVITY_CODE 2
12/12/2022 01:45:26 AM script INFO: SUCCESS!@#KODE 1!@#USER_ID 82!@#ACTIVITY_CODE 5
12/12/2022 01:45:26 AM script INFO: SUCCESS!@#KODE 1!@#USER_ID 82!@#ACTIVITY_CODE 5
12/12/2022 01:45:29 AM script INFO: SUCCESS!@#KODE 1!@#USER_ID 82!@#ACTIVITY_CODE 2
12/12/2022 01:45:29 AM script INFO: SUCCESS!@#KODE 1!@#USER_ID 82!@#ACTIVITY_CODE 1
12/12/2022 01:45:29 AM script INFO: SUCCESS!@#KODE 1!@#USER_ID 82!@#ACTIVITY_CODE 5
12/12/2022 01:45:29 AM script INFO: SUCCESS!@#KODE 1!@#USER_ID 82!@#ACTIVITY_CODE 5
12/12/2022 01:45:32 AM script INFO: SUCCESS!@#KODE 1!@#USER_ID 82!@#ACTIVITY_CODE 4
12/12/2022 01:45:32 AM script INFO: SUCCESS!@#KODE 1!@#USER_ID 82!@#ACTIVITY_CODE 2
12/12/2022 01:45:32 AM script INFO: SUCCESS!@#KODE 1!@#USER_ID 82!@#ACTIVITY_CODE 1
12/12/2022 01:45:32 AM script INFO: SUCCESS!@#KODE 1!@#USER_ID 82!@#ACTIVITY_CODE 5
12/12/2022 01:45:32 AM script INFO: SUCCESS!@#KODE 1!@#USER_ID 82!@#ACTIVITY_CODE 5
12/12/2022 01:45:35 AM script INFO: SUCCESS!@#KODE 1!@#USER_ID 82!@#ACTIVITY_CODE 2
12/12/2022 01:45:35 AM script INFO: SUCCESS!@#KODE 1!@#USER_ID 82!@#ACTIVITY_CODE 5
12/12/2022 01:45:35 AM script INFO: SUCCESS!@#KODE 1!@#USER_ID 82!@#ACTIVITY_CODE 5
12/12/2022 01:45:37 AM script INFO: SUCCESS!@#KODE 1!@#USER_ID 82!@#ACTIVITY_CODE 2
12/12/2022 01:45:37 AM script INFO: SUCCESS!@#KODE 1!@#USER_ID 82!@#ACTIVITY_CODE 5
12/12/2022 01:45:37 AM script INFO: SUCCESS!@#KODE 1!@#USER_ID 82!@#ACTIVITY_CODE 5
12/12/2022 01:45:40 AM script INFO: SUCCESS!@#KODE 1!@#USER_ID 82!@#ACTIVITY_CODE 3
12/12/2022 01:45:40 AM script INFO: SUCCESS!@#KODE 1!@#USER_ID 82!@#ACTIVITY_CODE 5
12/12/2022 01:45:40 AM script INFO: SUCCESS!@#KODE 1!@#USER_ID 82!@#ACTIVITY_CODE 5
12/12/2022 01:45:43 AM script INFO: SUCCESS!@#KODE 1!@#USER_ID 82!@#ACTIVITY_CODE 2
12/12/2022 01:45:43 AM script INFO: SUCCESS!@#KODE 1!@#USER_ID 82!@#ACTIVITY_CODE 2
12/12/2022 01:45:43 AM script INFO: SUCCESS!@#KODE 1!@#USER_ID 82!@#ACTIVITY_CODE 5
12/12/2022 01:45:43 AM script INFO: SUCCESS!@#KODE 1!@#USER_ID 82!@#ACTIVITY_CODE 5
12/12/2022 01:45:46 AM script INFO: SUCCESS!@#KODE 1!@#USER_ID 82!@#ACTIVITY_CODE 2
12/12/2022 01:45:46 AM script INFO: SUCCESS!@#KODE 1!@#USER_ID 82!@#ACTIVITY_CODE 5
12/12/2022 01:45:46 AM script INFO: SUCCESS!@#KODE 1!@#USER_ID 82!@#ACTIVITY_CODE 5
12/12/2022 01:45:48 AM script INFO: SUCCESS!@#KODE 1!@#USER_ID 82!@#ACTIVITY_CODE 2
12/12/2022 01:45:48 AM script INFO: SUCCESS!@#KODE 1!@#USER_ID 82!@#ACTIVITY_CODE 1
12/12/2022 01:45:48 AM script INFO: SUCCESS!@#KODE 1!@#USER_ID 82!@#ACTIVITY_CODE 5
12/12/2022 01:45:48 AM script INFO: SUCCESS!@#KODE 1!@#USER_ID 82!@#ACTIVITY_CODE 5
12/12/2022 01:45:51 AM script INFO: SUCCESS!@#KODE 1!@#USER_ID 82!@#ACTIVITY_CODE 4
12/12/2022 01:45:51 AM script INFO: SUCCESS!@#KODE 1!@#USER_ID 82!@#ACTIVITY_CODE 1
12/12/2022 01:45:51 AM script INFO: SUCCESS!@#KODE 1!@#USER_ID 82!@#ACTIVITY_CODE 1
12/12/2022 01:45:51 AM script INFO: SUCCESS!@#KODE 1!@#USER_ID 82!@#ACTIVITY_CODE 2
12/12/2022 01:45:51 AM script INFO: SUCCESS!@#KODE 1!@#USER_ID 82!@#ACTIVITY_CODE 3
12/12/2022 01:45:51 AM script INFO: SUCCESS!@#KODE 1!@#USER_ID 82!@#ACTIVITY_CODE 1
12/12/2022 01:45:52 AM script INFO: SUCCESS!@#KODE 1!@#USER_ID 82!@#ACTIVITY_CODE 2
12/12/2022 01:45:52 AM script INFO: SUCCESS!@#KODE 1!@#USER_ID 82!@#ACTIVITY_CODE 2
12/12/2022 01:45:52 AM script INFO: SUCCESS!@#KODE 1!@#USER_ID 82!@#ACTIVITY_CODE 2
12/12/2022 01:45:52 AM script INFO: SUCCESS!@#KODE 1!@#USER_ID 82!@#ACTIVITY_CODE 2
12/12/2022 01:45:52 AM script INFO: SUCCESS!@#KODE 1!@#USER_ID 82!@#ACTIVITY_CODE 2
12/12/2022 01:45:52 AM script INFO: SUCCESS!@#KODE 1!@#USER_ID 82!@#ACTIVITY_CODE 2
12/12/2022 01:45:52 AM script INFO: SUCCESS!@#KODE 1!@#USER_ID 82!@#ACTIVITY_CODE 2
12/12/2022 01:45:53 AM script INFO: SUCCESS!@#KODE 1!@#USER_ID 82!@#ACTIVITY_CODE 1
12/12/2022 01:45:53 AM script INFO: SUCCESS!@#KODE 1!@#USER_ID 82!@#ACTIVITY_CODE 2
12/12/2022 01:45:53 AM script INFO: SUCCESS!@#KODE 1!@#USER_ID 82!@#ACTIVITY_CODE 2
12/12/2022 01:45:53 AM script INFO: SUCCESS!@#KODE 1!@#USER_ID 82!@#ACTIVITY_CODE 1
12/12/2022 01:45:53 AM script INFO: SUCCESS!@#KODE 1!@#USER_ID 82!@#ACTIVITY_CODE 3
12/12/2022 01:45:53 AM script INFO: SUCCESS!@#KODE 1!@#USER_ID 82!@#ACTIVITY_CODE 2
12/12/2022 01:45:53 AM script INFO: SUCCESS!@#KODE 1!@#USER_ID 82!@#ACTIVITY_CODE 2
12/12/2022 01:45:53 AM script INFO: SUCCESS!@#KODE 1!@#USER_ID 82!@#ACTIVITY_CODE 2
12/12/2022 01:45:53 AM script INFO: SUCCESS!@#KODE 1!@#USER_ID 82!@#ACTIVITY_CODE 1
12/12/2022 01:45:54 AM script INFO: SUCCESS!@#KODE 1!@#USER_ID 82!@#ACTIVITY_CODE 4
12/12/2022 01:45:54 AM script INFO: SUCCESS!@#KODE 1!@#USER_ID 82!@#ACTIVITY_CODE 2
12/12/2022 01:45:54 AM script INFO: SUCCESS!@#KODE 1!@#USER_ID 82!@#ACTIVITY_CODE 2
12/12/2022 01:45:54 AM script INFO: SUCCESS!@#KODE 1!@#USER_ID 82!@#ACTIVITY_CODE 1
12/12/2022 01:45:54 AM script INFO: SUCCESS!@#KODE 1!@#USER_ID 82!@#ACTIVITY_CODE 1
12/12/2022 01:45:54 AM script INFO: SUCCESS!@#KODE 1!@#USER_ID 82!@#ACTIVITY_CODE 2
12/12/2022 01:45:54 AM script INFO: SUCCESS!@#KODE 1!@#USER_ID 82!@#ACTIVITY_CODE 2
12/12/2022 01:45:54 AM script INFO: SUCCESS!@#KODE 1!@#USER_ID 82!@#ACTIVITY_CODE 2
12/12/2022 01:45:54 AM script INFO: SUCCESS!@#KODE 1!@#USER_ID 82!@#ACTIVITY_CODE 4
12/12/2022 01:45:54 AM script INFO: SUCCESS!@#KODE 1!@#USER_ID 82!@#ACTIVITY_CODE 1
12/12/2022 01:45:55 AM script INFO: SUCCESS!@#KODE 1!@#USER_ID 82!@#ACTIVITY_CODE 1
12/12/2022 01:45:55 AM script INFO: SUCCESS!@#KODE 1!@#USER_ID 82!@#ACTIVITY_CODE 2
12/12/2022 01:45:55 AM script INFO: SUCCESS!@#KODE 1!@#USER_ID 82!@#ACTIVITY_CODE 1
12/12/2022 01:45:55 AM script INFO: SUCCESS!@#KODE 1!@#USER_ID 82!@#ACTIVITY_CODE 1
12/12/2022 01:45:55 AM script INFO: SUCCESS!@#KODE 1!@#USER_ID 82!@#ACTIVITY_CODE 4
12/12/2022 01:45:55 AM script INFO: SUCCESS!@#KODE 1!@#USER_ID 82!@#ACTIVITY_CODE 1
12/12/2022 01:45:55 AM script INFO: SUCCESS!@#KODE 1!@#USER_ID 82!@#ACTIVITY_CODE 4
12/12/2022 01:45:55 AM script INFO: SUCCESS!@#KODE 1!@#USER_ID 82!@#ACTIVITY_CODE 2
12/12/2022 01:45:55 AM script INFO: SUCCESS!@#KODE 1!@#USER_ID 82!@#ACTIVITY_CODE 2
12/12/2022 01:45:55 AM script INFO: SUCCESS!@#KODE 1!@#USER_ID 82!@#ACTIVITY_CODE 1
12/12/2022 01:45:55 AM script INFO: SUCCESS!@#KODE 1!@#USER_ID 82!@#ACTIVITY_CODE 3
12/12/2022 01:45:55 AM script INFO: SUCCESS!@#KODE 1!@#USER_ID 82!@#ACTIVITY_CODE 1
12/12/2022 01:45:56 AM script INFO: SUCCESS!@#KODE 1!@#USER_ID 82!@#ACTIVITY_CODE 2
12/12/2022 01:45:56 AM script INFO: SUCCESS!@#KODE 1!@#USER_ID 82!@#ACTIVITY_CODE 1
12/12/2022 01:45:56 AM script INFO: SUCCESS!@#KODE 1!@#USER_ID 82!@#ACTIVITY_CODE 4
12/12/2022 01:45:56 AM script INFO: SUCCESS!@#KODE 1!@#USER_ID 82!@#ACTIVITY_CODE 1
12/12/2022 01:45:56 AM script INFO: SUCCESS!@#KODE 1!@#USER_ID 82!@#ACTIVITY_CODE 1
12/12/2022 01:45:56 AM script INFO: SUCCESS!@#KODE 1!@#USER_ID 82!@#ACTIVITY_CODE 3
12/12/2022 01:45:56 AM script INFO: SUCCESS!@#KODE 1!@#USER_ID 82!@#ACTIVITY_CODE 3
12/12/2022 01:45:56 AM script INFO: SUCCESS!@#KODE 1!@#USER_ID 82!@#ACTIVITY_CODE 2
12/12/2022 01:45:56 AM script INFO: SUCCESS!@#KODE 1!@#USER_ID 82!@#ACTIVITY_CODE 1
12/12/2022 01:45:56 AM script INFO: SUCCESS!@#KODE 1!@#USER_ID 82!@#ACTIVITY_CODE 1
12/12/2022 01:45:56 AM script INFO: SUCCESS!@#KODE 1!@#USER_ID 82!@#ACTIVITY_CODE 4
12/12/2022 01:45:56 AM script INFO: SUCCESS!@#KODE 1!@#USER_ID 82!@#ACTIVITY_CODE 2
12/12/2022 01:45:56 AM script INFO: SUCCESS!@#KODE 1!@#USER_ID 82!@#ACTIVITY_CODE 1
12/12/2022 01:45:57 AM script INFO: SUCCESS!@#KODE 1!@#USER_ID 82!@#ACTIVITY_CODE 2
12/12/2022 01:45:57 AM script INFO: Duration: 35.69014525413513
12/12/2022 01:45:57 AM script INFO: mengakhiri-quiz
12/12/2022 01:45:57 AM script INFO: SUCCESS!@#KODE 1!@#USER_ID 82!@#ACTIVITY_CODE 5
12/12/2022 01:45:57 AM script INFO: berhasil-submit
