12/10/2022 08:53:26 AM script INFO: Prepared chrome options..
12/10/2022 08:53:28 AM script INFO: Initialized chrome browser..
12/10/2022 08:53:29 AM script INFO: mengakses-homepage
12/10/2022 08:53:47 AM script INFO: mengakses-login-page
12/10/2022 08:54:18 AM script INFO: mengakses-site-home
12/10/2022 08:54:21 AM script INFO: mengakses-site-course
12/10/2022 08:54:22 AM script INFO: mengakses-quiz
12/10/2022 08:55:52 AM script ERROR: TIMEOUT EXCEPTION!@#KODE 0!@#LOCATION mengakses-quiz
12/10/2022 08:55:52 AM main_worker ERROR: Message: None

