12/23/2022 07:11:46 AM script INFO: Prepared chrome options..
12/23/2022 07:11:48 AM script INFO: Initialized chrome browser..
12/23/2022 07:11:48 AM script INFO: mengakses-homepage
12/23/2022 07:12:30 AM script INFO: mengakses-login-page
12/23/2022 07:12:46 AM script INFO: mengakses-site-home
12/23/2022 07:12:47 AM script INFO: mengakses-site-course
12/23/2022 07:13:01 AM script INFO: mengakses-quiz
12/23/2022 07:13:01 AM script INFO: mengakses-start-quiz-page
12/23/2022 07:13:02 AM script INFO: memulai-quiz
12/23/2022 07:13:02 AM script INFO: SUCCESS!@#KODE 1!@#USER_ID 35!@#ACTIVITY_CODE 5
12/23/2022 07:13:13 AM script INFO: SUCCESS!@#KODE 1!@#USER_ID 35!@#ACTIVITY_CODE 1
12/23/2022 07:13:13 AM script INFO: SUCCESS!@#KODE 1!@#USER_ID 35!@#ACTIVITY_CODE 3
12/23/2022 07:13:13 AM script INFO: SUCCESS!@#KODE 1!@#USER_ID 35!@#ACTIVITY_CODE 2
12/23/2022 07:13:13 AM script INFO: SUCCESS!@#KODE 1!@#USER_ID 35!@#ACTIVITY_CODE 1
12/23/2022 07:13:13 AM script INFO: SUCCESS!@#KODE 1!@#USER_ID 35!@#ACTIVITY_CODE 5
12/23/2022 07:13:13 AM script INFO: SUCCESS!@#KODE 1!@#USER_ID 35!@#ACTIVITY_CODE 5
12/23/2022 07:13:16 AM script INFO: SUCCESS!@#KODE 1!@#USER_ID 35!@#ACTIVITY_CODE 1
12/23/2022 07:13:16 AM script INFO: SUCCESS!@#KODE 1!@#USER_ID 35!@#ACTIVITY_CODE 2
12/23/2022 07:13:16 AM script INFO: SUCCESS!@#KODE 1!@#USER_ID 35!@#ACTIVITY_CODE 2
12/23/2022 07:13:16 AM script INFO: SUCCESS!@#KODE 1!@#USER_ID 35!@#ACTIVITY_CODE 3
12/23/2022 07:13:16 AM script INFO: SUCCESS!@#KODE 1!@#USER_ID 35!@#ACTIVITY_CODE 1
12/23/2022 07:13:16 AM script INFO: SUCCESS!@#KODE 1!@#USER_ID 35!@#ACTIVITY_CODE 1
12/23/2022 07:13:16 AM script INFO: SUCCESS!@#KODE 1!@#USER_ID 35!@#ACTIVITY_CODE 2
12/23/2022 07:13:16 AM script INFO: SUCCESS!@#KODE 1!@#USER_ID 35!@#ACTIVITY_CODE 3
12/23/2022 07:13:16 AM script INFO: SUCCESS!@#KODE 1!@#USER_ID 35!@#ACTIVITY_CODE 3
12/23/2022 07:13:16 AM script INFO: SUCCESS!@#KODE 1!@#USER_ID 35!@#ACTIVITY_CODE 5
12/23/2022 07:13:16 AM script INFO: SUCCESS!@#KODE 1!@#USER_ID 35!@#ACTIVITY_CODE 5
12/23/2022 07:13:19 AM script INFO: SUCCESS!@#KODE 1!@#USER_ID 35!@#ACTIVITY_CODE 2
12/23/2022 07:13:19 AM script INFO: SUCCESS!@#KODE 1!@#USER_ID 35!@#ACTIVITY_CODE 3
12/23/2022 07:13:19 AM script INFO: SUCCESS!@#KODE 1!@#USER_ID 35!@#ACTIVITY_CODE 1
12/23/2022 07:13:19 AM script INFO: SUCCESS!@#KODE 1!@#USER_ID 35!@#ACTIVITY_CODE 1
12/23/2022 07:13:19 AM script INFO: SUCCESS!@#KODE 1!@#USER_ID 35!@#ACTIVITY_CODE 1
12/23/2022 07:13:19 AM script INFO: SUCCESS!@#KODE 1!@#USER_ID 35!@#ACTIVITY_CODE 1
12/23/2022 07:13:19 AM script INFO: SUCCESS!@#KODE 1!@#USER_ID 35!@#ACTIVITY_CODE 2
12/23/2022 07:13:19 AM script INFO: SUCCESS!@#KODE 1!@#USER_ID 35!@#ACTIVITY_CODE 3
12/23/2022 07:13:19 AM script INFO: SUCCESS!@#KODE 1!@#USER_ID 35!@#ACTIVITY_CODE 3
12/23/2022 07:13:19 AM script INFO: SUCCESS!@#KODE 1!@#USER_ID 35!@#ACTIVITY_CODE 3
12/23/2022 07:13:19 AM script INFO: SUCCESS!@#KODE 1!@#USER_ID 35!@#ACTIVITY_CODE 3
12/23/2022 07:13:20 AM script INFO: SUCCESS!@#KODE 1!@#USER_ID 35!@#ACTIVITY_CODE 2
12/23/2022 07:13:20 AM script INFO: SUCCESS!@#KODE 1!@#USER_ID 35!@#ACTIVITY_CODE 3
12/23/2022 07:13:20 AM script INFO: SUCCESS!@#KODE 1!@#USER_ID 35!@#ACTIVITY_CODE 5
12/23/2022 07:13:20 AM script INFO: SUCCESS!@#KODE 1!@#USER_ID 35!@#ACTIVITY_CODE 5
12/23/2022 07:13:22 AM script INFO: SUCCESS!@#KODE 1!@#USER_ID 35!@#ACTIVITY_CODE 2
12/23/2022 07:13:22 AM script INFO: SUCCESS!@#KODE 1!@#USER_ID 35!@#ACTIVITY_CODE 3
12/23/2022 07:13:22 AM script INFO: SUCCESS!@#KODE 1!@#USER_ID 35!@#ACTIVITY_CODE 2
12/23/2022 07:13:22 AM script INFO: SUCCESS!@#KODE 1!@#USER_ID 35!@#ACTIVITY_CODE 1
12/23/2022 07:13:23 AM script INFO: SUCCESS!@#KODE 1!@#USER_ID 35!@#ACTIVITY_CODE 1
12/23/2022 07:13:23 AM script INFO: SUCCESS!@#KODE 1!@#USER_ID 35!@#ACTIVITY_CODE 1
12/23/2022 07:13:23 AM script INFO: SUCCESS!@#KODE 1!@#USER_ID 35!@#ACTIVITY_CODE 1
12/23/2022 07:13:23 AM script INFO: SUCCESS!@#KODE 1!@#USER_ID 35!@#ACTIVITY_CODE 4
12/23/2022 07:13:23 AM script INFO: SUCCESS!@#KODE 1!@#USER_ID 35!@#ACTIVITY_CODE 5
12/23/2022 07:13:23 AM script INFO: SUCCESS!@#KODE 1!@#USER_ID 35!@#ACTIVITY_CODE 5
12/23/2022 07:13:25 AM script INFO: SUCCESS!@#KODE 1!@#USER_ID 35!@#ACTIVITY_CODE 5
12/23/2022 07:13:25 AM script INFO: SUCCESS!@#KODE 1!@#USER_ID 35!@#ACTIVITY_CODE 5
12/23/2022 07:13:28 AM script INFO: SUCCESS!@#KODE 1!@#USER_ID 35!@#ACTIVITY_CODE 5
12/23/2022 07:13:28 AM script INFO: SUCCESS!@#KODE 1!@#USER_ID 35!@#ACTIVITY_CODE 5
12/23/2022 07:13:30 AM script INFO: SUCCESS!@#KODE 1!@#USER_ID 35!@#ACTIVITY_CODE 3
12/23/2022 07:13:30 AM script INFO: SUCCESS!@#KODE 1!@#USER_ID 35!@#ACTIVITY_CODE 2
12/23/2022 07:13:30 AM script INFO: SUCCESS!@#KODE 1!@#USER_ID 35!@#ACTIVITY_CODE 5
12/23/2022 07:13:30 AM script INFO: SUCCESS!@#KODE 1!@#USER_ID 35!@#ACTIVITY_CODE 5
12/23/2022 07:13:33 AM script INFO: SUCCESS!@#KODE 1!@#USER_ID 35!@#ACTIVITY_CODE 1
12/23/2022 07:13:33 AM script INFO: SUCCESS!@#KODE 1!@#USER_ID 35!@#ACTIVITY_CODE 5
12/23/2022 07:13:33 AM script INFO: SUCCESS!@#KODE 1!@#USER_ID 35!@#ACTIVITY_CODE 5
12/23/2022 07:13:36 AM script INFO: SUCCESS!@#KODE 1!@#USER_ID 35!@#ACTIVITY_CODE 4
12/23/2022 07:13:36 AM script INFO: SUCCESS!@#KODE 1!@#USER_ID 35!@#ACTIVITY_CODE 2
12/23/2022 07:13:36 AM script INFO: SUCCESS!@#KODE 1!@#USER_ID 35!@#ACTIVITY_CODE 2
12/23/2022 07:13:36 AM script INFO: SUCCESS!@#KODE 1!@#USER_ID 35!@#ACTIVITY_CODE 5
12/23/2022 07:13:36 AM script INFO: SUCCESS!@#KODE 1!@#USER_ID 35!@#ACTIVITY_CODE 5
12/23/2022 07:13:38 AM script INFO: SUCCESS!@#KODE 1!@#USER_ID 35!@#ACTIVITY_CODE 2
12/23/2022 07:13:39 AM script INFO: SUCCESS!@#KODE 1!@#USER_ID 35!@#ACTIVITY_CODE 2
12/23/2022 07:13:39 AM script INFO: SUCCESS!@#KODE 1!@#USER_ID 35!@#ACTIVITY_CODE 5
12/23/2022 07:13:39 AM script INFO: SUCCESS!@#KODE 1!@#USER_ID 35!@#ACTIVITY_CODE 5
12/23/2022 07:13:41 AM script INFO: SUCCESS!@#KODE 1!@#USER_ID 35!@#ACTIVITY_CODE 1
12/23/2022 07:13:41 AM script INFO: SUCCESS!@#KODE 1!@#USER_ID 35!@#ACTIVITY_CODE 1
12/23/2022 07:13:41 AM script INFO: SUCCESS!@#KODE 1!@#USER_ID 35!@#ACTIVITY_CODE 5
12/23/2022 07:13:41 AM script INFO: SUCCESS!@#KODE 1!@#USER_ID 35!@#ACTIVITY_CODE 5
12/23/2022 07:13:44 AM script INFO: SUCCESS!@#KODE 1!@#USER_ID 35!@#ACTIVITY_CODE 1
12/23/2022 07:13:44 AM script INFO: SUCCESS!@#KODE 1!@#USER_ID 35!@#ACTIVITY_CODE 2
12/23/2022 07:13:44 AM script INFO: SUCCESS!@#KODE 1!@#USER_ID 35!@#ACTIVITY_CODE 2
12/23/2022 07:13:44 AM script INFO: SUCCESS!@#KODE 1!@#USER_ID 35!@#ACTIVITY_CODE 3
12/23/2022 07:13:44 AM script INFO: SUCCESS!@#KODE 1!@#USER_ID 35!@#ACTIVITY_CODE 3
12/23/2022 07:13:44 AM script INFO: SUCCESS!@#KODE 1!@#USER_ID 35!@#ACTIVITY_CODE 1
12/23/2022 07:13:44 AM script INFO: SUCCESS!@#KODE 1!@#USER_ID 35!@#ACTIVITY_CODE 4
12/23/2022 07:13:44 AM script INFO: SUCCESS!@#KODE 1!@#USER_ID 35!@#ACTIVITY_CODE 2
12/23/2022 07:13:44 AM script INFO: SUCCESS!@#KODE 1!@#USER_ID 35!@#ACTIVITY_CODE 1
12/23/2022 07:13:44 AM script INFO: SUCCESS!@#KODE 1!@#USER_ID 35!@#ACTIVITY_CODE 3
12/23/2022 07:13:44 AM script INFO: SUCCESS!@#KODE 1!@#USER_ID 35!@#ACTIVITY_CODE 2
12/23/2022 07:13:45 AM script INFO: SUCCESS!@#KODE 1!@#USER_ID 35!@#ACTIVITY_CODE 4
12/23/2022 07:13:45 AM script INFO: SUCCESS!@#KODE 1!@#USER_ID 35!@#ACTIVITY_CODE 1
12/23/2022 07:13:45 AM script INFO: SUCCESS!@#KODE 1!@#USER_ID 35!@#ACTIVITY_CODE 3
12/23/2022 07:13:45 AM script INFO: SUCCESS!@#KODE 1!@#USER_ID 35!@#ACTIVITY_CODE 2
12/23/2022 07:13:45 AM script INFO: SUCCESS!@#KODE 1!@#USER_ID 35!@#ACTIVITY_CODE 2
12/23/2022 07:13:45 AM script INFO: SUCCESS!@#KODE 1!@#USER_ID 35!@#ACTIVITY_CODE 1
12/23/2022 07:13:45 AM script INFO: SUCCESS!@#KODE 1!@#USER_ID 35!@#ACTIVITY_CODE 1
12/23/2022 07:13:45 AM script INFO: SUCCESS!@#KODE 1!@#USER_ID 35!@#ACTIVITY_CODE 3
12/23/2022 07:13:45 AM script INFO: SUCCESS!@#KODE 1!@#USER_ID 35!@#ACTIVITY_CODE 3
12/23/2022 07:13:45 AM script INFO: SUCCESS!@#KODE 1!@#USER_ID 35!@#ACTIVITY_CODE 2
12/23/2022 07:13:45 AM script INFO: SUCCESS!@#KODE 1!@#USER_ID 35!@#ACTIVITY_CODE 3
12/23/2022 07:13:45 AM script INFO: SUCCESS!@#KODE 1!@#USER_ID 35!@#ACTIVITY_CODE 4
12/23/2022 07:13:45 AM script INFO: SUCCESS!@#KODE 1!@#USER_ID 35!@#ACTIVITY_CODE 2
12/23/2022 07:13:45 AM script INFO: SUCCESS!@#KODE 1!@#USER_ID 35!@#ACTIVITY_CODE 3
12/23/2022 07:13:46 AM script INFO: SUCCESS!@#KODE 1!@#USER_ID 35!@#ACTIVITY_CODE 2
12/23/2022 07:13:46 AM script INFO: SUCCESS!@#KODE 1!@#USER_ID 35!@#ACTIVITY_CODE 3
12/23/2022 07:13:46 AM script INFO: SUCCESS!@#KODE 1!@#USER_ID 35!@#ACTIVITY_CODE 2
12/23/2022 07:13:46 AM script INFO: SUCCESS!@#KODE 1!@#USER_ID 35!@#ACTIVITY_CODE 3
12/23/2022 07:13:46 AM script INFO: SUCCESS!@#KODE 1!@#USER_ID 35!@#ACTIVITY_CODE 2
12/23/2022 07:13:46 AM script INFO: SUCCESS!@#KODE 1!@#USER_ID 35!@#ACTIVITY_CODE 2
12/23/2022 07:13:46 AM script INFO: SUCCESS!@#KODE 1!@#USER_ID 35!@#ACTIVITY_CODE 3
12/23/2022 07:13:46 AM script INFO: Duration: 33.153260231018066
12/23/2022 07:13:46 AM script INFO: mengakhiri-quiz
12/23/2022 07:13:47 AM script INFO: SUCCESS!@#KODE 1!@#USER_ID 35!@#ACTIVITY_CODE 5
12/23/2022 07:13:47 AM script INFO: berhasil-submit
