12/21/2022 02:49:19 PM script INFO: Prepared chrome options..
12/21/2022 02:49:20 PM script INFO: Initialized chrome browser..
12/21/2022 02:49:20 PM script INFO: mengakses-homepage
12/21/2022 02:49:51 PM script INFO: mengakses-login-page
12/21/2022 02:49:52 PM script INFO: mengakses-site-home
12/21/2022 02:49:53 PM script INFO: mengakses-site-course
12/21/2022 02:49:53 PM script INFO: mengakses-quiz
12/21/2022 02:49:54 PM script INFO: mengakses-start-quiz-page
12/21/2022 02:49:55 PM script INFO: memulai-quiz
12/21/2022 02:49:55 PM script INFO: SUCCESS!@#KODE 1!@#USER_ID 89!@#ACTIVITY_CODE 5
12/21/2022 02:50:06 PM script INFO: SUCCESS!@#KODE 1!@#USER_ID 89!@#ACTIVITY_CODE 3
12/21/2022 02:50:06 PM script INFO: SUCCESS!@#KODE 1!@#USER_ID 89!@#ACTIVITY_CODE 1
12/21/2022 02:50:06 PM script INFO: SUCCESS!@#KODE 1!@#USER_ID 89!@#ACTIVITY_CODE 4
12/21/2022 02:50:06 PM script INFO: SUCCESS!@#KODE 1!@#USER_ID 89!@#ACTIVITY_CODE 2
12/21/2022 02:50:06 PM script INFO: SUCCESS!@#KODE 1!@#USER_ID 89!@#ACTIVITY_CODE 3
12/21/2022 02:50:06 PM script INFO: SUCCESS!@#KODE 1!@#USER_ID 89!@#ACTIVITY_CODE 3
12/21/2022 02:50:06 PM script INFO: SUCCESS!@#KODE 1!@#USER_ID 89!@#ACTIVITY_CODE 2
12/21/2022 02:50:07 PM script INFO: SUCCESS!@#KODE 1!@#USER_ID 89!@#ACTIVITY_CODE 1
12/21/2022 02:50:07 PM script INFO: SUCCESS!@#KODE 1!@#USER_ID 89!@#ACTIVITY_CODE 2
12/21/2022 02:50:07 PM script INFO: SUCCESS!@#KODE 1!@#USER_ID 89!@#ACTIVITY_CODE 2
12/21/2022 02:50:07 PM script INFO: SUCCESS!@#KODE 1!@#USER_ID 89!@#ACTIVITY_CODE 5
12/21/2022 02:50:07 PM script INFO: SUCCESS!@#KODE 1!@#USER_ID 89!@#ACTIVITY_CODE 5
12/21/2022 02:50:09 PM script INFO: SUCCESS!@#KODE 1!@#USER_ID 89!@#ACTIVITY_CODE 3
12/21/2022 02:50:10 PM script INFO: SUCCESS!@#KODE 1!@#USER_ID 89!@#ACTIVITY_CODE 4
12/21/2022 02:50:10 PM script INFO: SUCCESS!@#KODE 1!@#USER_ID 89!@#ACTIVITY_CODE 1
12/21/2022 02:50:10 PM script INFO: SUCCESS!@#KODE 1!@#USER_ID 89!@#ACTIVITY_CODE 3
12/21/2022 02:50:10 PM script INFO: SUCCESS!@#KODE 1!@#USER_ID 89!@#ACTIVITY_CODE 4
12/21/2022 02:50:10 PM script INFO: SUCCESS!@#KODE 1!@#USER_ID 89!@#ACTIVITY_CODE 5
12/21/2022 02:50:10 PM script INFO: SUCCESS!@#KODE 1!@#USER_ID 89!@#ACTIVITY_CODE 5
12/21/2022 02:50:12 PM script INFO: SUCCESS!@#KODE 1!@#USER_ID 89!@#ACTIVITY_CODE 5
12/21/2022 02:50:12 PM script INFO: SUCCESS!@#KODE 1!@#USER_ID 89!@#ACTIVITY_CODE 5
12/21/2022 02:50:15 PM script INFO: SUCCESS!@#KODE 1!@#USER_ID 89!@#ACTIVITY_CODE 2
12/21/2022 02:50:15 PM script INFO: SUCCESS!@#KODE 1!@#USER_ID 89!@#ACTIVITY_CODE 3
12/21/2022 02:50:15 PM script INFO: SUCCESS!@#KODE 1!@#USER_ID 89!@#ACTIVITY_CODE 2
12/21/2022 02:50:15 PM script INFO: SUCCESS!@#KODE 1!@#USER_ID 89!@#ACTIVITY_CODE 5
12/21/2022 02:50:15 PM script INFO: SUCCESS!@#KODE 1!@#USER_ID 89!@#ACTIVITY_CODE 5
12/21/2022 02:50:18 PM script INFO: SUCCESS!@#KODE 1!@#USER_ID 89!@#ACTIVITY_CODE 5
12/21/2022 02:50:18 PM script INFO: SUCCESS!@#KODE 1!@#USER_ID 89!@#ACTIVITY_CODE 5
12/21/2022 02:50:20 PM script INFO: SUCCESS!@#KODE 1!@#USER_ID 89!@#ACTIVITY_CODE 1
12/21/2022 02:50:20 PM script INFO: SUCCESS!@#KODE 1!@#USER_ID 89!@#ACTIVITY_CODE 4
12/21/2022 02:50:20 PM script INFO: SUCCESS!@#KODE 1!@#USER_ID 89!@#ACTIVITY_CODE 1
12/21/2022 02:50:20 PM script INFO: SUCCESS!@#KODE 1!@#USER_ID 89!@#ACTIVITY_CODE 3
12/21/2022 02:50:20 PM script INFO: SUCCESS!@#KODE 1!@#USER_ID 89!@#ACTIVITY_CODE 2
12/21/2022 02:50:20 PM script INFO: SUCCESS!@#KODE 1!@#USER_ID 89!@#ACTIVITY_CODE 1
12/21/2022 02:50:20 PM script INFO: SUCCESS!@#KODE 1!@#USER_ID 89!@#ACTIVITY_CODE 3
12/21/2022 02:50:21 PM script INFO: SUCCESS!@#KODE 1!@#USER_ID 89!@#ACTIVITY_CODE 2
12/21/2022 02:50:21 PM script INFO: SUCCESS!@#KODE 1!@#USER_ID 89!@#ACTIVITY_CODE 1
12/21/2022 02:50:21 PM script INFO: SUCCESS!@#KODE 1!@#USER_ID 89!@#ACTIVITY_CODE 3
12/21/2022 02:50:21 PM script INFO: SUCCESS!@#KODE 1!@#USER_ID 89!@#ACTIVITY_CODE 3
12/21/2022 02:50:21 PM script INFO: SUCCESS!@#KODE 1!@#USER_ID 89!@#ACTIVITY_CODE 2
12/21/2022 02:50:21 PM script INFO: SUCCESS!@#KODE 1!@#USER_ID 89!@#ACTIVITY_CODE 1
12/21/2022 02:50:21 PM script INFO: SUCCESS!@#KODE 1!@#USER_ID 89!@#ACTIVITY_CODE 4
12/21/2022 02:50:21 PM script INFO: SUCCESS!@#KODE 1!@#USER_ID 89!@#ACTIVITY_CODE 1
12/21/2022 02:50:21 PM script INFO: SUCCESS!@#KODE 1!@#USER_ID 89!@#ACTIVITY_CODE 1
12/21/2022 02:50:21 PM script INFO: SUCCESS!@#KODE 1!@#USER_ID 89!@#ACTIVITY_CODE 5
12/21/2022 02:50:21 PM script INFO: SUCCESS!@#KODE 1!@#USER_ID 89!@#ACTIVITY_CODE 5
12/21/2022 02:50:24 PM script INFO: SUCCESS!@#KODE 1!@#USER_ID 89!@#ACTIVITY_CODE 1
12/21/2022 02:50:24 PM script INFO: SUCCESS!@#KODE 1!@#USER_ID 89!@#ACTIVITY_CODE 1
12/21/2022 02:50:24 PM script INFO: SUCCESS!@#KODE 1!@#USER_ID 89!@#ACTIVITY_CODE 5
12/21/2022 02:50:24 PM script INFO: SUCCESS!@#KODE 1!@#USER_ID 89!@#ACTIVITY_CODE 5
12/21/2022 02:50:26 PM script INFO: SUCCESS!@#KODE 1!@#USER_ID 89!@#ACTIVITY_CODE 5
12/21/2022 02:50:26 PM script INFO: SUCCESS!@#KODE 1!@#USER_ID 89!@#ACTIVITY_CODE 5
12/21/2022 02:50:29 PM script INFO: SUCCESS!@#KODE 1!@#USER_ID 89!@#ACTIVITY_CODE 1
12/21/2022 02:50:29 PM script INFO: SUCCESS!@#KODE 1!@#USER_ID 89!@#ACTIVITY_CODE 5
12/21/2022 02:50:29 PM script INFO: SUCCESS!@#KODE 1!@#USER_ID 89!@#ACTIVITY_CODE 5
12/21/2022 02:50:31 PM script INFO: SUCCESS!@#KODE 1!@#USER_ID 89!@#ACTIVITY_CODE 4
12/21/2022 02:50:31 PM script INFO: SUCCESS!@#KODE 1!@#USER_ID 89!@#ACTIVITY_CODE 5
12/21/2022 02:50:31 PM script INFO: SUCCESS!@#KODE 1!@#USER_ID 89!@#ACTIVITY_CODE 5
12/21/2022 02:50:34 PM script INFO: SUCCESS!@#KODE 1!@#USER_ID 89!@#ACTIVITY_CODE 3
12/21/2022 02:50:34 PM script INFO: SUCCESS!@#KODE 1!@#USER_ID 89!@#ACTIVITY_CODE 1
12/21/2022 02:50:34 PM script INFO: SUCCESS!@#KODE 1!@#USER_ID 89!@#ACTIVITY_CODE 5
12/21/2022 02:50:34 PM script INFO: SUCCESS!@#KODE 1!@#USER_ID 89!@#ACTIVITY_CODE 5
12/21/2022 02:50:37 PM script INFO: SUCCESS!@#KODE 1!@#USER_ID 89!@#ACTIVITY_CODE 3
12/21/2022 02:50:37 PM script INFO: SUCCESS!@#KODE 1!@#USER_ID 89!@#ACTIVITY_CODE 4
12/21/2022 02:50:37 PM script INFO: SUCCESS!@#KODE 1!@#USER_ID 89!@#ACTIVITY_CODE 3
12/21/2022 02:50:37 PM script INFO: SUCCESS!@#KODE 1!@#USER_ID 89!@#ACTIVITY_CODE 2
12/21/2022 02:50:37 PM script INFO: SUCCESS!@#KODE 1!@#USER_ID 89!@#ACTIVITY_CODE 3
12/21/2022 02:50:37 PM script INFO: SUCCESS!@#KODE 1!@#USER_ID 89!@#ACTIVITY_CODE 1
12/21/2022 02:50:37 PM script INFO: SUCCESS!@#KODE 1!@#USER_ID 89!@#ACTIVITY_CODE 3
12/21/2022 02:50:37 PM script INFO: SUCCESS!@#KODE 1!@#USER_ID 89!@#ACTIVITY_CODE 3
12/21/2022 02:50:37 PM script INFO: SUCCESS!@#KODE 1!@#USER_ID 89!@#ACTIVITY_CODE 5
12/21/2022 02:50:37 PM script INFO: SUCCESS!@#KODE 1!@#USER_ID 89!@#ACTIVITY_CODE 5
12/21/2022 02:50:40 PM script INFO: SUCCESS!@#KODE 1!@#USER_ID 89!@#ACTIVITY_CODE 2
12/21/2022 02:50:40 PM script INFO: SUCCESS!@#KODE 1!@#USER_ID 89!@#ACTIVITY_CODE 1
12/21/2022 02:50:40 PM script INFO: SUCCESS!@#KODE 1!@#USER_ID 89!@#ACTIVITY_CODE 1
12/21/2022 02:50:40 PM script INFO: SUCCESS!@#KODE 1!@#USER_ID 89!@#ACTIVITY_CODE 3
12/21/2022 02:50:40 PM script INFO: SUCCESS!@#KODE 1!@#USER_ID 89!@#ACTIVITY_CODE 2
12/21/2022 02:50:40 PM script INFO: SUCCESS!@#KODE 1!@#USER_ID 89!@#ACTIVITY_CODE 5
12/21/2022 02:50:40 PM script INFO: SUCCESS!@#KODE 1!@#USER_ID 89!@#ACTIVITY_CODE 5
12/21/2022 02:50:43 PM script INFO: SUCCESS!@#KODE 1!@#USER_ID 89!@#ACTIVITY_CODE 5
12/21/2022 02:50:43 PM script INFO: SUCCESS!@#KODE 1!@#USER_ID 89!@#ACTIVITY_CODE 5
12/21/2022 02:50:45 PM script INFO: SUCCESS!@#KODE 1!@#USER_ID 89!@#ACTIVITY_CODE 3
12/21/2022 02:50:45 PM script INFO: SUCCESS!@#KODE 1!@#USER_ID 89!@#ACTIVITY_CODE 5
12/21/2022 02:50:45 PM script INFO: SUCCESS!@#KODE 1!@#USER_ID 89!@#ACTIVITY_CODE 5
12/21/2022 02:50:48 PM script INFO: SUCCESS!@#KODE 1!@#USER_ID 89!@#ACTIVITY_CODE 2
12/21/2022 02:50:48 PM script INFO: SUCCESS!@#KODE 1!@#USER_ID 89!@#ACTIVITY_CODE 2
12/21/2022 02:50:48 PM script INFO: SUCCESS!@#KODE 1!@#USER_ID 89!@#ACTIVITY_CODE 5
12/21/2022 02:50:48 PM script INFO: SUCCESS!@#KODE 1!@#USER_ID 89!@#ACTIVITY_CODE 5
12/21/2022 02:50:51 PM script INFO: SUCCESS!@#KODE 1!@#USER_ID 89!@#ACTIVITY_CODE 5
12/21/2022 02:50:51 PM script INFO: SUCCESS!@#KODE 1!@#USER_ID 89!@#ACTIVITY_CODE 5
12/21/2022 02:50:53 PM script INFO: SUCCESS!@#KODE 1!@#USER_ID 89!@#ACTIVITY_CODE 3
12/21/2022 02:50:53 PM script INFO: SUCCESS!@#KODE 1!@#USER_ID 89!@#ACTIVITY_CODE 3
12/21/2022 02:50:53 PM script INFO: SUCCESS!@#KODE 1!@#USER_ID 89!@#ACTIVITY_CODE 5
12/21/2022 02:50:53 PM script INFO: SUCCESS!@#KODE 1!@#USER_ID 89!@#ACTIVITY_CODE 5
12/21/2022 02:50:56 PM script INFO: SUCCESS!@#KODE 1!@#USER_ID 89!@#ACTIVITY_CODE 1
12/21/2022 02:50:56 PM script INFO: SUCCESS!@#KODE 1!@#USER_ID 89!@#ACTIVITY_CODE 2
12/21/2022 02:50:56 PM script INFO: SUCCESS!@#KODE 1!@#USER_ID 89!@#ACTIVITY_CODE 3
12/21/2022 02:50:56 PM script INFO: SUCCESS!@#KODE 1!@#USER_ID 89!@#ACTIVITY_CODE 5
12/21/2022 02:50:56 PM script INFO: SUCCESS!@#KODE 1!@#USER_ID 89!@#ACTIVITY_CODE 5
12/21/2022 02:50:59 PM script INFO: SUCCESS!@#KODE 1!@#USER_ID 89!@#ACTIVITY_CODE 2
12/21/2022 02:50:59 PM script INFO: SUCCESS!@#KODE 1!@#USER_ID 89!@#ACTIVITY_CODE 3
12/21/2022 02:50:59 PM script INFO: SUCCESS!@#KODE 1!@#USER_ID 89!@#ACTIVITY_CODE 2
12/21/2022 02:50:59 PM script INFO: SUCCESS!@#KODE 1!@#USER_ID 89!@#ACTIVITY_CODE 5
12/21/2022 02:50:59 PM script INFO: SUCCESS!@#KODE 1!@#USER_ID 89!@#ACTIVITY_CODE 5
12/21/2022 02:51:02 PM script INFO: SUCCESS!@#KODE 1!@#USER_ID 89!@#ACTIVITY_CODE 1
12/21/2022 02:51:02 PM script INFO: SUCCESS!@#KODE 1!@#USER_ID 89!@#ACTIVITY_CODE 2
12/21/2022 02:51:02 PM script INFO: SUCCESS!@#KODE 1!@#USER_ID 89!@#ACTIVITY_CODE 3
12/21/2022 02:51:02 PM script INFO: SUCCESS!@#KODE 1!@#USER_ID 89!@#ACTIVITY_CODE 1
12/21/2022 02:51:02 PM script INFO: SUCCESS!@#KODE 1!@#USER_ID 89!@#ACTIVITY_CODE 5
12/21/2022 02:51:02 PM script INFO: SUCCESS!@#KODE 1!@#USER_ID 89!@#ACTIVITY_CODE 5
12/21/2022 02:51:05 PM script INFO: SUCCESS!@#KODE 1!@#USER_ID 89!@#ACTIVITY_CODE 4
12/21/2022 02:51:05 PM script INFO: SUCCESS!@#KODE 1!@#USER_ID 89!@#ACTIVITY_CODE 1
12/21/2022 02:51:05 PM script INFO: SUCCESS!@#KODE 1!@#USER_ID 89!@#ACTIVITY_CODE 3
12/21/2022 02:51:05 PM script INFO: SUCCESS!@#KODE 1!@#USER_ID 89!@#ACTIVITY_CODE 1
12/21/2022 02:51:05 PM script INFO: SUCCESS!@#KODE 1!@#USER_ID 89!@#ACTIVITY_CODE 1
12/21/2022 02:51:05 PM script INFO: SUCCESS!@#KODE 1!@#USER_ID 89!@#ACTIVITY_CODE 4
12/21/2022 02:51:05 PM script INFO: SUCCESS!@#KODE 1!@#USER_ID 89!@#ACTIVITY_CODE 2
12/21/2022 02:51:05 PM script INFO: SUCCESS!@#KODE 1!@#USER_ID 89!@#ACTIVITY_CODE 3
12/21/2022 02:51:06 PM script INFO: SUCCESS!@#KODE 1!@#USER_ID 89!@#ACTIVITY_CODE 2
12/21/2022 02:51:06 PM script INFO: SUCCESS!@#KODE 1!@#USER_ID 89!@#ACTIVITY_CODE 3
12/21/2022 02:51:06 PM script INFO: SUCCESS!@#KODE 1!@#USER_ID 89!@#ACTIVITY_CODE 2
12/21/2022 02:51:06 PM script INFO: SUCCESS!@#KODE 1!@#USER_ID 89!@#ACTIVITY_CODE 2
12/21/2022 02:51:06 PM script INFO: SUCCESS!@#KODE 1!@#USER_ID 89!@#ACTIVITY_CODE 3
12/21/2022 02:51:07 PM script INFO: SUCCESS!@#KODE 1!@#USER_ID 89!@#ACTIVITY_CODE 2
12/21/2022 02:51:07 PM script INFO: SUCCESS!@#KODE 1!@#USER_ID 89!@#ACTIVITY_CODE 4
12/21/2022 02:51:07 PM script INFO: SUCCESS!@#KODE 1!@#USER_ID 89!@#ACTIVITY_CODE 2
12/21/2022 02:51:07 PM script INFO: SUCCESS!@#KODE 1!@#USER_ID 89!@#ACTIVITY_CODE 4
12/21/2022 02:51:08 PM script INFO: SUCCESS!@#KODE 1!@#USER_ID 89!@#ACTIVITY_CODE 2
12/21/2022 02:51:08 PM script INFO: SUCCESS!@#KODE 1!@#USER_ID 89!@#ACTIVITY_CODE 1
12/21/2022 02:51:08 PM script INFO: SUCCESS!@#KODE 1!@#USER_ID 89!@#ACTIVITY_CODE 1
12/21/2022 02:51:08 PM script INFO: SUCCESS!@#KODE 1!@#USER_ID 89!@#ACTIVITY_CODE 4
12/21/2022 02:51:08 PM script INFO: SUCCESS!@#KODE 1!@#USER_ID 89!@#ACTIVITY_CODE 2
12/21/2022 02:51:08 PM script INFO: SUCCESS!@#KODE 1!@#USER_ID 89!@#ACTIVITY_CODE 2
12/21/2022 02:51:09 PM script INFO: SUCCESS!@#KODE 1!@#USER_ID 89!@#ACTIVITY_CODE 3
12/21/2022 02:51:09 PM script INFO: SUCCESS!@#KODE 1!@#USER_ID 89!@#ACTIVITY_CODE 2
12/21/2022 02:51:09 PM script INFO: SUCCESS!@#KODE 1!@#USER_ID 89!@#ACTIVITY_CODE 2
12/21/2022 02:51:09 PM script INFO: SUCCESS!@#KODE 1!@#USER_ID 89!@#ACTIVITY_CODE 3
12/21/2022 02:51:09 PM script INFO: SUCCESS!@#KODE 1!@#USER_ID 89!@#ACTIVITY_CODE 2
12/21/2022 02:51:10 PM script INFO: SUCCESS!@#KODE 1!@#USER_ID 89!@#ACTIVITY_CODE 2
12/21/2022 02:51:10 PM script INFO: SUCCESS!@#KODE 1!@#USER_ID 89!@#ACTIVITY_CODE 3
12/21/2022 02:51:10 PM script INFO: SUCCESS!@#KODE 1!@#USER_ID 89!@#ACTIVITY_CODE 1
12/21/2022 02:51:10 PM script INFO: SUCCESS!@#KODE 1!@#USER_ID 89!@#ACTIVITY_CODE 1
12/21/2022 02:51:10 PM script INFO: SUCCESS!@#KODE 1!@#USER_ID 89!@#ACTIVITY_CODE 4
12/21/2022 02:51:10 PM script INFO: SUCCESS!@#KODE 1!@#USER_ID 89!@#ACTIVITY_CODE 2
12/21/2022 02:51:11 PM script INFO: SUCCESS!@#KODE 1!@#USER_ID 89!@#ACTIVITY_CODE 2
12/21/2022 02:51:11 PM script INFO: SUCCESS!@#KODE 1!@#USER_ID 89!@#ACTIVITY_CODE 1
12/21/2022 02:51:11 PM script INFO: SUCCESS!@#KODE 1!@#USER_ID 89!@#ACTIVITY_CODE 2
12/21/2022 02:51:11 PM script INFO: SUCCESS!@#KODE 1!@#USER_ID 89!@#ACTIVITY_CODE 1
12/21/2022 02:51:11 PM script INFO: SUCCESS!@#KODE 1!@#USER_ID 89!@#ACTIVITY_CODE 1
12/21/2022 02:51:11 PM script INFO: SUCCESS!@#KODE 1!@#USER_ID 89!@#ACTIVITY_CODE 4
12/21/2022 02:51:12 PM script INFO: SUCCESS!@#KODE 1!@#USER_ID 89!@#ACTIVITY_CODE 3
12/21/2022 02:51:12 PM script INFO: SUCCESS!@#KODE 1!@#USER_ID 89!@#ACTIVITY_CODE 2
12/21/2022 02:51:12 PM script INFO: SUCCESS!@#KODE 1!@#USER_ID 89!@#ACTIVITY_CODE 1
12/21/2022 02:51:12 PM script INFO: SUCCESS!@#KODE 1!@#USER_ID 89!@#ACTIVITY_CODE 3
12/21/2022 02:51:12 PM script INFO: SUCCESS!@#KODE 1!@#USER_ID 89!@#ACTIVITY_CODE 1
12/21/2022 02:51:12 PM script INFO: SUCCESS!@#KODE 1!@#USER_ID 89!@#ACTIVITY_CODE 1
12/21/2022 02:51:12 PM script INFO: SUCCESS!@#KODE 1!@#USER_ID 89!@#ACTIVITY_CODE 4
12/21/2022 02:51:12 PM script INFO: SUCCESS!@#KODE 1!@#USER_ID 89!@#ACTIVITY_CODE 2
12/21/2022 02:51:13 PM script INFO: SUCCESS!@#KODE 1!@#USER_ID 89!@#ACTIVITY_CODE 3
12/21/2022 02:51:13 PM script INFO: SUCCESS!@#KODE 1!@#USER_ID 89!@#ACTIVITY_CODE 3
12/21/2022 02:51:13 PM script INFO: SUCCESS!@#KODE 1!@#USER_ID 89!@#ACTIVITY_CODE 1
12/21/2022 02:51:13 PM script INFO: SUCCESS!@#KODE 1!@#USER_ID 89!@#ACTIVITY_CODE 2
12/21/2022 02:51:13 PM script INFO: SUCCESS!@#KODE 1!@#USER_ID 89!@#ACTIVITY_CODE 1
12/21/2022 02:51:13 PM script INFO: SUCCESS!@#KODE 1!@#USER_ID 89!@#ACTIVITY_CODE 2
12/21/2022 02:51:14 PM script INFO: SUCCESS!@#KODE 1!@#USER_ID 89!@#ACTIVITY_CODE 3
12/21/2022 02:51:14 PM script INFO: SUCCESS!@#KODE 1!@#USER_ID 89!@#ACTIVITY_CODE 4
12/21/2022 02:51:14 PM script INFO: SUCCESS!@#KODE 1!@#USER_ID 89!@#ACTIVITY_CODE 2
12/21/2022 02:51:14 PM script INFO: SUCCESS!@#KODE 1!@#USER_ID 89!@#ACTIVITY_CODE 2
12/21/2022 02:51:14 PM script INFO: SUCCESS!@#KODE 1!@#USER_ID 89!@#ACTIVITY_CODE 3
12/21/2022 02:51:14 PM script INFO: SUCCESS!@#KODE 1!@#USER_ID 89!@#ACTIVITY_CODE 1
12/21/2022 02:51:15 PM script INFO: SUCCESS!@#KODE 1!@#USER_ID 89!@#ACTIVITY_CODE 3
12/21/2022 02:51:15 PM script INFO: SUCCESS!@#KODE 1!@#USER_ID 89!@#ACTIVITY_CODE 1
12/21/2022 02:51:15 PM script INFO: SUCCESS!@#KODE 1!@#USER_ID 89!@#ACTIVITY_CODE 2
12/21/2022 02:51:15 PM script INFO: SUCCESS!@#KODE 1!@#USER_ID 89!@#ACTIVITY_CODE 3
12/21/2022 02:51:15 PM script INFO: SUCCESS!@#KODE 1!@#USER_ID 89!@#ACTIVITY_CODE 2
12/21/2022 02:51:16 PM script INFO: SUCCESS!@#KODE 1!@#USER_ID 89!@#ACTIVITY_CODE 2
12/21/2022 02:51:16 PM script INFO: SUCCESS!@#KODE 1!@#USER_ID 89!@#ACTIVITY_CODE 2
12/21/2022 02:51:16 PM script INFO: SUCCESS!@#KODE 1!@#USER_ID 89!@#ACTIVITY_CODE 2
12/21/2022 02:51:16 PM script INFO: SUCCESS!@#KODE 1!@#USER_ID 89!@#ACTIVITY_CODE 4
12/21/2022 02:51:16 PM script INFO: SUCCESS!@#KODE 1!@#USER_ID 89!@#ACTIVITY_CODE 3
12/21/2022 02:51:16 PM script INFO: SUCCESS!@#KODE 1!@#USER_ID 89!@#ACTIVITY_CODE 1
12/21/2022 02:51:17 PM script INFO: SUCCESS!@#KODE 1!@#USER_ID 89!@#ACTIVITY_CODE 3
12/21/2022 02:51:17 PM script INFO: SUCCESS!@#KODE 1!@#USER_ID 89!@#ACTIVITY_CODE 4
12/21/2022 02:51:17 PM script INFO: SUCCESS!@#KODE 1!@#USER_ID 89!@#ACTIVITY_CODE 1
12/21/2022 02:51:17 PM script INFO: SUCCESS!@#KODE 1!@#USER_ID 89!@#ACTIVITY_CODE 3
12/21/2022 02:51:17 PM script INFO: SUCCESS!@#KODE 1!@#USER_ID 89!@#ACTIVITY_CODE 1
12/21/2022 02:51:17 PM script INFO: SUCCESS!@#KODE 1!@#USER_ID 89!@#ACTIVITY_CODE 2
12/21/2022 02:51:17 PM script INFO: SUCCESS!@#KODE 1!@#USER_ID 89!@#ACTIVITY_CODE 3
12/21/2022 02:51:17 PM script INFO: SUCCESS!@#KODE 1!@#USER_ID 89!@#ACTIVITY_CODE 1
12/21/2022 02:51:18 PM script INFO: SUCCESS!@#KODE 1!@#USER_ID 89!@#ACTIVITY_CODE 1
12/21/2022 02:51:18 PM script INFO: SUCCESS!@#KODE 1!@#USER_ID 89!@#ACTIVITY_CODE 2
12/21/2022 02:51:18 PM script INFO: SUCCESS!@#KODE 1!@#USER_ID 89!@#ACTIVITY_CODE 2
12/21/2022 02:51:18 PM script INFO: SUCCESS!@#KODE 1!@#USER_ID 89!@#ACTIVITY_CODE 2
12/21/2022 02:51:19 PM script INFO: SUCCESS!@#KODE 1!@#USER_ID 89!@#ACTIVITY_CODE 2
12/21/2022 02:51:19 PM script INFO: SUCCESS!@#KODE 1!@#USER_ID 89!@#ACTIVITY_CODE 1
12/21/2022 02:51:19 PM script INFO: SUCCESS!@#KODE 1!@#USER_ID 89!@#ACTIVITY_CODE 4
12/21/2022 02:51:19 PM script INFO: SUCCESS!@#KODE 1!@#USER_ID 89!@#ACTIVITY_CODE 3
12/21/2022 02:51:19 PM script INFO: SUCCESS!@#KODE 1!@#USER_ID 89!@#ACTIVITY_CODE 2
12/21/2022 02:51:19 PM script INFO: SUCCESS!@#KODE 1!@#USER_ID 89!@#ACTIVITY_CODE 3
12/21/2022 02:51:19 PM script INFO: SUCCESS!@#KODE 1!@#USER_ID 89!@#ACTIVITY_CODE 3
12/21/2022 02:51:20 PM script INFO: SUCCESS!@#KODE 1!@#USER_ID 89!@#ACTIVITY_CODE 3
12/21/2022 02:51:20 PM script INFO: SUCCESS!@#KODE 1!@#USER_ID 89!@#ACTIVITY_CODE 3
12/21/2022 02:51:20 PM script INFO: SUCCESS!@#KODE 1!@#USER_ID 89!@#ACTIVITY_CODE 1
12/21/2022 02:51:20 PM script INFO: SUCCESS!@#KODE 1!@#USER_ID 89!@#ACTIVITY_CODE 1
12/21/2022 02:51:20 PM script INFO: SUCCESS!@#KODE 1!@#USER_ID 89!@#ACTIVITY_CODE 1
12/21/2022 02:51:20 PM script INFO: SUCCESS!@#KODE 1!@#USER_ID 89!@#ACTIVITY_CODE 2
12/21/2022 02:51:20 PM script INFO: SUCCESS!@#KODE 1!@#USER_ID 89!@#ACTIVITY_CODE 3
12/21/2022 02:51:21 PM script INFO: SUCCESS!@#KODE 1!@#USER_ID 89!@#ACTIVITY_CODE 2
12/21/2022 02:51:21 PM script INFO: SUCCESS!@#KODE 1!@#USER_ID 89!@#ACTIVITY_CODE 3
12/21/2022 02:51:21 PM script INFO: SUCCESS!@#KODE 1!@#USER_ID 89!@#ACTIVITY_CODE 4
12/21/2022 02:51:21 PM script INFO: SUCCESS!@#KODE 1!@#USER_ID 89!@#ACTIVITY_CODE 2
12/21/2022 02:51:21 PM script INFO: SUCCESS!@#KODE 1!@#USER_ID 89!@#ACTIVITY_CODE 2
12/21/2022 02:51:22 PM script INFO: SUCCESS!@#KODE 1!@#USER_ID 89!@#ACTIVITY_CODE 3
12/21/2022 02:51:22 PM script INFO: SUCCESS!@#KODE 1!@#USER_ID 89!@#ACTIVITY_CODE 1
12/21/2022 02:51:22 PM script INFO: SUCCESS!@#KODE 1!@#USER_ID 89!@#ACTIVITY_CODE 1
12/21/2022 02:51:22 PM script INFO: SUCCESS!@#KODE 1!@#USER_ID 89!@#ACTIVITY_CODE 3
12/21/2022 02:51:22 PM script INFO: SUCCESS!@#KODE 1!@#USER_ID 89!@#ACTIVITY_CODE 4
12/21/2022 02:51:22 PM script INFO: SUCCESS!@#KODE 1!@#USER_ID 89!@#ACTIVITY_CODE 2
12/21/2022 02:51:22 PM script INFO: SUCCESS!@#KODE 1!@#USER_ID 89!@#ACTIVITY_CODE 1
12/21/2022 02:51:23 PM script INFO: SUCCESS!@#KODE 1!@#USER_ID 89!@#ACTIVITY_CODE 1
12/21/2022 02:51:23 PM script INFO: SUCCESS!@#KODE 1!@#USER_ID 89!@#ACTIVITY_CODE 1
12/21/2022 02:51:23 PM script INFO: SUCCESS!@#KODE 1!@#USER_ID 89!@#ACTIVITY_CODE 4
12/21/2022 02:51:23 PM script INFO: SUCCESS!@#KODE 1!@#USER_ID 89!@#ACTIVITY_CODE 2
12/21/2022 02:51:23 PM script INFO: SUCCESS!@#KODE 1!@#USER_ID 89!@#ACTIVITY_CODE 3
12/21/2022 02:51:23 PM script INFO: SUCCESS!@#KODE 1!@#USER_ID 89!@#ACTIVITY_CODE 3
12/21/2022 02:51:24 PM script INFO: SUCCESS!@#KODE 1!@#USER_ID 89!@#ACTIVITY_CODE 2
12/21/2022 02:51:24 PM script INFO: SUCCESS!@#KODE 1!@#USER_ID 89!@#ACTIVITY_CODE 1
12/21/2022 02:51:24 PM script INFO: SUCCESS!@#KODE 1!@#USER_ID 89!@#ACTIVITY_CODE 3
12/21/2022 02:51:24 PM script INFO: SUCCESS!@#KODE 1!@#USER_ID 89!@#ACTIVITY_CODE 2
12/21/2022 02:51:24 PM script INFO: SUCCESS!@#KODE 1!@#USER_ID 89!@#ACTIVITY_CODE 1
12/21/2022 02:51:24 PM script INFO: SUCCESS!@#KODE 1!@#USER_ID 89!@#ACTIVITY_CODE 4
12/21/2022 02:51:24 PM script INFO: SUCCESS!@#KODE 1!@#USER_ID 89!@#ACTIVITY_CODE 3
12/21/2022 02:51:24 PM script INFO: SUCCESS!@#KODE 1!@#USER_ID 89!@#ACTIVITY_CODE 3
12/21/2022 02:51:25 PM script INFO: SUCCESS!@#KODE 1!@#USER_ID 89!@#ACTIVITY_CODE 1
12/21/2022 02:51:25 PM script INFO: SUCCESS!@#KODE 1!@#USER_ID 89!@#ACTIVITY_CODE 3
12/21/2022 02:51:25 PM script INFO: SUCCESS!@#KODE 1!@#USER_ID 89!@#ACTIVITY_CODE 1
12/21/2022 02:51:25 PM script INFO: SUCCESS!@#KODE 1!@#USER_ID 89!@#ACTIVITY_CODE 2
12/21/2022 02:51:25 PM script INFO: SUCCESS!@#KODE 1!@#USER_ID 89!@#ACTIVITY_CODE 1
12/21/2022 02:51:25 PM script INFO: SUCCESS!@#KODE 1!@#USER_ID 89!@#ACTIVITY_CODE 1
12/21/2022 02:51:25 PM script INFO: SUCCESS!@#KODE 1!@#USER_ID 89!@#ACTIVITY_CODE 1
12/21/2022 02:51:25 PM script INFO: SUCCESS!@#KODE 1!@#USER_ID 89!@#ACTIVITY_CODE 4
12/21/2022 02:51:26 PM script INFO: SUCCESS!@#KODE 1!@#USER_ID 89!@#ACTIVITY_CODE 2
12/21/2022 02:51:26 PM script INFO: SUCCESS!@#KODE 1!@#USER_ID 89!@#ACTIVITY_CODE 2
12/21/2022 02:51:26 PM script INFO: SUCCESS!@#KODE 1!@#USER_ID 89!@#ACTIVITY_CODE 1
12/21/2022 02:51:26 PM script INFO: SUCCESS!@#KODE 1!@#USER_ID 89!@#ACTIVITY_CODE 3
12/21/2022 02:51:26 PM script INFO: SUCCESS!@#KODE 1!@#USER_ID 89!@#ACTIVITY_CODE 4
12/21/2022 02:51:26 PM script INFO: SUCCESS!@#KODE 1!@#USER_ID 89!@#ACTIVITY_CODE 1
12/21/2022 02:51:27 PM script INFO: SUCCESS!@#KODE 1!@#USER_ID 89!@#ACTIVITY_CODE 1
12/21/2022 02:51:27 PM script INFO: SUCCESS!@#KODE 1!@#USER_ID 89!@#ACTIVITY_CODE 2
12/21/2022 02:51:27 PM script INFO: SUCCESS!@#KODE 1!@#USER_ID 89!@#ACTIVITY_CODE 3
12/21/2022 02:51:27 PM script INFO: SUCCESS!@#KODE 1!@#USER_ID 89!@#ACTIVITY_CODE 3
12/21/2022 02:51:27 PM script INFO: SUCCESS!@#KODE 1!@#USER_ID 89!@#ACTIVITY_CODE 3
12/21/2022 02:51:27 PM script INFO: SUCCESS!@#KODE 1!@#USER_ID 89!@#ACTIVITY_CODE 2
12/21/2022 02:51:28 PM script INFO: SUCCESS!@#KODE 1!@#USER_ID 89!@#ACTIVITY_CODE 2
12/21/2022 02:51:28 PM script INFO: SUCCESS!@#KODE 1!@#USER_ID 89!@#ACTIVITY_CODE 1
12/21/2022 02:51:28 PM script INFO: SUCCESS!@#KODE 1!@#USER_ID 89!@#ACTIVITY_CODE 1
12/21/2022 02:51:28 PM script INFO: SUCCESS!@#KODE 1!@#USER_ID 89!@#ACTIVITY_CODE 3
12/21/2022 02:51:28 PM script INFO: SUCCESS!@#KODE 1!@#USER_ID 89!@#ACTIVITY_CODE 3
12/21/2022 02:51:28 PM script INFO: SUCCESS!@#KODE 1!@#USER_ID 89!@#ACTIVITY_CODE 1
12/21/2022 02:51:28 PM script INFO: SUCCESS!@#KODE 1!@#USER_ID 89!@#ACTIVITY_CODE 3
12/21/2022 02:51:28 PM script INFO: SUCCESS!@#KODE 1!@#USER_ID 89!@#ACTIVITY_CODE 2
12/21/2022 02:51:29 PM script INFO: SUCCESS!@#KODE 1!@#USER_ID 89!@#ACTIVITY_CODE 2
12/21/2022 02:51:29 PM script INFO: SUCCESS!@#KODE 1!@#USER_ID 89!@#ACTIVITY_CODE 3
12/21/2022 02:51:29 PM script INFO: SUCCESS!@#KODE 1!@#USER_ID 89!@#ACTIVITY_CODE 4
12/21/2022 02:51:29 PM script INFO: SUCCESS!@#KODE 1!@#USER_ID 89!@#ACTIVITY_CODE 3
12/21/2022 02:51:29 PM script INFO: SUCCESS!@#KODE 1!@#USER_ID 89!@#ACTIVITY_CODE 3
12/21/2022 02:51:29 PM script INFO: SUCCESS!@#KODE 1!@#USER_ID 89!@#ACTIVITY_CODE 3
12/21/2022 02:51:30 PM script INFO: SUCCESS!@#KODE 1!@#USER_ID 89!@#ACTIVITY_CODE 2
12/21/2022 02:51:30 PM script INFO: SUCCESS!@#KODE 1!@#USER_ID 89!@#ACTIVITY_CODE 3
12/21/2022 02:51:30 PM script INFO: SUCCESS!@#KODE 1!@#USER_ID 89!@#ACTIVITY_CODE 3
12/21/2022 02:51:30 PM script INFO: SUCCESS!@#KODE 1!@#USER_ID 89!@#ACTIVITY_CODE 1
12/21/2022 02:51:30 PM script INFO: SUCCESS!@#KODE 1!@#USER_ID 89!@#ACTIVITY_CODE 2
12/21/2022 02:51:30 PM script INFO: SUCCESS!@#KODE 1!@#USER_ID 89!@#ACTIVITY_CODE 1
12/21/2022 02:51:30 PM script INFO: SUCCESS!@#KODE 1!@#USER_ID 89!@#ACTIVITY_CODE 4
12/21/2022 02:51:31 PM script INFO: SUCCESS!@#KODE 1!@#USER_ID 89!@#ACTIVITY_CODE 1
12/21/2022 02:51:31 PM script INFO: SUCCESS!@#KODE 1!@#USER_ID 89!@#ACTIVITY_CODE 3
12/21/2022 02:51:31 PM script INFO: SUCCESS!@#KODE 1!@#USER_ID 89!@#ACTIVITY_CODE 1
12/21/2022 02:51:31 PM script INFO: SUCCESS!@#KODE 1!@#USER_ID 89!@#ACTIVITY_CODE 4
12/21/2022 02:51:31 PM script INFO: SUCCESS!@#KODE 1!@#USER_ID 89!@#ACTIVITY_CODE 2
12/21/2022 02:51:31 PM script INFO: SUCCESS!@#KODE 1!@#USER_ID 89!@#ACTIVITY_CODE 3
12/21/2022 02:51:31 PM script INFO: SUCCESS!@#KODE 1!@#USER_ID 89!@#ACTIVITY_CODE 3
12/21/2022 02:51:32 PM script INFO: SUCCESS!@#KODE 1!@#USER_ID 89!@#ACTIVITY_CODE 1
12/21/2022 02:51:32 PM script INFO: SUCCESS!@#KODE 1!@#USER_ID 89!@#ACTIVITY_CODE 3
12/21/2022 02:51:32 PM script INFO: SUCCESS!@#KODE 1!@#USER_ID 89!@#ACTIVITY_CODE 3
12/21/2022 02:51:32 PM script INFO: SUCCESS!@#KODE 1!@#USER_ID 89!@#ACTIVITY_CODE 4
12/21/2022 02:51:32 PM script INFO: SUCCESS!@#KODE 1!@#USER_ID 89!@#ACTIVITY_CODE 3
12/21/2022 02:51:32 PM script INFO: SUCCESS!@#KODE 1!@#USER_ID 89!@#ACTIVITY_CODE 2
12/21/2022 02:51:33 PM script INFO: SUCCESS!@#KODE 1!@#USER_ID 89!@#ACTIVITY_CODE 3
12/21/2022 02:51:33 PM script INFO: SUCCESS!@#KODE 1!@#USER_ID 89!@#ACTIVITY_CODE 1
12/21/2022 02:51:33 PM script INFO: SUCCESS!@#KODE 1!@#USER_ID 89!@#ACTIVITY_CODE 2
12/21/2022 02:51:33 PM script INFO: SUCCESS!@#KODE 1!@#USER_ID 89!@#ACTIVITY_CODE 2
12/21/2022 02:51:33 PM script INFO: SUCCESS!@#KODE 1!@#USER_ID 89!@#ACTIVITY_CODE 2
12/21/2022 02:51:33 PM script INFO: SUCCESS!@#KODE 1!@#USER_ID 89!@#ACTIVITY_CODE 3
12/21/2022 02:51:34 PM script INFO: SUCCESS!@#KODE 1!@#USER_ID 89!@#ACTIVITY_CODE 1
12/21/2022 02:51:34 PM script INFO: SUCCESS!@#KODE 1!@#USER_ID 89!@#ACTIVITY_CODE 3
12/21/2022 02:51:34 PM script INFO: SUCCESS!@#KODE 1!@#USER_ID 89!@#ACTIVITY_CODE 1
12/21/2022 02:51:34 PM script INFO: SUCCESS!@#KODE 1!@#USER_ID 89!@#ACTIVITY_CODE 1
12/21/2022 02:51:34 PM script INFO: SUCCESS!@#KODE 1!@#USER_ID 89!@#ACTIVITY_CODE 4
12/21/2022 02:51:34 PM script INFO: SUCCESS!@#KODE 1!@#USER_ID 89!@#ACTIVITY_CODE 3
12/21/2022 02:51:34 PM script INFO: SUCCESS!@#KODE 1!@#USER_ID 89!@#ACTIVITY_CODE 1
12/21/2022 02:51:34 PM script INFO: SUCCESS!@#KODE 1!@#USER_ID 89!@#ACTIVITY_CODE 3
12/21/2022 02:51:35 PM script INFO: SUCCESS!@#KODE 1!@#USER_ID 89!@#ACTIVITY_CODE 2
12/21/2022 02:51:35 PM script INFO: SUCCESS!@#KODE 1!@#USER_ID 89!@#ACTIVITY_CODE 3
12/21/2022 02:51:35 PM script INFO: SUCCESS!@#KODE 1!@#USER_ID 89!@#ACTIVITY_CODE 1
12/21/2022 02:51:35 PM script INFO: SUCCESS!@#KODE 1!@#USER_ID 89!@#ACTIVITY_CODE 4
12/21/2022 02:51:35 PM script INFO: SUCCESS!@#KODE 1!@#USER_ID 89!@#ACTIVITY_CODE 3
12/21/2022 02:51:35 PM script INFO: SUCCESS!@#KODE 1!@#USER_ID 89!@#ACTIVITY_CODE 3
12/21/2022 02:51:35 PM script INFO: SUCCESS!@#KODE 1!@#USER_ID 89!@#ACTIVITY_CODE 1
12/21/2022 02:51:36 PM script INFO: SUCCESS!@#KODE 1!@#USER_ID 89!@#ACTIVITY_CODE 3
12/21/2022 02:51:36 PM script INFO: SUCCESS!@#KODE 1!@#USER_ID 89!@#ACTIVITY_CODE 2
12/21/2022 02:51:36 PM script INFO: SUCCESS!@#KODE 1!@#USER_ID 89!@#ACTIVITY_CODE 1
12/21/2022 02:51:36 PM script INFO: SUCCESS!@#KODE 1!@#USER_ID 89!@#ACTIVITY_CODE 2
12/21/2022 02:51:36 PM script INFO: SUCCESS!@#KODE 1!@#USER_ID 89!@#ACTIVITY_CODE 4
12/21/2022 02:51:37 PM script INFO: SUCCESS!@#KODE 1!@#USER_ID 89!@#ACTIVITY_CODE 1
12/21/2022 02:51:37 PM script INFO: SUCCESS!@#KODE 1!@#USER_ID 89!@#ACTIVITY_CODE 4
12/21/2022 02:51:37 PM script INFO: SUCCESS!@#KODE 1!@#USER_ID 89!@#ACTIVITY_CODE 3
12/21/2022 02:51:37 PM script INFO: SUCCESS!@#KODE 1!@#USER_ID 89!@#ACTIVITY_CODE 2
12/21/2022 02:51:37 PM script INFO: SUCCESS!@#KODE 1!@#USER_ID 89!@#ACTIVITY_CODE 1
12/21/2022 02:51:37 PM script INFO: SUCCESS!@#KODE 1!@#USER_ID 89!@#ACTIVITY_CODE 1
12/21/2022 02:51:38 PM script INFO: SUCCESS!@#KODE 1!@#USER_ID 89!@#ACTIVITY_CODE 2
12/21/2022 02:51:38 PM script INFO: SUCCESS!@#KODE 1!@#USER_ID 89!@#ACTIVITY_CODE 1
12/21/2022 02:51:38 PM script INFO: SUCCESS!@#KODE 1!@#USER_ID 89!@#ACTIVITY_CODE 3
12/21/2022 02:51:38 PM script INFO: SUCCESS!@#KODE 1!@#USER_ID 89!@#ACTIVITY_CODE 3
12/21/2022 02:51:38 PM script INFO: SUCCESS!@#KODE 1!@#USER_ID 89!@#ACTIVITY_CODE 3
12/21/2022 02:51:38 PM script INFO: SUCCESS!@#KODE 1!@#USER_ID 89!@#ACTIVITY_CODE 3
12/21/2022 02:51:38 PM script INFO: SUCCESS!@#KODE 1!@#USER_ID 89!@#ACTIVITY_CODE 1
12/21/2022 02:51:38 PM script INFO: SUCCESS!@#KODE 1!@#USER_ID 89!@#ACTIVITY_CODE 1
12/21/2022 02:51:39 PM script INFO: SUCCESS!@#KODE 1!@#USER_ID 89!@#ACTIVITY_CODE 3
12/21/2022 02:51:39 PM script INFO: SUCCESS!@#KODE 1!@#USER_ID 89!@#ACTIVITY_CODE 3
12/21/2022 02:51:39 PM script INFO: SUCCESS!@#KODE 1!@#USER_ID 89!@#ACTIVITY_CODE 2
12/21/2022 02:51:39 PM script INFO: SUCCESS!@#KODE 1!@#USER_ID 89!@#ACTIVITY_CODE 1
12/21/2022 02:51:40 PM script INFO: SUCCESS!@#KODE 1!@#USER_ID 89!@#ACTIVITY_CODE 2
12/21/2022 02:51:40 PM script INFO: SUCCESS!@#KODE 1!@#USER_ID 89!@#ACTIVITY_CODE 4
12/21/2022 02:51:40 PM script INFO: SUCCESS!@#KODE 1!@#USER_ID 89!@#ACTIVITY_CODE 1
12/21/2022 02:51:40 PM script INFO: SUCCESS!@#KODE 1!@#USER_ID 89!@#ACTIVITY_CODE 3
12/21/2022 02:51:40 PM script INFO: SUCCESS!@#KODE 1!@#USER_ID 89!@#ACTIVITY_CODE 1
12/21/2022 02:51:40 PM script INFO: SUCCESS!@#KODE 1!@#USER_ID 89!@#ACTIVITY_CODE 2
12/21/2022 02:51:41 PM script INFO: SUCCESS!@#KODE 1!@#USER_ID 89!@#ACTIVITY_CODE 2
12/21/2022 02:51:41 PM script INFO: SUCCESS!@#KODE 1!@#USER_ID 89!@#ACTIVITY_CODE 4
12/21/2022 02:51:41 PM script INFO: SUCCESS!@#KODE 1!@#USER_ID 89!@#ACTIVITY_CODE 2
12/21/2022 02:51:41 PM script INFO: SUCCESS!@#KODE 1!@#USER_ID 89!@#ACTIVITY_CODE 2
12/21/2022 02:51:42 PM script INFO: SUCCESS!@#KODE 1!@#USER_ID 89!@#ACTIVITY_CODE 3
12/21/2022 02:51:42 PM script INFO: SUCCESS!@#KODE 1!@#USER_ID 89!@#ACTIVITY_CODE 1
12/21/2022 02:51:42 PM script INFO: SUCCESS!@#KODE 1!@#USER_ID 89!@#ACTIVITY_CODE 3
12/21/2022 02:51:42 PM script INFO: SUCCESS!@#KODE 1!@#USER_ID 89!@#ACTIVITY_CODE 2
12/21/2022 02:51:42 PM script INFO: SUCCESS!@#KODE 1!@#USER_ID 89!@#ACTIVITY_CODE 1
12/21/2022 02:51:42 PM script INFO: SUCCESS!@#KODE 1!@#USER_ID 89!@#ACTIVITY_CODE 1
12/21/2022 02:51:43 PM script INFO: SUCCESS!@#KODE 1!@#USER_ID 89!@#ACTIVITY_CODE 2
12/21/2022 02:51:43 PM script INFO: SUCCESS!@#KODE 1!@#USER_ID 89!@#ACTIVITY_CODE 1
12/21/2022 02:51:43 PM script INFO: SUCCESS!@#KODE 1!@#USER_ID 89!@#ACTIVITY_CODE 1
12/21/2022 02:51:43 PM script INFO: SUCCESS!@#KODE 1!@#USER_ID 89!@#ACTIVITY_CODE 4
12/21/2022 02:51:44 PM script INFO: SUCCESS!@#KODE 1!@#USER_ID 89!@#ACTIVITY_CODE 2
12/21/2022 02:51:44 PM script INFO: SUCCESS!@#KODE 1!@#USER_ID 89!@#ACTIVITY_CODE 1
12/21/2022 02:51:44 PM script INFO: SUCCESS!@#KODE 1!@#USER_ID 89!@#ACTIVITY_CODE 1
12/21/2022 02:51:44 PM script INFO: SUCCESS!@#KODE 1!@#USER_ID 89!@#ACTIVITY_CODE 2
12/21/2022 02:51:44 PM script INFO: SUCCESS!@#KODE 1!@#USER_ID 89!@#ACTIVITY_CODE 2
12/21/2022 02:51:45 PM script INFO: SUCCESS!@#KODE 1!@#USER_ID 89!@#ACTIVITY_CODE 4
12/21/2022 02:51:45 PM script INFO: SUCCESS!@#KODE 1!@#USER_ID 89!@#ACTIVITY_CODE 1
12/21/2022 02:51:45 PM script INFO: SUCCESS!@#KODE 1!@#USER_ID 89!@#ACTIVITY_CODE 1
12/21/2022 02:51:45 PM script INFO: SUCCESS!@#KODE 1!@#USER_ID 89!@#ACTIVITY_CODE 4
12/21/2022 02:51:45 PM script INFO: SUCCESS!@#KODE 1!@#USER_ID 89!@#ACTIVITY_CODE 3
12/21/2022 02:51:45 PM script INFO: SUCCESS!@#KODE 1!@#USER_ID 89!@#ACTIVITY_CODE 1
12/21/2022 02:51:45 PM script INFO: SUCCESS!@#KODE 1!@#USER_ID 89!@#ACTIVITY_CODE 3
12/21/2022 02:51:46 PM script INFO: SUCCESS!@#KODE 1!@#USER_ID 89!@#ACTIVITY_CODE 2
12/21/2022 02:51:46 PM script INFO: SUCCESS!@#KODE 1!@#USER_ID 89!@#ACTIVITY_CODE 4
12/21/2022 02:51:46 PM script INFO: SUCCESS!@#KODE 1!@#USER_ID 89!@#ACTIVITY_CODE 2
12/21/2022 02:51:47 PM script INFO: SUCCESS!@#KODE 1!@#USER_ID 89!@#ACTIVITY_CODE 1
12/21/2022 02:51:47 PM script INFO: SUCCESS!@#KODE 1!@#USER_ID 89!@#ACTIVITY_CODE 3
12/21/2022 02:51:47 PM script INFO: SUCCESS!@#KODE 1!@#USER_ID 89!@#ACTIVITY_CODE 2
12/21/2022 02:51:47 PM script INFO: SUCCESS!@#KODE 1!@#USER_ID 89!@#ACTIVITY_CODE 3
12/21/2022 02:51:47 PM script INFO: SUCCESS!@#KODE 1!@#USER_ID 89!@#ACTIVITY_CODE 3
12/21/2022 02:51:47 PM script INFO: SUCCESS!@#KODE 1!@#USER_ID 89!@#ACTIVITY_CODE 3
12/21/2022 02:51:48 PM script INFO: SUCCESS!@#KODE 1!@#USER_ID 89!@#ACTIVITY_CODE 3
12/21/2022 02:51:48 PM script INFO: SUCCESS!@#KODE 1!@#USER_ID 89!@#ACTIVITY_CODE 2
12/21/2022 02:51:48 PM script INFO: SUCCESS!@#KODE 1!@#USER_ID 89!@#ACTIVITY_CODE 3
12/21/2022 02:51:49 PM script INFO: SUCCESS!@#KODE 1!@#USER_ID 89!@#ACTIVITY_CODE 2
12/21/2022 02:51:49 PM script INFO: SUCCESS!@#KODE 1!@#USER_ID 89!@#ACTIVITY_CODE 3
12/21/2022 02:51:49 PM script INFO: SUCCESS!@#KODE 1!@#USER_ID 89!@#ACTIVITY_CODE 1
12/21/2022 02:51:49 PM script INFO: SUCCESS!@#KODE 1!@#USER_ID 89!@#ACTIVITY_CODE 1
12/21/2022 02:51:49 PM script INFO: SUCCESS!@#KODE 1!@#USER_ID 89!@#ACTIVITY_CODE 2
12/21/2022 02:51:50 PM script INFO: SUCCESS!@#KODE 1!@#USER_ID 89!@#ACTIVITY_CODE 4
12/21/2022 02:51:50 PM script INFO: SUCCESS!@#KODE 1!@#USER_ID 89!@#ACTIVITY_CODE 3
12/21/2022 02:51:50 PM script INFO: SUCCESS!@#KODE 1!@#USER_ID 89!@#ACTIVITY_CODE 1
12/21/2022 02:51:50 PM script INFO: SUCCESS!@#KODE 1!@#USER_ID 89!@#ACTIVITY_CODE 4
12/21/2022 02:51:50 PM script INFO: SUCCESS!@#KODE 1!@#USER_ID 89!@#ACTIVITY_CODE 1
12/21/2022 02:51:50 PM script INFO: SUCCESS!@#KODE 1!@#USER_ID 89!@#ACTIVITY_CODE 2
12/21/2022 02:51:51 PM script INFO: SUCCESS!@#KODE 1!@#USER_ID 89!@#ACTIVITY_CODE 2
12/21/2022 02:51:51 PM script INFO: SUCCESS!@#KODE 1!@#USER_ID 89!@#ACTIVITY_CODE 2
12/21/2022 02:51:51 PM script INFO: SUCCESS!@#KODE 1!@#USER_ID 89!@#ACTIVITY_CODE 2
12/21/2022 02:51:52 PM script INFO: SUCCESS!@#KODE 1!@#USER_ID 89!@#ACTIVITY_CODE 2
12/21/2022 02:51:52 PM script INFO: SUCCESS!@#KODE 1!@#USER_ID 89!@#ACTIVITY_CODE 2
12/21/2022 02:51:52 PM script INFO: SUCCESS!@#KODE 1!@#USER_ID 89!@#ACTIVITY_CODE 1
12/21/2022 02:51:52 PM script INFO: SUCCESS!@#KODE 1!@#USER_ID 89!@#ACTIVITY_CODE 1
12/21/2022 02:51:52 PM script INFO: SUCCESS!@#KODE 1!@#USER_ID 89!@#ACTIVITY_CODE 4
12/21/2022 02:51:53 PM script INFO: SUCCESS!@#KODE 1!@#USER_ID 89!@#ACTIVITY_CODE 3
12/21/2022 02:51:53 PM script INFO: SUCCESS!@#KODE 1!@#USER_ID 89!@#ACTIVITY_CODE 3
12/21/2022 02:51:53 PM script INFO: SUCCESS!@#KODE 1!@#USER_ID 89!@#ACTIVITY_CODE 3
12/21/2022 02:51:53 PM script INFO: SUCCESS!@#KODE 1!@#USER_ID 89!@#ACTIVITY_CODE 3
12/21/2022 02:51:53 PM script INFO: SUCCESS!@#KODE 1!@#USER_ID 89!@#ACTIVITY_CODE 2
12/21/2022 02:51:53 PM script INFO: SUCCESS!@#KODE 1!@#USER_ID 89!@#ACTIVITY_CODE 1
12/21/2022 02:51:54 PM script INFO: SUCCESS!@#KODE 1!@#USER_ID 89!@#ACTIVITY_CODE 3
12/21/2022 02:51:54 PM script INFO: SUCCESS!@#KODE 1!@#USER_ID 89!@#ACTIVITY_CODE 3
12/21/2022 02:51:54 PM script INFO: SUCCESS!@#KODE 1!@#USER_ID 89!@#ACTIVITY_CODE 2
12/21/2022 02:51:54 PM script INFO: SUCCESS!@#KODE 1!@#USER_ID 89!@#ACTIVITY_CODE 2
12/21/2022 02:51:55 PM script INFO: SUCCESS!@#KODE 1!@#USER_ID 89!@#ACTIVITY_CODE 1
12/21/2022 02:51:55 PM script INFO: SUCCESS!@#KODE 1!@#USER_ID 89!@#ACTIVITY_CODE 3
12/21/2022 02:51:55 PM script INFO: SUCCESS!@#KODE 1!@#USER_ID 89!@#ACTIVITY_CODE 1
12/21/2022 02:51:55 PM script INFO: SUCCESS!@#KODE 1!@#USER_ID 89!@#ACTIVITY_CODE 3
12/21/2022 02:51:55 PM script INFO: SUCCESS!@#KODE 1!@#USER_ID 89!@#ACTIVITY_CODE 2
12/21/2022 02:51:56 PM script INFO: SUCCESS!@#KODE 1!@#USER_ID 89!@#ACTIVITY_CODE 3
12/21/2022 02:51:56 PM script INFO: SUCCESS!@#KODE 1!@#USER_ID 89!@#ACTIVITY_CODE 1
12/21/2022 02:51:56 PM script INFO: SUCCESS!@#KODE 1!@#USER_ID 89!@#ACTIVITY_CODE 3
12/21/2022 02:51:56 PM script INFO: SUCCESS!@#KODE 1!@#USER_ID 89!@#ACTIVITY_CODE 2
12/21/2022 02:51:57 PM script INFO: SUCCESS!@#KODE 1!@#USER_ID 89!@#ACTIVITY_CODE 2
12/21/2022 02:51:57 PM script INFO: SUCCESS!@#KODE 1!@#USER_ID 89!@#ACTIVITY_CODE 1
12/21/2022 02:51:57 PM script INFO: SUCCESS!@#KODE 1!@#USER_ID 89!@#ACTIVITY_CODE 1
12/21/2022 02:51:57 PM script INFO: SUCCESS!@#KODE 1!@#USER_ID 89!@#ACTIVITY_CODE 3
12/21/2022 02:51:57 PM script INFO: SUCCESS!@#KODE 1!@#USER_ID 89!@#ACTIVITY_CODE 2
12/21/2022 02:51:57 PM script INFO: SUCCESS!@#KODE 1!@#USER_ID 89!@#ACTIVITY_CODE 3
12/21/2022 02:51:58 PM script INFO: SUCCESS!@#KODE 1!@#USER_ID 89!@#ACTIVITY_CODE 1
12/21/2022 02:51:58 PM script INFO: SUCCESS!@#KODE 1!@#USER_ID 89!@#ACTIVITY_CODE 4
12/21/2022 02:51:58 PM script INFO: SUCCESS!@#KODE 1!@#USER_ID 89!@#ACTIVITY_CODE 2
12/21/2022 02:51:58 PM script INFO: SUCCESS!@#KODE 1!@#USER_ID 89!@#ACTIVITY_CODE 3
12/21/2022 02:51:59 PM script INFO: SUCCESS!@#KODE 1!@#USER_ID 89!@#ACTIVITY_CODE 2
12/21/2022 02:51:59 PM script INFO: SUCCESS!@#KODE 1!@#USER_ID 89!@#ACTIVITY_CODE 2
12/21/2022 02:52:00 PM script INFO: SUCCESS!@#KODE 1!@#USER_ID 89!@#ACTIVITY_CODE 4
12/21/2022 02:52:00 PM script INFO: SUCCESS!@#KODE 1!@#USER_ID 89!@#ACTIVITY_CODE 2
12/21/2022 02:52:00 PM script INFO: SUCCESS!@#KODE 1!@#USER_ID 89!@#ACTIVITY_CODE 1
12/21/2022 02:52:00 PM script INFO: SUCCESS!@#KODE 1!@#USER_ID 89!@#ACTIVITY_CODE 1
12/21/2022 02:52:00 PM script INFO: SUCCESS!@#KODE 1!@#USER_ID 89!@#ACTIVITY_CODE 1
12/21/2022 02:52:00 PM script INFO: SUCCESS!@#KODE 1!@#USER_ID 89!@#ACTIVITY_CODE 1
12/21/2022 02:52:01 PM script INFO: SUCCESS!@#KODE 1!@#USER_ID 89!@#ACTIVITY_CODE 2
12/21/2022 02:52:01 PM script INFO: SUCCESS!@#KODE 1!@#USER_ID 89!@#ACTIVITY_CODE 3
12/21/2022 02:52:01 PM script INFO: SUCCESS!@#KODE 1!@#USER_ID 89!@#ACTIVITY_CODE 1
12/21/2022 02:52:01 PM script INFO: SUCCESS!@#KODE 1!@#USER_ID 89!@#ACTIVITY_CODE 1
12/21/2022 02:52:02 PM script INFO: SUCCESS!@#KODE 1!@#USER_ID 89!@#ACTIVITY_CODE 2
12/21/2022 02:52:02 PM script INFO: SUCCESS!@#KODE 1!@#USER_ID 89!@#ACTIVITY_CODE 1
12/21/2022 02:52:02 PM script INFO: SUCCESS!@#KODE 1!@#USER_ID 89!@#ACTIVITY_CODE 4
12/21/2022 02:52:02 PM script INFO: SUCCESS!@#KODE 1!@#USER_ID 89!@#ACTIVITY_CODE 2
12/21/2022 02:52:03 PM script INFO: SUCCESS!@#KODE 1!@#USER_ID 89!@#ACTIVITY_CODE 2
12/21/2022 02:52:03 PM script INFO: SUCCESS!@#KODE 1!@#USER_ID 89!@#ACTIVITY_CODE 4
12/21/2022 02:52:03 PM script INFO: SUCCESS!@#KODE 1!@#USER_ID 89!@#ACTIVITY_CODE 2
12/21/2022 02:52:03 PM script INFO: SUCCESS!@#KODE 1!@#USER_ID 89!@#ACTIVITY_CODE 3
12/21/2022 02:52:03 PM script INFO: SUCCESS!@#KODE 1!@#USER_ID 89!@#ACTIVITY_CODE 3
12/21/2022 02:52:04 PM script INFO: SUCCESS!@#KODE 1!@#USER_ID 89!@#ACTIVITY_CODE 3
12/21/2022 02:52:04 PM script INFO: SUCCESS!@#KODE 1!@#USER_ID 89!@#ACTIVITY_CODE 3
12/21/2022 02:52:04 PM script INFO: SUCCESS!@#KODE 1!@#USER_ID 89!@#ACTIVITY_CODE 2
12/21/2022 02:52:04 PM script INFO: SUCCESS!@#KODE 1!@#USER_ID 89!@#ACTIVITY_CODE 3
12/21/2022 02:52:04 PM script INFO: SUCCESS!@#KODE 1!@#USER_ID 89!@#ACTIVITY_CODE 3
12/21/2022 02:52:04 PM script INFO: SUCCESS!@#KODE 1!@#USER_ID 89!@#ACTIVITY_CODE 3
12/21/2022 02:52:04 PM script INFO: SUCCESS!@#KODE 1!@#USER_ID 89!@#ACTIVITY_CODE 3
12/21/2022 02:52:05 PM script INFO: SUCCESS!@#KODE 1!@#USER_ID 89!@#ACTIVITY_CODE 2
12/21/2022 02:52:05 PM script INFO: SUCCESS!@#KODE 1!@#USER_ID 89!@#ACTIVITY_CODE 3
12/21/2022 02:52:05 PM script INFO: SUCCESS!@#KODE 1!@#USER_ID 89!@#ACTIVITY_CODE 3
12/21/2022 02:52:06 PM script INFO: SUCCESS!@#KODE 1!@#USER_ID 89!@#ACTIVITY_CODE 1
12/21/2022 02:52:06 PM script INFO: SUCCESS!@#KODE 1!@#USER_ID 89!@#ACTIVITY_CODE 3
12/21/2022 02:52:06 PM script INFO: SUCCESS!@#KODE 1!@#USER_ID 89!@#ACTIVITY_CODE 3
12/21/2022 02:52:06 PM script INFO: SUCCESS!@#KODE 1!@#USER_ID 89!@#ACTIVITY_CODE 3
12/21/2022 02:52:07 PM script INFO: SUCCESS!@#KODE 1!@#USER_ID 89!@#ACTIVITY_CODE 2
12/21/2022 02:52:07 PM script INFO: SUCCESS!@#KODE 1!@#USER_ID 89!@#ACTIVITY_CODE 1
12/21/2022 02:52:07 PM script INFO: SUCCESS!@#KODE 1!@#USER_ID 89!@#ACTIVITY_CODE 4
12/21/2022 02:52:07 PM script INFO: SUCCESS!@#KODE 1!@#USER_ID 89!@#ACTIVITY_CODE 2
12/21/2022 02:52:07 PM script INFO: SUCCESS!@#KODE 1!@#USER_ID 89!@#ACTIVITY_CODE 4
12/21/2022 02:52:08 PM script INFO: SUCCESS!@#KODE 1!@#USER_ID 89!@#ACTIVITY_CODE 3
12/21/2022 02:52:08 PM script INFO: SUCCESS!@#KODE 1!@#USER_ID 89!@#ACTIVITY_CODE 1
12/21/2022 02:52:08 PM script INFO: SUCCESS!@#KODE 1!@#USER_ID 89!@#ACTIVITY_CODE 4
12/21/2022 02:52:08 PM script INFO: SUCCESS!@#KODE 1!@#USER_ID 89!@#ACTIVITY_CODE 3
12/21/2022 02:52:08 PM script INFO: SUCCESS!@#KODE 1!@#USER_ID 89!@#ACTIVITY_CODE 1
12/21/2022 02:52:08 PM script INFO: SUCCESS!@#KODE 1!@#USER_ID 89!@#ACTIVITY_CODE 4
12/21/2022 02:52:08 PM script INFO: SUCCESS!@#KODE 1!@#USER_ID 89!@#ACTIVITY_CODE 3
12/21/2022 02:52:08 PM script INFO: SUCCESS!@#KODE 1!@#USER_ID 89!@#ACTIVITY_CODE 1
12/21/2022 02:52:09 PM script INFO: SUCCESS!@#KODE 1!@#USER_ID 89!@#ACTIVITY_CODE 4
12/21/2022 02:52:09 PM script INFO: SUCCESS!@#KODE 1!@#USER_ID 89!@#ACTIVITY_CODE 3
12/21/2022 02:52:09 PM script INFO: SUCCESS!@#KODE 1!@#USER_ID 89!@#ACTIVITY_CODE 3
12/21/2022 02:52:09 PM script INFO: SUCCESS!@#KODE 1!@#USER_ID 89!@#ACTIVITY_CODE 1
12/21/2022 02:52:09 PM script INFO: SUCCESS!@#KODE 1!@#USER_ID 89!@#ACTIVITY_CODE 4
12/21/2022 02:52:10 PM script INFO: SUCCESS!@#KODE 1!@#USER_ID 89!@#ACTIVITY_CODE 3
12/21/2022 02:52:10 PM script INFO: SUCCESS!@#KODE 1!@#USER_ID 89!@#ACTIVITY_CODE 3
12/21/2022 02:52:10 PM script INFO: SUCCESS!@#KODE 1!@#USER_ID 89!@#ACTIVITY_CODE 3
12/21/2022 02:52:10 PM script INFO: SUCCESS!@#KODE 1!@#USER_ID 89!@#ACTIVITY_CODE 3
12/21/2022 02:52:10 PM script INFO: SUCCESS!@#KODE 1!@#USER_ID 89!@#ACTIVITY_CODE 1
12/21/2022 02:52:10 PM script INFO: SUCCESS!@#KODE 1!@#USER_ID 89!@#ACTIVITY_CODE 4
12/21/2022 02:52:10 PM script INFO: SUCCESS!@#KODE 1!@#USER_ID 89!@#ACTIVITY_CODE 3
12/21/2022 02:52:10 PM script INFO: SUCCESS!@#KODE 1!@#USER_ID 89!@#ACTIVITY_CODE 1
12/21/2022 02:52:11 PM script INFO: SUCCESS!@#KODE 1!@#USER_ID 89!@#ACTIVITY_CODE 2
12/21/2022 02:52:11 PM script INFO: SUCCESS!@#KODE 1!@#USER_ID 89!@#ACTIVITY_CODE 2
12/21/2022 02:52:12 PM script INFO: SUCCESS!@#KODE 1!@#USER_ID 89!@#ACTIVITY_CODE 2
12/21/2022 02:52:12 PM script INFO: SUCCESS!@#KODE 1!@#USER_ID 89!@#ACTIVITY_CODE 3
12/21/2022 02:52:12 PM script INFO: SUCCESS!@#KODE 1!@#USER_ID 89!@#ACTIVITY_CODE 1
12/21/2022 02:52:12 PM script INFO: SUCCESS!@#KODE 1!@#USER_ID 89!@#ACTIVITY_CODE 3
12/21/2022 02:52:12 PM script INFO: SUCCESS!@#KODE 1!@#USER_ID 89!@#ACTIVITY_CODE 1
12/21/2022 02:52:12 PM script INFO: SUCCESS!@#KODE 1!@#USER_ID 89!@#ACTIVITY_CODE 2
12/21/2022 02:52:13 PM script INFO: SUCCESS!@#KODE 1!@#USER_ID 89!@#ACTIVITY_CODE 1
12/21/2022 02:52:13 PM script INFO: SUCCESS!@#KODE 1!@#USER_ID 89!@#ACTIVITY_CODE 1
12/21/2022 02:52:13 PM script INFO: SUCCESS!@#KODE 1!@#USER_ID 89!@#ACTIVITY_CODE 2
12/21/2022 02:52:13 PM script INFO: SUCCESS!@#KODE 1!@#USER_ID 89!@#ACTIVITY_CODE 1
12/21/2022 02:52:13 PM script INFO: SUCCESS!@#KODE 1!@#USER_ID 89!@#ACTIVITY_CODE 2
12/21/2022 02:52:13 PM script INFO: SUCCESS!@#KODE 1!@#USER_ID 89!@#ACTIVITY_CODE 3
12/21/2022 02:52:13 PM script INFO: Duration: 127.68509340286255
12/21/2022 02:52:13 PM script INFO: mengakhiri-quiz
12/21/2022 02:52:41 PM script INFO: SUCCESS!@#KODE 1!@#USER_ID 89!@#ACTIVITY_CODE 5
12/21/2022 02:52:41 PM script INFO: berhasil-submit
