12/23/2022 07:04:05 AM script INFO: Prepared chrome options..
12/23/2022 07:04:07 AM script INFO: Initialized chrome browser..
12/23/2022 07:04:07 AM script INFO: mengakses-homepage
12/23/2022 07:04:27 AM script INFO: mengakses-login-page
12/23/2022 07:04:28 AM script INFO: mengakses-site-home
12/23/2022 07:04:29 AM script INFO: mengakses-site-course
12/23/2022 07:04:30 AM script INFO: mengakses-quiz
12/23/2022 07:04:30 AM script INFO: mengakses-start-quiz-page
12/23/2022 07:04:31 AM script INFO: memulai-quiz
12/23/2022 07:04:31 AM script INFO: SUCCESS!@#KODE 1!@#USER_ID 8!@#ACTIVITY_CODE 5
12/23/2022 07:04:42 AM script INFO: SUCCESS!@#KODE 1!@#USER_ID 8!@#ACTIVITY_CODE 1
12/23/2022 07:04:42 AM script INFO: SUCCESS!@#KODE 1!@#USER_ID 8!@#ACTIVITY_CODE 5
12/23/2022 07:04:42 AM script INFO: SUCCESS!@#KODE 1!@#USER_ID 8!@#ACTIVITY_CODE 5
12/23/2022 07:04:45 AM script INFO: SUCCESS!@#KODE 1!@#USER_ID 8!@#ACTIVITY_CODE 2
12/23/2022 07:04:45 AM script INFO: SUCCESS!@#KODE 1!@#USER_ID 8!@#ACTIVITY_CODE 2
12/23/2022 07:04:45 AM script INFO: SUCCESS!@#KODE 1!@#USER_ID 8!@#ACTIVITY_CODE 2
12/23/2022 07:04:45 AM script INFO: SUCCESS!@#KODE 1!@#USER_ID 8!@#ACTIVITY_CODE 1
12/23/2022 07:04:45 AM script INFO: SUCCESS!@#KODE 1!@#USER_ID 8!@#ACTIVITY_CODE 3
12/23/2022 07:04:46 AM script INFO: SUCCESS!@#KODE 1!@#USER_ID 8!@#ACTIVITY_CODE 2
12/23/2022 07:04:46 AM script INFO: SUCCESS!@#KODE 1!@#USER_ID 8!@#ACTIVITY_CODE 5
12/23/2022 07:04:46 AM script INFO: SUCCESS!@#KODE 1!@#USER_ID 8!@#ACTIVITY_CODE 5
12/23/2022 07:04:48 AM script INFO: SUCCESS!@#KODE 1!@#USER_ID 8!@#ACTIVITY_CODE 1
12/23/2022 07:04:48 AM script INFO: SUCCESS!@#KODE 1!@#USER_ID 8!@#ACTIVITY_CODE 5
12/23/2022 07:04:48 AM script INFO: SUCCESS!@#KODE 1!@#USER_ID 8!@#ACTIVITY_CODE 5
12/23/2022 07:04:51 AM script INFO: SUCCESS!@#KODE 1!@#USER_ID 8!@#ACTIVITY_CODE 5
12/23/2022 07:04:51 AM script INFO: SUCCESS!@#KODE 1!@#USER_ID 8!@#ACTIVITY_CODE 5
12/23/2022 07:04:53 AM script INFO: SUCCESS!@#KODE 1!@#USER_ID 8!@#ACTIVITY_CODE 5
12/23/2022 07:04:53 AM script INFO: SUCCESS!@#KODE 1!@#USER_ID 8!@#ACTIVITY_CODE 5
12/23/2022 07:04:56 AM script INFO: SUCCESS!@#KODE 1!@#USER_ID 8!@#ACTIVITY_CODE 1
12/23/2022 07:04:56 AM script INFO: SUCCESS!@#KODE 1!@#USER_ID 8!@#ACTIVITY_CODE 4
12/23/2022 07:04:56 AM script INFO: SUCCESS!@#KODE 1!@#USER_ID 8!@#ACTIVITY_CODE 1
12/23/2022 07:04:56 AM script INFO: SUCCESS!@#KODE 1!@#USER_ID 8!@#ACTIVITY_CODE 4
12/23/2022 07:04:56 AM script INFO: SUCCESS!@#KODE 1!@#USER_ID 8!@#ACTIVITY_CODE 5
12/23/2022 07:04:56 AM script INFO: SUCCESS!@#KODE 1!@#USER_ID 8!@#ACTIVITY_CODE 5
12/23/2022 07:04:59 AM script INFO: SUCCESS!@#KODE 1!@#USER_ID 8!@#ACTIVITY_CODE 3
12/23/2022 07:04:59 AM script INFO: SUCCESS!@#KODE 1!@#USER_ID 8!@#ACTIVITY_CODE 2
12/23/2022 07:04:59 AM script INFO: SUCCESS!@#KODE 1!@#USER_ID 8!@#ACTIVITY_CODE 2
12/23/2022 07:04:59 AM script INFO: SUCCESS!@#KODE 1!@#USER_ID 8!@#ACTIVITY_CODE 1
12/23/2022 07:04:59 AM script INFO: SUCCESS!@#KODE 1!@#USER_ID 8!@#ACTIVITY_CODE 2
12/23/2022 07:04:59 AM script INFO: SUCCESS!@#KODE 1!@#USER_ID 8!@#ACTIVITY_CODE 1
12/23/2022 07:04:59 AM script INFO: SUCCESS!@#KODE 1!@#USER_ID 8!@#ACTIVITY_CODE 3
12/23/2022 07:04:59 AM script INFO: SUCCESS!@#KODE 1!@#USER_ID 8!@#ACTIVITY_CODE 2
12/23/2022 07:04:59 AM script INFO: SUCCESS!@#KODE 1!@#USER_ID 8!@#ACTIVITY_CODE 2
12/23/2022 07:05:00 AM script INFO: SUCCESS!@#KODE 1!@#USER_ID 8!@#ACTIVITY_CODE 4
12/23/2022 07:05:00 AM script INFO: SUCCESS!@#KODE 1!@#USER_ID 8!@#ACTIVITY_CODE 3
12/23/2022 07:05:00 AM script INFO: SUCCESS!@#KODE 1!@#USER_ID 8!@#ACTIVITY_CODE 3
12/23/2022 07:05:00 AM script INFO: SUCCESS!@#KODE 1!@#USER_ID 8!@#ACTIVITY_CODE 1
12/23/2022 07:05:00 AM script INFO: SUCCESS!@#KODE 1!@#USER_ID 8!@#ACTIVITY_CODE 4
12/23/2022 07:05:00 AM script INFO: SUCCESS!@#KODE 1!@#USER_ID 8!@#ACTIVITY_CODE 3
12/23/2022 07:05:00 AM script INFO: SUCCESS!@#KODE 1!@#USER_ID 8!@#ACTIVITY_CODE 3
12/23/2022 07:05:00 AM script INFO: SUCCESS!@#KODE 1!@#USER_ID 8!@#ACTIVITY_CODE 3
12/23/2022 07:05:00 AM script INFO: SUCCESS!@#KODE 1!@#USER_ID 8!@#ACTIVITY_CODE 3
12/23/2022 07:05:00 AM script INFO: SUCCESS!@#KODE 1!@#USER_ID 8!@#ACTIVITY_CODE 1
12/23/2022 07:05:00 AM script INFO: SUCCESS!@#KODE 1!@#USER_ID 8!@#ACTIVITY_CODE 4
12/23/2022 07:05:00 AM script INFO: SUCCESS!@#KODE 1!@#USER_ID 8!@#ACTIVITY_CODE 3
12/23/2022 07:05:00 AM script INFO: SUCCESS!@#KODE 1!@#USER_ID 8!@#ACTIVITY_CODE 2
12/23/2022 07:05:01 AM script INFO: SUCCESS!@#KODE 1!@#USER_ID 8!@#ACTIVITY_CODE 1
12/23/2022 07:05:01 AM script INFO: SUCCESS!@#KODE 1!@#USER_ID 8!@#ACTIVITY_CODE 1
12/23/2022 07:05:01 AM script INFO: Duration: 18.445171117782593
12/23/2022 07:05:01 AM script INFO: mengakhiri-quiz
12/23/2022 07:05:01 AM script INFO: SUCCESS!@#KODE 1!@#USER_ID 8!@#ACTIVITY_CODE 5
12/23/2022 07:05:01 AM script INFO: berhasil-submit
