12/10/2022 08:53:26 AM script INFO: Prepared chrome options..
12/10/2022 08:53:28 AM script INFO: Initialized chrome browser..
12/10/2022 08:53:28 AM script INFO: mengakses-homepage
12/10/2022 08:53:38 AM script INFO: mengakses-login-page
12/10/2022 08:53:40 AM script INFO: mengakses-site-home
12/10/2022 08:53:42 AM script INFO: mengakses-site-course
12/10/2022 08:54:13 AM script INFO: mengakses-quiz
12/10/2022 08:54:31 AM script INFO: mengakses-start-quiz-page
12/10/2022 08:54:53 AM script INFO: memulai-quiz
12/10/2022 08:54:53 AM script INFO: SUCCESS!@#KODE 1!@#USER_ID 62!@#ACTIVITY_CODE 5
12/10/2022 08:55:03 AM script INFO: SUCCESS!@#KODE 1!@#USER_ID 62!@#ACTIVITY_CODE 5
12/10/2022 08:55:03 AM script INFO: SUCCESS!@#KODE 1!@#USER_ID 62!@#ACTIVITY_CODE 5
12/10/2022 08:55:06 AM script INFO: SUCCESS!@#KODE 1!@#USER_ID 62!@#ACTIVITY_CODE 3
12/10/2022 08:55:06 AM script INFO: SUCCESS!@#KODE 1!@#USER_ID 62!@#ACTIVITY_CODE 3
12/10/2022 08:55:06 AM script INFO: SUCCESS!@#KODE 1!@#USER_ID 62!@#ACTIVITY_CODE 2
12/10/2022 08:55:06 AM script INFO: SUCCESS!@#KODE 1!@#USER_ID 62!@#ACTIVITY_CODE 1
12/10/2022 08:55:06 AM script INFO: SUCCESS!@#KODE 1!@#USER_ID 62!@#ACTIVITY_CODE 4
12/10/2022 08:55:06 AM script INFO: SUCCESS!@#KODE 1!@#USER_ID 62!@#ACTIVITY_CODE 2
12/10/2022 08:55:07 AM script INFO: SUCCESS!@#KODE 1!@#USER_ID 62!@#ACTIVITY_CODE 2
12/10/2022 08:55:07 AM script INFO: SUCCESS!@#KODE 1!@#USER_ID 62!@#ACTIVITY_CODE 1
12/10/2022 08:55:07 AM script INFO: SUCCESS!@#KODE 1!@#USER_ID 62!@#ACTIVITY_CODE 2
12/10/2022 08:55:07 AM script INFO: SUCCESS!@#KODE 1!@#USER_ID 62!@#ACTIVITY_CODE 5
12/10/2022 08:55:07 AM script INFO: SUCCESS!@#KODE 1!@#USER_ID 62!@#ACTIVITY_CODE 5
12/10/2022 08:55:09 AM script INFO: SUCCESS!@#KODE 1!@#USER_ID 62!@#ACTIVITY_CODE 1
12/10/2022 08:55:09 AM script INFO: SUCCESS!@#KODE 1!@#USER_ID 62!@#ACTIVITY_CODE 5
12/10/2022 08:55:09 AM script INFO: SUCCESS!@#KODE 1!@#USER_ID 62!@#ACTIVITY_CODE 5
12/10/2022 08:55:12 AM script INFO: SUCCESS!@#KODE 1!@#USER_ID 62!@#ACTIVITY_CODE 2
12/10/2022 08:55:12 AM script INFO: SUCCESS!@#KODE 1!@#USER_ID 62!@#ACTIVITY_CODE 4
12/10/2022 08:55:12 AM script INFO: SUCCESS!@#KODE 1!@#USER_ID 62!@#ACTIVITY_CODE 3
12/10/2022 08:55:13 AM script INFO: SUCCESS!@#KODE 1!@#USER_ID 62!@#ACTIVITY_CODE 2
12/10/2022 08:55:13 AM script INFO: SUCCESS!@#KODE 1!@#USER_ID 62!@#ACTIVITY_CODE 4
12/10/2022 08:55:13 AM script INFO: SUCCESS!@#KODE 1!@#USER_ID 62!@#ACTIVITY_CODE 1
12/10/2022 08:55:13 AM script INFO: SUCCESS!@#KODE 1!@#USER_ID 62!@#ACTIVITY_CODE 3
12/10/2022 08:55:13 AM script INFO: SUCCESS!@#KODE 1!@#USER_ID 62!@#ACTIVITY_CODE 4
12/10/2022 08:55:13 AM script INFO: SUCCESS!@#KODE 1!@#USER_ID 62!@#ACTIVITY_CODE 1
12/10/2022 08:55:13 AM script INFO: SUCCESS!@#KODE 1!@#USER_ID 62!@#ACTIVITY_CODE 1
12/10/2022 08:55:13 AM script INFO: SUCCESS!@#KODE 1!@#USER_ID 62!@#ACTIVITY_CODE 4
12/10/2022 08:55:14 AM script INFO: SUCCESS!@#KODE 1!@#USER_ID 62!@#ACTIVITY_CODE 3
12/10/2022 08:55:14 AM script INFO: SUCCESS!@#KODE 1!@#USER_ID 62!@#ACTIVITY_CODE 1
12/10/2022 08:55:14 AM script INFO: SUCCESS!@#KODE 1!@#USER_ID 62!@#ACTIVITY_CODE 4
12/10/2022 08:55:14 AM script INFO: SUCCESS!@#KODE 1!@#USER_ID 62!@#ACTIVITY_CODE 1
12/10/2022 08:55:14 AM script INFO: SUCCESS!@#KODE 1!@#USER_ID 62!@#ACTIVITY_CODE 3
12/10/2022 08:55:14 AM script INFO: SUCCESS!@#KODE 1!@#USER_ID 62!@#ACTIVITY_CODE 3
12/10/2022 08:55:14 AM script INFO: SUCCESS!@#KODE 1!@#USER_ID 62!@#ACTIVITY_CODE 3
12/10/2022 08:55:14 AM script INFO: SUCCESS!@#KODE 1!@#USER_ID 62!@#ACTIVITY_CODE 5
12/10/2022 08:55:14 AM script INFO: SUCCESS!@#KODE 1!@#USER_ID 62!@#ACTIVITY_CODE 5
12/10/2022 08:55:17 AM script INFO: SUCCESS!@#KODE 1!@#USER_ID 62!@#ACTIVITY_CODE 3
12/10/2022 08:55:17 AM script INFO: SUCCESS!@#KODE 1!@#USER_ID 62!@#ACTIVITY_CODE 2
12/10/2022 08:55:17 AM script INFO: SUCCESS!@#KODE 1!@#USER_ID 62!@#ACTIVITY_CODE 2
12/10/2022 08:55:17 AM script INFO: SUCCESS!@#KODE 1!@#USER_ID 62!@#ACTIVITY_CODE 3
12/10/2022 08:55:17 AM script INFO: SUCCESS!@#KODE 1!@#USER_ID 62!@#ACTIVITY_CODE 3
12/10/2022 08:55:17 AM script INFO: SUCCESS!@#KODE 1!@#USER_ID 62!@#ACTIVITY_CODE 5
12/10/2022 08:55:17 AM script INFO: SUCCESS!@#KODE 1!@#USER_ID 62!@#ACTIVITY_CODE 5
12/10/2022 08:55:20 AM script INFO: SUCCESS!@#KODE 1!@#USER_ID 62!@#ACTIVITY_CODE 1
12/10/2022 08:55:20 AM script INFO: SUCCESS!@#KODE 1!@#USER_ID 62!@#ACTIVITY_CODE 5
12/10/2022 08:55:20 AM script INFO: SUCCESS!@#KODE 1!@#USER_ID 62!@#ACTIVITY_CODE 5
12/10/2022 08:55:23 AM script INFO: SUCCESS!@#KODE 1!@#USER_ID 62!@#ACTIVITY_CODE 3
12/10/2022 08:55:23 AM script INFO: SUCCESS!@#KODE 1!@#USER_ID 62!@#ACTIVITY_CODE 4
12/10/2022 08:55:23 AM script INFO: Duration: 19.551133155822754
12/10/2022 08:55:23 AM script INFO: mengakhiri-quiz
12/10/2022 08:55:24 AM script INFO: SUCCESS!@#KODE 1!@#USER_ID 62!@#ACTIVITY_CODE 5
12/10/2022 08:55:24 AM script INFO: berhasil-submit
