12/23/2022 04:20:19 AM script INFO: Prepared chrome options..
12/23/2022 04:20:21 AM script INFO: Initialized chrome browser..
12/23/2022 04:20:21 AM script INFO: mengakses-homepage
12/23/2022 04:21:05 AM script INFO: mengakses-login-page
12/23/2022 04:21:55 AM script INFO: mengakses-site-home
12/23/2022 04:21:56 AM main_worker ERROR: Message: element click intercepted: Element <a class="list-group-item list-group-item-action  " href="http://35.238.154.97/?redirect=0" data-key="home" data-isexpandable="0" data-indent="0" data-showdivider="0" data-type="70" data-nodetype="0" data-collapse="0" data-forceopen="0" data-isactive="0" data-hidden="0" data-preceedwithhr="0" data-parent-key="myhome">...</a> is not clickable at point (142, 141). Other element would receive the click: <div class="yui3-widget-mask" style="position: fixed; width: 100%; height: 100%; top: 0px; left: 0px; z-index: 1045;"></div>
  (Session info: headless chrome=107.0.5304.87)
Stacktrace:
#0 0x561b25bb1463 <unknown>
#1 0x561b259758d8 <unknown>
#2 0x561b259bb23b <unknown>
#3 0x561b259b8a79 <unknown>
#4 0x561b259b5fe4 <unknown>
#5 0x561b259b4b21 <unknown>
#6 0x561b259a7421 <unknown>
#7 0x561b259d4622 <unknown>
#8 0x561b259a6ba7 <unknown>
#9 0x561b259d478e <unknown>
#10 0x561b259ed30f <unknown>
#11 0x561b259d4443 <unknown>
#12 0x561b259a53c5 <unknown>
#13 0x561b259a6531 <unknown>
#14 0x561b25c03dce <unknown>
#15 0x561b25c07192 <unknown>
#16 0x561b25be893e <unknown>
#17 0x561b25c08103 <unknown>
#18 0x561b25bdbd85 <unknown>
#19 0x561b25c290a8 <unknown>
#20 0x561b25c29239 <unknown>
#21 0x561b25c44492 <unknown>
#22 0x7f80384fe609 start_thread

