12/21/2022 02:41:06 PM script INFO: Prepared chrome options..
12/21/2022 02:41:07 PM script INFO: Initialized chrome browser..
12/21/2022 02:41:07 PM script INFO: mengakses-homepage
12/21/2022 02:41:23 PM script INFO: mengakses-login-page
12/21/2022 02:41:43 PM script INFO: mengakses-site-home
12/21/2022 02:41:44 PM script INFO: mengakses-site-course
12/21/2022 02:42:00 PM script INFO: mengakses-quiz
12/21/2022 02:42:15 PM script INFO: mengakses-start-quiz-page
12/21/2022 02:42:46 PM script INFO: memulai-quiz
12/21/2022 02:42:46 PM script INFO: SUCCESS!@#KODE 1!@#USER_ID 11!@#ACTIVITY_CODE 5
12/21/2022 02:42:57 PM script INFO: SUCCESS!@#KODE 1!@#USER_ID 11!@#ACTIVITY_CODE 3
12/21/2022 02:42:57 PM script INFO: SUCCESS!@#KODE 1!@#USER_ID 11!@#ACTIVITY_CODE 3
12/21/2022 02:42:57 PM script INFO: SUCCESS!@#KODE 1!@#USER_ID 11!@#ACTIVITY_CODE 2
12/21/2022 02:42:57 PM script INFO: SUCCESS!@#KODE 1!@#USER_ID 11!@#ACTIVITY_CODE 3
12/21/2022 02:42:57 PM script INFO: SUCCESS!@#KODE 1!@#USER_ID 11!@#ACTIVITY_CODE 1
12/21/2022 02:42:57 PM script INFO: SUCCESS!@#KODE 1!@#USER_ID 11!@#ACTIVITY_CODE 4
12/21/2022 02:42:57 PM script INFO: SUCCESS!@#KODE 1!@#USER_ID 11!@#ACTIVITY_CODE 1
12/21/2022 02:42:57 PM script INFO: SUCCESS!@#KODE 1!@#USER_ID 11!@#ACTIVITY_CODE 2
12/21/2022 02:42:58 PM script INFO: SUCCESS!@#KODE 1!@#USER_ID 11!@#ACTIVITY_CODE 2
12/21/2022 02:42:58 PM script INFO: SUCCESS!@#KODE 1!@#USER_ID 11!@#ACTIVITY_CODE 1
12/21/2022 02:42:58 PM script INFO: SUCCESS!@#KODE 1!@#USER_ID 11!@#ACTIVITY_CODE 2
12/21/2022 02:42:58 PM script INFO: SUCCESS!@#KODE 1!@#USER_ID 11!@#ACTIVITY_CODE 3
12/21/2022 02:42:58 PM script INFO: SUCCESS!@#KODE 1!@#USER_ID 11!@#ACTIVITY_CODE 1
12/21/2022 02:42:58 PM script INFO: SUCCESS!@#KODE 1!@#USER_ID 11!@#ACTIVITY_CODE 3
12/21/2022 02:42:58 PM script INFO: SUCCESS!@#KODE 1!@#USER_ID 11!@#ACTIVITY_CODE 1
12/21/2022 02:42:58 PM script INFO: SUCCESS!@#KODE 1!@#USER_ID 11!@#ACTIVITY_CODE 5
12/21/2022 02:42:58 PM script INFO: SUCCESS!@#KODE 1!@#USER_ID 11!@#ACTIVITY_CODE 5
12/21/2022 02:43:00 PM script INFO: SUCCESS!@#KODE 1!@#USER_ID 11!@#ACTIVITY_CODE 5
12/21/2022 02:43:00 PM script INFO: SUCCESS!@#KODE 1!@#USER_ID 11!@#ACTIVITY_CODE 5
12/21/2022 02:43:03 PM script INFO: SUCCESS!@#KODE 1!@#USER_ID 11!@#ACTIVITY_CODE 1
12/21/2022 02:43:03 PM script INFO: SUCCESS!@#KODE 1!@#USER_ID 11!@#ACTIVITY_CODE 1
12/21/2022 02:43:03 PM script INFO: SUCCESS!@#KODE 1!@#USER_ID 11!@#ACTIVITY_CODE 5
12/21/2022 02:43:03 PM script INFO: SUCCESS!@#KODE 1!@#USER_ID 11!@#ACTIVITY_CODE 5
12/21/2022 02:43:06 PM script INFO: SUCCESS!@#KODE 1!@#USER_ID 11!@#ACTIVITY_CODE 2
12/21/2022 02:43:06 PM script INFO: SUCCESS!@#KODE 1!@#USER_ID 11!@#ACTIVITY_CODE 5
12/21/2022 02:43:06 PM script INFO: SUCCESS!@#KODE 1!@#USER_ID 11!@#ACTIVITY_CODE 5
12/21/2022 02:43:08 PM script INFO: SUCCESS!@#KODE 1!@#USER_ID 11!@#ACTIVITY_CODE 3
12/21/2022 02:43:08 PM script INFO: SUCCESS!@#KODE 1!@#USER_ID 11!@#ACTIVITY_CODE 1
12/21/2022 02:43:08 PM script INFO: SUCCESS!@#KODE 1!@#USER_ID 11!@#ACTIVITY_CODE 1
12/21/2022 02:43:08 PM script INFO: SUCCESS!@#KODE 1!@#USER_ID 11!@#ACTIVITY_CODE 3
12/21/2022 02:43:08 PM script INFO: SUCCESS!@#KODE 1!@#USER_ID 11!@#ACTIVITY_CODE 5
12/21/2022 02:43:08 PM script INFO: SUCCESS!@#KODE 1!@#USER_ID 11!@#ACTIVITY_CODE 5
12/21/2022 02:43:11 PM script INFO: SUCCESS!@#KODE 1!@#USER_ID 11!@#ACTIVITY_CODE 5
12/21/2022 02:43:11 PM script INFO: SUCCESS!@#KODE 1!@#USER_ID 11!@#ACTIVITY_CODE 5
12/21/2022 02:43:13 PM script INFO: SUCCESS!@#KODE 1!@#USER_ID 11!@#ACTIVITY_CODE 3
12/21/2022 02:43:13 PM script INFO: SUCCESS!@#KODE 1!@#USER_ID 11!@#ACTIVITY_CODE 5
12/21/2022 02:43:13 PM script INFO: SUCCESS!@#KODE 1!@#USER_ID 11!@#ACTIVITY_CODE 5
12/21/2022 02:43:16 PM script INFO: SUCCESS!@#KODE 1!@#USER_ID 11!@#ACTIVITY_CODE 2
12/21/2022 02:43:16 PM script INFO: SUCCESS!@#KODE 1!@#USER_ID 11!@#ACTIVITY_CODE 1
12/21/2022 02:43:16 PM script INFO: SUCCESS!@#KODE 1!@#USER_ID 11!@#ACTIVITY_CODE 5
12/21/2022 02:43:16 PM script INFO: SUCCESS!@#KODE 1!@#USER_ID 11!@#ACTIVITY_CODE 5
12/21/2022 02:43:19 PM script INFO: SUCCESS!@#KODE 1!@#USER_ID 11!@#ACTIVITY_CODE 1
12/21/2022 02:43:19 PM script INFO: SUCCESS!@#KODE 1!@#USER_ID 11!@#ACTIVITY_CODE 3
12/21/2022 02:43:19 PM script INFO: SUCCESS!@#KODE 1!@#USER_ID 11!@#ACTIVITY_CODE 1
12/21/2022 02:43:19 PM script INFO: SUCCESS!@#KODE 1!@#USER_ID 11!@#ACTIVITY_CODE 4
12/21/2022 02:43:19 PM script INFO: SUCCESS!@#KODE 1!@#USER_ID 11!@#ACTIVITY_CODE 5
12/21/2022 02:43:19 PM script INFO: SUCCESS!@#KODE 1!@#USER_ID 11!@#ACTIVITY_CODE 5
12/21/2022 02:43:21 PM script INFO: SUCCESS!@#KODE 1!@#USER_ID 11!@#ACTIVITY_CODE 1
12/21/2022 02:43:21 PM script INFO: SUCCESS!@#KODE 1!@#USER_ID 11!@#ACTIVITY_CODE 2
12/21/2022 02:43:22 PM script INFO: SUCCESS!@#KODE 1!@#USER_ID 11!@#ACTIVITY_CODE 2
12/21/2022 02:43:22 PM script INFO: SUCCESS!@#KODE 1!@#USER_ID 11!@#ACTIVITY_CODE 5
12/21/2022 02:43:22 PM script INFO: SUCCESS!@#KODE 1!@#USER_ID 11!@#ACTIVITY_CODE 5
12/21/2022 02:43:24 PM script INFO: SUCCESS!@#KODE 1!@#USER_ID 11!@#ACTIVITY_CODE 2
12/21/2022 02:43:24 PM script INFO: SUCCESS!@#KODE 1!@#USER_ID 11!@#ACTIVITY_CODE 3
12/21/2022 02:43:24 PM script INFO: SUCCESS!@#KODE 1!@#USER_ID 11!@#ACTIVITY_CODE 2
12/21/2022 02:43:24 PM script INFO: SUCCESS!@#KODE 1!@#USER_ID 11!@#ACTIVITY_CODE 1
12/21/2022 02:43:25 PM script INFO: SUCCESS!@#KODE 1!@#USER_ID 11!@#ACTIVITY_CODE 1
12/21/2022 02:43:25 PM script INFO: SUCCESS!@#KODE 1!@#USER_ID 11!@#ACTIVITY_CODE 5
12/21/2022 02:43:25 PM script INFO: SUCCESS!@#KODE 1!@#USER_ID 11!@#ACTIVITY_CODE 5
12/21/2022 02:43:27 PM script INFO: SUCCESS!@#KODE 1!@#USER_ID 11!@#ACTIVITY_CODE 2
12/21/2022 02:43:27 PM script INFO: SUCCESS!@#KODE 1!@#USER_ID 11!@#ACTIVITY_CODE 1
12/21/2022 02:43:27 PM script INFO: SUCCESS!@#KODE 1!@#USER_ID 11!@#ACTIVITY_CODE 5
12/21/2022 02:43:27 PM script INFO: SUCCESS!@#KODE 1!@#USER_ID 11!@#ACTIVITY_CODE 5
12/21/2022 02:43:30 PM script INFO: SUCCESS!@#KODE 1!@#USER_ID 11!@#ACTIVITY_CODE 3
12/21/2022 02:43:30 PM script INFO: SUCCESS!@#KODE 1!@#USER_ID 11!@#ACTIVITY_CODE 1
12/21/2022 02:43:30 PM script INFO: SUCCESS!@#KODE 1!@#USER_ID 11!@#ACTIVITY_CODE 3
12/21/2022 02:43:30 PM script INFO: SUCCESS!@#KODE 1!@#USER_ID 11!@#ACTIVITY_CODE 2
12/21/2022 02:43:30 PM script INFO: SUCCESS!@#KODE 1!@#USER_ID 11!@#ACTIVITY_CODE 3
12/21/2022 02:43:30 PM script INFO: SUCCESS!@#KODE 1!@#USER_ID 11!@#ACTIVITY_CODE 3
12/21/2022 02:43:30 PM script INFO: SUCCESS!@#KODE 1!@#USER_ID 11!@#ACTIVITY_CODE 5
12/21/2022 02:43:30 PM script INFO: SUCCESS!@#KODE 1!@#USER_ID 11!@#ACTIVITY_CODE 5
12/21/2022 02:43:33 PM script INFO: SUCCESS!@#KODE 1!@#USER_ID 11!@#ACTIVITY_CODE 2
12/21/2022 02:43:33 PM script INFO: SUCCESS!@#KODE 1!@#USER_ID 11!@#ACTIVITY_CODE 2
12/21/2022 02:43:33 PM script INFO: SUCCESS!@#KODE 1!@#USER_ID 11!@#ACTIVITY_CODE 1
12/21/2022 02:43:33 PM script INFO: SUCCESS!@#KODE 1!@#USER_ID 11!@#ACTIVITY_CODE 5
12/21/2022 02:43:33 PM script INFO: SUCCESS!@#KODE 1!@#USER_ID 11!@#ACTIVITY_CODE 5
12/21/2022 02:43:35 PM script INFO: SUCCESS!@#KODE 1!@#USER_ID 11!@#ACTIVITY_CODE 1
12/21/2022 02:43:35 PM script INFO: SUCCESS!@#KODE 1!@#USER_ID 11!@#ACTIVITY_CODE 4
12/21/2022 02:43:35 PM script INFO: SUCCESS!@#KODE 1!@#USER_ID 11!@#ACTIVITY_CODE 1
12/21/2022 02:43:35 PM script INFO: SUCCESS!@#KODE 1!@#USER_ID 11!@#ACTIVITY_CODE 4
12/21/2022 02:43:35 PM script INFO: SUCCESS!@#KODE 1!@#USER_ID 11!@#ACTIVITY_CODE 5
12/21/2022 02:43:35 PM script INFO: SUCCESS!@#KODE 1!@#USER_ID 11!@#ACTIVITY_CODE 5
12/21/2022 02:43:38 PM script INFO: SUCCESS!@#KODE 1!@#USER_ID 11!@#ACTIVITY_CODE 3
12/21/2022 02:43:38 PM script INFO: SUCCESS!@#KODE 1!@#USER_ID 11!@#ACTIVITY_CODE 5
12/21/2022 02:43:38 PM script INFO: SUCCESS!@#KODE 1!@#USER_ID 11!@#ACTIVITY_CODE 5
12/21/2022 02:43:41 PM script INFO: SUCCESS!@#KODE 1!@#USER_ID 11!@#ACTIVITY_CODE 2
12/21/2022 02:43:41 PM script INFO: SUCCESS!@#KODE 1!@#USER_ID 11!@#ACTIVITY_CODE 3
12/21/2022 02:43:41 PM script INFO: SUCCESS!@#KODE 1!@#USER_ID 11!@#ACTIVITY_CODE 1
12/21/2022 02:43:41 PM script INFO: SUCCESS!@#KODE 1!@#USER_ID 11!@#ACTIVITY_CODE 1
12/21/2022 02:43:41 PM script INFO: SUCCESS!@#KODE 1!@#USER_ID 11!@#ACTIVITY_CODE 2
12/21/2022 02:43:41 PM script INFO: SUCCESS!@#KODE 1!@#USER_ID 11!@#ACTIVITY_CODE 2
12/21/2022 02:43:41 PM script INFO: SUCCESS!@#KODE 1!@#USER_ID 11!@#ACTIVITY_CODE 2
12/21/2022 02:43:41 PM script INFO: SUCCESS!@#KODE 1!@#USER_ID 11!@#ACTIVITY_CODE 4
12/21/2022 02:43:41 PM script INFO: SUCCESS!@#KODE 1!@#USER_ID 11!@#ACTIVITY_CODE 1
12/21/2022 02:43:41 PM script INFO: SUCCESS!@#KODE 1!@#USER_ID 11!@#ACTIVITY_CODE 4
12/21/2022 02:43:41 PM script INFO: SUCCESS!@#KODE 1!@#USER_ID 11!@#ACTIVITY_CODE 2
12/21/2022 02:43:41 PM script INFO: SUCCESS!@#KODE 1!@#USER_ID 11!@#ACTIVITY_CODE 3
12/21/2022 02:43:41 PM script INFO: SUCCESS!@#KODE 1!@#USER_ID 11!@#ACTIVITY_CODE 1
12/21/2022 02:43:41 PM script INFO: SUCCESS!@#KODE 1!@#USER_ID 11!@#ACTIVITY_CODE 1
12/21/2022 02:43:42 PM script INFO: SUCCESS!@#KODE 1!@#USER_ID 11!@#ACTIVITY_CODE 4
12/21/2022 02:43:42 PM script INFO: SUCCESS!@#KODE 1!@#USER_ID 11!@#ACTIVITY_CODE 1
12/21/2022 02:43:42 PM script INFO: SUCCESS!@#KODE 1!@#USER_ID 11!@#ACTIVITY_CODE 3
12/21/2022 02:43:42 PM script INFO: SUCCESS!@#KODE 1!@#USER_ID 11!@#ACTIVITY_CODE 3
12/21/2022 02:43:42 PM script INFO: SUCCESS!@#KODE 1!@#USER_ID 11!@#ACTIVITY_CODE 3
12/21/2022 02:43:42 PM script INFO: SUCCESS!@#KODE 1!@#USER_ID 11!@#ACTIVITY_CODE 4
12/21/2022 02:43:42 PM script INFO: SUCCESS!@#KODE 1!@#USER_ID 11!@#ACTIVITY_CODE 1
12/21/2022 02:43:42 PM script INFO: SUCCESS!@#KODE 1!@#USER_ID 11!@#ACTIVITY_CODE 2
12/21/2022 02:43:42 PM script INFO: SUCCESS!@#KODE 1!@#USER_ID 11!@#ACTIVITY_CODE 3
12/21/2022 02:43:42 PM script INFO: SUCCESS!@#KODE 1!@#USER_ID 11!@#ACTIVITY_CODE 3
12/21/2022 02:43:42 PM script INFO: SUCCESS!@#KODE 1!@#USER_ID 11!@#ACTIVITY_CODE 3
12/21/2022 02:43:42 PM script INFO: SUCCESS!@#KODE 1!@#USER_ID 11!@#ACTIVITY_CODE 3
12/21/2022 02:43:42 PM script INFO: SUCCESS!@#KODE 1!@#USER_ID 11!@#ACTIVITY_CODE 3
12/21/2022 02:43:42 PM script INFO: SUCCESS!@#KODE 1!@#USER_ID 11!@#ACTIVITY_CODE 1
12/21/2022 02:43:42 PM script INFO: SUCCESS!@#KODE 1!@#USER_ID 11!@#ACTIVITY_CODE 3
12/21/2022 02:43:42 PM script INFO: SUCCESS!@#KODE 1!@#USER_ID 11!@#ACTIVITY_CODE 3
12/21/2022 02:43:42 PM script INFO: SUCCESS!@#KODE 1!@#USER_ID 11!@#ACTIVITY_CODE 2
12/21/2022 02:43:42 PM script INFO: SUCCESS!@#KODE 1!@#USER_ID 11!@#ACTIVITY_CODE 2
12/21/2022 02:43:43 PM script INFO: SUCCESS!@#KODE 1!@#USER_ID 11!@#ACTIVITY_CODE 3
12/21/2022 02:43:43 PM script INFO: SUCCESS!@#KODE 1!@#USER_ID 11!@#ACTIVITY_CODE 4
12/21/2022 02:43:43 PM script INFO: SUCCESS!@#KODE 1!@#USER_ID 11!@#ACTIVITY_CODE 2
12/21/2022 02:43:43 PM script INFO: SUCCESS!@#KODE 1!@#USER_ID 11!@#ACTIVITY_CODE 1
12/21/2022 02:43:43 PM script INFO: SUCCESS!@#KODE 1!@#USER_ID 11!@#ACTIVITY_CODE 2
12/21/2022 02:43:43 PM script INFO: SUCCESS!@#KODE 1!@#USER_ID 11!@#ACTIVITY_CODE 2
12/21/2022 02:43:43 PM script INFO: SUCCESS!@#KODE 1!@#USER_ID 11!@#ACTIVITY_CODE 3
12/21/2022 02:43:43 PM script INFO: SUCCESS!@#KODE 1!@#USER_ID 11!@#ACTIVITY_CODE 4
12/21/2022 02:43:43 PM script INFO: SUCCESS!@#KODE 1!@#USER_ID 11!@#ACTIVITY_CODE 1
12/21/2022 02:43:43 PM script INFO: SUCCESS!@#KODE 1!@#USER_ID 11!@#ACTIVITY_CODE 2
12/21/2022 02:43:43 PM script INFO: SUCCESS!@#KODE 1!@#USER_ID 11!@#ACTIVITY_CODE 1
12/21/2022 02:43:43 PM script INFO: SUCCESS!@#KODE 1!@#USER_ID 11!@#ACTIVITY_CODE 3
12/21/2022 02:43:43 PM script INFO: SUCCESS!@#KODE 1!@#USER_ID 11!@#ACTIVITY_CODE 2
12/21/2022 02:43:43 PM script INFO: SUCCESS!@#KODE 1!@#USER_ID 11!@#ACTIVITY_CODE 1
12/21/2022 02:43:43 PM script INFO: SUCCESS!@#KODE 1!@#USER_ID 11!@#ACTIVITY_CODE 4
12/21/2022 02:43:43 PM script INFO: SUCCESS!@#KODE 1!@#USER_ID 11!@#ACTIVITY_CODE 1
12/21/2022 02:43:44 PM script INFO: SUCCESS!@#KODE 1!@#USER_ID 11!@#ACTIVITY_CODE 3
12/21/2022 02:43:44 PM script INFO: SUCCESS!@#KODE 1!@#USER_ID 11!@#ACTIVITY_CODE 4
12/21/2022 02:43:44 PM script INFO: SUCCESS!@#KODE 1!@#USER_ID 11!@#ACTIVITY_CODE 2
12/21/2022 02:43:44 PM script INFO: SUCCESS!@#KODE 1!@#USER_ID 11!@#ACTIVITY_CODE 4
12/21/2022 02:43:44 PM script INFO: SUCCESS!@#KODE 1!@#USER_ID 11!@#ACTIVITY_CODE 2
12/21/2022 02:43:44 PM script INFO: SUCCESS!@#KODE 1!@#USER_ID 11!@#ACTIVITY_CODE 1
12/21/2022 02:43:44 PM script INFO: SUCCESS!@#KODE 1!@#USER_ID 11!@#ACTIVITY_CODE 1
12/21/2022 02:43:44 PM script INFO: SUCCESS!@#KODE 1!@#USER_ID 11!@#ACTIVITY_CODE 2
12/21/2022 02:43:44 PM script INFO: SUCCESS!@#KODE 1!@#USER_ID 11!@#ACTIVITY_CODE 1
12/21/2022 02:43:44 PM script INFO: SUCCESS!@#KODE 1!@#USER_ID 11!@#ACTIVITY_CODE 3
12/21/2022 02:43:44 PM script INFO: SUCCESS!@#KODE 1!@#USER_ID 11!@#ACTIVITY_CODE 1
12/21/2022 02:43:44 PM script INFO: SUCCESS!@#KODE 1!@#USER_ID 11!@#ACTIVITY_CODE 2
12/21/2022 02:43:44 PM script INFO: SUCCESS!@#KODE 1!@#USER_ID 11!@#ACTIVITY_CODE 1
12/21/2022 02:43:44 PM script INFO: SUCCESS!@#KODE 1!@#USER_ID 11!@#ACTIVITY_CODE 1
12/21/2022 02:43:44 PM script INFO: SUCCESS!@#KODE 1!@#USER_ID 11!@#ACTIVITY_CODE 1
12/21/2022 02:43:44 PM script INFO: SUCCESS!@#KODE 1!@#USER_ID 11!@#ACTIVITY_CODE 2
12/21/2022 02:43:44 PM script INFO: SUCCESS!@#KODE 1!@#USER_ID 11!@#ACTIVITY_CODE 1
12/21/2022 02:43:45 PM script INFO: SUCCESS!@#KODE 1!@#USER_ID 11!@#ACTIVITY_CODE 2
12/21/2022 02:43:45 PM script INFO: SUCCESS!@#KODE 1!@#USER_ID 11!@#ACTIVITY_CODE 2
12/21/2022 02:43:45 PM script INFO: SUCCESS!@#KODE 1!@#USER_ID 11!@#ACTIVITY_CODE 4
12/21/2022 02:43:45 PM script INFO: SUCCESS!@#KODE 1!@#USER_ID 11!@#ACTIVITY_CODE 3
12/21/2022 02:43:45 PM script INFO: SUCCESS!@#KODE 1!@#USER_ID 11!@#ACTIVITY_CODE 3
12/21/2022 02:43:45 PM script INFO: SUCCESS!@#KODE 1!@#USER_ID 11!@#ACTIVITY_CODE 3
12/21/2022 02:43:45 PM script INFO: SUCCESS!@#KODE 1!@#USER_ID 11!@#ACTIVITY_CODE 3
12/21/2022 02:43:45 PM script INFO: SUCCESS!@#KODE 1!@#USER_ID 11!@#ACTIVITY_CODE 2
12/21/2022 02:43:45 PM script INFO: SUCCESS!@#KODE 1!@#USER_ID 11!@#ACTIVITY_CODE 3
12/21/2022 02:43:45 PM script INFO: SUCCESS!@#KODE 1!@#USER_ID 11!@#ACTIVITY_CODE 4
12/21/2022 02:43:45 PM script INFO: SUCCESS!@#KODE 1!@#USER_ID 11!@#ACTIVITY_CODE 3
12/21/2022 02:43:45 PM script INFO: SUCCESS!@#KODE 1!@#USER_ID 11!@#ACTIVITY_CODE 3
12/21/2022 02:43:45 PM script INFO: SUCCESS!@#KODE 1!@#USER_ID 11!@#ACTIVITY_CODE 3
12/21/2022 02:43:45 PM script INFO: SUCCESS!@#KODE 1!@#USER_ID 11!@#ACTIVITY_CODE 2
12/21/2022 02:43:45 PM script INFO: SUCCESS!@#KODE 1!@#USER_ID 11!@#ACTIVITY_CODE 3
12/21/2022 02:43:45 PM script INFO: SUCCESS!@#KODE 1!@#USER_ID 11!@#ACTIVITY_CODE 3
12/21/2022 02:43:46 PM script INFO: SUCCESS!@#KODE 1!@#USER_ID 11!@#ACTIVITY_CODE 2
12/21/2022 02:43:46 PM script INFO: SUCCESS!@#KODE 1!@#USER_ID 11!@#ACTIVITY_CODE 1
12/21/2022 02:43:46 PM script INFO: SUCCESS!@#KODE 1!@#USER_ID 11!@#ACTIVITY_CODE 4
12/21/2022 02:43:46 PM script INFO: SUCCESS!@#KODE 1!@#USER_ID 11!@#ACTIVITY_CODE 3
12/21/2022 02:43:46 PM script INFO: SUCCESS!@#KODE 1!@#USER_ID 11!@#ACTIVITY_CODE 2
12/21/2022 02:43:46 PM script INFO: SUCCESS!@#KODE 1!@#USER_ID 11!@#ACTIVITY_CODE 3
12/21/2022 02:43:46 PM script INFO: SUCCESS!@#KODE 1!@#USER_ID 11!@#ACTIVITY_CODE 1
12/21/2022 02:43:46 PM script INFO: SUCCESS!@#KODE 1!@#USER_ID 11!@#ACTIVITY_CODE 3
12/21/2022 02:43:46 PM script INFO: SUCCESS!@#KODE 1!@#USER_ID 11!@#ACTIVITY_CODE 4
12/21/2022 02:43:46 PM script INFO: SUCCESS!@#KODE 1!@#USER_ID 11!@#ACTIVITY_CODE 2
12/21/2022 02:43:46 PM script INFO: SUCCESS!@#KODE 1!@#USER_ID 11!@#ACTIVITY_CODE 1
12/21/2022 02:43:46 PM script INFO: SUCCESS!@#KODE 1!@#USER_ID 11!@#ACTIVITY_CODE 1
12/21/2022 02:43:46 PM script INFO: SUCCESS!@#KODE 1!@#USER_ID 11!@#ACTIVITY_CODE 4
12/21/2022 02:43:46 PM script INFO: SUCCESS!@#KODE 1!@#USER_ID 11!@#ACTIVITY_CODE 2
12/21/2022 02:43:46 PM script INFO: SUCCESS!@#KODE 1!@#USER_ID 11!@#ACTIVITY_CODE 2
12/21/2022 02:43:46 PM script INFO: SUCCESS!@#KODE 1!@#USER_ID 11!@#ACTIVITY_CODE 3
12/21/2022 02:43:46 PM script INFO: SUCCESS!@#KODE 1!@#USER_ID 11!@#ACTIVITY_CODE 3
12/21/2022 02:43:46 PM script INFO: SUCCESS!@#KODE 1!@#USER_ID 11!@#ACTIVITY_CODE 1
12/21/2022 02:43:47 PM script INFO: SUCCESS!@#KODE 1!@#USER_ID 11!@#ACTIVITY_CODE 2
12/21/2022 02:43:47 PM script INFO: SUCCESS!@#KODE 1!@#USER_ID 11!@#ACTIVITY_CODE 3
12/21/2022 02:43:47 PM script INFO: SUCCESS!@#KODE 1!@#USER_ID 11!@#ACTIVITY_CODE 3
12/21/2022 02:43:47 PM script INFO: SUCCESS!@#KODE 1!@#USER_ID 11!@#ACTIVITY_CODE 1
12/21/2022 02:43:47 PM script INFO: SUCCESS!@#KODE 1!@#USER_ID 11!@#ACTIVITY_CODE 1
12/21/2022 02:43:47 PM script INFO: SUCCESS!@#KODE 1!@#USER_ID 11!@#ACTIVITY_CODE 2
12/21/2022 02:43:47 PM script INFO: SUCCESS!@#KODE 1!@#USER_ID 11!@#ACTIVITY_CODE 3
12/21/2022 02:43:47 PM script INFO: SUCCESS!@#KODE 1!@#USER_ID 11!@#ACTIVITY_CODE 2
12/21/2022 02:43:47 PM script INFO: SUCCESS!@#KODE 1!@#USER_ID 11!@#ACTIVITY_CODE 2
12/21/2022 02:43:47 PM script INFO: SUCCESS!@#KODE 1!@#USER_ID 11!@#ACTIVITY_CODE 1
12/21/2022 02:43:47 PM script INFO: SUCCESS!@#KODE 1!@#USER_ID 11!@#ACTIVITY_CODE 1
12/21/2022 02:43:47 PM script INFO: SUCCESS!@#KODE 1!@#USER_ID 11!@#ACTIVITY_CODE 1
12/21/2022 02:43:47 PM script INFO: SUCCESS!@#KODE 1!@#USER_ID 11!@#ACTIVITY_CODE 1
12/21/2022 02:43:47 PM script INFO: SUCCESS!@#KODE 1!@#USER_ID 11!@#ACTIVITY_CODE 2
12/21/2022 02:43:47 PM script INFO: SUCCESS!@#KODE 1!@#USER_ID 11!@#ACTIVITY_CODE 2
12/21/2022 02:43:48 PM script INFO: SUCCESS!@#KODE 1!@#USER_ID 11!@#ACTIVITY_CODE 2
12/21/2022 02:43:48 PM script INFO: SUCCESS!@#KODE 1!@#USER_ID 11!@#ACTIVITY_CODE 4
12/21/2022 02:43:48 PM script INFO: SUCCESS!@#KODE 1!@#USER_ID 11!@#ACTIVITY_CODE 1
12/21/2022 02:43:48 PM script INFO: SUCCESS!@#KODE 1!@#USER_ID 11!@#ACTIVITY_CODE 3
12/21/2022 02:43:48 PM script INFO: SUCCESS!@#KODE 1!@#USER_ID 11!@#ACTIVITY_CODE 1
12/21/2022 02:43:48 PM script INFO: SUCCESS!@#KODE 1!@#USER_ID 11!@#ACTIVITY_CODE 4
12/21/2022 02:43:48 PM script INFO: SUCCESS!@#KODE 1!@#USER_ID 11!@#ACTIVITY_CODE 1
12/21/2022 02:43:48 PM script INFO: SUCCESS!@#KODE 1!@#USER_ID 11!@#ACTIVITY_CODE 4
12/21/2022 02:43:48 PM script INFO: SUCCESS!@#KODE 1!@#USER_ID 11!@#ACTIVITY_CODE 2
12/21/2022 02:43:48 PM script INFO: SUCCESS!@#KODE 1!@#USER_ID 11!@#ACTIVITY_CODE 4
12/21/2022 02:43:48 PM script INFO: SUCCESS!@#KODE 1!@#USER_ID 11!@#ACTIVITY_CODE 2
12/21/2022 02:43:48 PM script INFO: SUCCESS!@#KODE 1!@#USER_ID 11!@#ACTIVITY_CODE 2
12/21/2022 02:43:48 PM script INFO: SUCCESS!@#KODE 1!@#USER_ID 11!@#ACTIVITY_CODE 1
12/21/2022 02:43:48 PM script INFO: SUCCESS!@#KODE 1!@#USER_ID 11!@#ACTIVITY_CODE 2
12/21/2022 02:43:48 PM script INFO: SUCCESS!@#KODE 1!@#USER_ID 11!@#ACTIVITY_CODE 3
12/21/2022 02:43:48 PM script INFO: SUCCESS!@#KODE 1!@#USER_ID 11!@#ACTIVITY_CODE 2
12/21/2022 02:43:49 PM script INFO: SUCCESS!@#KODE 1!@#USER_ID 11!@#ACTIVITY_CODE 3
12/21/2022 02:43:49 PM script INFO: SUCCESS!@#KODE 1!@#USER_ID 11!@#ACTIVITY_CODE 4
12/21/2022 02:43:49 PM script INFO: SUCCESS!@#KODE 1!@#USER_ID 11!@#ACTIVITY_CODE 1
12/21/2022 02:43:49 PM script INFO: SUCCESS!@#KODE 1!@#USER_ID 11!@#ACTIVITY_CODE 3
12/21/2022 02:43:49 PM script INFO: SUCCESS!@#KODE 1!@#USER_ID 11!@#ACTIVITY_CODE 1
12/21/2022 02:43:49 PM script INFO: SUCCESS!@#KODE 1!@#USER_ID 11!@#ACTIVITY_CODE 1
12/21/2022 02:43:49 PM script INFO: SUCCESS!@#KODE 1!@#USER_ID 11!@#ACTIVITY_CODE 4
12/21/2022 02:43:49 PM script INFO: SUCCESS!@#KODE 1!@#USER_ID 11!@#ACTIVITY_CODE 2
12/21/2022 02:43:49 PM script INFO: SUCCESS!@#KODE 1!@#USER_ID 11!@#ACTIVITY_CODE 2
12/21/2022 02:43:49 PM script INFO: SUCCESS!@#KODE 1!@#USER_ID 11!@#ACTIVITY_CODE 3
12/21/2022 02:43:49 PM script INFO: SUCCESS!@#KODE 1!@#USER_ID 11!@#ACTIVITY_CODE 1
12/21/2022 02:43:49 PM script INFO: SUCCESS!@#KODE 1!@#USER_ID 11!@#ACTIVITY_CODE 2
12/21/2022 02:43:49 PM script INFO: SUCCESS!@#KODE 1!@#USER_ID 11!@#ACTIVITY_CODE 3
12/21/2022 02:43:49 PM script INFO: SUCCESS!@#KODE 1!@#USER_ID 11!@#ACTIVITY_CODE 1
12/21/2022 02:43:49 PM script INFO: SUCCESS!@#KODE 1!@#USER_ID 11!@#ACTIVITY_CODE 1
12/21/2022 02:43:49 PM script INFO: SUCCESS!@#KODE 1!@#USER_ID 11!@#ACTIVITY_CODE 4
12/21/2022 02:43:49 PM script INFO: SUCCESS!@#KODE 1!@#USER_ID 11!@#ACTIVITY_CODE 2
12/21/2022 02:43:49 PM script INFO: SUCCESS!@#KODE 1!@#USER_ID 11!@#ACTIVITY_CODE 1
12/21/2022 02:43:50 PM script INFO: SUCCESS!@#KODE 1!@#USER_ID 11!@#ACTIVITY_CODE 2
12/21/2022 02:43:50 PM script INFO: SUCCESS!@#KODE 1!@#USER_ID 11!@#ACTIVITY_CODE 2
12/21/2022 02:43:50 PM script INFO: SUCCESS!@#KODE 1!@#USER_ID 11!@#ACTIVITY_CODE 3
12/21/2022 02:43:50 PM script INFO: SUCCESS!@#KODE 1!@#USER_ID 11!@#ACTIVITY_CODE 2
12/21/2022 02:43:50 PM script INFO: SUCCESS!@#KODE 1!@#USER_ID 11!@#ACTIVITY_CODE 1
12/21/2022 02:43:50 PM script INFO: SUCCESS!@#KODE 1!@#USER_ID 11!@#ACTIVITY_CODE 3
12/21/2022 02:43:50 PM script INFO: SUCCESS!@#KODE 1!@#USER_ID 11!@#ACTIVITY_CODE 1
12/21/2022 02:43:50 PM script INFO: SUCCESS!@#KODE 1!@#USER_ID 11!@#ACTIVITY_CODE 3
12/21/2022 02:43:50 PM script INFO: SUCCESS!@#KODE 1!@#USER_ID 11!@#ACTIVITY_CODE 3
12/21/2022 02:43:50 PM script INFO: SUCCESS!@#KODE 1!@#USER_ID 11!@#ACTIVITY_CODE 1
12/21/2022 02:43:50 PM script INFO: SUCCESS!@#KODE 1!@#USER_ID 11!@#ACTIVITY_CODE 3
12/21/2022 02:43:50 PM script INFO: SUCCESS!@#KODE 1!@#USER_ID 11!@#ACTIVITY_CODE 1
12/21/2022 02:43:50 PM script INFO: SUCCESS!@#KODE 1!@#USER_ID 11!@#ACTIVITY_CODE 1
12/21/2022 02:43:50 PM script INFO: SUCCESS!@#KODE 1!@#USER_ID 11!@#ACTIVITY_CODE 1
12/21/2022 02:43:50 PM script INFO: SUCCESS!@#KODE 1!@#USER_ID 11!@#ACTIVITY_CODE 1
12/21/2022 02:43:50 PM script INFO: Duration: 53.40809893608093
12/21/2022 02:43:50 PM script INFO: mengakhiri-quiz
12/21/2022 02:43:51 PM script INFO: SUCCESS!@#KODE 1!@#USER_ID 11!@#ACTIVITY_CODE 5
12/21/2022 02:43:51 PM script INFO: berhasil-submit
