12/11/2022 03:05:19 PM script INFO: Prepared chrome options..
12/11/2022 03:05:20 PM script INFO: Initialized chrome browser..
12/11/2022 03:05:20 PM script INFO: mengakses-homepage
12/11/2022 03:05:29 PM script INFO: mengakses-login-page
12/11/2022 03:05:30 PM script INFO: mengakses-site-home
12/11/2022 03:05:30 PM script INFO: mengakses-site-course
12/11/2022 03:05:31 PM script INFO: mengakses-quiz
12/11/2022 03:05:32 PM script INFO: mengakses-start-quiz-page
12/11/2022 03:05:33 PM script INFO: memulai-quiz
12/11/2022 03:05:33 PM script INFO: SUCCESS!@#KODE 1!@#USER_ID 27!@#ACTIVITY_CODE 5
12/11/2022 03:05:44 PM script INFO: SUCCESS!@#KODE 1!@#USER_ID 27!@#ACTIVITY_CODE 1
12/11/2022 03:05:44 PM script INFO: SUCCESS!@#KODE 1!@#USER_ID 27!@#ACTIVITY_CODE 5
12/11/2022 03:05:44 PM script INFO: SUCCESS!@#KODE 1!@#USER_ID 27!@#ACTIVITY_CODE 5
12/11/2022 03:05:47 PM script INFO: SUCCESS!@#KODE 1!@#USER_ID 27!@#ACTIVITY_CODE 3
12/11/2022 03:05:47 PM script INFO: SUCCESS!@#KODE 1!@#USER_ID 27!@#ACTIVITY_CODE 5
12/11/2022 03:05:47 PM script INFO: SUCCESS!@#KODE 1!@#USER_ID 27!@#ACTIVITY_CODE 5
12/11/2022 03:05:49 PM script INFO: SUCCESS!@#KODE 1!@#USER_ID 27!@#ACTIVITY_CODE 1
12/11/2022 03:05:49 PM script INFO: SUCCESS!@#KODE 1!@#USER_ID 27!@#ACTIVITY_CODE 5
12/11/2022 03:05:49 PM script INFO: SUCCESS!@#KODE 1!@#USER_ID 27!@#ACTIVITY_CODE 5
12/11/2022 03:05:52 PM script INFO: SUCCESS!@#KODE 1!@#USER_ID 27!@#ACTIVITY_CODE 5
12/11/2022 03:05:52 PM script INFO: SUCCESS!@#KODE 1!@#USER_ID 27!@#ACTIVITY_CODE 5
12/11/2022 03:05:54 PM script INFO: SUCCESS!@#KODE 1!@#USER_ID 27!@#ACTIVITY_CODE 4
12/11/2022 03:05:54 PM script INFO: SUCCESS!@#KODE 1!@#USER_ID 27!@#ACTIVITY_CODE 2
12/11/2022 03:05:55 PM script INFO: SUCCESS!@#KODE 1!@#USER_ID 27!@#ACTIVITY_CODE 2
12/11/2022 03:05:55 PM script INFO: SUCCESS!@#KODE 1!@#USER_ID 27!@#ACTIVITY_CODE 1
12/11/2022 03:05:55 PM script INFO: SUCCESS!@#KODE 1!@#USER_ID 27!@#ACTIVITY_CODE 3
12/11/2022 03:05:55 PM script INFO: SUCCESS!@#KODE 1!@#USER_ID 27!@#ACTIVITY_CODE 4
12/11/2022 03:05:55 PM script INFO: SUCCESS!@#KODE 1!@#USER_ID 27!@#ACTIVITY_CODE 3
12/11/2022 03:05:55 PM script INFO: SUCCESS!@#KODE 1!@#USER_ID 27!@#ACTIVITY_CODE 2
12/11/2022 03:05:55 PM script INFO: SUCCESS!@#KODE 1!@#USER_ID 27!@#ACTIVITY_CODE 5
12/11/2022 03:05:55 PM script INFO: SUCCESS!@#KODE 1!@#USER_ID 27!@#ACTIVITY_CODE 5
12/11/2022 03:05:58 PM script INFO: SUCCESS!@#KODE 1!@#USER_ID 27!@#ACTIVITY_CODE 3
12/11/2022 03:05:58 PM script INFO: SUCCESS!@#KODE 1!@#USER_ID 27!@#ACTIVITY_CODE 2
12/11/2022 03:05:58 PM script INFO: SUCCESS!@#KODE 1!@#USER_ID 27!@#ACTIVITY_CODE 3
12/11/2022 03:05:58 PM script INFO: SUCCESS!@#KODE 1!@#USER_ID 27!@#ACTIVITY_CODE 1
12/11/2022 03:05:58 PM script INFO: SUCCESS!@#KODE 1!@#USER_ID 27!@#ACTIVITY_CODE 1
12/11/2022 03:05:58 PM script INFO: SUCCESS!@#KODE 1!@#USER_ID 27!@#ACTIVITY_CODE 1
12/11/2022 03:05:58 PM script INFO: SUCCESS!@#KODE 1!@#USER_ID 27!@#ACTIVITY_CODE 2
12/11/2022 03:05:58 PM script INFO: SUCCESS!@#KODE 1!@#USER_ID 27!@#ACTIVITY_CODE 5
12/11/2022 03:05:58 PM script INFO: SUCCESS!@#KODE 1!@#USER_ID 27!@#ACTIVITY_CODE 5
12/11/2022 03:06:01 PM script INFO: SUCCESS!@#KODE 1!@#USER_ID 27!@#ACTIVITY_CODE 1
12/11/2022 03:06:01 PM script INFO: SUCCESS!@#KODE 1!@#USER_ID 27!@#ACTIVITY_CODE 2
12/11/2022 03:06:01 PM script INFO: SUCCESS!@#KODE 1!@#USER_ID 27!@#ACTIVITY_CODE 1
12/11/2022 03:06:01 PM script INFO: SUCCESS!@#KODE 1!@#USER_ID 27!@#ACTIVITY_CODE 4
12/11/2022 03:06:01 PM script INFO: SUCCESS!@#KODE 1!@#USER_ID 27!@#ACTIVITY_CODE 3
12/11/2022 03:06:01 PM script INFO: SUCCESS!@#KODE 1!@#USER_ID 27!@#ACTIVITY_CODE 2
12/11/2022 03:06:01 PM script INFO: SUCCESS!@#KODE 1!@#USER_ID 27!@#ACTIVITY_CODE 1
12/11/2022 03:06:01 PM script INFO: SUCCESS!@#KODE 1!@#USER_ID 27!@#ACTIVITY_CODE 1
12/11/2022 03:06:01 PM script INFO: SUCCESS!@#KODE 1!@#USER_ID 27!@#ACTIVITY_CODE 1
12/11/2022 03:06:01 PM script INFO: SUCCESS!@#KODE 1!@#USER_ID 27!@#ACTIVITY_CODE 1
12/11/2022 03:06:01 PM script INFO: SUCCESS!@#KODE 1!@#USER_ID 27!@#ACTIVITY_CODE 3
12/11/2022 03:06:02 PM script INFO: SUCCESS!@#KODE 1!@#USER_ID 27!@#ACTIVITY_CODE 2
12/11/2022 03:06:02 PM script INFO: SUCCESS!@#KODE 1!@#USER_ID 27!@#ACTIVITY_CODE 1
12/11/2022 03:06:02 PM script INFO: SUCCESS!@#KODE 1!@#USER_ID 27!@#ACTIVITY_CODE 3
12/11/2022 03:06:02 PM script INFO: SUCCESS!@#KODE 1!@#USER_ID 27!@#ACTIVITY_CODE 4
12/11/2022 03:06:02 PM script INFO: SUCCESS!@#KODE 1!@#USER_ID 27!@#ACTIVITY_CODE 2
12/11/2022 03:06:02 PM script INFO: SUCCESS!@#KODE 1!@#USER_ID 27!@#ACTIVITY_CODE 3
12/11/2022 03:06:02 PM script INFO: SUCCESS!@#KODE 1!@#USER_ID 27!@#ACTIVITY_CODE 3
12/11/2022 03:06:02 PM script INFO: Duration: 18.093832969665527
12/11/2022 03:06:02 PM script INFO: mengakhiri-quiz
12/11/2022 03:06:18 PM script INFO: SUCCESS!@#KODE 1!@#USER_ID 27!@#ACTIVITY_CODE 5
12/11/2022 03:06:18 PM script INFO: berhasil-submit
