12/21/2022 01:28:08 PM script INFO: Prepared chrome options..
12/21/2022 01:28:09 PM script INFO: Initialized chrome browser..
12/21/2022 01:28:09 PM script INFO: mengakses-homepage
12/21/2022 01:28:35 PM script INFO: mengakses-login-page
12/21/2022 01:28:58 PM script INFO: mengakses-site-home
12/21/2022 01:29:03 PM script INFO: mengakses-site-course
12/21/2022 01:29:33 PM script INFO: mengakses-quiz
12/21/2022 01:29:34 PM script INFO: mengakses-start-quiz-page
12/21/2022 01:29:35 PM script INFO: memulai-quiz
12/21/2022 01:29:35 PM script INFO: SUCCESS!@#KODE 1!@#USER_ID 70!@#ACTIVITY_CODE 5
12/21/2022 01:29:45 PM script INFO: SUCCESS!@#KODE 1!@#USER_ID 70!@#ACTIVITY_CODE 2
12/21/2022 01:29:46 PM script INFO: SUCCESS!@#KODE 1!@#USER_ID 70!@#ACTIVITY_CODE 2
12/21/2022 01:29:46 PM script INFO: SUCCESS!@#KODE 1!@#USER_ID 70!@#ACTIVITY_CODE 3
12/21/2022 01:29:46 PM script INFO: SUCCESS!@#KODE 1!@#USER_ID 70!@#ACTIVITY_CODE 1
12/21/2022 01:29:46 PM script INFO: SUCCESS!@#KODE 1!@#USER_ID 70!@#ACTIVITY_CODE 1
12/21/2022 01:29:46 PM script INFO: SUCCESS!@#KODE 1!@#USER_ID 70!@#ACTIVITY_CODE 4
12/21/2022 01:29:46 PM script INFO: SUCCESS!@#KODE 1!@#USER_ID 70!@#ACTIVITY_CODE 3
12/21/2022 01:29:46 PM script INFO: SUCCESS!@#KODE 1!@#USER_ID 70!@#ACTIVITY_CODE 1
12/21/2022 01:29:46 PM script INFO: SUCCESS!@#KODE 1!@#USER_ID 70!@#ACTIVITY_CODE 1
12/21/2022 01:29:46 PM script INFO: SUCCESS!@#KODE 1!@#USER_ID 70!@#ACTIVITY_CODE 5
12/21/2022 01:29:46 PM script INFO: SUCCESS!@#KODE 1!@#USER_ID 70!@#ACTIVITY_CODE 5
12/21/2022 01:29:49 PM script INFO: SUCCESS!@#KODE 1!@#USER_ID 70!@#ACTIVITY_CODE 1
12/21/2022 01:29:49 PM script INFO: SUCCESS!@#KODE 1!@#USER_ID 70!@#ACTIVITY_CODE 5
12/21/2022 01:29:49 PM script INFO: SUCCESS!@#KODE 1!@#USER_ID 70!@#ACTIVITY_CODE 5
12/21/2022 01:29:51 PM script INFO: SUCCESS!@#KODE 1!@#USER_ID 70!@#ACTIVITY_CODE 4
12/21/2022 01:29:51 PM script INFO: SUCCESS!@#KODE 1!@#USER_ID 70!@#ACTIVITY_CODE 1
12/21/2022 01:29:51 PM script INFO: SUCCESS!@#KODE 1!@#USER_ID 70!@#ACTIVITY_CODE 3
12/21/2022 01:29:51 PM script INFO: SUCCESS!@#KODE 1!@#USER_ID 70!@#ACTIVITY_CODE 3
12/21/2022 01:29:51 PM script INFO: SUCCESS!@#KODE 1!@#USER_ID 70!@#ACTIVITY_CODE 5
12/21/2022 01:29:51 PM script INFO: SUCCESS!@#KODE 1!@#USER_ID 70!@#ACTIVITY_CODE 5
12/21/2022 01:29:54 PM script INFO: SUCCESS!@#KODE 1!@#USER_ID 70!@#ACTIVITY_CODE 3
12/21/2022 01:29:54 PM script INFO: SUCCESS!@#KODE 1!@#USER_ID 70!@#ACTIVITY_CODE 4
12/21/2022 01:29:54 PM script INFO: SUCCESS!@#KODE 1!@#USER_ID 70!@#ACTIVITY_CODE 5
12/21/2022 01:29:54 PM script INFO: SUCCESS!@#KODE 1!@#USER_ID 70!@#ACTIVITY_CODE 5
12/21/2022 01:29:57 PM script INFO: SUCCESS!@#KODE 1!@#USER_ID 70!@#ACTIVITY_CODE 1
12/21/2022 01:29:57 PM script INFO: SUCCESS!@#KODE 1!@#USER_ID 70!@#ACTIVITY_CODE 2
12/21/2022 01:29:57 PM script INFO: SUCCESS!@#KODE 1!@#USER_ID 70!@#ACTIVITY_CODE 1
12/21/2022 01:29:57 PM script INFO: SUCCESS!@#KODE 1!@#USER_ID 70!@#ACTIVITY_CODE 1
12/21/2022 01:29:57 PM script INFO: SUCCESS!@#KODE 1!@#USER_ID 70!@#ACTIVITY_CODE 3
12/21/2022 01:29:57 PM script INFO: SUCCESS!@#KODE 1!@#USER_ID 70!@#ACTIVITY_CODE 3
12/21/2022 01:29:57 PM script INFO: SUCCESS!@#KODE 1!@#USER_ID 70!@#ACTIVITY_CODE 4
12/21/2022 01:29:57 PM script INFO: SUCCESS!@#KODE 1!@#USER_ID 70!@#ACTIVITY_CODE 5
12/21/2022 01:29:57 PM script INFO: SUCCESS!@#KODE 1!@#USER_ID 70!@#ACTIVITY_CODE 5
12/21/2022 01:30:00 PM script INFO: SUCCESS!@#KODE 1!@#USER_ID 70!@#ACTIVITY_CODE 3
12/21/2022 01:30:00 PM script INFO: SUCCESS!@#KODE 1!@#USER_ID 70!@#ACTIVITY_CODE 5
12/21/2022 01:30:00 PM script INFO: SUCCESS!@#KODE 1!@#USER_ID 70!@#ACTIVITY_CODE 5
12/21/2022 01:30:02 PM script INFO: SUCCESS!@#KODE 1!@#USER_ID 70!@#ACTIVITY_CODE 2
12/21/2022 01:30:02 PM script INFO: SUCCESS!@#KODE 1!@#USER_ID 70!@#ACTIVITY_CODE 1
12/21/2022 01:30:02 PM script INFO: SUCCESS!@#KODE 1!@#USER_ID 70!@#ACTIVITY_CODE 2
12/21/2022 01:30:03 PM script INFO: SUCCESS!@#KODE 1!@#USER_ID 70!@#ACTIVITY_CODE 2
12/21/2022 01:30:03 PM script INFO: SUCCESS!@#KODE 1!@#USER_ID 70!@#ACTIVITY_CODE 1
12/21/2022 01:30:03 PM script INFO: SUCCESS!@#KODE 1!@#USER_ID 70!@#ACTIVITY_CODE 2
12/21/2022 01:30:03 PM script INFO: SUCCESS!@#KODE 1!@#USER_ID 70!@#ACTIVITY_CODE 1
12/21/2022 01:30:03 PM script INFO: SUCCESS!@#KODE 1!@#USER_ID 70!@#ACTIVITY_CODE 3
12/21/2022 01:30:03 PM script INFO: SUCCESS!@#KODE 1!@#USER_ID 70!@#ACTIVITY_CODE 3
12/21/2022 01:30:03 PM script INFO: SUCCESS!@#KODE 1!@#USER_ID 70!@#ACTIVITY_CODE 3
12/21/2022 01:30:03 PM script INFO: SUCCESS!@#KODE 1!@#USER_ID 70!@#ACTIVITY_CODE 3
12/21/2022 01:30:03 PM script INFO: SUCCESS!@#KODE 1!@#USER_ID 70!@#ACTIVITY_CODE 2
12/21/2022 01:30:03 PM script INFO: Duration: 18.004598379135132
12/21/2022 01:30:03 PM script INFO: mengakhiri-quiz
12/21/2022 01:30:08 PM script INFO: SUCCESS!@#KODE 1!@#USER_ID 70!@#ACTIVITY_CODE 5
12/21/2022 01:30:08 PM script INFO: berhasil-submit
12/21/2022 01:31:38 PM script ERROR: TIMEOUT EXCEPTION!@#KODE 0!@#LOCATION berhasil-submit
12/21/2022 01:31:38 PM main_worker ERROR: Message: None

