12/23/2022 01:17:54 AM script INFO: Prepared chrome options..
12/23/2022 01:17:56 AM script INFO: Initialized chrome browser..
12/23/2022 01:17:56 AM script INFO: mengakses-homepage
12/23/2022 01:19:27 AM script INFO: mengakses-login-page
12/23/2022 01:20:02 AM script INFO: mengakses-site-home
12/23/2022 01:20:11 AM script INFO: mengakses-site-course
12/23/2022 01:20:43 AM script INFO: mengakses-quiz
12/23/2022 01:20:56 AM script INFO: mengakses-start-quiz-page
12/23/2022 01:21:48 AM script INFO: memulai-quiz
12/23/2022 01:21:48 AM script INFO: SUCCESS!@#KODE 1!@#USER_ID 100!@#ACTIVITY_CODE 5
12/23/2022 01:21:59 AM script INFO: SUCCESS!@#KODE 1!@#USER_ID 100!@#ACTIVITY_CODE 5
12/23/2022 01:21:59 AM script INFO: SUCCESS!@#KODE 1!@#USER_ID 100!@#ACTIVITY_CODE 5
12/23/2022 01:22:01 AM script INFO: SUCCESS!@#KODE 1!@#USER_ID 100!@#ACTIVITY_CODE 2
12/23/2022 01:22:01 AM script INFO: SUCCESS!@#KODE 1!@#USER_ID 100!@#ACTIVITY_CODE 3
12/23/2022 01:22:01 AM script INFO: SUCCESS!@#KODE 1!@#USER_ID 100!@#ACTIVITY_CODE 3
12/23/2022 01:22:02 AM script INFO: SUCCESS!@#KODE 1!@#USER_ID 100!@#ACTIVITY_CODE 2
12/23/2022 01:22:02 AM script INFO: SUCCESS!@#KODE 1!@#USER_ID 100!@#ACTIVITY_CODE 3
12/23/2022 01:22:02 AM script INFO: SUCCESS!@#KODE 1!@#USER_ID 100!@#ACTIVITY_CODE 2
12/23/2022 01:22:02 AM script INFO: SUCCESS!@#KODE 1!@#USER_ID 100!@#ACTIVITY_CODE 5
12/23/2022 01:22:02 AM script INFO: SUCCESS!@#KODE 1!@#USER_ID 100!@#ACTIVITY_CODE 5
12/23/2022 01:22:04 AM script INFO: SUCCESS!@#KODE 1!@#USER_ID 100!@#ACTIVITY_CODE 5
12/23/2022 01:22:04 AM script INFO: SUCCESS!@#KODE 1!@#USER_ID 100!@#ACTIVITY_CODE 5
12/23/2022 01:22:07 AM script INFO: SUCCESS!@#KODE 1!@#USER_ID 100!@#ACTIVITY_CODE 5
12/23/2022 01:22:07 AM script INFO: SUCCESS!@#KODE 1!@#USER_ID 100!@#ACTIVITY_CODE 5
12/23/2022 01:22:09 AM script INFO: SUCCESS!@#KODE 1!@#USER_ID 100!@#ACTIVITY_CODE 5
12/23/2022 01:22:09 AM script INFO: SUCCESS!@#KODE 1!@#USER_ID 100!@#ACTIVITY_CODE 5
12/23/2022 01:22:12 AM script INFO: SUCCESS!@#KODE 1!@#USER_ID 100!@#ACTIVITY_CODE 2
12/23/2022 01:22:12 AM script INFO: SUCCESS!@#KODE 1!@#USER_ID 100!@#ACTIVITY_CODE 3
12/23/2022 01:22:12 AM script INFO: SUCCESS!@#KODE 1!@#USER_ID 100!@#ACTIVITY_CODE 1
12/23/2022 01:22:12 AM script INFO: SUCCESS!@#KODE 1!@#USER_ID 100!@#ACTIVITY_CODE 5
12/23/2022 01:22:12 AM script INFO: SUCCESS!@#KODE 1!@#USER_ID 100!@#ACTIVITY_CODE 5
12/23/2022 01:22:15 AM script INFO: SUCCESS!@#KODE 1!@#USER_ID 100!@#ACTIVITY_CODE 1
12/23/2022 01:22:15 AM script INFO: SUCCESS!@#KODE 1!@#USER_ID 100!@#ACTIVITY_CODE 2
12/23/2022 01:22:15 AM script INFO: SUCCESS!@#KODE 1!@#USER_ID 100!@#ACTIVITY_CODE 5
12/23/2022 01:22:15 AM script INFO: SUCCESS!@#KODE 1!@#USER_ID 100!@#ACTIVITY_CODE 5
12/23/2022 01:22:17 AM script INFO: SUCCESS!@#KODE 1!@#USER_ID 100!@#ACTIVITY_CODE 2
12/23/2022 01:22:17 AM script INFO: SUCCESS!@#KODE 1!@#USER_ID 100!@#ACTIVITY_CODE 1
12/23/2022 01:22:17 AM script INFO: SUCCESS!@#KODE 1!@#USER_ID 100!@#ACTIVITY_CODE 1
12/23/2022 01:22:17 AM script INFO: SUCCESS!@#KODE 1!@#USER_ID 100!@#ACTIVITY_CODE 5
12/23/2022 01:22:17 AM script INFO: SUCCESS!@#KODE 1!@#USER_ID 100!@#ACTIVITY_CODE 5
12/23/2022 01:22:20 AM script INFO: SUCCESS!@#KODE 1!@#USER_ID 100!@#ACTIVITY_CODE 1
12/23/2022 01:22:20 AM script INFO: SUCCESS!@#KODE 1!@#USER_ID 100!@#ACTIVITY_CODE 3
12/23/2022 01:22:20 AM script INFO: SUCCESS!@#KODE 1!@#USER_ID 100!@#ACTIVITY_CODE 3
12/23/2022 01:22:20 AM script INFO: SUCCESS!@#KODE 1!@#USER_ID 100!@#ACTIVITY_CODE 2
12/23/2022 01:22:20 AM script INFO: SUCCESS!@#KODE 1!@#USER_ID 100!@#ACTIVITY_CODE 1
12/23/2022 01:22:20 AM script INFO: SUCCESS!@#KODE 1!@#USER_ID 100!@#ACTIVITY_CODE 1
12/23/2022 01:22:20 AM script INFO: SUCCESS!@#KODE 1!@#USER_ID 100!@#ACTIVITY_CODE 2
12/23/2022 01:22:20 AM script INFO: SUCCESS!@#KODE 1!@#USER_ID 100!@#ACTIVITY_CODE 1
12/23/2022 01:22:21 AM script INFO: SUCCESS!@#KODE 1!@#USER_ID 100!@#ACTIVITY_CODE 3
12/23/2022 01:22:21 AM script INFO: SUCCESS!@#KODE 1!@#USER_ID 100!@#ACTIVITY_CODE 1
12/23/2022 01:22:21 AM script INFO: SUCCESS!@#KODE 1!@#USER_ID 100!@#ACTIVITY_CODE 4
12/23/2022 01:22:21 AM script INFO: SUCCESS!@#KODE 1!@#USER_ID 100!@#ACTIVITY_CODE 3
12/23/2022 01:22:21 AM script INFO: SUCCESS!@#KODE 1!@#USER_ID 100!@#ACTIVITY_CODE 2
12/23/2022 01:22:21 AM script INFO: SUCCESS!@#KODE 1!@#USER_ID 100!@#ACTIVITY_CODE 5
12/23/2022 01:22:21 AM script INFO: SUCCESS!@#KODE 1!@#USER_ID 100!@#ACTIVITY_CODE 5
12/23/2022 01:22:23 AM script INFO: SUCCESS!@#KODE 1!@#USER_ID 100!@#ACTIVITY_CODE 3
12/23/2022 01:22:24 AM script INFO: SUCCESS!@#KODE 1!@#USER_ID 100!@#ACTIVITY_CODE 2
12/23/2022 01:22:24 AM script INFO: SUCCESS!@#KODE 1!@#USER_ID 100!@#ACTIVITY_CODE 5
12/23/2022 01:22:24 AM script INFO: SUCCESS!@#KODE 1!@#USER_ID 100!@#ACTIVITY_CODE 5
12/23/2022 01:22:26 AM script INFO: SUCCESS!@#KODE 1!@#USER_ID 100!@#ACTIVITY_CODE 1
12/23/2022 01:22:26 AM script INFO: SUCCESS!@#KODE 1!@#USER_ID 100!@#ACTIVITY_CODE 4
12/23/2022 01:22:26 AM script INFO: SUCCESS!@#KODE 1!@#USER_ID 100!@#ACTIVITY_CODE 5
12/23/2022 01:22:26 AM script INFO: SUCCESS!@#KODE 1!@#USER_ID 100!@#ACTIVITY_CODE 5
12/23/2022 01:22:29 AM script INFO: SUCCESS!@#KODE 1!@#USER_ID 100!@#ACTIVITY_CODE 1
12/23/2022 01:22:29 AM script INFO: SUCCESS!@#KODE 1!@#USER_ID 100!@#ACTIVITY_CODE 4
12/23/2022 01:22:29 AM script INFO: SUCCESS!@#KODE 1!@#USER_ID 100!@#ACTIVITY_CODE 2
12/23/2022 01:22:29 AM script INFO: SUCCESS!@#KODE 1!@#USER_ID 100!@#ACTIVITY_CODE 3
12/23/2022 01:22:29 AM script INFO: SUCCESS!@#KODE 1!@#USER_ID 100!@#ACTIVITY_CODE 1
12/23/2022 01:22:29 AM script INFO: SUCCESS!@#KODE 1!@#USER_ID 100!@#ACTIVITY_CODE 3
12/23/2022 01:22:29 AM script INFO: SUCCESS!@#KODE 1!@#USER_ID 100!@#ACTIVITY_CODE 3
12/23/2022 01:22:29 AM script INFO: SUCCESS!@#KODE 1!@#USER_ID 100!@#ACTIVITY_CODE 4
12/23/2022 01:22:29 AM script INFO: SUCCESS!@#KODE 1!@#USER_ID 100!@#ACTIVITY_CODE 1
12/23/2022 01:22:29 AM script INFO: SUCCESS!@#KODE 1!@#USER_ID 100!@#ACTIVITY_CODE 4
12/23/2022 01:22:29 AM script INFO: SUCCESS!@#KODE 1!@#USER_ID 100!@#ACTIVITY_CODE 2
12/23/2022 01:22:29 AM script INFO: SUCCESS!@#KODE 1!@#USER_ID 100!@#ACTIVITY_CODE 1
12/23/2022 01:22:30 AM script INFO: SUCCESS!@#KODE 1!@#USER_ID 100!@#ACTIVITY_CODE 3
12/23/2022 01:22:30 AM script INFO: SUCCESS!@#KODE 1!@#USER_ID 100!@#ACTIVITY_CODE 3
12/23/2022 01:22:30 AM script INFO: SUCCESS!@#KODE 1!@#USER_ID 100!@#ACTIVITY_CODE 3
12/23/2022 01:22:30 AM script INFO: SUCCESS!@#KODE 1!@#USER_ID 100!@#ACTIVITY_CODE 2
12/23/2022 01:22:30 AM script INFO: SUCCESS!@#KODE 1!@#USER_ID 100!@#ACTIVITY_CODE 3
12/23/2022 01:22:30 AM script INFO: SUCCESS!@#KODE 1!@#USER_ID 100!@#ACTIVITY_CODE 1
12/23/2022 01:22:30 AM script INFO: SUCCESS!@#KODE 1!@#USER_ID 100!@#ACTIVITY_CODE 2
12/23/2022 01:22:30 AM script INFO: SUCCESS!@#KODE 1!@#USER_ID 100!@#ACTIVITY_CODE 3
12/23/2022 01:22:30 AM script INFO: SUCCESS!@#KODE 1!@#USER_ID 100!@#ACTIVITY_CODE 1
12/23/2022 01:22:30 AM script INFO: SUCCESS!@#KODE 1!@#USER_ID 100!@#ACTIVITY_CODE 1
12/23/2022 01:22:30 AM script INFO: SUCCESS!@#KODE 1!@#USER_ID 100!@#ACTIVITY_CODE 1
12/23/2022 01:22:30 AM script INFO: SUCCESS!@#KODE 1!@#USER_ID 100!@#ACTIVITY_CODE 3
12/23/2022 01:22:30 AM script INFO: SUCCESS!@#KODE 1!@#USER_ID 100!@#ACTIVITY_CODE 2
12/23/2022 01:22:30 AM script INFO: SUCCESS!@#KODE 1!@#USER_ID 100!@#ACTIVITY_CODE 3
12/23/2022 01:22:30 AM script INFO: SUCCESS!@#KODE 1!@#USER_ID 100!@#ACTIVITY_CODE 1
12/23/2022 01:22:31 AM script INFO: SUCCESS!@#KODE 1!@#USER_ID 100!@#ACTIVITY_CODE 2
12/23/2022 01:22:31 AM script INFO: SUCCESS!@#KODE 1!@#USER_ID 100!@#ACTIVITY_CODE 4
12/23/2022 01:22:31 AM script INFO: SUCCESS!@#KODE 1!@#USER_ID 100!@#ACTIVITY_CODE 2
12/23/2022 01:22:31 AM script INFO: SUCCESS!@#KODE 1!@#USER_ID 100!@#ACTIVITY_CODE 3
12/23/2022 01:22:31 AM script INFO: SUCCESS!@#KODE 1!@#USER_ID 100!@#ACTIVITY_CODE 1
12/23/2022 01:22:31 AM script INFO: SUCCESS!@#KODE 1!@#USER_ID 100!@#ACTIVITY_CODE 1
12/23/2022 01:22:31 AM script INFO: SUCCESS!@#KODE 1!@#USER_ID 100!@#ACTIVITY_CODE 2
12/23/2022 01:22:31 AM script INFO: SUCCESS!@#KODE 1!@#USER_ID 100!@#ACTIVITY_CODE 2
12/23/2022 01:22:31 AM script INFO: SUCCESS!@#KODE 1!@#USER_ID 100!@#ACTIVITY_CODE 2
12/23/2022 01:22:31 AM script INFO: SUCCESS!@#KODE 1!@#USER_ID 100!@#ACTIVITY_CODE 2
12/23/2022 01:22:31 AM script INFO: SUCCESS!@#KODE 1!@#USER_ID 100!@#ACTIVITY_CODE 1
12/23/2022 01:22:31 AM script INFO: SUCCESS!@#KODE 1!@#USER_ID 100!@#ACTIVITY_CODE 3
12/23/2022 01:22:31 AM script INFO: SUCCESS!@#KODE 1!@#USER_ID 100!@#ACTIVITY_CODE 1
12/23/2022 01:22:32 AM script INFO: SUCCESS!@#KODE 1!@#USER_ID 100!@#ACTIVITY_CODE 1
12/23/2022 01:22:32 AM script INFO: SUCCESS!@#KODE 1!@#USER_ID 100!@#ACTIVITY_CODE 2
12/23/2022 01:22:32 AM script INFO: SUCCESS!@#KODE 1!@#USER_ID 100!@#ACTIVITY_CODE 2
12/23/2022 01:22:32 AM script INFO: SUCCESS!@#KODE 1!@#USER_ID 100!@#ACTIVITY_CODE 4
12/23/2022 01:22:32 AM script INFO: SUCCESS!@#KODE 1!@#USER_ID 100!@#ACTIVITY_CODE 3
12/23/2022 01:22:32 AM script INFO: Duration: 33.23747634887695
12/23/2022 01:22:32 AM script INFO: mengakhiri-quiz
12/23/2022 01:22:36 AM script INFO: SUCCESS!@#KODE 1!@#USER_ID 100!@#ACTIVITY_CODE 5
12/23/2022 01:22:36 AM script INFO: berhasil-submit
