12/21/2022 01:28:08 PM script INFO: Prepared chrome options..
12/21/2022 01:28:09 PM script INFO: Initialized chrome browser..
12/21/2022 01:28:09 PM script INFO: mengakses-homepage
12/21/2022 01:28:17 PM script INFO: mengakses-login-page
12/21/2022 01:28:22 PM script INFO: mengakses-site-home
12/21/2022 01:28:53 PM script INFO: mengakses-site-course
12/21/2022 01:29:19 PM script INFO: mengakses-quiz
12/21/2022 01:29:23 PM script INFO: mengakses-start-quiz-page
12/21/2022 01:29:46 PM script INFO: memulai-quiz
12/21/2022 01:29:46 PM script INFO: SUCCESS!@#KODE 1!@#USER_ID 18!@#ACTIVITY_CODE 5
12/21/2022 01:29:57 PM script INFO: SUCCESS!@#KODE 1!@#USER_ID 18!@#ACTIVITY_CODE 5
12/21/2022 01:29:57 PM script INFO: SUCCESS!@#KODE 1!@#USER_ID 18!@#ACTIVITY_CODE 5
12/21/2022 01:29:59 PM script INFO: SUCCESS!@#KODE 1!@#USER_ID 18!@#ACTIVITY_CODE 5
12/21/2022 01:29:59 PM script INFO: SUCCESS!@#KODE 1!@#USER_ID 18!@#ACTIVITY_CODE 5
12/21/2022 01:30:02 PM script INFO: SUCCESS!@#KODE 1!@#USER_ID 18!@#ACTIVITY_CODE 3
12/21/2022 01:30:02 PM script INFO: SUCCESS!@#KODE 1!@#USER_ID 18!@#ACTIVITY_CODE 2
12/21/2022 01:30:02 PM script INFO: SUCCESS!@#KODE 1!@#USER_ID 18!@#ACTIVITY_CODE 2
12/21/2022 01:30:02 PM script INFO: SUCCESS!@#KODE 1!@#USER_ID 18!@#ACTIVITY_CODE 3
12/21/2022 01:30:02 PM script INFO: SUCCESS!@#KODE 1!@#USER_ID 18!@#ACTIVITY_CODE 3
12/21/2022 01:30:03 PM script INFO: SUCCESS!@#KODE 1!@#USER_ID 18!@#ACTIVITY_CODE 2
12/21/2022 01:30:03 PM script INFO: SUCCESS!@#KODE 1!@#USER_ID 18!@#ACTIVITY_CODE 5
12/21/2022 01:30:03 PM script INFO: SUCCESS!@#KODE 1!@#USER_ID 18!@#ACTIVITY_CODE 5
12/21/2022 01:30:05 PM script INFO: SUCCESS!@#KODE 1!@#USER_ID 18!@#ACTIVITY_CODE 5
12/21/2022 01:30:05 PM script INFO: SUCCESS!@#KODE 1!@#USER_ID 18!@#ACTIVITY_CODE 5
12/21/2022 01:30:08 PM script INFO: SUCCESS!@#KODE 1!@#USER_ID 18!@#ACTIVITY_CODE 2
12/21/2022 01:30:08 PM script INFO: SUCCESS!@#KODE 1!@#USER_ID 18!@#ACTIVITY_CODE 2
12/21/2022 01:30:08 PM script INFO: SUCCESS!@#KODE 1!@#USER_ID 18!@#ACTIVITY_CODE 5
12/21/2022 01:30:08 PM script INFO: SUCCESS!@#KODE 1!@#USER_ID 18!@#ACTIVITY_CODE 5
12/21/2022 01:30:10 PM script INFO: SUCCESS!@#KODE 1!@#USER_ID 18!@#ACTIVITY_CODE 1
12/21/2022 01:30:10 PM script INFO: SUCCESS!@#KODE 1!@#USER_ID 18!@#ACTIVITY_CODE 3
12/21/2022 01:30:11 PM script INFO: SUCCESS!@#KODE 1!@#USER_ID 18!@#ACTIVITY_CODE 1
12/21/2022 01:30:11 PM script INFO: SUCCESS!@#KODE 1!@#USER_ID 18!@#ACTIVITY_CODE 5
12/21/2022 01:30:11 PM script INFO: SUCCESS!@#KODE 1!@#USER_ID 18!@#ACTIVITY_CODE 5
12/21/2022 01:30:13 PM script INFO: SUCCESS!@#KODE 1!@#USER_ID 18!@#ACTIVITY_CODE 4
12/21/2022 01:30:13 PM script INFO: SUCCESS!@#KODE 1!@#USER_ID 18!@#ACTIVITY_CODE 3
12/21/2022 01:30:13 PM script INFO: SUCCESS!@#KODE 1!@#USER_ID 18!@#ACTIVITY_CODE 3
12/21/2022 01:30:13 PM script INFO: SUCCESS!@#KODE 1!@#USER_ID 18!@#ACTIVITY_CODE 3
12/21/2022 01:30:13 PM script INFO: SUCCESS!@#KODE 1!@#USER_ID 18!@#ACTIVITY_CODE 3
12/21/2022 01:30:13 PM script INFO: SUCCESS!@#KODE 1!@#USER_ID 18!@#ACTIVITY_CODE 3
12/21/2022 01:30:13 PM script INFO: SUCCESS!@#KODE 1!@#USER_ID 18!@#ACTIVITY_CODE 3
12/21/2022 01:30:13 PM script INFO: SUCCESS!@#KODE 1!@#USER_ID 18!@#ACTIVITY_CODE 3
12/21/2022 01:30:14 PM script INFO: SUCCESS!@#KODE 1!@#USER_ID 18!@#ACTIVITY_CODE 3
12/21/2022 01:30:14 PM script INFO: SUCCESS!@#KODE 1!@#USER_ID 18!@#ACTIVITY_CODE 2
12/21/2022 01:30:14 PM script INFO: SUCCESS!@#KODE 1!@#USER_ID 18!@#ACTIVITY_CODE 3
12/21/2022 01:30:14 PM script INFO: SUCCESS!@#KODE 1!@#USER_ID 18!@#ACTIVITY_CODE 1
12/21/2022 01:30:14 PM script INFO: SUCCESS!@#KODE 1!@#USER_ID 18!@#ACTIVITY_CODE 1
12/21/2022 01:30:14 PM script INFO: SUCCESS!@#KODE 1!@#USER_ID 18!@#ACTIVITY_CODE 3
12/21/2022 01:30:14 PM script INFO: SUCCESS!@#KODE 1!@#USER_ID 18!@#ACTIVITY_CODE 2
12/21/2022 01:30:14 PM script INFO: SUCCESS!@#KODE 1!@#USER_ID 18!@#ACTIVITY_CODE 2
12/21/2022 01:30:14 PM script INFO: SUCCESS!@#KODE 1!@#USER_ID 18!@#ACTIVITY_CODE 3
12/21/2022 01:30:14 PM script INFO: SUCCESS!@#KODE 1!@#USER_ID 18!@#ACTIVITY_CODE 2
12/21/2022 01:30:14 PM script INFO: SUCCESS!@#KODE 1!@#USER_ID 18!@#ACTIVITY_CODE 3
12/21/2022 01:30:15 PM script INFO: SUCCESS!@#KODE 1!@#USER_ID 18!@#ACTIVITY_CODE 1
12/21/2022 01:30:15 PM script INFO: SUCCESS!@#KODE 1!@#USER_ID 18!@#ACTIVITY_CODE 1
12/21/2022 01:30:15 PM script INFO: SUCCESS!@#KODE 1!@#USER_ID 18!@#ACTIVITY_CODE 4
12/21/2022 01:30:15 PM script INFO: SUCCESS!@#KODE 1!@#USER_ID 18!@#ACTIVITY_CODE 3
12/21/2022 01:30:15 PM script INFO: SUCCESS!@#KODE 1!@#USER_ID 18!@#ACTIVITY_CODE 1
12/21/2022 01:30:15 PM script INFO: SUCCESS!@#KODE 1!@#USER_ID 18!@#ACTIVITY_CODE 1
12/21/2022 01:30:15 PM script INFO: Duration: 18.18230676651001
12/21/2022 01:30:15 PM script INFO: mengakhiri-quiz
12/21/2022 01:30:22 PM script INFO: SUCCESS!@#KODE 1!@#USER_ID 18!@#ACTIVITY_CODE 5
12/21/2022 01:30:22 PM script INFO: berhasil-submit
