12/23/2022 05:52:03 AM script INFO: Prepared chrome options..
12/23/2022 05:52:04 AM script INFO: Initialized chrome browser..
12/23/2022 05:52:04 AM script INFO: mengakses-homepage
12/23/2022 05:52:22 AM script INFO: mengakses-login-page
12/23/2022 05:53:06 AM script INFO: mengakses-site-home
12/23/2022 05:53:17 AM script INFO: mengakses-site-course
12/23/2022 05:54:00 AM script INFO: mengakses-quiz
12/23/2022 05:54:12 AM script INFO: mengakses-start-quiz-page
12/23/2022 05:54:28 AM script INFO: memulai-quiz
12/23/2022 05:54:28 AM script INFO: SUCCESS!@#KODE 1!@#USER_ID 71!@#ACTIVITY_CODE 5
12/23/2022 05:54:39 AM script INFO: SUCCESS!@#KODE 1!@#USER_ID 71!@#ACTIVITY_CODE 2
12/23/2022 05:54:39 AM script INFO: SUCCESS!@#KODE 1!@#USER_ID 71!@#ACTIVITY_CODE 2
12/23/2022 05:54:39 AM script INFO: SUCCESS!@#KODE 1!@#USER_ID 71!@#ACTIVITY_CODE 1
12/23/2022 05:54:39 AM script INFO: SUCCESS!@#KODE 1!@#USER_ID 71!@#ACTIVITY_CODE 3
12/23/2022 05:54:39 AM script INFO: SUCCESS!@#KODE 1!@#USER_ID 71!@#ACTIVITY_CODE 1
12/23/2022 05:54:39 AM script INFO: SUCCESS!@#KODE 1!@#USER_ID 71!@#ACTIVITY_CODE 4
12/23/2022 05:54:39 AM script INFO: SUCCESS!@#KODE 1!@#USER_ID 71!@#ACTIVITY_CODE 2
12/23/2022 05:54:39 AM script INFO: SUCCESS!@#KODE 1!@#USER_ID 71!@#ACTIVITY_CODE 5
12/23/2022 05:54:39 AM script INFO: SUCCESS!@#KODE 1!@#USER_ID 71!@#ACTIVITY_CODE 5
12/23/2022 05:54:42 AM script INFO: SUCCESS!@#KODE 1!@#USER_ID 71!@#ACTIVITY_CODE 5
12/23/2022 05:54:42 AM script INFO: SUCCESS!@#KODE 1!@#USER_ID 71!@#ACTIVITY_CODE 5
12/23/2022 05:54:44 AM script INFO: SUCCESS!@#KODE 1!@#USER_ID 71!@#ACTIVITY_CODE 5
12/23/2022 05:54:44 AM script INFO: SUCCESS!@#KODE 1!@#USER_ID 71!@#ACTIVITY_CODE 5
12/23/2022 05:54:47 AM script INFO: SUCCESS!@#KODE 1!@#USER_ID 71!@#ACTIVITY_CODE 2
12/23/2022 05:54:47 AM script INFO: SUCCESS!@#KODE 1!@#USER_ID 71!@#ACTIVITY_CODE 2
12/23/2022 05:54:47 AM script INFO: SUCCESS!@#KODE 1!@#USER_ID 71!@#ACTIVITY_CODE 5
12/23/2022 05:54:47 AM script INFO: SUCCESS!@#KODE 1!@#USER_ID 71!@#ACTIVITY_CODE 5
12/23/2022 05:54:50 AM script INFO: SUCCESS!@#KODE 1!@#USER_ID 71!@#ACTIVITY_CODE 3
12/23/2022 05:54:50 AM script INFO: SUCCESS!@#KODE 1!@#USER_ID 71!@#ACTIVITY_CODE 2
12/23/2022 05:54:50 AM script INFO: SUCCESS!@#KODE 1!@#USER_ID 71!@#ACTIVITY_CODE 2
12/23/2022 05:54:50 AM script INFO: SUCCESS!@#KODE 1!@#USER_ID 71!@#ACTIVITY_CODE 1
12/23/2022 05:54:50 AM script INFO: SUCCESS!@#KODE 1!@#USER_ID 71!@#ACTIVITY_CODE 3
12/23/2022 05:54:50 AM script INFO: SUCCESS!@#KODE 1!@#USER_ID 71!@#ACTIVITY_CODE 1
12/23/2022 05:54:50 AM script INFO: SUCCESS!@#KODE 1!@#USER_ID 71!@#ACTIVITY_CODE 3
12/23/2022 05:54:50 AM script INFO: SUCCESS!@#KODE 1!@#USER_ID 71!@#ACTIVITY_CODE 5
12/23/2022 05:54:50 AM script INFO: SUCCESS!@#KODE 1!@#USER_ID 71!@#ACTIVITY_CODE 5
12/23/2022 05:54:53 AM script INFO: SUCCESS!@#KODE 1!@#USER_ID 71!@#ACTIVITY_CODE 5
12/23/2022 05:54:53 AM script INFO: SUCCESS!@#KODE 1!@#USER_ID 71!@#ACTIVITY_CODE 5
12/23/2022 05:54:55 AM script INFO: SUCCESS!@#KODE 1!@#USER_ID 71!@#ACTIVITY_CODE 3
12/23/2022 05:54:55 AM script INFO: SUCCESS!@#KODE 1!@#USER_ID 71!@#ACTIVITY_CODE 5
12/23/2022 05:54:55 AM script INFO: SUCCESS!@#KODE 1!@#USER_ID 71!@#ACTIVITY_CODE 5
12/23/2022 05:54:58 AM script INFO: SUCCESS!@#KODE 1!@#USER_ID 71!@#ACTIVITY_CODE 1
12/23/2022 05:54:58 AM script INFO: SUCCESS!@#KODE 1!@#USER_ID 71!@#ACTIVITY_CODE 2
12/23/2022 05:54:58 AM script INFO: SUCCESS!@#KODE 1!@#USER_ID 71!@#ACTIVITY_CODE 1
12/23/2022 05:54:58 AM script INFO: SUCCESS!@#KODE 1!@#USER_ID 71!@#ACTIVITY_CODE 4
12/23/2022 05:54:58 AM script INFO: SUCCESS!@#KODE 1!@#USER_ID 71!@#ACTIVITY_CODE 1
12/23/2022 05:54:58 AM script INFO: SUCCESS!@#KODE 1!@#USER_ID 71!@#ACTIVITY_CODE 4
12/23/2022 05:54:58 AM script INFO: SUCCESS!@#KODE 1!@#USER_ID 71!@#ACTIVITY_CODE 5
12/23/2022 05:54:58 AM script INFO: SUCCESS!@#KODE 1!@#USER_ID 71!@#ACTIVITY_CODE 5
12/23/2022 05:55:01 AM script INFO: SUCCESS!@#KODE 1!@#USER_ID 71!@#ACTIVITY_CODE 1
12/23/2022 05:55:01 AM script INFO: SUCCESS!@#KODE 1!@#USER_ID 71!@#ACTIVITY_CODE 4
12/23/2022 05:55:01 AM script INFO: SUCCESS!@#KODE 1!@#USER_ID 71!@#ACTIVITY_CODE 5
12/23/2022 05:55:01 AM script INFO: SUCCESS!@#KODE 1!@#USER_ID 71!@#ACTIVITY_CODE 5
12/23/2022 05:55:03 AM script INFO: SUCCESS!@#KODE 1!@#USER_ID 71!@#ACTIVITY_CODE 1
12/23/2022 05:55:03 AM script INFO: SUCCESS!@#KODE 1!@#USER_ID 71!@#ACTIVITY_CODE 5
12/23/2022 05:55:03 AM script INFO: SUCCESS!@#KODE 1!@#USER_ID 71!@#ACTIVITY_CODE 5
12/23/2022 05:55:06 AM script INFO: SUCCESS!@#KODE 1!@#USER_ID 71!@#ACTIVITY_CODE 3
12/23/2022 05:55:06 AM script INFO: SUCCESS!@#KODE 1!@#USER_ID 71!@#ACTIVITY_CODE 5
12/23/2022 05:55:06 AM script INFO: SUCCESS!@#KODE 1!@#USER_ID 71!@#ACTIVITY_CODE 5
12/23/2022 05:55:08 AM script INFO: SUCCESS!@#KODE 1!@#USER_ID 71!@#ACTIVITY_CODE 3
12/23/2022 05:55:08 AM script INFO: SUCCESS!@#KODE 1!@#USER_ID 71!@#ACTIVITY_CODE 3
12/23/2022 05:55:08 AM script INFO: SUCCESS!@#KODE 1!@#USER_ID 71!@#ACTIVITY_CODE 1
12/23/2022 05:55:08 AM script INFO: SUCCESS!@#KODE 1!@#USER_ID 71!@#ACTIVITY_CODE 3
12/23/2022 05:55:09 AM script INFO: SUCCESS!@#KODE 1!@#USER_ID 71!@#ACTIVITY_CODE 2
12/23/2022 05:55:09 AM script INFO: SUCCESS!@#KODE 1!@#USER_ID 71!@#ACTIVITY_CODE 1
12/23/2022 05:55:09 AM script INFO: SUCCESS!@#KODE 1!@#USER_ID 71!@#ACTIVITY_CODE 1
12/23/2022 05:55:09 AM script INFO: SUCCESS!@#KODE 1!@#USER_ID 71!@#ACTIVITY_CODE 3
12/23/2022 05:55:09 AM script INFO: SUCCESS!@#KODE 1!@#USER_ID 71!@#ACTIVITY_CODE 1
12/23/2022 05:55:09 AM script INFO: SUCCESS!@#KODE 1!@#USER_ID 71!@#ACTIVITY_CODE 4
12/23/2022 05:55:09 AM script INFO: SUCCESS!@#KODE 1!@#USER_ID 71!@#ACTIVITY_CODE 5
12/23/2022 05:55:09 AM script INFO: SUCCESS!@#KODE 1!@#USER_ID 71!@#ACTIVITY_CODE 5
12/23/2022 05:55:11 AM script INFO: SUCCESS!@#KODE 1!@#USER_ID 71!@#ACTIVITY_CODE 1
12/23/2022 05:55:11 AM script INFO: SUCCESS!@#KODE 1!@#USER_ID 71!@#ACTIVITY_CODE 5
12/23/2022 05:55:11 AM script INFO: SUCCESS!@#KODE 1!@#USER_ID 71!@#ACTIVITY_CODE 5
12/23/2022 05:55:14 AM script INFO: SUCCESS!@#KODE 1!@#USER_ID 71!@#ACTIVITY_CODE 4
12/23/2022 05:55:14 AM script INFO: SUCCESS!@#KODE 1!@#USER_ID 71!@#ACTIVITY_CODE 5
12/23/2022 05:55:14 AM script INFO: SUCCESS!@#KODE 1!@#USER_ID 71!@#ACTIVITY_CODE 5
12/23/2022 05:55:16 AM script INFO: SUCCESS!@#KODE 1!@#USER_ID 71!@#ACTIVITY_CODE 1
12/23/2022 05:55:17 AM script INFO: SUCCESS!@#KODE 1!@#USER_ID 71!@#ACTIVITY_CODE 3
12/23/2022 05:55:17 AM script INFO: SUCCESS!@#KODE 1!@#USER_ID 71!@#ACTIVITY_CODE 4
12/23/2022 05:55:17 AM script INFO: SUCCESS!@#KODE 1!@#USER_ID 71!@#ACTIVITY_CODE 1
12/23/2022 05:55:17 AM script INFO: SUCCESS!@#KODE 1!@#USER_ID 71!@#ACTIVITY_CODE 5
12/23/2022 05:55:17 AM script INFO: SUCCESS!@#KODE 1!@#USER_ID 71!@#ACTIVITY_CODE 5
12/23/2022 05:55:19 AM script INFO: SUCCESS!@#KODE 1!@#USER_ID 71!@#ACTIVITY_CODE 3
12/23/2022 05:55:19 AM script INFO: SUCCESS!@#KODE 1!@#USER_ID 71!@#ACTIVITY_CODE 3
12/23/2022 05:55:19 AM script INFO: SUCCESS!@#KODE 1!@#USER_ID 71!@#ACTIVITY_CODE 4
12/23/2022 05:55:19 AM script INFO: SUCCESS!@#KODE 1!@#USER_ID 71!@#ACTIVITY_CODE 3
12/23/2022 05:55:19 AM script INFO: SUCCESS!@#KODE 1!@#USER_ID 71!@#ACTIVITY_CODE 3
12/23/2022 05:55:19 AM script INFO: SUCCESS!@#KODE 1!@#USER_ID 71!@#ACTIVITY_CODE 3
12/23/2022 05:55:19 AM script INFO: SUCCESS!@#KODE 1!@#USER_ID 71!@#ACTIVITY_CODE 5
12/23/2022 05:55:19 AM script INFO: SUCCESS!@#KODE 1!@#USER_ID 71!@#ACTIVITY_CODE 5
12/23/2022 05:55:22 AM script INFO: SUCCESS!@#KODE 1!@#USER_ID 71!@#ACTIVITY_CODE 1
12/23/2022 05:55:22 AM script INFO: SUCCESS!@#KODE 1!@#USER_ID 71!@#ACTIVITY_CODE 4
12/23/2022 05:55:22 AM script INFO: SUCCESS!@#KODE 1!@#USER_ID 71!@#ACTIVITY_CODE 2
12/23/2022 05:55:22 AM script INFO: SUCCESS!@#KODE 1!@#USER_ID 71!@#ACTIVITY_CODE 5
12/23/2022 05:55:22 AM script INFO: SUCCESS!@#KODE 1!@#USER_ID 71!@#ACTIVITY_CODE 5
12/23/2022 05:55:25 AM script INFO: SUCCESS!@#KODE 1!@#USER_ID 71!@#ACTIVITY_CODE 3
12/23/2022 05:55:25 AM script INFO: SUCCESS!@#KODE 1!@#USER_ID 71!@#ACTIVITY_CODE 2
12/23/2022 05:55:25 AM script INFO: SUCCESS!@#KODE 1!@#USER_ID 71!@#ACTIVITY_CODE 5
12/23/2022 05:55:25 AM script INFO: SUCCESS!@#KODE 1!@#USER_ID 71!@#ACTIVITY_CODE 5
12/23/2022 05:55:27 AM script INFO: SUCCESS!@#KODE 1!@#USER_ID 71!@#ACTIVITY_CODE 5
12/23/2022 05:55:27 AM script INFO: SUCCESS!@#KODE 1!@#USER_ID 71!@#ACTIVITY_CODE 5
12/23/2022 05:55:30 AM script INFO: SUCCESS!@#KODE 1!@#USER_ID 71!@#ACTIVITY_CODE 2
12/23/2022 05:55:30 AM script INFO: SUCCESS!@#KODE 1!@#USER_ID 71!@#ACTIVITY_CODE 2
12/23/2022 05:55:30 AM script INFO: SUCCESS!@#KODE 1!@#USER_ID 71!@#ACTIVITY_CODE 2
12/23/2022 05:55:30 AM script INFO: SUCCESS!@#KODE 1!@#USER_ID 71!@#ACTIVITY_CODE 4
12/23/2022 05:55:30 AM script INFO: SUCCESS!@#KODE 1!@#USER_ID 71!@#ACTIVITY_CODE 3
12/23/2022 05:55:30 AM script INFO: SUCCESS!@#KODE 1!@#USER_ID 71!@#ACTIVITY_CODE 1
12/23/2022 05:55:31 AM script INFO: SUCCESS!@#KODE 1!@#USER_ID 71!@#ACTIVITY_CODE 4
12/23/2022 05:55:31 AM script INFO: SUCCESS!@#KODE 1!@#USER_ID 71!@#ACTIVITY_CODE 5
12/23/2022 05:55:31 AM script INFO: SUCCESS!@#KODE 1!@#USER_ID 71!@#ACTIVITY_CODE 5
12/23/2022 05:55:33 AM script INFO: SUCCESS!@#KODE 1!@#USER_ID 71!@#ACTIVITY_CODE 2
12/23/2022 05:55:33 AM script INFO: SUCCESS!@#KODE 1!@#USER_ID 71!@#ACTIVITY_CODE 3
12/23/2022 05:55:33 AM script INFO: SUCCESS!@#KODE 1!@#USER_ID 71!@#ACTIVITY_CODE 2
12/23/2022 05:55:33 AM script INFO: SUCCESS!@#KODE 1!@#USER_ID 71!@#ACTIVITY_CODE 3
12/23/2022 05:55:34 AM script INFO: SUCCESS!@#KODE 1!@#USER_ID 71!@#ACTIVITY_CODE 2
12/23/2022 05:55:34 AM script INFO: SUCCESS!@#KODE 1!@#USER_ID 71!@#ACTIVITY_CODE 2
12/23/2022 05:55:34 AM script INFO: SUCCESS!@#KODE 1!@#USER_ID 71!@#ACTIVITY_CODE 3
12/23/2022 05:55:34 AM script INFO: SUCCESS!@#KODE 1!@#USER_ID 71!@#ACTIVITY_CODE 3
12/23/2022 05:55:34 AM script INFO: SUCCESS!@#KODE 1!@#USER_ID 71!@#ACTIVITY_CODE 3
12/23/2022 05:55:34 AM script INFO: SUCCESS!@#KODE 1!@#USER_ID 71!@#ACTIVITY_CODE 1
12/23/2022 05:55:34 AM script INFO: SUCCESS!@#KODE 1!@#USER_ID 71!@#ACTIVITY_CODE 2
12/23/2022 05:55:34 AM script INFO: SUCCESS!@#KODE 1!@#USER_ID 71!@#ACTIVITY_CODE 3
12/23/2022 05:55:34 AM script INFO: SUCCESS!@#KODE 1!@#USER_ID 71!@#ACTIVITY_CODE 3
12/23/2022 05:55:34 AM script INFO: SUCCESS!@#KODE 1!@#USER_ID 71!@#ACTIVITY_CODE 5
12/23/2022 05:55:34 AM script INFO: SUCCESS!@#KODE 1!@#USER_ID 71!@#ACTIVITY_CODE 5
12/23/2022 05:55:37 AM script INFO: SUCCESS!@#KODE 1!@#USER_ID 71!@#ACTIVITY_CODE 2
12/23/2022 05:55:37 AM script INFO: SUCCESS!@#KODE 1!@#USER_ID 71!@#ACTIVITY_CODE 1
12/23/2022 05:55:37 AM script INFO: SUCCESS!@#KODE 1!@#USER_ID 71!@#ACTIVITY_CODE 1
12/23/2022 05:55:37 AM script INFO: SUCCESS!@#KODE 1!@#USER_ID 71!@#ACTIVITY_CODE 1
12/23/2022 05:55:37 AM script INFO: SUCCESS!@#KODE 1!@#USER_ID 71!@#ACTIVITY_CODE 2
12/23/2022 05:55:37 AM script INFO: SUCCESS!@#KODE 1!@#USER_ID 71!@#ACTIVITY_CODE 1
12/23/2022 05:55:37 AM script INFO: SUCCESS!@#KODE 1!@#USER_ID 71!@#ACTIVITY_CODE 4
12/23/2022 05:55:37 AM script INFO: SUCCESS!@#KODE 1!@#USER_ID 71!@#ACTIVITY_CODE 1
12/23/2022 05:55:37 AM script INFO: SUCCESS!@#KODE 1!@#USER_ID 71!@#ACTIVITY_CODE 3
12/23/2022 05:55:37 AM script INFO: SUCCESS!@#KODE 1!@#USER_ID 71!@#ACTIVITY_CODE 1
12/23/2022 05:55:37 AM script INFO: SUCCESS!@#KODE 1!@#USER_ID 71!@#ACTIVITY_CODE 2
12/23/2022 05:55:38 AM script INFO: SUCCESS!@#KODE 1!@#USER_ID 71!@#ACTIVITY_CODE 2
12/23/2022 05:55:38 AM script INFO: SUCCESS!@#KODE 1!@#USER_ID 71!@#ACTIVITY_CODE 1
12/23/2022 05:55:38 AM script INFO: SUCCESS!@#KODE 1!@#USER_ID 71!@#ACTIVITY_CODE 4
12/23/2022 05:55:38 AM script INFO: SUCCESS!@#KODE 1!@#USER_ID 71!@#ACTIVITY_CODE 2
12/23/2022 05:55:38 AM script INFO: SUCCESS!@#KODE 1!@#USER_ID 71!@#ACTIVITY_CODE 1
12/23/2022 05:55:38 AM script INFO: SUCCESS!@#KODE 1!@#USER_ID 71!@#ACTIVITY_CODE 4
12/23/2022 05:55:38 AM script INFO: SUCCESS!@#KODE 1!@#USER_ID 71!@#ACTIVITY_CODE 1
12/23/2022 05:55:38 AM script INFO: SUCCESS!@#KODE 1!@#USER_ID 71!@#ACTIVITY_CODE 4
12/23/2022 05:55:38 AM script INFO: SUCCESS!@#KODE 1!@#USER_ID 71!@#ACTIVITY_CODE 1
12/23/2022 05:55:38 AM script INFO: SUCCESS!@#KODE 1!@#USER_ID 71!@#ACTIVITY_CODE 4
12/23/2022 05:55:38 AM script INFO: SUCCESS!@#KODE 1!@#USER_ID 71!@#ACTIVITY_CODE 3
12/23/2022 05:55:38 AM script INFO: SUCCESS!@#KODE 1!@#USER_ID 71!@#ACTIVITY_CODE 1
12/23/2022 05:55:38 AM script INFO: SUCCESS!@#KODE 1!@#USER_ID 71!@#ACTIVITY_CODE 1
12/23/2022 05:55:38 AM script INFO: SUCCESS!@#KODE 1!@#USER_ID 71!@#ACTIVITY_CODE 3
12/23/2022 05:55:39 AM script INFO: SUCCESS!@#KODE 1!@#USER_ID 71!@#ACTIVITY_CODE 2
12/23/2022 05:55:39 AM script INFO: SUCCESS!@#KODE 1!@#USER_ID 71!@#ACTIVITY_CODE 3
12/23/2022 05:55:39 AM script INFO: SUCCESS!@#KODE 1!@#USER_ID 71!@#ACTIVITY_CODE 4
12/23/2022 05:55:39 AM script INFO: SUCCESS!@#KODE 1!@#USER_ID 71!@#ACTIVITY_CODE 3
12/23/2022 05:55:39 AM script INFO: SUCCESS!@#KODE 1!@#USER_ID 71!@#ACTIVITY_CODE 2
12/23/2022 05:55:39 AM script INFO: SUCCESS!@#KODE 1!@#USER_ID 71!@#ACTIVITY_CODE 1
12/23/2022 05:55:39 AM script INFO: SUCCESS!@#KODE 1!@#USER_ID 71!@#ACTIVITY_CODE 3
12/23/2022 05:55:39 AM script INFO: SUCCESS!@#KODE 1!@#USER_ID 71!@#ACTIVITY_CODE 1
12/23/2022 05:55:39 AM script INFO: SUCCESS!@#KODE 1!@#USER_ID 71!@#ACTIVITY_CODE 2
12/23/2022 05:55:39 AM script INFO: SUCCESS!@#KODE 1!@#USER_ID 71!@#ACTIVITY_CODE 1
12/23/2022 05:55:39 AM script INFO: SUCCESS!@#KODE 1!@#USER_ID 71!@#ACTIVITY_CODE 2
12/23/2022 05:55:40 AM script INFO: SUCCESS!@#KODE 1!@#USER_ID 71!@#ACTIVITY_CODE 2
12/23/2022 05:55:40 AM script INFO: SUCCESS!@#KODE 1!@#USER_ID 71!@#ACTIVITY_CODE 3
12/23/2022 05:55:40 AM script INFO: SUCCESS!@#KODE 1!@#USER_ID 71!@#ACTIVITY_CODE 2
12/23/2022 05:55:40 AM script INFO: SUCCESS!@#KODE 1!@#USER_ID 71!@#ACTIVITY_CODE 1
12/23/2022 05:55:40 AM script INFO: SUCCESS!@#KODE 1!@#USER_ID 71!@#ACTIVITY_CODE 3
12/23/2022 05:55:40 AM script INFO: SUCCESS!@#KODE 1!@#USER_ID 71!@#ACTIVITY_CODE 1
12/23/2022 05:55:40 AM script INFO: SUCCESS!@#KODE 1!@#USER_ID 71!@#ACTIVITY_CODE 2
12/23/2022 05:55:40 AM script INFO: SUCCESS!@#KODE 1!@#USER_ID 71!@#ACTIVITY_CODE 1
12/23/2022 05:55:40 AM script INFO: SUCCESS!@#KODE 1!@#USER_ID 71!@#ACTIVITY_CODE 3
12/23/2022 05:55:40 AM script INFO: SUCCESS!@#KODE 1!@#USER_ID 71!@#ACTIVITY_CODE 4
12/23/2022 05:55:40 AM script INFO: SUCCESS!@#KODE 1!@#USER_ID 71!@#ACTIVITY_CODE 2
12/23/2022 05:55:40 AM script INFO: SUCCESS!@#KODE 1!@#USER_ID 71!@#ACTIVITY_CODE 1
12/23/2022 05:55:41 AM script INFO: SUCCESS!@#KODE 1!@#USER_ID 71!@#ACTIVITY_CODE 1
12/23/2022 05:55:41 AM script INFO: SUCCESS!@#KODE 1!@#USER_ID 71!@#ACTIVITY_CODE 4
12/23/2022 05:55:41 AM script INFO: SUCCESS!@#KODE 1!@#USER_ID 71!@#ACTIVITY_CODE 2
12/23/2022 05:55:41 AM script INFO: SUCCESS!@#KODE 1!@#USER_ID 71!@#ACTIVITY_CODE 3
12/23/2022 05:55:41 AM script INFO: SUCCESS!@#KODE 1!@#USER_ID 71!@#ACTIVITY_CODE 1
12/23/2022 05:55:41 AM script INFO: SUCCESS!@#KODE 1!@#USER_ID 71!@#ACTIVITY_CODE 4
12/23/2022 05:55:41 AM script INFO: SUCCESS!@#KODE 1!@#USER_ID 71!@#ACTIVITY_CODE 2
12/23/2022 05:55:41 AM script INFO: SUCCESS!@#KODE 1!@#USER_ID 71!@#ACTIVITY_CODE 3
12/23/2022 05:55:41 AM script INFO: SUCCESS!@#KODE 1!@#USER_ID 71!@#ACTIVITY_CODE 2
12/23/2022 05:55:41 AM script INFO: SUCCESS!@#KODE 1!@#USER_ID 71!@#ACTIVITY_CODE 2
12/23/2022 05:55:41 AM script INFO: SUCCESS!@#KODE 1!@#USER_ID 71!@#ACTIVITY_CODE 1
12/23/2022 05:55:42 AM script INFO: SUCCESS!@#KODE 1!@#USER_ID 71!@#ACTIVITY_CODE 3
12/23/2022 05:55:42 AM script INFO: SUCCESS!@#KODE 1!@#USER_ID 71!@#ACTIVITY_CODE 1
12/23/2022 05:55:42 AM script INFO: SUCCESS!@#KODE 1!@#USER_ID 71!@#ACTIVITY_CODE 3
12/23/2022 05:55:42 AM script INFO: SUCCESS!@#KODE 1!@#USER_ID 71!@#ACTIVITY_CODE 3
12/23/2022 05:55:42 AM script INFO: SUCCESS!@#KODE 1!@#USER_ID 71!@#ACTIVITY_CODE 3
12/23/2022 05:55:42 AM script INFO: SUCCESS!@#KODE 1!@#USER_ID 71!@#ACTIVITY_CODE 2
12/23/2022 05:55:42 AM script INFO: SUCCESS!@#KODE 1!@#USER_ID 71!@#ACTIVITY_CODE 3
12/23/2022 05:55:42 AM script INFO: SUCCESS!@#KODE 1!@#USER_ID 71!@#ACTIVITY_CODE 3
12/23/2022 05:55:42 AM script INFO: SUCCESS!@#KODE 1!@#USER_ID 71!@#ACTIVITY_CODE 2
12/23/2022 05:55:42 AM script INFO: SUCCESS!@#KODE 1!@#USER_ID 71!@#ACTIVITY_CODE 3
12/23/2022 05:55:42 AM script INFO: SUCCESS!@#KODE 1!@#USER_ID 71!@#ACTIVITY_CODE 3
12/23/2022 05:55:43 AM script INFO: SUCCESS!@#KODE 1!@#USER_ID 71!@#ACTIVITY_CODE 2
12/23/2022 05:55:43 AM script INFO: SUCCESS!@#KODE 1!@#USER_ID 71!@#ACTIVITY_CODE 3
12/23/2022 05:55:43 AM script INFO: SUCCESS!@#KODE 1!@#USER_ID 71!@#ACTIVITY_CODE 2
12/23/2022 05:55:43 AM script INFO: SUCCESS!@#KODE 1!@#USER_ID 71!@#ACTIVITY_CODE 2
12/23/2022 05:55:43 AM script INFO: SUCCESS!@#KODE 1!@#USER_ID 71!@#ACTIVITY_CODE 2
12/23/2022 05:55:43 AM script INFO: SUCCESS!@#KODE 1!@#USER_ID 71!@#ACTIVITY_CODE 3
12/23/2022 05:55:43 AM script INFO: SUCCESS!@#KODE 1!@#USER_ID 71!@#ACTIVITY_CODE 1
12/23/2022 05:55:43 AM script INFO: SUCCESS!@#KODE 1!@#USER_ID 71!@#ACTIVITY_CODE 1
12/23/2022 05:55:43 AM script INFO: SUCCESS!@#KODE 1!@#USER_ID 71!@#ACTIVITY_CODE 1
12/23/2022 05:55:43 AM script INFO: SUCCESS!@#KODE 1!@#USER_ID 71!@#ACTIVITY_CODE 2
12/23/2022 05:55:43 AM script INFO: SUCCESS!@#KODE 1!@#USER_ID 71!@#ACTIVITY_CODE 1
12/23/2022 05:55:44 AM script INFO: SUCCESS!@#KODE 1!@#USER_ID 71!@#ACTIVITY_CODE 1
12/23/2022 05:55:44 AM script INFO: SUCCESS!@#KODE 1!@#USER_ID 71!@#ACTIVITY_CODE 2
12/23/2022 05:55:44 AM script INFO: SUCCESS!@#KODE 1!@#USER_ID 71!@#ACTIVITY_CODE 4
12/23/2022 05:55:44 AM script INFO: SUCCESS!@#KODE 1!@#USER_ID 71!@#ACTIVITY_CODE 2
12/23/2022 05:55:44 AM script INFO: SUCCESS!@#KODE 1!@#USER_ID 71!@#ACTIVITY_CODE 3
12/23/2022 05:55:44 AM script INFO: SUCCESS!@#KODE 1!@#USER_ID 71!@#ACTIVITY_CODE 1
12/23/2022 05:55:44 AM script INFO: SUCCESS!@#KODE 1!@#USER_ID 71!@#ACTIVITY_CODE 3
12/23/2022 05:55:44 AM script INFO: SUCCESS!@#KODE 1!@#USER_ID 71!@#ACTIVITY_CODE 3
12/23/2022 05:55:44 AM script INFO: SUCCESS!@#KODE 1!@#USER_ID 71!@#ACTIVITY_CODE 3
12/23/2022 05:55:44 AM script INFO: SUCCESS!@#KODE 1!@#USER_ID 71!@#ACTIVITY_CODE 2
12/23/2022 05:55:45 AM script INFO: SUCCESS!@#KODE 1!@#USER_ID 71!@#ACTIVITY_CODE 2
12/23/2022 05:55:45 AM script INFO: SUCCESS!@#KODE 1!@#USER_ID 71!@#ACTIVITY_CODE 2
12/23/2022 05:55:45 AM script INFO: SUCCESS!@#KODE 1!@#USER_ID 71!@#ACTIVITY_CODE 2
12/23/2022 05:55:45 AM script INFO: SUCCESS!@#KODE 1!@#USER_ID 71!@#ACTIVITY_CODE 4
12/23/2022 05:55:45 AM script INFO: SUCCESS!@#KODE 1!@#USER_ID 71!@#ACTIVITY_CODE 3
12/23/2022 05:55:45 AM script INFO: SUCCESS!@#KODE 1!@#USER_ID 71!@#ACTIVITY_CODE 3
12/23/2022 05:55:45 AM script INFO: SUCCESS!@#KODE 1!@#USER_ID 71!@#ACTIVITY_CODE 1
12/23/2022 05:55:45 AM script INFO: SUCCESS!@#KODE 1!@#USER_ID 71!@#ACTIVITY_CODE 2
12/23/2022 05:55:45 AM script INFO: SUCCESS!@#KODE 1!@#USER_ID 71!@#ACTIVITY_CODE 3
12/23/2022 05:55:45 AM script INFO: SUCCESS!@#KODE 1!@#USER_ID 71!@#ACTIVITY_CODE 3
12/23/2022 05:55:45 AM script INFO: SUCCESS!@#KODE 1!@#USER_ID 71!@#ACTIVITY_CODE 1
12/23/2022 05:55:45 AM script INFO: SUCCESS!@#KODE 1!@#USER_ID 71!@#ACTIVITY_CODE 1
12/23/2022 05:55:46 AM script INFO: SUCCESS!@#KODE 1!@#USER_ID 71!@#ACTIVITY_CODE 1
12/23/2022 05:55:46 AM script INFO: SUCCESS!@#KODE 1!@#USER_ID 71!@#ACTIVITY_CODE 3
12/23/2022 05:55:46 AM script INFO: SUCCESS!@#KODE 1!@#USER_ID 71!@#ACTIVITY_CODE 4
12/23/2022 05:55:46 AM script INFO: SUCCESS!@#KODE 1!@#USER_ID 71!@#ACTIVITY_CODE 1
12/23/2022 05:55:46 AM script INFO: SUCCESS!@#KODE 1!@#USER_ID 71!@#ACTIVITY_CODE 3
12/23/2022 05:55:46 AM script INFO: SUCCESS!@#KODE 1!@#USER_ID 71!@#ACTIVITY_CODE 2
12/23/2022 05:55:46 AM script INFO: SUCCESS!@#KODE 1!@#USER_ID 71!@#ACTIVITY_CODE 3
12/23/2022 05:55:46 AM script INFO: SUCCESS!@#KODE 1!@#USER_ID 71!@#ACTIVITY_CODE 2
12/23/2022 05:55:46 AM script INFO: SUCCESS!@#KODE 1!@#USER_ID 71!@#ACTIVITY_CODE 3
12/23/2022 05:55:46 AM script INFO: SUCCESS!@#KODE 1!@#USER_ID 71!@#ACTIVITY_CODE 4
12/23/2022 05:55:46 AM script INFO: SUCCESS!@#KODE 1!@#USER_ID 71!@#ACTIVITY_CODE 3
12/23/2022 05:55:46 AM script INFO: SUCCESS!@#KODE 1!@#USER_ID 71!@#ACTIVITY_CODE 3
12/23/2022 05:55:47 AM script INFO: SUCCESS!@#KODE 1!@#USER_ID 71!@#ACTIVITY_CODE 1
12/23/2022 05:55:47 AM script INFO: SUCCESS!@#KODE 1!@#USER_ID 71!@#ACTIVITY_CODE 3
12/23/2022 05:55:47 AM script INFO: SUCCESS!@#KODE 1!@#USER_ID 71!@#ACTIVITY_CODE 1
12/23/2022 05:55:47 AM script INFO: SUCCESS!@#KODE 1!@#USER_ID 71!@#ACTIVITY_CODE 3
12/23/2022 05:55:47 AM script INFO: SUCCESS!@#KODE 1!@#USER_ID 71!@#ACTIVITY_CODE 4
12/23/2022 05:55:47 AM script INFO: SUCCESS!@#KODE 1!@#USER_ID 71!@#ACTIVITY_CODE 3
12/23/2022 05:55:47 AM script INFO: SUCCESS!@#KODE 1!@#USER_ID 71!@#ACTIVITY_CODE 2
12/23/2022 05:55:47 AM script INFO: SUCCESS!@#KODE 1!@#USER_ID 71!@#ACTIVITY_CODE 2
12/23/2022 05:55:47 AM script INFO: SUCCESS!@#KODE 1!@#USER_ID 71!@#ACTIVITY_CODE 2
12/23/2022 05:55:48 AM script INFO: SUCCESS!@#KODE 1!@#USER_ID 71!@#ACTIVITY_CODE 2
12/23/2022 05:55:48 AM script INFO: SUCCESS!@#KODE 1!@#USER_ID 71!@#ACTIVITY_CODE 1
12/23/2022 05:55:48 AM script INFO: SUCCESS!@#KODE 1!@#USER_ID 71!@#ACTIVITY_CODE 2
12/23/2022 05:55:48 AM script INFO: SUCCESS!@#KODE 1!@#USER_ID 71!@#ACTIVITY_CODE 2
12/23/2022 05:55:48 AM script INFO: SUCCESS!@#KODE 1!@#USER_ID 71!@#ACTIVITY_CODE 1
12/23/2022 05:55:48 AM script INFO: SUCCESS!@#KODE 1!@#USER_ID 71!@#ACTIVITY_CODE 1
12/23/2022 05:55:48 AM script INFO: SUCCESS!@#KODE 1!@#USER_ID 71!@#ACTIVITY_CODE 1
12/23/2022 05:55:48 AM script INFO: SUCCESS!@#KODE 1!@#USER_ID 71!@#ACTIVITY_CODE 3
12/23/2022 05:55:48 AM script INFO: SUCCESS!@#KODE 1!@#USER_ID 71!@#ACTIVITY_CODE 2
12/23/2022 05:55:48 AM script INFO: SUCCESS!@#KODE 1!@#USER_ID 71!@#ACTIVITY_CODE 3
12/23/2022 05:55:48 AM script INFO: SUCCESS!@#KODE 1!@#USER_ID 71!@#ACTIVITY_CODE 1
12/23/2022 05:55:49 AM script INFO: SUCCESS!@#KODE 1!@#USER_ID 71!@#ACTIVITY_CODE 2
12/23/2022 05:55:49 AM script INFO: SUCCESS!@#KODE 1!@#USER_ID 71!@#ACTIVITY_CODE 1
12/23/2022 05:55:49 AM script INFO: SUCCESS!@#KODE 1!@#USER_ID 71!@#ACTIVITY_CODE 2
12/23/2022 05:55:49 AM script INFO: SUCCESS!@#KODE 1!@#USER_ID 71!@#ACTIVITY_CODE 2
12/23/2022 05:55:49 AM script INFO: SUCCESS!@#KODE 1!@#USER_ID 71!@#ACTIVITY_CODE 2
12/23/2022 05:55:49 AM script INFO: SUCCESS!@#KODE 1!@#USER_ID 71!@#ACTIVITY_CODE 2
12/23/2022 05:55:49 AM script INFO: SUCCESS!@#KODE 1!@#USER_ID 71!@#ACTIVITY_CODE 1
12/23/2022 05:55:49 AM script INFO: SUCCESS!@#KODE 1!@#USER_ID 71!@#ACTIVITY_CODE 4
12/23/2022 05:55:50 AM script INFO: SUCCESS!@#KODE 1!@#USER_ID 71!@#ACTIVITY_CODE 1
12/23/2022 05:55:50 AM script INFO: SUCCESS!@#KODE 1!@#USER_ID 71!@#ACTIVITY_CODE 1
12/23/2022 05:55:50 AM script INFO: SUCCESS!@#KODE 1!@#USER_ID 71!@#ACTIVITY_CODE 4
12/23/2022 05:55:50 AM script INFO: SUCCESS!@#KODE 1!@#USER_ID 71!@#ACTIVITY_CODE 1
12/23/2022 05:55:50 AM script INFO: SUCCESS!@#KODE 1!@#USER_ID 71!@#ACTIVITY_CODE 2
12/23/2022 05:55:50 AM script INFO: SUCCESS!@#KODE 1!@#USER_ID 71!@#ACTIVITY_CODE 1
12/23/2022 05:55:50 AM script INFO: SUCCESS!@#KODE 1!@#USER_ID 71!@#ACTIVITY_CODE 3
12/23/2022 05:55:50 AM script INFO: SUCCESS!@#KODE 1!@#USER_ID 71!@#ACTIVITY_CODE 3
12/23/2022 05:55:50 AM script INFO: SUCCESS!@#KODE 1!@#USER_ID 71!@#ACTIVITY_CODE 3
12/23/2022 05:55:50 AM script INFO: SUCCESS!@#KODE 1!@#USER_ID 71!@#ACTIVITY_CODE 4
12/23/2022 05:55:50 AM script INFO: SUCCESS!@#KODE 1!@#USER_ID 71!@#ACTIVITY_CODE 1
12/23/2022 05:55:50 AM script INFO: SUCCESS!@#KODE 1!@#USER_ID 71!@#ACTIVITY_CODE 3
12/23/2022 05:55:51 AM script INFO: SUCCESS!@#KODE 1!@#USER_ID 71!@#ACTIVITY_CODE 2
12/23/2022 05:55:51 AM script INFO: SUCCESS!@#KODE 1!@#USER_ID 71!@#ACTIVITY_CODE 1
12/23/2022 05:55:51 AM script INFO: SUCCESS!@#KODE 1!@#USER_ID 71!@#ACTIVITY_CODE 3
12/23/2022 05:55:51 AM script INFO: SUCCESS!@#KODE 1!@#USER_ID 71!@#ACTIVITY_CODE 2
12/23/2022 05:55:51 AM script INFO: SUCCESS!@#KODE 1!@#USER_ID 71!@#ACTIVITY_CODE 3
12/23/2022 05:55:51 AM script INFO: SUCCESS!@#KODE 1!@#USER_ID 71!@#ACTIVITY_CODE 1
12/23/2022 05:55:51 AM script INFO: SUCCESS!@#KODE 1!@#USER_ID 71!@#ACTIVITY_CODE 1
12/23/2022 05:55:51 AM script INFO: SUCCESS!@#KODE 1!@#USER_ID 71!@#ACTIVITY_CODE 3
12/23/2022 05:55:51 AM script INFO: SUCCESS!@#KODE 1!@#USER_ID 71!@#ACTIVITY_CODE 3
12/23/2022 05:55:51 AM script INFO: SUCCESS!@#KODE 1!@#USER_ID 71!@#ACTIVITY_CODE 2
12/23/2022 05:55:51 AM script INFO: SUCCESS!@#KODE 1!@#USER_ID 71!@#ACTIVITY_CODE 1
12/23/2022 05:55:51 AM script INFO: SUCCESS!@#KODE 1!@#USER_ID 71!@#ACTIVITY_CODE 3
12/23/2022 05:55:51 AM script INFO: SUCCESS!@#KODE 1!@#USER_ID 71!@#ACTIVITY_CODE 1
12/23/2022 05:55:52 AM script INFO: SUCCESS!@#KODE 1!@#USER_ID 71!@#ACTIVITY_CODE 4
12/23/2022 05:55:52 AM script INFO: SUCCESS!@#KODE 1!@#USER_ID 71!@#ACTIVITY_CODE 2
12/23/2022 05:55:52 AM script INFO: SUCCESS!@#KODE 1!@#USER_ID 71!@#ACTIVITY_CODE 1
12/23/2022 05:55:52 AM script INFO: SUCCESS!@#KODE 1!@#USER_ID 71!@#ACTIVITY_CODE 1
12/23/2022 05:55:52 AM script INFO: SUCCESS!@#KODE 1!@#USER_ID 71!@#ACTIVITY_CODE 4
12/23/2022 05:55:52 AM script INFO: SUCCESS!@#KODE 1!@#USER_ID 71!@#ACTIVITY_CODE 2
12/23/2022 05:55:52 AM script INFO: SUCCESS!@#KODE 1!@#USER_ID 71!@#ACTIVITY_CODE 1
12/23/2022 05:55:52 AM script INFO: SUCCESS!@#KODE 1!@#USER_ID 71!@#ACTIVITY_CODE 3
12/23/2022 05:55:52 AM script INFO: SUCCESS!@#KODE 1!@#USER_ID 71!@#ACTIVITY_CODE 4
12/23/2022 05:55:52 AM script INFO: SUCCESS!@#KODE 1!@#USER_ID 71!@#ACTIVITY_CODE 2
12/23/2022 05:55:53 AM script INFO: SUCCESS!@#KODE 1!@#USER_ID 71!@#ACTIVITY_CODE 4
12/23/2022 05:55:53 AM script INFO: SUCCESS!@#KODE 1!@#USER_ID 71!@#ACTIVITY_CODE 2
12/23/2022 05:55:53 AM script INFO: SUCCESS!@#KODE 1!@#USER_ID 71!@#ACTIVITY_CODE 3
12/23/2022 05:55:53 AM script INFO: SUCCESS!@#KODE 1!@#USER_ID 71!@#ACTIVITY_CODE 2
12/23/2022 05:55:53 AM script INFO: SUCCESS!@#KODE 1!@#USER_ID 71!@#ACTIVITY_CODE 3
12/23/2022 05:55:53 AM script INFO: SUCCESS!@#KODE 1!@#USER_ID 71!@#ACTIVITY_CODE 1
12/23/2022 05:55:53 AM script INFO: SUCCESS!@#KODE 1!@#USER_ID 71!@#ACTIVITY_CODE 4
12/23/2022 05:55:53 AM script INFO: SUCCESS!@#KODE 1!@#USER_ID 71!@#ACTIVITY_CODE 3
12/23/2022 05:55:53 AM script INFO: SUCCESS!@#KODE 1!@#USER_ID 71!@#ACTIVITY_CODE 2
12/23/2022 05:55:54 AM script INFO: SUCCESS!@#KODE 1!@#USER_ID 71!@#ACTIVITY_CODE 2
12/23/2022 05:55:54 AM script INFO: SUCCESS!@#KODE 1!@#USER_ID 71!@#ACTIVITY_CODE 1
12/23/2022 05:55:54 AM script INFO: SUCCESS!@#KODE 1!@#USER_ID 71!@#ACTIVITY_CODE 3
12/23/2022 05:55:54 AM script INFO: SUCCESS!@#KODE 1!@#USER_ID 71!@#ACTIVITY_CODE 3
12/23/2022 05:55:54 AM script INFO: SUCCESS!@#KODE 1!@#USER_ID 71!@#ACTIVITY_CODE 2
12/23/2022 05:55:54 AM script INFO: SUCCESS!@#KODE 1!@#USER_ID 71!@#ACTIVITY_CODE 2
12/23/2022 05:55:54 AM script INFO: SUCCESS!@#KODE 1!@#USER_ID 71!@#ACTIVITY_CODE 1
12/23/2022 05:55:54 AM script INFO: SUCCESS!@#KODE 1!@#USER_ID 71!@#ACTIVITY_CODE 2
12/23/2022 05:55:55 AM script INFO: SUCCESS!@#KODE 1!@#USER_ID 71!@#ACTIVITY_CODE 2
12/23/2022 05:55:55 AM script INFO: SUCCESS!@#KODE 1!@#USER_ID 71!@#ACTIVITY_CODE 1
12/23/2022 05:55:55 AM script INFO: SUCCESS!@#KODE 1!@#USER_ID 71!@#ACTIVITY_CODE 3
12/23/2022 05:55:55 AM script INFO: SUCCESS!@#KODE 1!@#USER_ID 71!@#ACTIVITY_CODE 3
12/23/2022 05:55:55 AM script INFO: SUCCESS!@#KODE 1!@#USER_ID 71!@#ACTIVITY_CODE 4
12/23/2022 05:55:55 AM script INFO: SUCCESS!@#KODE 1!@#USER_ID 71!@#ACTIVITY_CODE 2
12/23/2022 05:55:55 AM script INFO: SUCCESS!@#KODE 1!@#USER_ID 71!@#ACTIVITY_CODE 3
12/23/2022 05:55:55 AM script INFO: SUCCESS!@#KODE 1!@#USER_ID 71!@#ACTIVITY_CODE 3
12/23/2022 05:55:55 AM script INFO: SUCCESS!@#KODE 1!@#USER_ID 71!@#ACTIVITY_CODE 2
12/23/2022 05:55:56 AM script INFO: SUCCESS!@#KODE 1!@#USER_ID 71!@#ACTIVITY_CODE 2
12/23/2022 05:55:56 AM script INFO: SUCCESS!@#KODE 1!@#USER_ID 71!@#ACTIVITY_CODE 1
12/23/2022 05:55:56 AM script INFO: SUCCESS!@#KODE 1!@#USER_ID 71!@#ACTIVITY_CODE 3
12/23/2022 05:55:56 AM script INFO: SUCCESS!@#KODE 1!@#USER_ID 71!@#ACTIVITY_CODE 3
12/23/2022 05:55:56 AM script INFO: SUCCESS!@#KODE 1!@#USER_ID 71!@#ACTIVITY_CODE 3
12/23/2022 05:55:56 AM script INFO: SUCCESS!@#KODE 1!@#USER_ID 71!@#ACTIVITY_CODE 4
12/23/2022 05:55:56 AM script INFO: SUCCESS!@#KODE 1!@#USER_ID 71!@#ACTIVITY_CODE 3
12/23/2022 05:55:56 AM script INFO: SUCCESS!@#KODE 1!@#USER_ID 71!@#ACTIVITY_CODE 3
12/23/2022 05:55:56 AM script INFO: SUCCESS!@#KODE 1!@#USER_ID 71!@#ACTIVITY_CODE 2
12/23/2022 05:55:56 AM script INFO: SUCCESS!@#KODE 1!@#USER_ID 71!@#ACTIVITY_CODE 2
12/23/2022 05:55:57 AM script INFO: SUCCESS!@#KODE 1!@#USER_ID 71!@#ACTIVITY_CODE 4
12/23/2022 05:55:57 AM script INFO: SUCCESS!@#KODE 1!@#USER_ID 71!@#ACTIVITY_CODE 1
12/23/2022 05:55:57 AM script INFO: SUCCESS!@#KODE 1!@#USER_ID 71!@#ACTIVITY_CODE 1
12/23/2022 05:55:57 AM script INFO: SUCCESS!@#KODE 1!@#USER_ID 71!@#ACTIVITY_CODE 3
12/23/2022 05:55:57 AM script INFO: SUCCESS!@#KODE 1!@#USER_ID 71!@#ACTIVITY_CODE 2
12/23/2022 05:55:57 AM script INFO: SUCCESS!@#KODE 1!@#USER_ID 71!@#ACTIVITY_CODE 2
12/23/2022 05:55:57 AM script INFO: SUCCESS!@#KODE 1!@#USER_ID 71!@#ACTIVITY_CODE 1
12/23/2022 05:55:57 AM script INFO: SUCCESS!@#KODE 1!@#USER_ID 71!@#ACTIVITY_CODE 2
12/23/2022 05:55:57 AM script INFO: SUCCESS!@#KODE 1!@#USER_ID 71!@#ACTIVITY_CODE 3
12/23/2022 05:55:57 AM script INFO: SUCCESS!@#KODE 1!@#USER_ID 71!@#ACTIVITY_CODE 3
12/23/2022 05:55:57 AM script INFO: SUCCESS!@#KODE 1!@#USER_ID 71!@#ACTIVITY_CODE 1
12/23/2022 05:55:58 AM script INFO: SUCCESS!@#KODE 1!@#USER_ID 71!@#ACTIVITY_CODE 3
12/23/2022 05:55:58 AM script INFO: SUCCESS!@#KODE 1!@#USER_ID 71!@#ACTIVITY_CODE 1
12/23/2022 05:55:58 AM script INFO: SUCCESS!@#KODE 1!@#USER_ID 71!@#ACTIVITY_CODE 1
12/23/2022 05:55:58 AM script INFO: SUCCESS!@#KODE 1!@#USER_ID 71!@#ACTIVITY_CODE 1
12/23/2022 05:55:58 AM script INFO: SUCCESS!@#KODE 1!@#USER_ID 71!@#ACTIVITY_CODE 1
12/23/2022 05:55:58 AM script INFO: SUCCESS!@#KODE 1!@#USER_ID 71!@#ACTIVITY_CODE 3
12/23/2022 05:55:58 AM script INFO: SUCCESS!@#KODE 1!@#USER_ID 71!@#ACTIVITY_CODE 1
12/23/2022 05:55:58 AM script INFO: SUCCESS!@#KODE 1!@#USER_ID 71!@#ACTIVITY_CODE 2
12/23/2022 05:55:58 AM script INFO: SUCCESS!@#KODE 1!@#USER_ID 71!@#ACTIVITY_CODE 1
12/23/2022 05:55:58 AM script INFO: SUCCESS!@#KODE 1!@#USER_ID 71!@#ACTIVITY_CODE 2
12/23/2022 05:55:58 AM script INFO: SUCCESS!@#KODE 1!@#USER_ID 71!@#ACTIVITY_CODE 3
12/23/2022 05:55:58 AM script INFO: SUCCESS!@#KODE 1!@#USER_ID 71!@#ACTIVITY_CODE 3
12/23/2022 05:55:59 AM script INFO: SUCCESS!@#KODE 1!@#USER_ID 71!@#ACTIVITY_CODE 3
12/23/2022 05:55:59 AM script INFO: SUCCESS!@#KODE 1!@#USER_ID 71!@#ACTIVITY_CODE 1
12/23/2022 05:55:59 AM script INFO: SUCCESS!@#KODE 1!@#USER_ID 71!@#ACTIVITY_CODE 2
12/23/2022 05:55:59 AM script INFO: SUCCESS!@#KODE 1!@#USER_ID 71!@#ACTIVITY_CODE 1
12/23/2022 05:55:59 AM script INFO: SUCCESS!@#KODE 1!@#USER_ID 71!@#ACTIVITY_CODE 3
12/23/2022 05:55:59 AM script INFO: SUCCESS!@#KODE 1!@#USER_ID 71!@#ACTIVITY_CODE 1
12/23/2022 05:55:59 AM script INFO: SUCCESS!@#KODE 1!@#USER_ID 71!@#ACTIVITY_CODE 2
12/23/2022 05:55:59 AM script INFO: SUCCESS!@#KODE 1!@#USER_ID 71!@#ACTIVITY_CODE 1
12/23/2022 05:55:59 AM script INFO: SUCCESS!@#KODE 1!@#USER_ID 71!@#ACTIVITY_CODE 1
12/23/2022 05:55:59 AM script INFO: SUCCESS!@#KODE 1!@#USER_ID 71!@#ACTIVITY_CODE 2
12/23/2022 05:55:59 AM script INFO: SUCCESS!@#KODE 1!@#USER_ID 71!@#ACTIVITY_CODE 1
12/23/2022 05:56:00 AM script INFO: SUCCESS!@#KODE 1!@#USER_ID 71!@#ACTIVITY_CODE 2
12/23/2022 05:56:00 AM script INFO: SUCCESS!@#KODE 1!@#USER_ID 71!@#ACTIVITY_CODE 4
12/23/2022 05:56:00 AM script INFO: SUCCESS!@#KODE 1!@#USER_ID 71!@#ACTIVITY_CODE 2
12/23/2022 05:56:00 AM script INFO: SUCCESS!@#KODE 1!@#USER_ID 71!@#ACTIVITY_CODE 3
12/23/2022 05:56:00 AM script INFO: SUCCESS!@#KODE 1!@#USER_ID 71!@#ACTIVITY_CODE 4
12/23/2022 05:56:00 AM script INFO: SUCCESS!@#KODE 1!@#USER_ID 71!@#ACTIVITY_CODE 2
12/23/2022 05:56:00 AM script INFO: SUCCESS!@#KODE 1!@#USER_ID 71!@#ACTIVITY_CODE 3
12/23/2022 05:56:00 AM script INFO: SUCCESS!@#KODE 1!@#USER_ID 71!@#ACTIVITY_CODE 1
12/23/2022 05:56:01 AM script INFO: SUCCESS!@#KODE 1!@#USER_ID 71!@#ACTIVITY_CODE 2
12/23/2022 05:56:01 AM script INFO: SUCCESS!@#KODE 1!@#USER_ID 71!@#ACTIVITY_CODE 3
12/23/2022 05:56:01 AM script INFO: SUCCESS!@#KODE 1!@#USER_ID 71!@#ACTIVITY_CODE 1
12/23/2022 05:56:01 AM script INFO: SUCCESS!@#KODE 1!@#USER_ID 71!@#ACTIVITY_CODE 1
12/23/2022 05:56:01 AM script INFO: SUCCESS!@#KODE 1!@#USER_ID 71!@#ACTIVITY_CODE 4
12/23/2022 05:56:01 AM script INFO: SUCCESS!@#KODE 1!@#USER_ID 71!@#ACTIVITY_CODE 3
12/23/2022 05:56:01 AM script INFO: SUCCESS!@#KODE 1!@#USER_ID 71!@#ACTIVITY_CODE 3
12/23/2022 05:56:01 AM script INFO: SUCCESS!@#KODE 1!@#USER_ID 71!@#ACTIVITY_CODE 1
12/23/2022 05:56:01 AM script INFO: SUCCESS!@#KODE 1!@#USER_ID 71!@#ACTIVITY_CODE 1
12/23/2022 05:56:01 AM script INFO: SUCCESS!@#KODE 1!@#USER_ID 71!@#ACTIVITY_CODE 3
12/23/2022 05:56:01 AM script INFO: SUCCESS!@#KODE 1!@#USER_ID 71!@#ACTIVITY_CODE 3
12/23/2022 05:56:01 AM script INFO: SUCCESS!@#KODE 1!@#USER_ID 71!@#ACTIVITY_CODE 3
12/23/2022 05:56:01 AM script INFO: SUCCESS!@#KODE 1!@#USER_ID 71!@#ACTIVITY_CODE 1
12/23/2022 05:56:01 AM script INFO: SUCCESS!@#KODE 1!@#USER_ID 71!@#ACTIVITY_CODE 3
12/23/2022 05:56:02 AM script INFO: SUCCESS!@#KODE 1!@#USER_ID 71!@#ACTIVITY_CODE 4
12/23/2022 05:56:02 AM script INFO: SUCCESS!@#KODE 1!@#USER_ID 71!@#ACTIVITY_CODE 2
12/23/2022 05:56:02 AM script INFO: SUCCESS!@#KODE 1!@#USER_ID 71!@#ACTIVITY_CODE 3
12/23/2022 05:56:02 AM script INFO: SUCCESS!@#KODE 1!@#USER_ID 71!@#ACTIVITY_CODE 3
12/23/2022 05:56:02 AM script INFO: SUCCESS!@#KODE 1!@#USER_ID 71!@#ACTIVITY_CODE 1
12/23/2022 05:56:02 AM script INFO: SUCCESS!@#KODE 1!@#USER_ID 71!@#ACTIVITY_CODE 2
12/23/2022 05:56:02 AM script INFO: SUCCESS!@#KODE 1!@#USER_ID 71!@#ACTIVITY_CODE 3
12/23/2022 05:56:02 AM script INFO: SUCCESS!@#KODE 1!@#USER_ID 71!@#ACTIVITY_CODE 1
12/23/2022 05:56:02 AM script INFO: SUCCESS!@#KODE 1!@#USER_ID 71!@#ACTIVITY_CODE 3
12/23/2022 05:56:02 AM script INFO: SUCCESS!@#KODE 1!@#USER_ID 71!@#ACTIVITY_CODE 3
12/23/2022 05:56:02 AM script INFO: SUCCESS!@#KODE 1!@#USER_ID 71!@#ACTIVITY_CODE 3
12/23/2022 05:56:03 AM script INFO: SUCCESS!@#KODE 1!@#USER_ID 71!@#ACTIVITY_CODE 2
12/23/2022 05:56:03 AM script INFO: SUCCESS!@#KODE 1!@#USER_ID 71!@#ACTIVITY_CODE 1
12/23/2022 05:56:03 AM script INFO: SUCCESS!@#KODE 1!@#USER_ID 71!@#ACTIVITY_CODE 1
12/23/2022 05:56:03 AM script INFO: SUCCESS!@#KODE 1!@#USER_ID 71!@#ACTIVITY_CODE 3
12/23/2022 05:56:03 AM script INFO: SUCCESS!@#KODE 1!@#USER_ID 71!@#ACTIVITY_CODE 4
12/23/2022 05:56:03 AM script INFO: SUCCESS!@#KODE 1!@#USER_ID 71!@#ACTIVITY_CODE 1
12/23/2022 05:56:03 AM script INFO: SUCCESS!@#KODE 1!@#USER_ID 71!@#ACTIVITY_CODE 1
12/23/2022 05:56:03 AM script INFO: SUCCESS!@#KODE 1!@#USER_ID 71!@#ACTIVITY_CODE 2
12/23/2022 05:56:03 AM script INFO: SUCCESS!@#KODE 1!@#USER_ID 71!@#ACTIVITY_CODE 1
12/23/2022 05:56:03 AM script INFO: SUCCESS!@#KODE 1!@#USER_ID 71!@#ACTIVITY_CODE 4
12/23/2022 05:56:03 AM script INFO: SUCCESS!@#KODE 1!@#USER_ID 71!@#ACTIVITY_CODE 3
12/23/2022 05:56:04 AM script INFO: SUCCESS!@#KODE 1!@#USER_ID 71!@#ACTIVITY_CODE 2
12/23/2022 05:56:04 AM script INFO: SUCCESS!@#KODE 1!@#USER_ID 71!@#ACTIVITY_CODE 3
12/23/2022 05:56:04 AM script INFO: SUCCESS!@#KODE 1!@#USER_ID 71!@#ACTIVITY_CODE 4
12/23/2022 05:56:04 AM script INFO: SUCCESS!@#KODE 1!@#USER_ID 71!@#ACTIVITY_CODE 2
12/23/2022 05:56:04 AM script INFO: SUCCESS!@#KODE 1!@#USER_ID 71!@#ACTIVITY_CODE 2
12/23/2022 05:56:04 AM script INFO: SUCCESS!@#KODE 1!@#USER_ID 71!@#ACTIVITY_CODE 2
12/23/2022 05:56:04 AM script INFO: SUCCESS!@#KODE 1!@#USER_ID 71!@#ACTIVITY_CODE 3
12/23/2022 05:56:05 AM script INFO: SUCCESS!@#KODE 1!@#USER_ID 71!@#ACTIVITY_CODE 2
12/23/2022 05:56:05 AM script INFO: SUCCESS!@#KODE 1!@#USER_ID 71!@#ACTIVITY_CODE 1
12/23/2022 05:56:05 AM script INFO: SUCCESS!@#KODE 1!@#USER_ID 71!@#ACTIVITY_CODE 3
12/23/2022 05:56:05 AM script INFO: SUCCESS!@#KODE 1!@#USER_ID 71!@#ACTIVITY_CODE 1
12/23/2022 05:56:05 AM script INFO: SUCCESS!@#KODE 1!@#USER_ID 71!@#ACTIVITY_CODE 3
12/23/2022 05:56:05 AM script INFO: SUCCESS!@#KODE 1!@#USER_ID 71!@#ACTIVITY_CODE 4
12/23/2022 05:56:05 AM script INFO: SUCCESS!@#KODE 1!@#USER_ID 71!@#ACTIVITY_CODE 2
12/23/2022 05:56:05 AM script INFO: SUCCESS!@#KODE 1!@#USER_ID 71!@#ACTIVITY_CODE 2
12/23/2022 05:56:05 AM script INFO: SUCCESS!@#KODE 1!@#USER_ID 71!@#ACTIVITY_CODE 1
12/23/2022 05:56:05 AM script INFO: SUCCESS!@#KODE 1!@#USER_ID 71!@#ACTIVITY_CODE 1
12/23/2022 05:56:05 AM script INFO: SUCCESS!@#KODE 1!@#USER_ID 71!@#ACTIVITY_CODE 1
12/23/2022 05:56:06 AM script INFO: SUCCESS!@#KODE 1!@#USER_ID 71!@#ACTIVITY_CODE 2
12/23/2022 05:56:06 AM script INFO: SUCCESS!@#KODE 1!@#USER_ID 71!@#ACTIVITY_CODE 3
12/23/2022 05:56:06 AM script INFO: SUCCESS!@#KODE 1!@#USER_ID 71!@#ACTIVITY_CODE 3
12/23/2022 05:56:06 AM script INFO: SUCCESS!@#KODE 1!@#USER_ID 71!@#ACTIVITY_CODE 2
12/23/2022 05:56:06 AM script INFO: SUCCESS!@#KODE 1!@#USER_ID 71!@#ACTIVITY_CODE 1
12/23/2022 05:56:06 AM script INFO: SUCCESS!@#KODE 1!@#USER_ID 71!@#ACTIVITY_CODE 2
12/23/2022 05:56:06 AM script INFO: SUCCESS!@#KODE 1!@#USER_ID 71!@#ACTIVITY_CODE 3
12/23/2022 05:56:06 AM script INFO: SUCCESS!@#KODE 1!@#USER_ID 71!@#ACTIVITY_CODE 4
12/23/2022 05:56:06 AM script INFO: SUCCESS!@#KODE 1!@#USER_ID 71!@#ACTIVITY_CODE 3
12/23/2022 05:56:06 AM script INFO: SUCCESS!@#KODE 1!@#USER_ID 71!@#ACTIVITY_CODE 1
12/23/2022 05:56:07 AM script INFO: SUCCESS!@#KODE 1!@#USER_ID 71!@#ACTIVITY_CODE 4
12/23/2022 05:56:07 AM script INFO: SUCCESS!@#KODE 1!@#USER_ID 71!@#ACTIVITY_CODE 2
12/23/2022 05:56:07 AM script INFO: SUCCESS!@#KODE 1!@#USER_ID 71!@#ACTIVITY_CODE 1
12/23/2022 05:56:07 AM script INFO: SUCCESS!@#KODE 1!@#USER_ID 71!@#ACTIVITY_CODE 3
12/23/2022 05:56:07 AM script INFO: SUCCESS!@#KODE 1!@#USER_ID 71!@#ACTIVITY_CODE 1
12/23/2022 05:56:07 AM script INFO: SUCCESS!@#KODE 1!@#USER_ID 71!@#ACTIVITY_CODE 1
12/23/2022 05:56:07 AM script INFO: SUCCESS!@#KODE 1!@#USER_ID 71!@#ACTIVITY_CODE 3
12/23/2022 05:56:07 AM script INFO: SUCCESS!@#KODE 1!@#USER_ID 71!@#ACTIVITY_CODE 3
12/23/2022 05:56:07 AM script INFO: SUCCESS!@#KODE 1!@#USER_ID 71!@#ACTIVITY_CODE 2
12/23/2022 05:56:07 AM script INFO: SUCCESS!@#KODE 1!@#USER_ID 71!@#ACTIVITY_CODE 3
12/23/2022 05:56:07 AM script INFO: SUCCESS!@#KODE 1!@#USER_ID 71!@#ACTIVITY_CODE 3
12/23/2022 05:56:08 AM script INFO: SUCCESS!@#KODE 1!@#USER_ID 71!@#ACTIVITY_CODE 2
12/23/2022 05:56:08 AM script INFO: SUCCESS!@#KODE 1!@#USER_ID 71!@#ACTIVITY_CODE 3
12/23/2022 05:56:08 AM script INFO: SUCCESS!@#KODE 1!@#USER_ID 71!@#ACTIVITY_CODE 2
12/23/2022 05:56:08 AM script INFO: SUCCESS!@#KODE 1!@#USER_ID 71!@#ACTIVITY_CODE 1
12/23/2022 05:56:08 AM script INFO: SUCCESS!@#KODE 1!@#USER_ID 71!@#ACTIVITY_CODE 1
12/23/2022 05:56:08 AM script INFO: SUCCESS!@#KODE 1!@#USER_ID 71!@#ACTIVITY_CODE 4
12/23/2022 05:56:08 AM script INFO: SUCCESS!@#KODE 1!@#USER_ID 71!@#ACTIVITY_CODE 2
12/23/2022 05:56:08 AM script INFO: SUCCESS!@#KODE 1!@#USER_ID 71!@#ACTIVITY_CODE 1
12/23/2022 05:56:08 AM script INFO: SUCCESS!@#KODE 1!@#USER_ID 71!@#ACTIVITY_CODE 3
12/23/2022 05:56:08 AM script INFO: SUCCESS!@#KODE 1!@#USER_ID 71!@#ACTIVITY_CODE 1
12/23/2022 05:56:09 AM script INFO: SUCCESS!@#KODE 1!@#USER_ID 71!@#ACTIVITY_CODE 2
12/23/2022 05:56:09 AM script INFO: SUCCESS!@#KODE 1!@#USER_ID 71!@#ACTIVITY_CODE 1
12/23/2022 05:56:09 AM script INFO: SUCCESS!@#KODE 1!@#USER_ID 71!@#ACTIVITY_CODE 4
12/23/2022 05:56:09 AM script INFO: SUCCESS!@#KODE 1!@#USER_ID 71!@#ACTIVITY_CODE 1
12/23/2022 05:56:09 AM script INFO: SUCCESS!@#KODE 1!@#USER_ID 71!@#ACTIVITY_CODE 1
12/23/2022 05:56:09 AM script INFO: SUCCESS!@#KODE 1!@#USER_ID 71!@#ACTIVITY_CODE 3
12/23/2022 05:56:09 AM script INFO: SUCCESS!@#KODE 1!@#USER_ID 71!@#ACTIVITY_CODE 3
12/23/2022 05:56:09 AM script INFO: SUCCESS!@#KODE 1!@#USER_ID 71!@#ACTIVITY_CODE 4
12/23/2022 05:56:09 AM script INFO: SUCCESS!@#KODE 1!@#USER_ID 71!@#ACTIVITY_CODE 1
12/23/2022 05:56:09 AM script INFO: SUCCESS!@#KODE 1!@#USER_ID 71!@#ACTIVITY_CODE 3
12/23/2022 05:56:09 AM script INFO: SUCCESS!@#KODE 1!@#USER_ID 71!@#ACTIVITY_CODE 4
12/23/2022 05:56:09 AM script INFO: SUCCESS!@#KODE 1!@#USER_ID 71!@#ACTIVITY_CODE 3
12/23/2022 05:56:09 AM script INFO: SUCCESS!@#KODE 1!@#USER_ID 71!@#ACTIVITY_CODE 3
12/23/2022 05:56:10 AM script INFO: SUCCESS!@#KODE 1!@#USER_ID 71!@#ACTIVITY_CODE 1
12/23/2022 05:56:10 AM script INFO: SUCCESS!@#KODE 1!@#USER_ID 71!@#ACTIVITY_CODE 2
12/23/2022 05:56:10 AM script INFO: SUCCESS!@#KODE 1!@#USER_ID 71!@#ACTIVITY_CODE 2
12/23/2022 05:56:10 AM script INFO: SUCCESS!@#KODE 1!@#USER_ID 71!@#ACTIVITY_CODE 3
12/23/2022 05:56:10 AM script INFO: SUCCESS!@#KODE 1!@#USER_ID 71!@#ACTIVITY_CODE 1
12/23/2022 05:56:10 AM script INFO: SUCCESS!@#KODE 1!@#USER_ID 71!@#ACTIVITY_CODE 1
12/23/2022 05:56:10 AM script INFO: SUCCESS!@#KODE 1!@#USER_ID 71!@#ACTIVITY_CODE 1
12/23/2022 05:56:10 AM script INFO: SUCCESS!@#KODE 1!@#USER_ID 71!@#ACTIVITY_CODE 3
12/23/2022 05:56:10 AM script INFO: SUCCESS!@#KODE 1!@#USER_ID 71!@#ACTIVITY_CODE 3
12/23/2022 05:56:10 AM script INFO: SUCCESS!@#KODE 1!@#USER_ID 71!@#ACTIVITY_CODE 2
12/23/2022 05:56:10 AM script INFO: SUCCESS!@#KODE 1!@#USER_ID 71!@#ACTIVITY_CODE 1
12/23/2022 05:56:11 AM script INFO: SUCCESS!@#KODE 1!@#USER_ID 71!@#ACTIVITY_CODE 3
12/23/2022 05:56:11 AM script INFO: SUCCESS!@#KODE 1!@#USER_ID 71!@#ACTIVITY_CODE 1
12/23/2022 05:56:11 AM script INFO: SUCCESS!@#KODE 1!@#USER_ID 71!@#ACTIVITY_CODE 2
12/23/2022 05:56:11 AM script INFO: SUCCESS!@#KODE 1!@#USER_ID 71!@#ACTIVITY_CODE 3
12/23/2022 05:56:11 AM script INFO: SUCCESS!@#KODE 1!@#USER_ID 71!@#ACTIVITY_CODE 2
12/23/2022 05:56:11 AM script INFO: SUCCESS!@#KODE 1!@#USER_ID 71!@#ACTIVITY_CODE 1
12/23/2022 05:56:11 AM script INFO: SUCCESS!@#KODE 1!@#USER_ID 71!@#ACTIVITY_CODE 3
12/23/2022 05:56:11 AM script INFO: SUCCESS!@#KODE 1!@#USER_ID 71!@#ACTIVITY_CODE 1
12/23/2022 05:56:11 AM script INFO: SUCCESS!@#KODE 1!@#USER_ID 71!@#ACTIVITY_CODE 2
12/23/2022 05:56:11 AM script INFO: SUCCESS!@#KODE 1!@#USER_ID 71!@#ACTIVITY_CODE 3
12/23/2022 05:56:12 AM script INFO: SUCCESS!@#KODE 1!@#USER_ID 71!@#ACTIVITY_CODE 2
12/23/2022 05:56:12 AM script INFO: SUCCESS!@#KODE 1!@#USER_ID 71!@#ACTIVITY_CODE 3
12/23/2022 05:56:12 AM script INFO: SUCCESS!@#KODE 1!@#USER_ID 71!@#ACTIVITY_CODE 2
12/23/2022 05:56:12 AM script INFO: SUCCESS!@#KODE 1!@#USER_ID 71!@#ACTIVITY_CODE 3
12/23/2022 05:56:12 AM script INFO: SUCCESS!@#KODE 1!@#USER_ID 71!@#ACTIVITY_CODE 1
12/23/2022 05:56:12 AM script INFO: SUCCESS!@#KODE 1!@#USER_ID 71!@#ACTIVITY_CODE 1
12/23/2022 05:56:12 AM script INFO: SUCCESS!@#KODE 1!@#USER_ID 71!@#ACTIVITY_CODE 3
12/23/2022 05:56:12 AM script INFO: Duration: 93.58321070671082
12/23/2022 05:56:12 AM script INFO: mengakhiri-quiz
12/23/2022 05:56:43 AM script INFO: SUCCESS!@#KODE 1!@#USER_ID 71!@#ACTIVITY_CODE 5
12/23/2022 05:56:43 AM script INFO: berhasil-submit
