12/21/2022 02:35:01 PM script INFO: Prepared chrome options..
12/21/2022 02:35:02 PM script INFO: Initialized chrome browser..
12/21/2022 02:35:02 PM script INFO: mengakses-homepage
12/21/2022 02:35:13 PM script INFO: mengakses-login-page
12/21/2022 02:35:14 PM script INFO: mengakses-site-home
12/21/2022 02:35:14 PM script INFO: mengakses-site-course
12/21/2022 02:35:15 PM script INFO: mengakses-quiz
12/21/2022 02:35:16 PM script INFO: mengakses-start-quiz-page
12/21/2022 02:35:17 PM script INFO: memulai-quiz
12/21/2022 02:35:17 PM script INFO: SUCCESS!@#KODE 1!@#USER_ID 15!@#ACTIVITY_CODE 5
12/21/2022 02:35:27 PM script INFO: SUCCESS!@#KODE 1!@#USER_ID 15!@#ACTIVITY_CODE 2
12/21/2022 02:35:27 PM script INFO: SUCCESS!@#KODE 1!@#USER_ID 15!@#ACTIVITY_CODE 2
12/21/2022 02:35:27 PM script INFO: SUCCESS!@#KODE 1!@#USER_ID 15!@#ACTIVITY_CODE 5
12/21/2022 02:35:27 PM script INFO: SUCCESS!@#KODE 1!@#USER_ID 15!@#ACTIVITY_CODE 5
12/21/2022 02:35:30 PM script INFO: SUCCESS!@#KODE 1!@#USER_ID 15!@#ACTIVITY_CODE 3
12/21/2022 02:35:30 PM script INFO: SUCCESS!@#KODE 1!@#USER_ID 15!@#ACTIVITY_CODE 2
12/21/2022 02:35:30 PM script INFO: SUCCESS!@#KODE 1!@#USER_ID 15!@#ACTIVITY_CODE 3
12/21/2022 02:35:30 PM script INFO: SUCCESS!@#KODE 1!@#USER_ID 15!@#ACTIVITY_CODE 3
12/21/2022 02:35:30 PM script INFO: SUCCESS!@#KODE 1!@#USER_ID 15!@#ACTIVITY_CODE 5
12/21/2022 02:35:30 PM script INFO: SUCCESS!@#KODE 1!@#USER_ID 15!@#ACTIVITY_CODE 5
12/21/2022 02:35:33 PM script INFO: SUCCESS!@#KODE 1!@#USER_ID 15!@#ACTIVITY_CODE 1
12/21/2022 02:35:33 PM script INFO: SUCCESS!@#KODE 1!@#USER_ID 15!@#ACTIVITY_CODE 2
12/21/2022 02:35:33 PM script INFO: SUCCESS!@#KODE 1!@#USER_ID 15!@#ACTIVITY_CODE 5
12/21/2022 02:35:33 PM script INFO: SUCCESS!@#KODE 1!@#USER_ID 15!@#ACTIVITY_CODE 5
12/21/2022 02:35:36 PM script INFO: SUCCESS!@#KODE 1!@#USER_ID 15!@#ACTIVITY_CODE 2
12/21/2022 02:35:36 PM script INFO: SUCCESS!@#KODE 1!@#USER_ID 15!@#ACTIVITY_CODE 2
12/21/2022 02:35:36 PM script INFO: SUCCESS!@#KODE 1!@#USER_ID 15!@#ACTIVITY_CODE 3
12/21/2022 02:35:36 PM script INFO: SUCCESS!@#KODE 1!@#USER_ID 15!@#ACTIVITY_CODE 3
12/21/2022 02:35:36 PM script INFO: SUCCESS!@#KODE 1!@#USER_ID 15!@#ACTIVITY_CODE 2
12/21/2022 02:35:36 PM script INFO: SUCCESS!@#KODE 1!@#USER_ID 15!@#ACTIVITY_CODE 5
12/21/2022 02:35:36 PM script INFO: SUCCESS!@#KODE 1!@#USER_ID 15!@#ACTIVITY_CODE 5
12/21/2022 02:35:39 PM script INFO: SUCCESS!@#KODE 1!@#USER_ID 15!@#ACTIVITY_CODE 3
12/21/2022 02:35:39 PM script INFO: SUCCESS!@#KODE 1!@#USER_ID 15!@#ACTIVITY_CODE 2
12/21/2022 02:35:39 PM script INFO: SUCCESS!@#KODE 1!@#USER_ID 15!@#ACTIVITY_CODE 3
12/21/2022 02:35:39 PM script INFO: SUCCESS!@#KODE 1!@#USER_ID 15!@#ACTIVITY_CODE 2
12/21/2022 02:35:39 PM script INFO: SUCCESS!@#KODE 1!@#USER_ID 15!@#ACTIVITY_CODE 5
12/21/2022 02:35:39 PM script INFO: SUCCESS!@#KODE 1!@#USER_ID 15!@#ACTIVITY_CODE 5
12/21/2022 02:35:41 PM script INFO: SUCCESS!@#KODE 1!@#USER_ID 15!@#ACTIVITY_CODE 1
12/21/2022 02:35:41 PM script INFO: SUCCESS!@#KODE 1!@#USER_ID 15!@#ACTIVITY_CODE 5
12/21/2022 02:35:41 PM script INFO: SUCCESS!@#KODE 1!@#USER_ID 15!@#ACTIVITY_CODE 5
12/21/2022 02:35:44 PM script INFO: SUCCESS!@#KODE 1!@#USER_ID 15!@#ACTIVITY_CODE 1
12/21/2022 02:35:44 PM script INFO: SUCCESS!@#KODE 1!@#USER_ID 15!@#ACTIVITY_CODE 1
12/21/2022 02:35:44 PM script INFO: SUCCESS!@#KODE 1!@#USER_ID 15!@#ACTIVITY_CODE 2
12/21/2022 02:35:44 PM script INFO: SUCCESS!@#KODE 1!@#USER_ID 15!@#ACTIVITY_CODE 5
12/21/2022 02:35:44 PM script INFO: SUCCESS!@#KODE 1!@#USER_ID 15!@#ACTIVITY_CODE 5
12/21/2022 02:35:47 PM script INFO: SUCCESS!@#KODE 1!@#USER_ID 15!@#ACTIVITY_CODE 1
12/21/2022 02:35:47 PM script INFO: SUCCESS!@#KODE 1!@#USER_ID 15!@#ACTIVITY_CODE 2
12/21/2022 02:35:47 PM script INFO: SUCCESS!@#KODE 1!@#USER_ID 15!@#ACTIVITY_CODE 5
12/21/2022 02:35:47 PM script INFO: SUCCESS!@#KODE 1!@#USER_ID 15!@#ACTIVITY_CODE 5
12/21/2022 02:35:49 PM script INFO: SUCCESS!@#KODE 1!@#USER_ID 15!@#ACTIVITY_CODE 3
12/21/2022 02:35:50 PM script INFO: SUCCESS!@#KODE 1!@#USER_ID 15!@#ACTIVITY_CODE 2
12/21/2022 02:35:50 PM script INFO: SUCCESS!@#KODE 1!@#USER_ID 15!@#ACTIVITY_CODE 3
12/21/2022 02:35:50 PM script INFO: SUCCESS!@#KODE 1!@#USER_ID 15!@#ACTIVITY_CODE 2
12/21/2022 02:35:50 PM script INFO: SUCCESS!@#KODE 1!@#USER_ID 15!@#ACTIVITY_CODE 2
12/21/2022 02:35:50 PM script INFO: SUCCESS!@#KODE 1!@#USER_ID 15!@#ACTIVITY_CODE 5
12/21/2022 02:35:50 PM script INFO: SUCCESS!@#KODE 1!@#USER_ID 15!@#ACTIVITY_CODE 5
12/21/2022 02:35:52 PM script INFO: SUCCESS!@#KODE 1!@#USER_ID 15!@#ACTIVITY_CODE 5
12/21/2022 02:35:52 PM script INFO: SUCCESS!@#KODE 1!@#USER_ID 15!@#ACTIVITY_CODE 5
12/21/2022 02:35:55 PM script INFO: SUCCESS!@#KODE 1!@#USER_ID 15!@#ACTIVITY_CODE 5
12/21/2022 02:35:55 PM script INFO: SUCCESS!@#KODE 1!@#USER_ID 15!@#ACTIVITY_CODE 5
12/21/2022 02:35:57 PM script INFO: SUCCESS!@#KODE 1!@#USER_ID 15!@#ACTIVITY_CODE 3
12/21/2022 02:35:58 PM script INFO: SUCCESS!@#KODE 1!@#USER_ID 15!@#ACTIVITY_CODE 2
12/21/2022 02:35:58 PM script INFO: SUCCESS!@#KODE 1!@#USER_ID 15!@#ACTIVITY_CODE 2
12/21/2022 02:35:58 PM script INFO: SUCCESS!@#KODE 1!@#USER_ID 15!@#ACTIVITY_CODE 3
12/21/2022 02:35:58 PM script INFO: SUCCESS!@#KODE 1!@#USER_ID 15!@#ACTIVITY_CODE 1
12/21/2022 02:35:58 PM script INFO: SUCCESS!@#KODE 1!@#USER_ID 15!@#ACTIVITY_CODE 2
12/21/2022 02:35:58 PM script INFO: SUCCESS!@#KODE 1!@#USER_ID 15!@#ACTIVITY_CODE 3
12/21/2022 02:35:58 PM script INFO: SUCCESS!@#KODE 1!@#USER_ID 15!@#ACTIVITY_CODE 3
12/21/2022 02:35:58 PM script INFO: SUCCESS!@#KODE 1!@#USER_ID 15!@#ACTIVITY_CODE 1
12/21/2022 02:35:58 PM script INFO: SUCCESS!@#KODE 1!@#USER_ID 15!@#ACTIVITY_CODE 4
12/21/2022 02:35:58 PM script INFO: SUCCESS!@#KODE 1!@#USER_ID 15!@#ACTIVITY_CODE 2
12/21/2022 02:35:59 PM script INFO: SUCCESS!@#KODE 1!@#USER_ID 15!@#ACTIVITY_CODE 3
12/21/2022 02:35:59 PM script INFO: SUCCESS!@#KODE 1!@#USER_ID 15!@#ACTIVITY_CODE 2
12/21/2022 02:35:59 PM script INFO: SUCCESS!@#KODE 1!@#USER_ID 15!@#ACTIVITY_CODE 2
12/21/2022 02:35:59 PM script INFO: SUCCESS!@#KODE 1!@#USER_ID 15!@#ACTIVITY_CODE 1
12/21/2022 02:35:59 PM script INFO: SUCCESS!@#KODE 1!@#USER_ID 15!@#ACTIVITY_CODE 2
12/21/2022 02:35:59 PM script INFO: SUCCESS!@#KODE 1!@#USER_ID 15!@#ACTIVITY_CODE 1
12/21/2022 02:35:59 PM script INFO: SUCCESS!@#KODE 1!@#USER_ID 15!@#ACTIVITY_CODE 4
12/21/2022 02:35:59 PM script INFO: SUCCESS!@#KODE 1!@#USER_ID 15!@#ACTIVITY_CODE 2
12/21/2022 02:35:59 PM script INFO: SUCCESS!@#KODE 1!@#USER_ID 15!@#ACTIVITY_CODE 3
12/21/2022 02:35:59 PM script INFO: SUCCESS!@#KODE 1!@#USER_ID 15!@#ACTIVITY_CODE 1
12/21/2022 02:36:00 PM script INFO: SUCCESS!@#KODE 1!@#USER_ID 15!@#ACTIVITY_CODE 4
12/21/2022 02:36:00 PM script INFO: SUCCESS!@#KODE 1!@#USER_ID 15!@#ACTIVITY_CODE 3
12/21/2022 02:36:00 PM script INFO: SUCCESS!@#KODE 1!@#USER_ID 15!@#ACTIVITY_CODE 1
12/21/2022 02:36:00 PM script INFO: SUCCESS!@#KODE 1!@#USER_ID 15!@#ACTIVITY_CODE 2
12/21/2022 02:36:00 PM script INFO: SUCCESS!@#KODE 1!@#USER_ID 15!@#ACTIVITY_CODE 3
12/21/2022 02:36:00 PM script INFO: SUCCESS!@#KODE 1!@#USER_ID 15!@#ACTIVITY_CODE 3
12/21/2022 02:36:00 PM script INFO: SUCCESS!@#KODE 1!@#USER_ID 15!@#ACTIVITY_CODE 4
12/21/2022 02:36:00 PM script INFO: SUCCESS!@#KODE 1!@#USER_ID 15!@#ACTIVITY_CODE 3
12/21/2022 02:36:00 PM script INFO: SUCCESS!@#KODE 1!@#USER_ID 15!@#ACTIVITY_CODE 3
12/21/2022 02:36:00 PM script INFO: SUCCESS!@#KODE 1!@#USER_ID 15!@#ACTIVITY_CODE 2
12/21/2022 02:36:00 PM script INFO: SUCCESS!@#KODE 1!@#USER_ID 15!@#ACTIVITY_CODE 2
12/21/2022 02:36:01 PM script INFO: SUCCESS!@#KODE 1!@#USER_ID 15!@#ACTIVITY_CODE 2
12/21/2022 02:36:01 PM script INFO: SUCCESS!@#KODE 1!@#USER_ID 15!@#ACTIVITY_CODE 3
12/21/2022 02:36:01 PM script INFO: SUCCESS!@#KODE 1!@#USER_ID 15!@#ACTIVITY_CODE 2
12/21/2022 02:36:01 PM script INFO: SUCCESS!@#KODE 1!@#USER_ID 15!@#ACTIVITY_CODE 3
12/21/2022 02:36:01 PM script INFO: SUCCESS!@#KODE 1!@#USER_ID 15!@#ACTIVITY_CODE 1
12/21/2022 02:36:01 PM script INFO: SUCCESS!@#KODE 1!@#USER_ID 15!@#ACTIVITY_CODE 1
12/21/2022 02:36:01 PM script INFO: SUCCESS!@#KODE 1!@#USER_ID 15!@#ACTIVITY_CODE 2
12/21/2022 02:36:01 PM script INFO: SUCCESS!@#KODE 1!@#USER_ID 15!@#ACTIVITY_CODE 3
12/21/2022 02:36:01 PM script INFO: SUCCESS!@#KODE 1!@#USER_ID 15!@#ACTIVITY_CODE 2
12/21/2022 02:36:01 PM script INFO: SUCCESS!@#KODE 1!@#USER_ID 15!@#ACTIVITY_CODE 3
12/21/2022 02:36:01 PM script INFO: SUCCESS!@#KODE 1!@#USER_ID 15!@#ACTIVITY_CODE 3
12/21/2022 02:36:01 PM script INFO: SUCCESS!@#KODE 1!@#USER_ID 15!@#ACTIVITY_CODE 3
12/21/2022 02:36:01 PM script INFO: SUCCESS!@#KODE 1!@#USER_ID 15!@#ACTIVITY_CODE 3
12/21/2022 02:36:02 PM script INFO: SUCCESS!@#KODE 1!@#USER_ID 15!@#ACTIVITY_CODE 1
12/21/2022 02:36:02 PM script INFO: SUCCESS!@#KODE 1!@#USER_ID 15!@#ACTIVITY_CODE 1
12/21/2022 02:36:02 PM script INFO: SUCCESS!@#KODE 1!@#USER_ID 15!@#ACTIVITY_CODE 2
12/21/2022 02:36:02 PM script INFO: Duration: 34.475791454315186
12/21/2022 02:36:02 PM script INFO: mengakhiri-quiz
12/21/2022 02:36:20 PM script INFO: SUCCESS!@#KODE 1!@#USER_ID 15!@#ACTIVITY_CODE 5
12/21/2022 02:36:20 PM script INFO: berhasil-submit
