12/21/2022 01:28:08 PM script INFO: Prepared chrome options..
12/21/2022 01:28:09 PM script INFO: Initialized chrome browser..
12/21/2022 01:28:09 PM script INFO: mengakses-homepage
12/21/2022 01:28:53 PM script INFO: mengakses-login-page
12/21/2022 01:29:18 PM script INFO: mengakses-site-home
12/21/2022 01:29:19 PM main_worker ERROR: Message: element click intercepted: Element <a class="list-group-item list-group-item-action  " href="http://34.133.110.143/?redirect=0" data-key="home" data-isexpandable="0" data-indent="0" data-showdivider="0" data-type="70" data-nodetype="0" data-collapse="0" data-forceopen="0" data-isactive="0" data-hidden="0" data-preceedwithhr="0" data-parent-key="myhome">...</a> is not clickable at point (142, 141). Other element would receive the click: <div class="yui3-widget-mask" style="position: fixed; width: 100%; height: 100%; top: 0px; left: 0px; z-index: 1047;"></div>
  (Session info: headless chrome=107.0.5304.87)
Stacktrace:
#0 0x55ac47f57463 <unknown>
#1 0x55ac47d1b8d8 <unknown>
#2 0x55ac47d6123b <unknown>
#3 0x55ac47d5ea79 <unknown>
#4 0x55ac47d5bfe4 <unknown>
#5 0x55ac47d5ab21 <unknown>
#6 0x55ac47d4d421 <unknown>
#7 0x55ac47d7a622 <unknown>
#8 0x55ac47d4cba7 <unknown>
#9 0x55ac47d7a78e <unknown>
#10 0x55ac47d9330f <unknown>
#11 0x55ac47d7a443 <unknown>
#12 0x55ac47d4b3c5 <unknown>
#13 0x55ac47d4c531 <unknown>
#14 0x55ac47fa9dce <unknown>
#15 0x55ac47fad192 <unknown>
#16 0x55ac47f8e93e <unknown>
#17 0x55ac47fae103 <unknown>
#18 0x55ac47f81d85 <unknown>
#19 0x55ac47fcf0a8 <unknown>
#20 0x55ac47fcf239 <unknown>
#21 0x55ac47fea492 <unknown>
#22 0x7f2c2440e609 start_thread

