12/21/2022 01:36:43 PM script INFO: Prepared chrome options..
12/21/2022 01:36:44 PM script INFO: Initialized chrome browser..
12/21/2022 01:36:44 PM script INFO: mengakses-homepage
12/21/2022 01:37:10 PM script INFO: mengakses-login-page
12/21/2022 01:37:15 PM script INFO: mengakses-site-home
12/21/2022 01:37:41 PM script INFO: mengakses-site-course
12/21/2022 01:38:01 PM script INFO: mengakses-quiz
12/21/2022 01:38:03 PM script INFO: mengakses-start-quiz-page
12/21/2022 01:38:06 PM script INFO: memulai-quiz
12/21/2022 01:38:06 PM script INFO: SUCCESS!@#KODE 1!@#USER_ID 36!@#ACTIVITY_CODE 5
12/21/2022 01:38:16 PM script INFO: SUCCESS!@#KODE 1!@#USER_ID 36!@#ACTIVITY_CODE 5
12/21/2022 01:38:16 PM script INFO: SUCCESS!@#KODE 1!@#USER_ID 36!@#ACTIVITY_CODE 5
12/21/2022 01:38:19 PM script INFO: SUCCESS!@#KODE 1!@#USER_ID 36!@#ACTIVITY_CODE 1
12/21/2022 01:38:19 PM script INFO: SUCCESS!@#KODE 1!@#USER_ID 36!@#ACTIVITY_CODE 1
12/21/2022 01:38:19 PM script INFO: SUCCESS!@#KODE 1!@#USER_ID 36!@#ACTIVITY_CODE 5
12/21/2022 01:38:19 PM script INFO: SUCCESS!@#KODE 1!@#USER_ID 36!@#ACTIVITY_CODE 5
12/21/2022 01:38:22 PM script INFO: SUCCESS!@#KODE 1!@#USER_ID 36!@#ACTIVITY_CODE 4
12/21/2022 01:38:22 PM script INFO: SUCCESS!@#KODE 1!@#USER_ID 36!@#ACTIVITY_CODE 3
12/21/2022 01:38:22 PM script INFO: SUCCESS!@#KODE 1!@#USER_ID 36!@#ACTIVITY_CODE 2
12/21/2022 01:38:22 PM script INFO: SUCCESS!@#KODE 1!@#USER_ID 36!@#ACTIVITY_CODE 5
12/21/2022 01:38:22 PM script INFO: SUCCESS!@#KODE 1!@#USER_ID 36!@#ACTIVITY_CODE 5
12/21/2022 01:38:24 PM script INFO: SUCCESS!@#KODE 1!@#USER_ID 36!@#ACTIVITY_CODE 2
12/21/2022 01:38:25 PM script INFO: SUCCESS!@#KODE 1!@#USER_ID 36!@#ACTIVITY_CODE 3
12/21/2022 01:38:25 PM script INFO: SUCCESS!@#KODE 1!@#USER_ID 36!@#ACTIVITY_CODE 3
12/21/2022 01:38:25 PM script INFO: SUCCESS!@#KODE 1!@#USER_ID 36!@#ACTIVITY_CODE 2
12/21/2022 01:38:25 PM script INFO: SUCCESS!@#KODE 1!@#USER_ID 36!@#ACTIVITY_CODE 3
12/21/2022 01:38:25 PM script INFO: SUCCESS!@#KODE 1!@#USER_ID 36!@#ACTIVITY_CODE 5
12/21/2022 01:38:25 PM script INFO: SUCCESS!@#KODE 1!@#USER_ID 36!@#ACTIVITY_CODE 5
12/21/2022 01:38:27 PM script INFO: SUCCESS!@#KODE 1!@#USER_ID 36!@#ACTIVITY_CODE 1
12/21/2022 01:38:27 PM script INFO: SUCCESS!@#KODE 1!@#USER_ID 36!@#ACTIVITY_CODE 3
12/21/2022 01:38:28 PM script INFO: SUCCESS!@#KODE 1!@#USER_ID 36!@#ACTIVITY_CODE 2
12/21/2022 01:38:28 PM script INFO: SUCCESS!@#KODE 1!@#USER_ID 36!@#ACTIVITY_CODE 2
12/21/2022 01:38:28 PM script INFO: SUCCESS!@#KODE 1!@#USER_ID 36!@#ACTIVITY_CODE 1
12/21/2022 01:38:28 PM script INFO: SUCCESS!@#KODE 1!@#USER_ID 36!@#ACTIVITY_CODE 1
12/21/2022 01:38:28 PM script INFO: SUCCESS!@#KODE 1!@#USER_ID 36!@#ACTIVITY_CODE 1
12/21/2022 01:38:28 PM script INFO: SUCCESS!@#KODE 1!@#USER_ID 36!@#ACTIVITY_CODE 1
12/21/2022 01:38:28 PM script INFO: SUCCESS!@#KODE 1!@#USER_ID 36!@#ACTIVITY_CODE 2
12/21/2022 01:38:28 PM script INFO: SUCCESS!@#KODE 1!@#USER_ID 36!@#ACTIVITY_CODE 3
12/21/2022 01:38:28 PM script INFO: SUCCESS!@#KODE 1!@#USER_ID 36!@#ACTIVITY_CODE 3
12/21/2022 01:38:28 PM script INFO: SUCCESS!@#KODE 1!@#USER_ID 36!@#ACTIVITY_CODE 5
12/21/2022 01:38:28 PM script INFO: SUCCESS!@#KODE 1!@#USER_ID 36!@#ACTIVITY_CODE 5
12/21/2022 01:38:31 PM script INFO: SUCCESS!@#KODE 1!@#USER_ID 36!@#ACTIVITY_CODE 2
12/21/2022 01:38:31 PM script INFO: SUCCESS!@#KODE 1!@#USER_ID 36!@#ACTIVITY_CODE 1
12/21/2022 01:38:31 PM script INFO: SUCCESS!@#KODE 1!@#USER_ID 36!@#ACTIVITY_CODE 5
12/21/2022 01:38:31 PM script INFO: SUCCESS!@#KODE 1!@#USER_ID 36!@#ACTIVITY_CODE 5
12/21/2022 01:38:33 PM script INFO: SUCCESS!@#KODE 1!@#USER_ID 36!@#ACTIVITY_CODE 3
12/21/2022 01:38:34 PM script INFO: SUCCESS!@#KODE 1!@#USER_ID 36!@#ACTIVITY_CODE 2
12/21/2022 01:38:34 PM script INFO: SUCCESS!@#KODE 1!@#USER_ID 36!@#ACTIVITY_CODE 1
12/21/2022 01:38:34 PM script INFO: SUCCESS!@#KODE 1!@#USER_ID 36!@#ACTIVITY_CODE 2
12/21/2022 01:38:34 PM script INFO: SUCCESS!@#KODE 1!@#USER_ID 36!@#ACTIVITY_CODE 2
12/21/2022 01:38:34 PM script INFO: SUCCESS!@#KODE 1!@#USER_ID 36!@#ACTIVITY_CODE 4
12/21/2022 01:38:34 PM script INFO: SUCCESS!@#KODE 1!@#USER_ID 36!@#ACTIVITY_CODE 3
12/21/2022 01:38:34 PM script INFO: SUCCESS!@#KODE 1!@#USER_ID 36!@#ACTIVITY_CODE 5
12/21/2022 01:38:34 PM script INFO: SUCCESS!@#KODE 1!@#USER_ID 36!@#ACTIVITY_CODE 5
12/21/2022 01:38:37 PM script INFO: SUCCESS!@#KODE 1!@#USER_ID 36!@#ACTIVITY_CODE 3
12/21/2022 01:38:37 PM script INFO: SUCCESS!@#KODE 1!@#USER_ID 36!@#ACTIVITY_CODE 2
12/21/2022 01:38:37 PM script INFO: SUCCESS!@#KODE 1!@#USER_ID 36!@#ACTIVITY_CODE 4
12/21/2022 01:38:37 PM script INFO: SUCCESS!@#KODE 1!@#USER_ID 36!@#ACTIVITY_CODE 1
12/21/2022 01:38:37 PM script INFO: SUCCESS!@#KODE 1!@#USER_ID 36!@#ACTIVITY_CODE 2
12/21/2022 01:38:37 PM script INFO: SUCCESS!@#KODE 1!@#USER_ID 36!@#ACTIVITY_CODE 1
12/21/2022 01:38:37 PM script INFO: SUCCESS!@#KODE 1!@#USER_ID 36!@#ACTIVITY_CODE 5
12/21/2022 01:38:37 PM script INFO: SUCCESS!@#KODE 1!@#USER_ID 36!@#ACTIVITY_CODE 5
12/21/2022 01:38:40 PM script INFO: SUCCESS!@#KODE 1!@#USER_ID 36!@#ACTIVITY_CODE 2
12/21/2022 01:38:40 PM script INFO: SUCCESS!@#KODE 1!@#USER_ID 36!@#ACTIVITY_CODE 1
12/21/2022 01:38:40 PM script INFO: SUCCESS!@#KODE 1!@#USER_ID 36!@#ACTIVITY_CODE 2
12/21/2022 01:38:40 PM script INFO: SUCCESS!@#KODE 1!@#USER_ID 36!@#ACTIVITY_CODE 5
12/21/2022 01:38:40 PM script INFO: SUCCESS!@#KODE 1!@#USER_ID 36!@#ACTIVITY_CODE 5
12/21/2022 01:38:42 PM script INFO: SUCCESS!@#KODE 1!@#USER_ID 36!@#ACTIVITY_CODE 5
12/21/2022 01:38:42 PM script INFO: SUCCESS!@#KODE 1!@#USER_ID 36!@#ACTIVITY_CODE 5
12/21/2022 01:38:45 PM script INFO: SUCCESS!@#KODE 1!@#USER_ID 36!@#ACTIVITY_CODE 2
12/21/2022 01:38:45 PM script INFO: SUCCESS!@#KODE 1!@#USER_ID 36!@#ACTIVITY_CODE 5
12/21/2022 01:38:45 PM script INFO: SUCCESS!@#KODE 1!@#USER_ID 36!@#ACTIVITY_CODE 5
12/21/2022 01:38:48 PM script INFO: SUCCESS!@#KODE 1!@#USER_ID 36!@#ACTIVITY_CODE 2
12/21/2022 01:38:48 PM script INFO: SUCCESS!@#KODE 1!@#USER_ID 36!@#ACTIVITY_CODE 2
12/21/2022 01:38:48 PM script INFO: SUCCESS!@#KODE 1!@#USER_ID 36!@#ACTIVITY_CODE 4
12/21/2022 01:38:48 PM script INFO: SUCCESS!@#KODE 1!@#USER_ID 36!@#ACTIVITY_CODE 2
12/21/2022 01:38:48 PM script INFO: SUCCESS!@#KODE 1!@#USER_ID 36!@#ACTIVITY_CODE 2
12/21/2022 01:38:48 PM script INFO: SUCCESS!@#KODE 1!@#USER_ID 36!@#ACTIVITY_CODE 1
12/21/2022 01:38:49 PM script INFO: SUCCESS!@#KODE 1!@#USER_ID 36!@#ACTIVITY_CODE 2
12/21/2022 01:38:49 PM script INFO: SUCCESS!@#KODE 1!@#USER_ID 36!@#ACTIVITY_CODE 1
12/21/2022 01:38:49 PM script INFO: SUCCESS!@#KODE 1!@#USER_ID 36!@#ACTIVITY_CODE 3
12/21/2022 01:38:49 PM script INFO: SUCCESS!@#KODE 1!@#USER_ID 36!@#ACTIVITY_CODE 3
12/21/2022 01:38:49 PM script INFO: SUCCESS!@#KODE 1!@#USER_ID 36!@#ACTIVITY_CODE 1
12/21/2022 01:38:49 PM script INFO: SUCCESS!@#KODE 1!@#USER_ID 36!@#ACTIVITY_CODE 4
12/21/2022 01:38:49 PM script INFO: SUCCESS!@#KODE 1!@#USER_ID 36!@#ACTIVITY_CODE 3
12/21/2022 01:38:49 PM script INFO: SUCCESS!@#KODE 1!@#USER_ID 36!@#ACTIVITY_CODE 2
12/21/2022 01:38:49 PM script INFO: SUCCESS!@#KODE 1!@#USER_ID 36!@#ACTIVITY_CODE 1
12/21/2022 01:38:49 PM script INFO: SUCCESS!@#KODE 1!@#USER_ID 36!@#ACTIVITY_CODE 2
12/21/2022 01:38:50 PM script INFO: SUCCESS!@#KODE 1!@#USER_ID 36!@#ACTIVITY_CODE 2
12/21/2022 01:38:50 PM script INFO: SUCCESS!@#KODE 1!@#USER_ID 36!@#ACTIVITY_CODE 3
12/21/2022 01:38:50 PM script INFO: SUCCESS!@#KODE 1!@#USER_ID 36!@#ACTIVITY_CODE 2
12/21/2022 01:38:50 PM script INFO: SUCCESS!@#KODE 1!@#USER_ID 36!@#ACTIVITY_CODE 2
12/21/2022 01:38:50 PM script INFO: SUCCESS!@#KODE 1!@#USER_ID 36!@#ACTIVITY_CODE 1
12/21/2022 01:38:50 PM script INFO: SUCCESS!@#KODE 1!@#USER_ID 36!@#ACTIVITY_CODE 3
12/21/2022 01:38:50 PM script INFO: SUCCESS!@#KODE 1!@#USER_ID 36!@#ACTIVITY_CODE 1
12/21/2022 01:38:50 PM script INFO: SUCCESS!@#KODE 1!@#USER_ID 36!@#ACTIVITY_CODE 2
12/21/2022 01:38:50 PM script INFO: SUCCESS!@#KODE 1!@#USER_ID 36!@#ACTIVITY_CODE 3
12/21/2022 01:38:51 PM script INFO: SUCCESS!@#KODE 1!@#USER_ID 36!@#ACTIVITY_CODE 1
12/21/2022 01:38:51 PM script INFO: SUCCESS!@#KODE 1!@#USER_ID 36!@#ACTIVITY_CODE 1
12/21/2022 01:38:51 PM script INFO: SUCCESS!@#KODE 1!@#USER_ID 36!@#ACTIVITY_CODE 2
12/21/2022 01:38:51 PM script INFO: SUCCESS!@#KODE 1!@#USER_ID 36!@#ACTIVITY_CODE 1
12/21/2022 01:38:51 PM script INFO: SUCCESS!@#KODE 1!@#USER_ID 36!@#ACTIVITY_CODE 3
12/21/2022 01:38:51 PM script INFO: SUCCESS!@#KODE 1!@#USER_ID 36!@#ACTIVITY_CODE 1
12/21/2022 01:38:51 PM script INFO: SUCCESS!@#KODE 1!@#USER_ID 36!@#ACTIVITY_CODE 2
12/21/2022 01:38:51 PM script INFO: SUCCESS!@#KODE 1!@#USER_ID 36!@#ACTIVITY_CODE 1
12/21/2022 01:38:51 PM script INFO: SUCCESS!@#KODE 1!@#USER_ID 36!@#ACTIVITY_CODE 2
12/21/2022 01:38:51 PM script INFO: SUCCESS!@#KODE 1!@#USER_ID 36!@#ACTIVITY_CODE 3
12/21/2022 01:38:51 PM script INFO: SUCCESS!@#KODE 1!@#USER_ID 36!@#ACTIVITY_CODE 4
12/21/2022 01:38:51 PM script INFO: Duration: 34.93914723396301
12/21/2022 01:38:51 PM script INFO: mengakhiri-quiz
12/21/2022 01:39:06 PM script INFO: SUCCESS!@#KODE 1!@#USER_ID 36!@#ACTIVITY_CODE 5
12/21/2022 01:39:06 PM script INFO: berhasil-submit
