12/21/2022 02:29:40 PM script INFO: Prepared chrome options..
12/21/2022 02:29:42 PM script INFO: Initialized chrome browser..
12/21/2022 02:29:42 PM script INFO: mengakses-homepage
12/21/2022 02:30:33 PM script INFO: mengakses-login-page
12/21/2022 02:30:36 PM script INFO: mengakses-site-home
12/21/2022 02:30:46 PM script INFO: mengakses-site-course
12/21/2022 02:30:51 PM script INFO: mengakses-quiz
12/21/2022 02:30:52 PM script INFO: mengakses-start-quiz-page
12/21/2022 02:30:53 PM script INFO: memulai-quiz
12/21/2022 02:30:53 PM script INFO: SUCCESS!@#KODE 1!@#USER_ID 51!@#ACTIVITY_CODE 5
12/21/2022 02:31:04 PM script INFO: SUCCESS!@#KODE 1!@#USER_ID 51!@#ACTIVITY_CODE 1
12/21/2022 02:31:04 PM script INFO: SUCCESS!@#KODE 1!@#USER_ID 51!@#ACTIVITY_CODE 2
12/21/2022 02:31:04 PM script INFO: SUCCESS!@#KODE 1!@#USER_ID 51!@#ACTIVITY_CODE 5
12/21/2022 02:31:04 PM script INFO: SUCCESS!@#KODE 1!@#USER_ID 51!@#ACTIVITY_CODE 5
12/21/2022 02:31:07 PM script INFO: SUCCESS!@#KODE 1!@#USER_ID 51!@#ACTIVITY_CODE 2
12/21/2022 02:31:07 PM script INFO: SUCCESS!@#KODE 1!@#USER_ID 51!@#ACTIVITY_CODE 3
12/21/2022 02:31:07 PM script INFO: SUCCESS!@#KODE 1!@#USER_ID 51!@#ACTIVITY_CODE 4
12/21/2022 02:31:07 PM script INFO: SUCCESS!@#KODE 1!@#USER_ID 51!@#ACTIVITY_CODE 1
12/21/2022 02:31:08 PM script INFO: SUCCESS!@#KODE 1!@#USER_ID 51!@#ACTIVITY_CODE 2
12/21/2022 02:31:08 PM script INFO: SUCCESS!@#KODE 1!@#USER_ID 51!@#ACTIVITY_CODE 5
12/21/2022 02:31:08 PM script INFO: SUCCESS!@#KODE 1!@#USER_ID 51!@#ACTIVITY_CODE 5
12/21/2022 02:31:10 PM script INFO: SUCCESS!@#KODE 1!@#USER_ID 51!@#ACTIVITY_CODE 2
12/21/2022 02:31:10 PM script INFO: SUCCESS!@#KODE 1!@#USER_ID 51!@#ACTIVITY_CODE 2
12/21/2022 02:31:10 PM script INFO: SUCCESS!@#KODE 1!@#USER_ID 51!@#ACTIVITY_CODE 2
12/21/2022 02:31:11 PM script INFO: SUCCESS!@#KODE 1!@#USER_ID 51!@#ACTIVITY_CODE 1
12/21/2022 02:31:11 PM script INFO: SUCCESS!@#KODE 1!@#USER_ID 51!@#ACTIVITY_CODE 1
12/21/2022 02:31:11 PM script INFO: SUCCESS!@#KODE 1!@#USER_ID 51!@#ACTIVITY_CODE 4
12/21/2022 02:31:11 PM script INFO: SUCCESS!@#KODE 1!@#USER_ID 51!@#ACTIVITY_CODE 5
12/21/2022 02:31:11 PM script INFO: SUCCESS!@#KODE 1!@#USER_ID 51!@#ACTIVITY_CODE 5
12/21/2022 02:31:13 PM script INFO: SUCCESS!@#KODE 1!@#USER_ID 51!@#ACTIVITY_CODE 1
12/21/2022 02:31:13 PM script INFO: SUCCESS!@#KODE 1!@#USER_ID 51!@#ACTIVITY_CODE 3
12/21/2022 02:31:13 PM script INFO: SUCCESS!@#KODE 1!@#USER_ID 51!@#ACTIVITY_CODE 5
12/21/2022 02:31:13 PM script INFO: SUCCESS!@#KODE 1!@#USER_ID 51!@#ACTIVITY_CODE 5
12/21/2022 02:31:16 PM script INFO: SUCCESS!@#KODE 1!@#USER_ID 51!@#ACTIVITY_CODE 5
12/21/2022 02:31:16 PM script INFO: SUCCESS!@#KODE 1!@#USER_ID 51!@#ACTIVITY_CODE 5
12/21/2022 02:31:18 PM script INFO: SUCCESS!@#KODE 1!@#USER_ID 51!@#ACTIVITY_CODE 3
12/21/2022 02:31:19 PM script INFO: SUCCESS!@#KODE 1!@#USER_ID 51!@#ACTIVITY_CODE 3
12/21/2022 02:31:19 PM script INFO: SUCCESS!@#KODE 1!@#USER_ID 51!@#ACTIVITY_CODE 1
12/21/2022 02:31:19 PM script INFO: SUCCESS!@#KODE 1!@#USER_ID 51!@#ACTIVITY_CODE 5
12/21/2022 02:31:19 PM script INFO: SUCCESS!@#KODE 1!@#USER_ID 51!@#ACTIVITY_CODE 5
12/21/2022 02:31:21 PM script INFO: SUCCESS!@#KODE 1!@#USER_ID 51!@#ACTIVITY_CODE 4
12/21/2022 02:31:21 PM script INFO: SUCCESS!@#KODE 1!@#USER_ID 51!@#ACTIVITY_CODE 1
12/21/2022 02:31:21 PM script INFO: SUCCESS!@#KODE 1!@#USER_ID 51!@#ACTIVITY_CODE 1
12/21/2022 02:31:21 PM script INFO: SUCCESS!@#KODE 1!@#USER_ID 51!@#ACTIVITY_CODE 1
12/21/2022 02:31:21 PM script INFO: SUCCESS!@#KODE 1!@#USER_ID 51!@#ACTIVITY_CODE 2
12/21/2022 02:31:22 PM script INFO: SUCCESS!@#KODE 1!@#USER_ID 51!@#ACTIVITY_CODE 2
12/21/2022 02:31:22 PM script INFO: SUCCESS!@#KODE 1!@#USER_ID 51!@#ACTIVITY_CODE 4
12/21/2022 02:31:22 PM script INFO: SUCCESS!@#KODE 1!@#USER_ID 51!@#ACTIVITY_CODE 1
12/21/2022 02:31:22 PM script INFO: SUCCESS!@#KODE 1!@#USER_ID 51!@#ACTIVITY_CODE 1
12/21/2022 02:31:22 PM script INFO: SUCCESS!@#KODE 1!@#USER_ID 51!@#ACTIVITY_CODE 2
12/21/2022 02:31:22 PM script INFO: SUCCESS!@#KODE 1!@#USER_ID 51!@#ACTIVITY_CODE 2
12/21/2022 02:31:22 PM script INFO: SUCCESS!@#KODE 1!@#USER_ID 51!@#ACTIVITY_CODE 1
12/21/2022 02:31:22 PM script INFO: SUCCESS!@#KODE 1!@#USER_ID 51!@#ACTIVITY_CODE 2
12/21/2022 02:31:22 PM script INFO: SUCCESS!@#KODE 1!@#USER_ID 51!@#ACTIVITY_CODE 3
12/21/2022 02:31:22 PM script INFO: SUCCESS!@#KODE 1!@#USER_ID 51!@#ACTIVITY_CODE 3
12/21/2022 02:31:22 PM script INFO: SUCCESS!@#KODE 1!@#USER_ID 51!@#ACTIVITY_CODE 3
12/21/2022 02:31:22 PM script INFO: SUCCESS!@#KODE 1!@#USER_ID 51!@#ACTIVITY_CODE 4
12/21/2022 02:31:22 PM script INFO: SUCCESS!@#KODE 1!@#USER_ID 51!@#ACTIVITY_CODE 1
12/21/2022 02:31:22 PM script INFO: Duration: 18.265249729156494
12/21/2022 02:31:22 PM script INFO: mengakhiri-quiz
12/21/2022 02:31:23 PM script INFO: SUCCESS!@#KODE 1!@#USER_ID 51!@#ACTIVITY_CODE 5
12/21/2022 02:31:23 PM script INFO: berhasil-submit
