12/23/2022 07:04:05 AM script INFO: Prepared chrome options..
12/23/2022 07:04:06 AM script INFO: Initialized chrome browser..
12/23/2022 07:04:06 AM script INFO: mengakses-homepage
12/23/2022 07:04:13 AM script INFO: mengakses-login-page
12/23/2022 07:04:14 AM script INFO: mengakses-site-home
12/23/2022 07:04:15 AM script INFO: mengakses-site-course
12/23/2022 07:04:16 AM script INFO: mengakses-quiz
12/23/2022 07:04:17 AM script INFO: mengakses-start-quiz-page
12/23/2022 07:04:17 AM script INFO: memulai-quiz
12/23/2022 07:04:17 AM script INFO: SUCCESS!@#KODE 1!@#USER_ID 84!@#ACTIVITY_CODE 5
12/23/2022 07:04:28 AM script INFO: SUCCESS!@#KODE 1!@#USER_ID 84!@#ACTIVITY_CODE 1
12/23/2022 07:04:28 AM script INFO: SUCCESS!@#KODE 1!@#USER_ID 84!@#ACTIVITY_CODE 3
12/23/2022 07:04:28 AM script INFO: SUCCESS!@#KODE 1!@#USER_ID 84!@#ACTIVITY_CODE 4
12/23/2022 07:04:28 AM script INFO: SUCCESS!@#KODE 1!@#USER_ID 84!@#ACTIVITY_CODE 5
12/23/2022 07:04:28 AM script INFO: SUCCESS!@#KODE 1!@#USER_ID 84!@#ACTIVITY_CODE 5
12/23/2022 07:04:31 AM script INFO: SUCCESS!@#KODE 1!@#USER_ID 84!@#ACTIVITY_CODE 2
12/23/2022 07:04:31 AM script INFO: SUCCESS!@#KODE 1!@#USER_ID 84!@#ACTIVITY_CODE 3
12/23/2022 07:04:31 AM script INFO: SUCCESS!@#KODE 1!@#USER_ID 84!@#ACTIVITY_CODE 5
12/23/2022 07:04:31 AM script INFO: SUCCESS!@#KODE 1!@#USER_ID 84!@#ACTIVITY_CODE 5
12/23/2022 07:04:34 AM script INFO: SUCCESS!@#KODE 1!@#USER_ID 84!@#ACTIVITY_CODE 2
12/23/2022 07:04:34 AM script INFO: SUCCESS!@#KODE 1!@#USER_ID 84!@#ACTIVITY_CODE 2
12/23/2022 07:04:34 AM script INFO: SUCCESS!@#KODE 1!@#USER_ID 84!@#ACTIVITY_CODE 2
12/23/2022 07:04:34 AM script INFO: SUCCESS!@#KODE 1!@#USER_ID 84!@#ACTIVITY_CODE 2
12/23/2022 07:04:34 AM script INFO: SUCCESS!@#KODE 1!@#USER_ID 84!@#ACTIVITY_CODE 5
12/23/2022 07:04:34 AM script INFO: SUCCESS!@#KODE 1!@#USER_ID 84!@#ACTIVITY_CODE 5
12/23/2022 07:04:37 AM script INFO: SUCCESS!@#KODE 1!@#USER_ID 84!@#ACTIVITY_CODE 5
12/23/2022 07:04:37 AM script INFO: SUCCESS!@#KODE 1!@#USER_ID 84!@#ACTIVITY_CODE 5
12/23/2022 07:04:39 AM script INFO: SUCCESS!@#KODE 1!@#USER_ID 84!@#ACTIVITY_CODE 3
12/23/2022 07:04:39 AM script INFO: SUCCESS!@#KODE 1!@#USER_ID 84!@#ACTIVITY_CODE 2
12/23/2022 07:04:39 AM script INFO: SUCCESS!@#KODE 1!@#USER_ID 84!@#ACTIVITY_CODE 3
12/23/2022 07:04:39 AM script INFO: SUCCESS!@#KODE 1!@#USER_ID 84!@#ACTIVITY_CODE 1
12/23/2022 07:04:40 AM script INFO: SUCCESS!@#KODE 1!@#USER_ID 84!@#ACTIVITY_CODE 4
12/23/2022 07:04:40 AM script INFO: SUCCESS!@#KODE 1!@#USER_ID 84!@#ACTIVITY_CODE 5
12/23/2022 07:04:40 AM script INFO: SUCCESS!@#KODE 1!@#USER_ID 84!@#ACTIVITY_CODE 5
12/23/2022 07:04:42 AM script INFO: SUCCESS!@#KODE 1!@#USER_ID 84!@#ACTIVITY_CODE 3
12/23/2022 07:04:42 AM script INFO: SUCCESS!@#KODE 1!@#USER_ID 84!@#ACTIVITY_CODE 3
12/23/2022 07:04:42 AM script INFO: SUCCESS!@#KODE 1!@#USER_ID 84!@#ACTIVITY_CODE 3
12/23/2022 07:04:42 AM script INFO: SUCCESS!@#KODE 1!@#USER_ID 84!@#ACTIVITY_CODE 5
12/23/2022 07:04:42 AM script INFO: SUCCESS!@#KODE 1!@#USER_ID 84!@#ACTIVITY_CODE 5
12/23/2022 07:04:45 AM script INFO: SUCCESS!@#KODE 1!@#USER_ID 84!@#ACTIVITY_CODE 2
12/23/2022 07:04:45 AM script INFO: SUCCESS!@#KODE 1!@#USER_ID 84!@#ACTIVITY_CODE 2
12/23/2022 07:04:45 AM script INFO: SUCCESS!@#KODE 1!@#USER_ID 84!@#ACTIVITY_CODE 3
12/23/2022 07:04:45 AM script INFO: SUCCESS!@#KODE 1!@#USER_ID 84!@#ACTIVITY_CODE 2
12/23/2022 07:04:45 AM script INFO: SUCCESS!@#KODE 1!@#USER_ID 84!@#ACTIVITY_CODE 2
12/23/2022 07:04:45 AM script INFO: SUCCESS!@#KODE 1!@#USER_ID 84!@#ACTIVITY_CODE 1
12/23/2022 07:04:46 AM script INFO: SUCCESS!@#KODE 1!@#USER_ID 84!@#ACTIVITY_CODE 2
12/23/2022 07:04:46 AM script INFO: SUCCESS!@#KODE 1!@#USER_ID 84!@#ACTIVITY_CODE 3
12/23/2022 07:04:46 AM script INFO: SUCCESS!@#KODE 1!@#USER_ID 84!@#ACTIVITY_CODE 3
12/23/2022 07:04:46 AM script INFO: SUCCESS!@#KODE 1!@#USER_ID 84!@#ACTIVITY_CODE 2
12/23/2022 07:04:46 AM script INFO: SUCCESS!@#KODE 1!@#USER_ID 84!@#ACTIVITY_CODE 1
12/23/2022 07:04:46 AM script INFO: SUCCESS!@#KODE 1!@#USER_ID 84!@#ACTIVITY_CODE 3
12/23/2022 07:04:46 AM script INFO: SUCCESS!@#KODE 1!@#USER_ID 84!@#ACTIVITY_CODE 2
12/23/2022 07:04:46 AM script INFO: SUCCESS!@#KODE 1!@#USER_ID 84!@#ACTIVITY_CODE 3
12/23/2022 07:04:46 AM script INFO: SUCCESS!@#KODE 1!@#USER_ID 84!@#ACTIVITY_CODE 1
12/23/2022 07:04:46 AM script INFO: SUCCESS!@#KODE 1!@#USER_ID 84!@#ACTIVITY_CODE 1
12/23/2022 07:04:47 AM script INFO: SUCCESS!@#KODE 1!@#USER_ID 84!@#ACTIVITY_CODE 2
12/23/2022 07:04:47 AM script INFO: SUCCESS!@#KODE 1!@#USER_ID 84!@#ACTIVITY_CODE 1
12/23/2022 07:04:47 AM script INFO: SUCCESS!@#KODE 1!@#USER_ID 84!@#ACTIVITY_CODE 3
12/23/2022 07:04:47 AM script INFO: Duration: 18.74649977684021
12/23/2022 07:04:47 AM script INFO: mengakhiri-quiz
12/23/2022 07:04:57 AM script INFO: SUCCESS!@#KODE 1!@#USER_ID 84!@#ACTIVITY_CODE 5
12/23/2022 07:04:57 AM script INFO: berhasil-submit
