12/23/2022 07:21:05 AM script INFO: Prepared chrome options..
12/23/2022 07:21:06 AM script INFO: Initialized chrome browser..
12/23/2022 07:21:06 AM script INFO: mengakses-homepage
12/23/2022 07:21:44 AM script INFO: mengakses-login-page
12/23/2022 07:21:46 AM script INFO: mengakses-site-home
12/23/2022 07:21:46 AM script INFO: mengakses-site-course
12/23/2022 07:21:47 AM script INFO: mengakses-quiz
12/23/2022 07:21:48 AM script INFO: mengakses-start-quiz-page
12/23/2022 07:21:49 AM script INFO: memulai-quiz
12/23/2022 07:21:49 AM script INFO: SUCCESS!@#KODE 1!@#USER_ID 34!@#ACTIVITY_CODE 5
12/23/2022 07:22:00 AM script INFO: SUCCESS!@#KODE 1!@#USER_ID 34!@#ACTIVITY_CODE 2
12/23/2022 07:22:00 AM script INFO: SUCCESS!@#KODE 1!@#USER_ID 34!@#ACTIVITY_CODE 1
12/23/2022 07:22:00 AM script INFO: SUCCESS!@#KODE 1!@#USER_ID 34!@#ACTIVITY_CODE 5
12/23/2022 07:22:00 AM script INFO: SUCCESS!@#KODE 1!@#USER_ID 34!@#ACTIVITY_CODE 5
12/23/2022 07:22:03 AM script INFO: SUCCESS!@#KODE 1!@#USER_ID 34!@#ACTIVITY_CODE 3
12/23/2022 07:22:03 AM script INFO: SUCCESS!@#KODE 1!@#USER_ID 34!@#ACTIVITY_CODE 2
12/23/2022 07:22:03 AM script INFO: SUCCESS!@#KODE 1!@#USER_ID 34!@#ACTIVITY_CODE 1
12/23/2022 07:22:03 AM script INFO: SUCCESS!@#KODE 1!@#USER_ID 34!@#ACTIVITY_CODE 1
12/23/2022 07:22:03 AM script INFO: SUCCESS!@#KODE 1!@#USER_ID 34!@#ACTIVITY_CODE 1
12/23/2022 07:22:03 AM script INFO: SUCCESS!@#KODE 1!@#USER_ID 34!@#ACTIVITY_CODE 2
12/23/2022 07:22:03 AM script INFO: SUCCESS!@#KODE 1!@#USER_ID 34!@#ACTIVITY_CODE 3
12/23/2022 07:22:03 AM script INFO: SUCCESS!@#KODE 1!@#USER_ID 34!@#ACTIVITY_CODE 5
12/23/2022 07:22:03 AM script INFO: SUCCESS!@#KODE 1!@#USER_ID 34!@#ACTIVITY_CODE 5
12/23/2022 07:22:06 AM script INFO: SUCCESS!@#KODE 1!@#USER_ID 34!@#ACTIVITY_CODE 5
12/23/2022 07:22:06 AM script INFO: SUCCESS!@#KODE 1!@#USER_ID 34!@#ACTIVITY_CODE 5
12/23/2022 07:22:08 AM script INFO: SUCCESS!@#KODE 1!@#USER_ID 34!@#ACTIVITY_CODE 2
12/23/2022 07:22:09 AM script INFO: SUCCESS!@#KODE 1!@#USER_ID 34!@#ACTIVITY_CODE 1
12/23/2022 07:22:09 AM script INFO: SUCCESS!@#KODE 1!@#USER_ID 34!@#ACTIVITY_CODE 4
12/23/2022 07:22:09 AM script INFO: SUCCESS!@#KODE 1!@#USER_ID 34!@#ACTIVITY_CODE 2
12/23/2022 07:22:09 AM script INFO: SUCCESS!@#KODE 1!@#USER_ID 34!@#ACTIVITY_CODE 4
12/23/2022 07:22:09 AM script INFO: SUCCESS!@#KODE 1!@#USER_ID 34!@#ACTIVITY_CODE 2
12/23/2022 07:22:09 AM script INFO: SUCCESS!@#KODE 1!@#USER_ID 34!@#ACTIVITY_CODE 5
12/23/2022 07:22:09 AM script INFO: SUCCESS!@#KODE 1!@#USER_ID 34!@#ACTIVITY_CODE 5
12/23/2022 07:22:12 AM script INFO: SUCCESS!@#KODE 1!@#USER_ID 34!@#ACTIVITY_CODE 5
12/23/2022 07:22:12 AM script INFO: SUCCESS!@#KODE 1!@#USER_ID 34!@#ACTIVITY_CODE 5
12/23/2022 07:22:14 AM script INFO: SUCCESS!@#KODE 1!@#USER_ID 34!@#ACTIVITY_CODE 3
12/23/2022 07:22:14 AM script INFO: SUCCESS!@#KODE 1!@#USER_ID 34!@#ACTIVITY_CODE 2
12/23/2022 07:22:15 AM script INFO: SUCCESS!@#KODE 1!@#USER_ID 34!@#ACTIVITY_CODE 2
12/23/2022 07:22:15 AM script INFO: SUCCESS!@#KODE 1!@#USER_ID 34!@#ACTIVITY_CODE 5
12/23/2022 07:22:15 AM script INFO: SUCCESS!@#KODE 1!@#USER_ID 34!@#ACTIVITY_CODE 5
12/23/2022 07:22:17 AM script INFO: SUCCESS!@#KODE 1!@#USER_ID 34!@#ACTIVITY_CODE 5
12/23/2022 07:22:17 AM script INFO: SUCCESS!@#KODE 1!@#USER_ID 34!@#ACTIVITY_CODE 5
12/23/2022 07:22:20 AM script INFO: SUCCESS!@#KODE 1!@#USER_ID 34!@#ACTIVITY_CODE 2
12/23/2022 07:22:20 AM script INFO: SUCCESS!@#KODE 1!@#USER_ID 34!@#ACTIVITY_CODE 1
12/23/2022 07:22:20 AM script INFO: SUCCESS!@#KODE 1!@#USER_ID 34!@#ACTIVITY_CODE 2
12/23/2022 07:22:20 AM script INFO: SUCCESS!@#KODE 1!@#USER_ID 34!@#ACTIVITY_CODE 3
12/23/2022 07:22:20 AM script INFO: SUCCESS!@#KODE 1!@#USER_ID 34!@#ACTIVITY_CODE 3
12/23/2022 07:22:20 AM script INFO: SUCCESS!@#KODE 1!@#USER_ID 34!@#ACTIVITY_CODE 2
12/23/2022 07:22:21 AM script INFO: SUCCESS!@#KODE 1!@#USER_ID 34!@#ACTIVITY_CODE 2
12/23/2022 07:22:21 AM script INFO: SUCCESS!@#KODE 1!@#USER_ID 34!@#ACTIVITY_CODE 5
12/23/2022 07:22:21 AM script INFO: SUCCESS!@#KODE 1!@#USER_ID 34!@#ACTIVITY_CODE 5
12/23/2022 07:22:23 AM script INFO: SUCCESS!@#KODE 1!@#USER_ID 34!@#ACTIVITY_CODE 2
12/23/2022 07:22:23 AM script INFO: SUCCESS!@#KODE 1!@#USER_ID 34!@#ACTIVITY_CODE 1
12/23/2022 07:22:24 AM script INFO: SUCCESS!@#KODE 1!@#USER_ID 34!@#ACTIVITY_CODE 2
12/23/2022 07:22:24 AM script INFO: SUCCESS!@#KODE 1!@#USER_ID 34!@#ACTIVITY_CODE 1
12/23/2022 07:22:24 AM script INFO: SUCCESS!@#KODE 1!@#USER_ID 34!@#ACTIVITY_CODE 1
12/23/2022 07:22:24 AM script INFO: SUCCESS!@#KODE 1!@#USER_ID 34!@#ACTIVITY_CODE 3
12/23/2022 07:22:24 AM script INFO: SUCCESS!@#KODE 1!@#USER_ID 34!@#ACTIVITY_CODE 1
12/23/2022 07:22:24 AM script INFO: SUCCESS!@#KODE 1!@#USER_ID 34!@#ACTIVITY_CODE 5
12/23/2022 07:22:24 AM script INFO: SUCCESS!@#KODE 1!@#USER_ID 34!@#ACTIVITY_CODE 5
12/23/2022 07:22:27 AM script INFO: SUCCESS!@#KODE 1!@#USER_ID 34!@#ACTIVITY_CODE 2
12/23/2022 07:22:27 AM script INFO: SUCCESS!@#KODE 1!@#USER_ID 34!@#ACTIVITY_CODE 2
12/23/2022 07:22:27 AM script INFO: SUCCESS!@#KODE 1!@#USER_ID 34!@#ACTIVITY_CODE 4
12/23/2022 07:22:27 AM script INFO: SUCCESS!@#KODE 1!@#USER_ID 34!@#ACTIVITY_CODE 5
12/23/2022 07:22:27 AM script INFO: SUCCESS!@#KODE 1!@#USER_ID 34!@#ACTIVITY_CODE 5
12/23/2022 07:22:30 AM script INFO: SUCCESS!@#KODE 1!@#USER_ID 34!@#ACTIVITY_CODE 2
12/23/2022 07:22:30 AM script INFO: SUCCESS!@#KODE 1!@#USER_ID 34!@#ACTIVITY_CODE 3
12/23/2022 07:22:30 AM script INFO: SUCCESS!@#KODE 1!@#USER_ID 34!@#ACTIVITY_CODE 1
12/23/2022 07:22:30 AM script INFO: SUCCESS!@#KODE 1!@#USER_ID 34!@#ACTIVITY_CODE 2
12/23/2022 07:22:30 AM script INFO: SUCCESS!@#KODE 1!@#USER_ID 34!@#ACTIVITY_CODE 5
12/23/2022 07:22:30 AM script INFO: SUCCESS!@#KODE 1!@#USER_ID 34!@#ACTIVITY_CODE 5
12/23/2022 07:22:33 AM script INFO: SUCCESS!@#KODE 1!@#USER_ID 34!@#ACTIVITY_CODE 3
12/23/2022 07:22:33 AM script INFO: SUCCESS!@#KODE 1!@#USER_ID 34!@#ACTIVITY_CODE 5
12/23/2022 07:22:33 AM script INFO: SUCCESS!@#KODE 1!@#USER_ID 34!@#ACTIVITY_CODE 5
12/23/2022 07:22:36 AM script INFO: SUCCESS!@#KODE 1!@#USER_ID 34!@#ACTIVITY_CODE 5
12/23/2022 07:22:36 AM script INFO: SUCCESS!@#KODE 1!@#USER_ID 34!@#ACTIVITY_CODE 5
12/23/2022 07:22:38 AM script INFO: SUCCESS!@#KODE 1!@#USER_ID 34!@#ACTIVITY_CODE 5
12/23/2022 07:22:38 AM script INFO: SUCCESS!@#KODE 1!@#USER_ID 34!@#ACTIVITY_CODE 5
12/23/2022 07:22:41 AM script INFO: SUCCESS!@#KODE 1!@#USER_ID 34!@#ACTIVITY_CODE 1
12/23/2022 07:22:41 AM script INFO: SUCCESS!@#KODE 1!@#USER_ID 34!@#ACTIVITY_CODE 4
12/23/2022 07:22:41 AM script INFO: SUCCESS!@#KODE 1!@#USER_ID 34!@#ACTIVITY_CODE 5
12/23/2022 07:22:41 AM script INFO: SUCCESS!@#KODE 1!@#USER_ID 34!@#ACTIVITY_CODE 5
12/23/2022 07:22:44 AM script INFO: SUCCESS!@#KODE 1!@#USER_ID 34!@#ACTIVITY_CODE 3
12/23/2022 07:22:44 AM script INFO: SUCCESS!@#KODE 1!@#USER_ID 34!@#ACTIVITY_CODE 3
12/23/2022 07:22:44 AM script INFO: SUCCESS!@#KODE 1!@#USER_ID 34!@#ACTIVITY_CODE 2
12/23/2022 07:22:44 AM script INFO: SUCCESS!@#KODE 1!@#USER_ID 34!@#ACTIVITY_CODE 3
12/23/2022 07:22:44 AM script INFO: SUCCESS!@#KODE 1!@#USER_ID 34!@#ACTIVITY_CODE 3
12/23/2022 07:22:44 AM script INFO: SUCCESS!@#KODE 1!@#USER_ID 34!@#ACTIVITY_CODE 1
12/23/2022 07:22:45 AM script INFO: SUCCESS!@#KODE 1!@#USER_ID 34!@#ACTIVITY_CODE 1
12/23/2022 07:22:45 AM script INFO: SUCCESS!@#KODE 1!@#USER_ID 34!@#ACTIVITY_CODE 2
12/23/2022 07:22:45 AM script INFO: SUCCESS!@#KODE 1!@#USER_ID 34!@#ACTIVITY_CODE 2
12/23/2022 07:22:45 AM script INFO: SUCCESS!@#KODE 1!@#USER_ID 34!@#ACTIVITY_CODE 5
12/23/2022 07:22:45 AM script INFO: SUCCESS!@#KODE 1!@#USER_ID 34!@#ACTIVITY_CODE 5
12/23/2022 07:22:48 AM script INFO: SUCCESS!@#KODE 1!@#USER_ID 34!@#ACTIVITY_CODE 2
12/23/2022 07:22:48 AM script INFO: SUCCESS!@#KODE 1!@#USER_ID 34!@#ACTIVITY_CODE 1
12/23/2022 07:22:48 AM script INFO: SUCCESS!@#KODE 1!@#USER_ID 34!@#ACTIVITY_CODE 1
12/23/2022 07:22:48 AM script INFO: SUCCESS!@#KODE 1!@#USER_ID 34!@#ACTIVITY_CODE 3
12/23/2022 07:22:48 AM script INFO: SUCCESS!@#KODE 1!@#USER_ID 34!@#ACTIVITY_CODE 1
12/23/2022 07:22:49 AM script INFO: SUCCESS!@#KODE 1!@#USER_ID 34!@#ACTIVITY_CODE 2
12/23/2022 07:22:49 AM script INFO: SUCCESS!@#KODE 1!@#USER_ID 34!@#ACTIVITY_CODE 2
12/23/2022 07:22:49 AM script INFO: SUCCESS!@#KODE 1!@#USER_ID 34!@#ACTIVITY_CODE 3
12/23/2022 07:22:49 AM script INFO: SUCCESS!@#KODE 1!@#USER_ID 34!@#ACTIVITY_CODE 3
12/23/2022 07:22:49 AM script INFO: SUCCESS!@#KODE 1!@#USER_ID 34!@#ACTIVITY_CODE 1
12/23/2022 07:22:49 AM script INFO: SUCCESS!@#KODE 1!@#USER_ID 34!@#ACTIVITY_CODE 3
12/23/2022 07:22:50 AM script INFO: SUCCESS!@#KODE 1!@#USER_ID 34!@#ACTIVITY_CODE 4
12/23/2022 07:22:50 AM script INFO: SUCCESS!@#KODE 1!@#USER_ID 34!@#ACTIVITY_CODE 1
12/23/2022 07:22:50 AM script INFO: SUCCESS!@#KODE 1!@#USER_ID 34!@#ACTIVITY_CODE 4
12/23/2022 07:22:50 AM script INFO: SUCCESS!@#KODE 1!@#USER_ID 34!@#ACTIVITY_CODE 3
12/23/2022 07:22:50 AM script INFO: SUCCESS!@#KODE 1!@#USER_ID 34!@#ACTIVITY_CODE 3
12/23/2022 07:22:50 AM script INFO: SUCCESS!@#KODE 1!@#USER_ID 34!@#ACTIVITY_CODE 1
12/23/2022 07:22:50 AM script INFO: SUCCESS!@#KODE 1!@#USER_ID 34!@#ACTIVITY_CODE 4
12/23/2022 07:22:50 AM script INFO: SUCCESS!@#KODE 1!@#USER_ID 34!@#ACTIVITY_CODE 1
12/23/2022 07:22:50 AM script INFO: SUCCESS!@#KODE 1!@#USER_ID 34!@#ACTIVITY_CODE 1
12/23/2022 07:22:51 AM script INFO: SUCCESS!@#KODE 1!@#USER_ID 34!@#ACTIVITY_CODE 4
12/23/2022 07:22:51 AM script INFO: SUCCESS!@#KODE 1!@#USER_ID 34!@#ACTIVITY_CODE 1
12/23/2022 07:22:51 AM script INFO: SUCCESS!@#KODE 1!@#USER_ID 34!@#ACTIVITY_CODE 3
12/23/2022 07:22:51 AM script INFO: SUCCESS!@#KODE 1!@#USER_ID 34!@#ACTIVITY_CODE 1
12/23/2022 07:22:51 AM script INFO: SUCCESS!@#KODE 1!@#USER_ID 34!@#ACTIVITY_CODE 1
12/23/2022 07:22:51 AM script INFO: SUCCESS!@#KODE 1!@#USER_ID 34!@#ACTIVITY_CODE 4
12/23/2022 07:22:51 AM script INFO: SUCCESS!@#KODE 1!@#USER_ID 34!@#ACTIVITY_CODE 1
12/23/2022 07:22:52 AM script INFO: SUCCESS!@#KODE 1!@#USER_ID 34!@#ACTIVITY_CODE 2
12/23/2022 07:22:52 AM script INFO: SUCCESS!@#KODE 1!@#USER_ID 34!@#ACTIVITY_CODE 2
12/23/2022 07:22:52 AM script INFO: SUCCESS!@#KODE 1!@#USER_ID 34!@#ACTIVITY_CODE 1
12/23/2022 07:22:52 AM script INFO: SUCCESS!@#KODE 1!@#USER_ID 34!@#ACTIVITY_CODE 1
12/23/2022 07:22:52 AM script INFO: SUCCESS!@#KODE 1!@#USER_ID 34!@#ACTIVITY_CODE 2
12/23/2022 07:22:52 AM script INFO: SUCCESS!@#KODE 1!@#USER_ID 34!@#ACTIVITY_CODE 3
12/23/2022 07:22:53 AM script INFO: SUCCESS!@#KODE 1!@#USER_ID 34!@#ACTIVITY_CODE 2
12/23/2022 07:22:53 AM script INFO: SUCCESS!@#KODE 1!@#USER_ID 34!@#ACTIVITY_CODE 3
12/23/2022 07:22:53 AM script INFO: SUCCESS!@#KODE 1!@#USER_ID 34!@#ACTIVITY_CODE 1
12/23/2022 07:22:53 AM script INFO: SUCCESS!@#KODE 1!@#USER_ID 34!@#ACTIVITY_CODE 1
12/23/2022 07:22:53 AM script INFO: SUCCESS!@#KODE 1!@#USER_ID 34!@#ACTIVITY_CODE 2
12/23/2022 07:22:53 AM script INFO: SUCCESS!@#KODE 1!@#USER_ID 34!@#ACTIVITY_CODE 1
12/23/2022 07:22:53 AM script INFO: SUCCESS!@#KODE 1!@#USER_ID 34!@#ACTIVITY_CODE 3
12/23/2022 07:22:53 AM script INFO: SUCCESS!@#KODE 1!@#USER_ID 34!@#ACTIVITY_CODE 3
12/23/2022 07:22:53 AM script INFO: SUCCESS!@#KODE 1!@#USER_ID 34!@#ACTIVITY_CODE 4
12/23/2022 07:22:54 AM script INFO: SUCCESS!@#KODE 1!@#USER_ID 34!@#ACTIVITY_CODE 3
12/23/2022 07:22:54 AM script INFO: SUCCESS!@#KODE 1!@#USER_ID 34!@#ACTIVITY_CODE 1
12/23/2022 07:22:54 AM script INFO: SUCCESS!@#KODE 1!@#USER_ID 34!@#ACTIVITY_CODE 1
12/23/2022 07:22:54 AM script INFO: SUCCESS!@#KODE 1!@#USER_ID 34!@#ACTIVITY_CODE 1
12/23/2022 07:22:54 AM script INFO: SUCCESS!@#KODE 1!@#USER_ID 34!@#ACTIVITY_CODE 1
12/23/2022 07:22:54 AM script INFO: SUCCESS!@#KODE 1!@#USER_ID 34!@#ACTIVITY_CODE 3
12/23/2022 07:22:54 AM script INFO: SUCCESS!@#KODE 1!@#USER_ID 34!@#ACTIVITY_CODE 2
12/23/2022 07:22:54 AM script INFO: SUCCESS!@#KODE 1!@#USER_ID 34!@#ACTIVITY_CODE 3
12/23/2022 07:22:55 AM script INFO: SUCCESS!@#KODE 1!@#USER_ID 34!@#ACTIVITY_CODE 3
12/23/2022 07:22:55 AM script INFO: SUCCESS!@#KODE 1!@#USER_ID 34!@#ACTIVITY_CODE 3
12/23/2022 07:22:55 AM script INFO: SUCCESS!@#KODE 1!@#USER_ID 34!@#ACTIVITY_CODE 4
12/23/2022 07:22:55 AM script INFO: SUCCESS!@#KODE 1!@#USER_ID 34!@#ACTIVITY_CODE 3
12/23/2022 07:22:55 AM script INFO: SUCCESS!@#KODE 1!@#USER_ID 34!@#ACTIVITY_CODE 3
12/23/2022 07:22:55 AM script INFO: SUCCESS!@#KODE 1!@#USER_ID 34!@#ACTIVITY_CODE 2
12/23/2022 07:22:55 AM script INFO: SUCCESS!@#KODE 1!@#USER_ID 34!@#ACTIVITY_CODE 3
12/23/2022 07:22:56 AM script INFO: SUCCESS!@#KODE 1!@#USER_ID 34!@#ACTIVITY_CODE 2
12/23/2022 07:22:56 AM script INFO: SUCCESS!@#KODE 1!@#USER_ID 34!@#ACTIVITY_CODE 3
12/23/2022 07:22:56 AM script INFO: SUCCESS!@#KODE 1!@#USER_ID 34!@#ACTIVITY_CODE 1
12/23/2022 07:22:56 AM script INFO: SUCCESS!@#KODE 1!@#USER_ID 34!@#ACTIVITY_CODE 1
12/23/2022 07:22:56 AM script INFO: SUCCESS!@#KODE 1!@#USER_ID 34!@#ACTIVITY_CODE 1
12/23/2022 07:22:56 AM script INFO: SUCCESS!@#KODE 1!@#USER_ID 34!@#ACTIVITY_CODE 2
12/23/2022 07:22:56 AM script INFO: SUCCESS!@#KODE 1!@#USER_ID 34!@#ACTIVITY_CODE 4
12/23/2022 07:22:56 AM script INFO: SUCCESS!@#KODE 1!@#USER_ID 34!@#ACTIVITY_CODE 3
12/23/2022 07:22:56 AM script INFO: SUCCESS!@#KODE 1!@#USER_ID 34!@#ACTIVITY_CODE 2
12/23/2022 07:22:57 AM script INFO: SUCCESS!@#KODE 1!@#USER_ID 34!@#ACTIVITY_CODE 3
12/23/2022 07:22:57 AM script INFO: SUCCESS!@#KODE 1!@#USER_ID 34!@#ACTIVITY_CODE 1
12/23/2022 07:22:57 AM script INFO: SUCCESS!@#KODE 1!@#USER_ID 34!@#ACTIVITY_CODE 1
12/23/2022 07:22:57 AM script INFO: SUCCESS!@#KODE 1!@#USER_ID 34!@#ACTIVITY_CODE 1
12/23/2022 07:22:57 AM script INFO: SUCCESS!@#KODE 1!@#USER_ID 34!@#ACTIVITY_CODE 1
12/23/2022 07:22:57 AM script INFO: SUCCESS!@#KODE 1!@#USER_ID 34!@#ACTIVITY_CODE 4
12/23/2022 07:22:57 AM script INFO: SUCCESS!@#KODE 1!@#USER_ID 34!@#ACTIVITY_CODE 2
12/23/2022 07:22:57 AM script INFO: SUCCESS!@#KODE 1!@#USER_ID 34!@#ACTIVITY_CODE 1
12/23/2022 07:22:57 AM script INFO: SUCCESS!@#KODE 1!@#USER_ID 34!@#ACTIVITY_CODE 3
12/23/2022 07:22:57 AM script INFO: SUCCESS!@#KODE 1!@#USER_ID 34!@#ACTIVITY_CODE 1
12/23/2022 07:22:57 AM script INFO: SUCCESS!@#KODE 1!@#USER_ID 34!@#ACTIVITY_CODE 4
12/23/2022 07:22:58 AM script INFO: SUCCESS!@#KODE 1!@#USER_ID 34!@#ACTIVITY_CODE 1
12/23/2022 07:22:58 AM script INFO: SUCCESS!@#KODE 1!@#USER_ID 34!@#ACTIVITY_CODE 3
12/23/2022 07:22:58 AM script INFO: SUCCESS!@#KODE 1!@#USER_ID 34!@#ACTIVITY_CODE 4
12/23/2022 07:22:58 AM script INFO: SUCCESS!@#KODE 1!@#USER_ID 34!@#ACTIVITY_CODE 3
12/23/2022 07:22:58 AM script INFO: SUCCESS!@#KODE 1!@#USER_ID 34!@#ACTIVITY_CODE 2
12/23/2022 07:22:58 AM script INFO: SUCCESS!@#KODE 1!@#USER_ID 34!@#ACTIVITY_CODE 1
12/23/2022 07:22:58 AM script INFO: SUCCESS!@#KODE 1!@#USER_ID 34!@#ACTIVITY_CODE 3
12/23/2022 07:22:58 AM script INFO: SUCCESS!@#KODE 1!@#USER_ID 34!@#ACTIVITY_CODE 2
12/23/2022 07:22:59 AM script INFO: SUCCESS!@#KODE 1!@#USER_ID 34!@#ACTIVITY_CODE 1
12/23/2022 07:22:59 AM script INFO: SUCCESS!@#KODE 1!@#USER_ID 34!@#ACTIVITY_CODE 3
12/23/2022 07:22:59 AM script INFO: SUCCESS!@#KODE 1!@#USER_ID 34!@#ACTIVITY_CODE 2
12/23/2022 07:22:59 AM script INFO: SUCCESS!@#KODE 1!@#USER_ID 34!@#ACTIVITY_CODE 1
12/23/2022 07:22:59 AM script INFO: SUCCESS!@#KODE 1!@#USER_ID 34!@#ACTIVITY_CODE 1
12/23/2022 07:22:59 AM script INFO: SUCCESS!@#KODE 1!@#USER_ID 34!@#ACTIVITY_CODE 2
12/23/2022 07:22:59 AM script INFO: SUCCESS!@#KODE 1!@#USER_ID 34!@#ACTIVITY_CODE 4
12/23/2022 07:22:59 AM script INFO: SUCCESS!@#KODE 1!@#USER_ID 34!@#ACTIVITY_CODE 3
12/23/2022 07:22:59 AM script INFO: SUCCESS!@#KODE 1!@#USER_ID 34!@#ACTIVITY_CODE 3
12/23/2022 07:23:00 AM script INFO: SUCCESS!@#KODE 1!@#USER_ID 34!@#ACTIVITY_CODE 1
12/23/2022 07:23:00 AM script INFO: SUCCESS!@#KODE 1!@#USER_ID 34!@#ACTIVITY_CODE 3
12/23/2022 07:23:00 AM script INFO: SUCCESS!@#KODE 1!@#USER_ID 34!@#ACTIVITY_CODE 3
12/23/2022 07:23:00 AM script INFO: SUCCESS!@#KODE 1!@#USER_ID 34!@#ACTIVITY_CODE 4
12/23/2022 07:23:00 AM script INFO: SUCCESS!@#KODE 1!@#USER_ID 34!@#ACTIVITY_CODE 3
12/23/2022 07:23:00 AM script INFO: SUCCESS!@#KODE 1!@#USER_ID 34!@#ACTIVITY_CODE 1
12/23/2022 07:23:00 AM script INFO: SUCCESS!@#KODE 1!@#USER_ID 34!@#ACTIVITY_CODE 2
12/23/2022 07:23:00 AM script INFO: SUCCESS!@#KODE 1!@#USER_ID 34!@#ACTIVITY_CODE 2
12/23/2022 07:23:00 AM script INFO: SUCCESS!@#KODE 1!@#USER_ID 34!@#ACTIVITY_CODE 3
12/23/2022 07:23:00 AM script INFO: SUCCESS!@#KODE 1!@#USER_ID 34!@#ACTIVITY_CODE 1
12/23/2022 07:23:01 AM script INFO: SUCCESS!@#KODE 1!@#USER_ID 34!@#ACTIVITY_CODE 3
12/23/2022 07:23:01 AM script INFO: SUCCESS!@#KODE 1!@#USER_ID 34!@#ACTIVITY_CODE 2
12/23/2022 07:23:01 AM script INFO: SUCCESS!@#KODE 1!@#USER_ID 34!@#ACTIVITY_CODE 1
12/23/2022 07:23:01 AM script INFO: SUCCESS!@#KODE 1!@#USER_ID 34!@#ACTIVITY_CODE 3
12/23/2022 07:23:01 AM script INFO: SUCCESS!@#KODE 1!@#USER_ID 34!@#ACTIVITY_CODE 1
12/23/2022 07:23:01 AM script INFO: SUCCESS!@#KODE 1!@#USER_ID 34!@#ACTIVITY_CODE 4
12/23/2022 07:23:01 AM script INFO: SUCCESS!@#KODE 1!@#USER_ID 34!@#ACTIVITY_CODE 1
12/23/2022 07:23:01 AM script INFO: SUCCESS!@#KODE 1!@#USER_ID 34!@#ACTIVITY_CODE 4
12/23/2022 07:23:01 AM script INFO: SUCCESS!@#KODE 1!@#USER_ID 34!@#ACTIVITY_CODE 1
12/23/2022 07:23:01 AM script INFO: SUCCESS!@#KODE 1!@#USER_ID 34!@#ACTIVITY_CODE 4
12/23/2022 07:23:01 AM script INFO: SUCCESS!@#KODE 1!@#USER_ID 34!@#ACTIVITY_CODE 3
12/23/2022 07:23:02 AM script INFO: SUCCESS!@#KODE 1!@#USER_ID 34!@#ACTIVITY_CODE 3
12/23/2022 07:23:02 AM script INFO: SUCCESS!@#KODE 1!@#USER_ID 34!@#ACTIVITY_CODE 2
12/23/2022 07:23:02 AM script INFO: SUCCESS!@#KODE 1!@#USER_ID 34!@#ACTIVITY_CODE 4
12/23/2022 07:23:02 AM script INFO: SUCCESS!@#KODE 1!@#USER_ID 34!@#ACTIVITY_CODE 2
12/23/2022 07:23:02 AM script INFO: SUCCESS!@#KODE 1!@#USER_ID 34!@#ACTIVITY_CODE 2
12/23/2022 07:23:02 AM script INFO: SUCCESS!@#KODE 1!@#USER_ID 34!@#ACTIVITY_CODE 1
12/23/2022 07:23:02 AM script INFO: SUCCESS!@#KODE 1!@#USER_ID 34!@#ACTIVITY_CODE 4
12/23/2022 07:23:02 AM script INFO: SUCCESS!@#KODE 1!@#USER_ID 34!@#ACTIVITY_CODE 2
12/23/2022 07:23:03 AM script INFO: SUCCESS!@#KODE 1!@#USER_ID 34!@#ACTIVITY_CODE 1
12/23/2022 07:23:03 AM script INFO: SUCCESS!@#KODE 1!@#USER_ID 34!@#ACTIVITY_CODE 4
12/23/2022 07:23:03 AM script INFO: SUCCESS!@#KODE 1!@#USER_ID 34!@#ACTIVITY_CODE 2
12/23/2022 07:23:03 AM script INFO: SUCCESS!@#KODE 1!@#USER_ID 34!@#ACTIVITY_CODE 2
12/23/2022 07:23:03 AM script INFO: SUCCESS!@#KODE 1!@#USER_ID 34!@#ACTIVITY_CODE 3
12/23/2022 07:23:03 AM script INFO: SUCCESS!@#KODE 1!@#USER_ID 34!@#ACTIVITY_CODE 2
12/23/2022 07:23:03 AM script INFO: SUCCESS!@#KODE 1!@#USER_ID 34!@#ACTIVITY_CODE 3
12/23/2022 07:23:03 AM script INFO: SUCCESS!@#KODE 1!@#USER_ID 34!@#ACTIVITY_CODE 1
12/23/2022 07:23:03 AM script INFO: SUCCESS!@#KODE 1!@#USER_ID 34!@#ACTIVITY_CODE 3
12/23/2022 07:23:04 AM script INFO: SUCCESS!@#KODE 1!@#USER_ID 34!@#ACTIVITY_CODE 2
12/23/2022 07:23:04 AM script INFO: SUCCESS!@#KODE 1!@#USER_ID 34!@#ACTIVITY_CODE 1
12/23/2022 07:23:04 AM script INFO: SUCCESS!@#KODE 1!@#USER_ID 34!@#ACTIVITY_CODE 3
12/23/2022 07:23:04 AM script INFO: SUCCESS!@#KODE 1!@#USER_ID 34!@#ACTIVITY_CODE 4
12/23/2022 07:23:04 AM script INFO: SUCCESS!@#KODE 1!@#USER_ID 34!@#ACTIVITY_CODE 1
12/23/2022 07:23:04 AM script INFO: SUCCESS!@#KODE 1!@#USER_ID 34!@#ACTIVITY_CODE 1
12/23/2022 07:23:04 AM script INFO: SUCCESS!@#KODE 1!@#USER_ID 34!@#ACTIVITY_CODE 2
12/23/2022 07:23:04 AM script INFO: SUCCESS!@#KODE 1!@#USER_ID 34!@#ACTIVITY_CODE 1
12/23/2022 07:23:04 AM script INFO: SUCCESS!@#KODE 1!@#USER_ID 34!@#ACTIVITY_CODE 4
12/23/2022 07:23:04 AM script INFO: SUCCESS!@#KODE 1!@#USER_ID 34!@#ACTIVITY_CODE 1
12/23/2022 07:23:04 AM script INFO: SUCCESS!@#KODE 1!@#USER_ID 34!@#ACTIVITY_CODE 1
12/23/2022 07:23:05 AM script INFO: SUCCESS!@#KODE 1!@#USER_ID 34!@#ACTIVITY_CODE 3
12/23/2022 07:23:05 AM script INFO: SUCCESS!@#KODE 1!@#USER_ID 34!@#ACTIVITY_CODE 1
12/23/2022 07:23:05 AM script INFO: SUCCESS!@#KODE 1!@#USER_ID 34!@#ACTIVITY_CODE 2
12/23/2022 07:23:05 AM script INFO: SUCCESS!@#KODE 1!@#USER_ID 34!@#ACTIVITY_CODE 2
12/23/2022 07:23:05 AM script INFO: SUCCESS!@#KODE 1!@#USER_ID 34!@#ACTIVITY_CODE 4
12/23/2022 07:23:05 AM script INFO: SUCCESS!@#KODE 1!@#USER_ID 34!@#ACTIVITY_CODE 1
12/23/2022 07:23:05 AM script INFO: SUCCESS!@#KODE 1!@#USER_ID 34!@#ACTIVITY_CODE 4
12/23/2022 07:23:05 AM script INFO: SUCCESS!@#KODE 1!@#USER_ID 34!@#ACTIVITY_CODE 2
12/23/2022 07:23:05 AM script INFO: SUCCESS!@#KODE 1!@#USER_ID 34!@#ACTIVITY_CODE 4
12/23/2022 07:23:05 AM script INFO: SUCCESS!@#KODE 1!@#USER_ID 34!@#ACTIVITY_CODE 1
12/23/2022 07:23:06 AM script INFO: SUCCESS!@#KODE 1!@#USER_ID 34!@#ACTIVITY_CODE 3
12/23/2022 07:23:06 AM script INFO: SUCCESS!@#KODE 1!@#USER_ID 34!@#ACTIVITY_CODE 3
12/23/2022 07:23:06 AM script INFO: SUCCESS!@#KODE 1!@#USER_ID 34!@#ACTIVITY_CODE 2
12/23/2022 07:23:06 AM script INFO: SUCCESS!@#KODE 1!@#USER_ID 34!@#ACTIVITY_CODE 3
12/23/2022 07:23:06 AM script INFO: SUCCESS!@#KODE 1!@#USER_ID 34!@#ACTIVITY_CODE 2
12/23/2022 07:23:06 AM script INFO: SUCCESS!@#KODE 1!@#USER_ID 34!@#ACTIVITY_CODE 3
12/23/2022 07:23:06 AM script INFO: SUCCESS!@#KODE 1!@#USER_ID 34!@#ACTIVITY_CODE 1
12/23/2022 07:23:06 AM script INFO: SUCCESS!@#KODE 1!@#USER_ID 34!@#ACTIVITY_CODE 1
12/23/2022 07:23:06 AM script INFO: SUCCESS!@#KODE 1!@#USER_ID 34!@#ACTIVITY_CODE 3
12/23/2022 07:23:06 AM script INFO: SUCCESS!@#KODE 1!@#USER_ID 34!@#ACTIVITY_CODE 4
12/23/2022 07:23:06 AM script INFO: SUCCESS!@#KODE 1!@#USER_ID 34!@#ACTIVITY_CODE 1
12/23/2022 07:23:06 AM script INFO: SUCCESS!@#KODE 1!@#USER_ID 34!@#ACTIVITY_CODE 3
12/23/2022 07:23:06 AM script INFO: Duration: 66.6301097869873
12/23/2022 07:23:06 AM script INFO: mengakhiri-quiz
12/23/2022 07:23:08 AM script INFO: SUCCESS!@#KODE 1!@#USER_ID 34!@#ACTIVITY_CODE 5
12/23/2022 07:23:08 AM script INFO: berhasil-submit
