12/23/2022 04:26:04 AM script INFO: Prepared chrome options..
12/23/2022 04:26:06 AM script INFO: Initialized chrome browser..
12/23/2022 04:26:06 AM script INFO: mengakses-homepage
12/23/2022 04:26:46 AM script INFO: mengakses-login-page
12/23/2022 04:27:41 AM script INFO: mengakses-site-home
12/23/2022 04:27:42 AM main_worker ERROR: Message: element click intercepted: Element <a class="list-group-item list-group-item-action  " href="http://35.238.154.97/?redirect=0" data-key="home" data-isexpandable="0" data-indent="0" data-showdivider="0" data-type="70" data-nodetype="0" data-collapse="0" data-forceopen="0" data-isactive="0" data-hidden="0" data-preceedwithhr="0" data-parent-key="myhome">...</a> is not clickable at point (142, 141). Other element would receive the click: <div class="yui3-widget-mask" style="position: fixed; width: 100%; height: 100%; top: 0px; left: 0px; z-index: 1046;"></div>
  (Session info: headless chrome=107.0.5304.87)
Stacktrace:
#0 0x55661d094463 <unknown>
#1 0x55661ce588d8 <unknown>
#2 0x55661ce9e23b <unknown>
#3 0x55661ce9ba79 <unknown>
#4 0x55661ce98fe4 <unknown>
#5 0x55661ce97b21 <unknown>
#6 0x55661ce8a421 <unknown>
#7 0x55661ceb7622 <unknown>
#8 0x55661ce89ba7 <unknown>
#9 0x55661ceb778e <unknown>
#10 0x55661ced030f <unknown>
#11 0x55661ceb7443 <unknown>
#12 0x55661ce883c5 <unknown>
#13 0x55661ce89531 <unknown>
#14 0x55661d0e6dce <unknown>
#15 0x55661d0ea192 <unknown>
#16 0x55661d0cb93e <unknown>
#17 0x55661d0eb103 <unknown>
#18 0x55661d0bed85 <unknown>
#19 0x55661d10c0a8 <unknown>
#20 0x55661d10c239 <unknown>
#21 0x55661d127492 <unknown>
#22 0x7f3a72b7c609 start_thread

