12/23/2022 07:04:05 AM script INFO: Prepared chrome options..
12/23/2022 07:04:07 AM script INFO: Initialized chrome browser..
12/23/2022 07:04:07 AM script INFO: mengakses-homepage
12/23/2022 07:04:52 AM script INFO: mengakses-login-page
12/23/2022 07:05:01 AM script INFO: mengakses-site-home
12/23/2022 07:05:01 AM script INFO: mengakses-site-course
12/23/2022 07:05:09 AM script INFO: mengakses-quiz
12/23/2022 07:05:10 AM script INFO: mengakses-start-quiz-page
12/23/2022 07:05:11 AM script INFO: memulai-quiz
12/23/2022 07:05:11 AM script INFO: SUCCESS!@#KODE 1!@#USER_ID 42!@#ACTIVITY_CODE 5
12/23/2022 07:05:22 AM script INFO: SUCCESS!@#KODE 1!@#USER_ID 42!@#ACTIVITY_CODE 3
12/23/2022 07:05:22 AM script INFO: SUCCESS!@#KODE 1!@#USER_ID 42!@#ACTIVITY_CODE 2
12/23/2022 07:05:22 AM script INFO: SUCCESS!@#KODE 1!@#USER_ID 42!@#ACTIVITY_CODE 3
12/23/2022 07:05:22 AM script INFO: SUCCESS!@#KODE 1!@#USER_ID 42!@#ACTIVITY_CODE 3
12/23/2022 07:05:22 AM script INFO: SUCCESS!@#KODE 1!@#USER_ID 42!@#ACTIVITY_CODE 1
12/23/2022 07:05:22 AM script INFO: SUCCESS!@#KODE 1!@#USER_ID 42!@#ACTIVITY_CODE 2
12/23/2022 07:05:22 AM script INFO: SUCCESS!@#KODE 1!@#USER_ID 42!@#ACTIVITY_CODE 3
12/23/2022 07:05:22 AM script INFO: SUCCESS!@#KODE 1!@#USER_ID 42!@#ACTIVITY_CODE 2
12/23/2022 07:05:22 AM script INFO: SUCCESS!@#KODE 1!@#USER_ID 42!@#ACTIVITY_CODE 4
12/23/2022 07:05:22 AM script INFO: SUCCESS!@#KODE 1!@#USER_ID 42!@#ACTIVITY_CODE 1
12/23/2022 07:05:23 AM script INFO: SUCCESS!@#KODE 1!@#USER_ID 42!@#ACTIVITY_CODE 4
12/23/2022 07:05:23 AM script INFO: SUCCESS!@#KODE 1!@#USER_ID 42!@#ACTIVITY_CODE 2
12/23/2022 07:05:23 AM script INFO: SUCCESS!@#KODE 1!@#USER_ID 42!@#ACTIVITY_CODE 5
12/23/2022 07:05:23 AM script INFO: SUCCESS!@#KODE 1!@#USER_ID 42!@#ACTIVITY_CODE 5
12/23/2022 07:05:25 AM script INFO: SUCCESS!@#KODE 1!@#USER_ID 42!@#ACTIVITY_CODE 3
12/23/2022 07:05:25 AM script INFO: SUCCESS!@#KODE 1!@#USER_ID 42!@#ACTIVITY_CODE 1
12/23/2022 07:05:25 AM script INFO: SUCCESS!@#KODE 1!@#USER_ID 42!@#ACTIVITY_CODE 5
12/23/2022 07:05:25 AM script INFO: SUCCESS!@#KODE 1!@#USER_ID 42!@#ACTIVITY_CODE 5
12/23/2022 07:05:28 AM script INFO: SUCCESS!@#KODE 1!@#USER_ID 42!@#ACTIVITY_CODE 2
12/23/2022 07:05:28 AM script INFO: SUCCESS!@#KODE 1!@#USER_ID 42!@#ACTIVITY_CODE 3
12/23/2022 07:05:28 AM script INFO: SUCCESS!@#KODE 1!@#USER_ID 42!@#ACTIVITY_CODE 1
12/23/2022 07:05:28 AM script INFO: SUCCESS!@#KODE 1!@#USER_ID 42!@#ACTIVITY_CODE 4
12/23/2022 07:05:28 AM script INFO: SUCCESS!@#KODE 1!@#USER_ID 42!@#ACTIVITY_CODE 3
12/23/2022 07:05:28 AM script INFO: SUCCESS!@#KODE 1!@#USER_ID 42!@#ACTIVITY_CODE 2
12/23/2022 07:05:28 AM script INFO: SUCCESS!@#KODE 1!@#USER_ID 42!@#ACTIVITY_CODE 5
12/23/2022 07:05:28 AM script INFO: SUCCESS!@#KODE 1!@#USER_ID 42!@#ACTIVITY_CODE 5
12/23/2022 07:05:31 AM script INFO: SUCCESS!@#KODE 1!@#USER_ID 42!@#ACTIVITY_CODE 2
12/23/2022 07:05:31 AM script INFO: SUCCESS!@#KODE 1!@#USER_ID 42!@#ACTIVITY_CODE 3
12/23/2022 07:05:31 AM script INFO: SUCCESS!@#KODE 1!@#USER_ID 42!@#ACTIVITY_CODE 2
12/23/2022 07:05:31 AM script INFO: SUCCESS!@#KODE 1!@#USER_ID 42!@#ACTIVITY_CODE 2
12/23/2022 07:05:31 AM script INFO: SUCCESS!@#KODE 1!@#USER_ID 42!@#ACTIVITY_CODE 2
12/23/2022 07:05:31 AM script INFO: SUCCESS!@#KODE 1!@#USER_ID 42!@#ACTIVITY_CODE 5
12/23/2022 07:05:31 AM script INFO: SUCCESS!@#KODE 1!@#USER_ID 42!@#ACTIVITY_CODE 5
12/23/2022 07:05:34 AM script INFO: SUCCESS!@#KODE 1!@#USER_ID 42!@#ACTIVITY_CODE 5
12/23/2022 07:05:34 AM script INFO: SUCCESS!@#KODE 1!@#USER_ID 42!@#ACTIVITY_CODE 5
12/23/2022 07:05:36 AM script INFO: SUCCESS!@#KODE 1!@#USER_ID 42!@#ACTIVITY_CODE 2
12/23/2022 07:05:37 AM script INFO: SUCCESS!@#KODE 1!@#USER_ID 42!@#ACTIVITY_CODE 2
12/23/2022 07:05:37 AM script INFO: SUCCESS!@#KODE 1!@#USER_ID 42!@#ACTIVITY_CODE 2
12/23/2022 07:05:37 AM script INFO: SUCCESS!@#KODE 1!@#USER_ID 42!@#ACTIVITY_CODE 1
12/23/2022 07:05:37 AM script INFO: SUCCESS!@#KODE 1!@#USER_ID 42!@#ACTIVITY_CODE 3
12/23/2022 07:05:37 AM script INFO: SUCCESS!@#KODE 1!@#USER_ID 42!@#ACTIVITY_CODE 4
12/23/2022 07:05:37 AM script INFO: SUCCESS!@#KODE 1!@#USER_ID 42!@#ACTIVITY_CODE 2
12/23/2022 07:05:37 AM script INFO: SUCCESS!@#KODE 1!@#USER_ID 42!@#ACTIVITY_CODE 5
12/23/2022 07:05:37 AM script INFO: SUCCESS!@#KODE 1!@#USER_ID 42!@#ACTIVITY_CODE 5
12/23/2022 07:05:40 AM script INFO: SUCCESS!@#KODE 1!@#USER_ID 42!@#ACTIVITY_CODE 3
12/23/2022 07:05:40 AM script INFO: SUCCESS!@#KODE 1!@#USER_ID 42!@#ACTIVITY_CODE 3
12/23/2022 07:05:40 AM script INFO: SUCCESS!@#KODE 1!@#USER_ID 42!@#ACTIVITY_CODE 2
12/23/2022 07:05:40 AM script INFO: SUCCESS!@#KODE 1!@#USER_ID 42!@#ACTIVITY_CODE 2
12/23/2022 07:05:40 AM script INFO: Duration: 18.18409013748169
12/23/2022 07:05:40 AM script INFO: mengakhiri-quiz
12/23/2022 07:05:40 AM script INFO: SUCCESS!@#KODE 1!@#USER_ID 42!@#ACTIVITY_CODE 5
12/23/2022 07:05:40 AM script INFO: berhasil-submit
