12/23/2022 07:11:47 AM script INFO: Prepared chrome options..
12/23/2022 07:11:48 AM script INFO: Initialized chrome browser..
12/23/2022 07:11:48 AM script INFO: mengakses-homepage
12/23/2022 07:12:38 AM script INFO: mengakses-login-page
12/23/2022 07:12:39 AM script INFO: mengakses-site-home
12/23/2022 07:12:40 AM script INFO: mengakses-site-course
12/23/2022 07:12:55 AM script INFO: mengakses-quiz
12/23/2022 07:12:56 AM script INFO: mengakses-start-quiz-page
12/23/2022 07:12:57 AM script INFO: memulai-quiz
12/23/2022 07:12:57 AM script INFO: SUCCESS!@#KODE 1!@#USER_ID 80!@#ACTIVITY_CODE 5
12/23/2022 07:13:08 AM script INFO: SUCCESS!@#KODE 1!@#USER_ID 80!@#ACTIVITY_CODE 2
12/23/2022 07:13:08 AM script INFO: SUCCESS!@#KODE 1!@#USER_ID 80!@#ACTIVITY_CODE 3
12/23/2022 07:13:08 AM script INFO: SUCCESS!@#KODE 1!@#USER_ID 80!@#ACTIVITY_CODE 3
12/23/2022 07:13:08 AM script INFO: SUCCESS!@#KODE 1!@#USER_ID 80!@#ACTIVITY_CODE 2
12/23/2022 07:13:08 AM script INFO: SUCCESS!@#KODE 1!@#USER_ID 80!@#ACTIVITY_CODE 3
12/23/2022 07:13:08 AM script INFO: SUCCESS!@#KODE 1!@#USER_ID 80!@#ACTIVITY_CODE 1
12/23/2022 07:13:08 AM script INFO: SUCCESS!@#KODE 1!@#USER_ID 80!@#ACTIVITY_CODE 3
12/23/2022 07:13:08 AM script INFO: SUCCESS!@#KODE 1!@#USER_ID 80!@#ACTIVITY_CODE 5
12/23/2022 07:13:08 AM script INFO: SUCCESS!@#KODE 1!@#USER_ID 80!@#ACTIVITY_CODE 5
12/23/2022 07:13:11 AM script INFO: SUCCESS!@#KODE 1!@#USER_ID 80!@#ACTIVITY_CODE 4
12/23/2022 07:13:11 AM script INFO: SUCCESS!@#KODE 1!@#USER_ID 80!@#ACTIVITY_CODE 2
12/23/2022 07:13:11 AM script INFO: SUCCESS!@#KODE 1!@#USER_ID 80!@#ACTIVITY_CODE 2
12/23/2022 07:13:11 AM script INFO: SUCCESS!@#KODE 1!@#USER_ID 80!@#ACTIVITY_CODE 5
12/23/2022 07:13:11 AM script INFO: SUCCESS!@#KODE 1!@#USER_ID 80!@#ACTIVITY_CODE 5
12/23/2022 07:13:14 AM script INFO: SUCCESS!@#KODE 1!@#USER_ID 80!@#ACTIVITY_CODE 2
12/23/2022 07:13:14 AM script INFO: SUCCESS!@#KODE 1!@#USER_ID 80!@#ACTIVITY_CODE 5
12/23/2022 07:13:14 AM script INFO: SUCCESS!@#KODE 1!@#USER_ID 80!@#ACTIVITY_CODE 5
12/23/2022 07:13:17 AM script INFO: SUCCESS!@#KODE 1!@#USER_ID 80!@#ACTIVITY_CODE 3
12/23/2022 07:13:17 AM script INFO: SUCCESS!@#KODE 1!@#USER_ID 80!@#ACTIVITY_CODE 2
12/23/2022 07:13:17 AM script INFO: SUCCESS!@#KODE 1!@#USER_ID 80!@#ACTIVITY_CODE 1
12/23/2022 07:13:17 AM script INFO: SUCCESS!@#KODE 1!@#USER_ID 80!@#ACTIVITY_CODE 5
12/23/2022 07:13:17 AM script INFO: SUCCESS!@#KODE 1!@#USER_ID 80!@#ACTIVITY_CODE 5
12/23/2022 07:13:19 AM script INFO: SUCCESS!@#KODE 1!@#USER_ID 80!@#ACTIVITY_CODE 3
12/23/2022 07:13:19 AM script INFO: SUCCESS!@#KODE 1!@#USER_ID 80!@#ACTIVITY_CODE 5
12/23/2022 07:13:19 AM script INFO: SUCCESS!@#KODE 1!@#USER_ID 80!@#ACTIVITY_CODE 5
12/23/2022 07:13:22 AM script INFO: SUCCESS!@#KODE 1!@#USER_ID 80!@#ACTIVITY_CODE 1
12/23/2022 07:13:22 AM script INFO: SUCCESS!@#KODE 1!@#USER_ID 80!@#ACTIVITY_CODE 1
12/23/2022 07:13:22 AM script INFO: SUCCESS!@#KODE 1!@#USER_ID 80!@#ACTIVITY_CODE 3
12/23/2022 07:13:22 AM script INFO: SUCCESS!@#KODE 1!@#USER_ID 80!@#ACTIVITY_CODE 5
12/23/2022 07:13:22 AM script INFO: SUCCESS!@#KODE 1!@#USER_ID 80!@#ACTIVITY_CODE 5
12/23/2022 07:13:25 AM script INFO: SUCCESS!@#KODE 1!@#USER_ID 80!@#ACTIVITY_CODE 4
12/23/2022 07:13:25 AM script INFO: SUCCESS!@#KODE 1!@#USER_ID 80!@#ACTIVITY_CODE 3
12/23/2022 07:13:25 AM script INFO: SUCCESS!@#KODE 1!@#USER_ID 80!@#ACTIVITY_CODE 5
12/23/2022 07:13:25 AM script INFO: SUCCESS!@#KODE 1!@#USER_ID 80!@#ACTIVITY_CODE 5
12/23/2022 07:13:27 AM script INFO: SUCCESS!@#KODE 1!@#USER_ID 80!@#ACTIVITY_CODE 1
12/23/2022 07:13:27 AM script INFO: SUCCESS!@#KODE 1!@#USER_ID 80!@#ACTIVITY_CODE 1
12/23/2022 07:13:27 AM script INFO: SUCCESS!@#KODE 1!@#USER_ID 80!@#ACTIVITY_CODE 3
12/23/2022 07:13:27 AM script INFO: SUCCESS!@#KODE 1!@#USER_ID 80!@#ACTIVITY_CODE 1
12/23/2022 07:13:27 AM script INFO: SUCCESS!@#KODE 1!@#USER_ID 80!@#ACTIVITY_CODE 3
12/23/2022 07:13:27 AM script INFO: SUCCESS!@#KODE 1!@#USER_ID 80!@#ACTIVITY_CODE 4
12/23/2022 07:13:27 AM script INFO: SUCCESS!@#KODE 1!@#USER_ID 80!@#ACTIVITY_CODE 3
12/23/2022 07:13:27 AM script INFO: SUCCESS!@#KODE 1!@#USER_ID 80!@#ACTIVITY_CODE 5
12/23/2022 07:13:27 AM script INFO: SUCCESS!@#KODE 1!@#USER_ID 80!@#ACTIVITY_CODE 5
12/23/2022 07:13:30 AM script INFO: SUCCESS!@#KODE 1!@#USER_ID 80!@#ACTIVITY_CODE 1
12/23/2022 07:13:30 AM script INFO: SUCCESS!@#KODE 1!@#USER_ID 80!@#ACTIVITY_CODE 5
12/23/2022 07:13:30 AM script INFO: SUCCESS!@#KODE 1!@#USER_ID 80!@#ACTIVITY_CODE 5
12/23/2022 07:13:33 AM script INFO: SUCCESS!@#KODE 1!@#USER_ID 80!@#ACTIVITY_CODE 3
12/23/2022 07:13:33 AM script INFO: SUCCESS!@#KODE 1!@#USER_ID 80!@#ACTIVITY_CODE 3
12/23/2022 07:13:33 AM script INFO: SUCCESS!@#KODE 1!@#USER_ID 80!@#ACTIVITY_CODE 5
12/23/2022 07:13:33 AM script INFO: SUCCESS!@#KODE 1!@#USER_ID 80!@#ACTIVITY_CODE 5
12/23/2022 07:13:35 AM script INFO: SUCCESS!@#KODE 1!@#USER_ID 80!@#ACTIVITY_CODE 2
12/23/2022 07:13:35 AM script INFO: SUCCESS!@#KODE 1!@#USER_ID 80!@#ACTIVITY_CODE 1
12/23/2022 07:13:35 AM script INFO: SUCCESS!@#KODE 1!@#USER_ID 80!@#ACTIVITY_CODE 4
12/23/2022 07:13:35 AM script INFO: SUCCESS!@#KODE 1!@#USER_ID 80!@#ACTIVITY_CODE 5
12/23/2022 07:13:35 AM script INFO: SUCCESS!@#KODE 1!@#USER_ID 80!@#ACTIVITY_CODE 5
12/23/2022 07:13:38 AM script INFO: SUCCESS!@#KODE 1!@#USER_ID 80!@#ACTIVITY_CODE 1
12/23/2022 07:13:38 AM script INFO: SUCCESS!@#KODE 1!@#USER_ID 80!@#ACTIVITY_CODE 2
12/23/2022 07:13:38 AM script INFO: SUCCESS!@#KODE 1!@#USER_ID 80!@#ACTIVITY_CODE 2
12/23/2022 07:13:38 AM script INFO: SUCCESS!@#KODE 1!@#USER_ID 80!@#ACTIVITY_CODE 2
12/23/2022 07:13:38 AM script INFO: SUCCESS!@#KODE 1!@#USER_ID 80!@#ACTIVITY_CODE 1
12/23/2022 07:13:38 AM script INFO: SUCCESS!@#KODE 1!@#USER_ID 80!@#ACTIVITY_CODE 1
12/23/2022 07:13:38 AM script INFO: SUCCESS!@#KODE 1!@#USER_ID 80!@#ACTIVITY_CODE 2
12/23/2022 07:13:39 AM script INFO: SUCCESS!@#KODE 1!@#USER_ID 80!@#ACTIVITY_CODE 2
12/23/2022 07:13:39 AM script INFO: SUCCESS!@#KODE 1!@#USER_ID 80!@#ACTIVITY_CODE 1
12/23/2022 07:13:39 AM script INFO: SUCCESS!@#KODE 1!@#USER_ID 80!@#ACTIVITY_CODE 1
12/23/2022 07:13:39 AM script INFO: SUCCESS!@#KODE 1!@#USER_ID 80!@#ACTIVITY_CODE 1
12/23/2022 07:13:39 AM script INFO: SUCCESS!@#KODE 1!@#USER_ID 80!@#ACTIVITY_CODE 1
12/23/2022 07:13:39 AM script INFO: SUCCESS!@#KODE 1!@#USER_ID 80!@#ACTIVITY_CODE 2
12/23/2022 07:13:39 AM script INFO: SUCCESS!@#KODE 1!@#USER_ID 80!@#ACTIVITY_CODE 1
12/23/2022 07:13:39 AM script INFO: SUCCESS!@#KODE 1!@#USER_ID 80!@#ACTIVITY_CODE 3
12/23/2022 07:13:39 AM script INFO: SUCCESS!@#KODE 1!@#USER_ID 80!@#ACTIVITY_CODE 3
12/23/2022 07:13:39 AM script INFO: SUCCESS!@#KODE 1!@#USER_ID 80!@#ACTIVITY_CODE 4
12/23/2022 07:13:39 AM script INFO: SUCCESS!@#KODE 1!@#USER_ID 80!@#ACTIVITY_CODE 2
12/23/2022 07:13:39 AM script INFO: SUCCESS!@#KODE 1!@#USER_ID 80!@#ACTIVITY_CODE 1
12/23/2022 07:13:39 AM script INFO: SUCCESS!@#KODE 1!@#USER_ID 80!@#ACTIVITY_CODE 2
12/23/2022 07:13:39 AM script INFO: SUCCESS!@#KODE 1!@#USER_ID 80!@#ACTIVITY_CODE 1
12/23/2022 07:13:39 AM script INFO: SUCCESS!@#KODE 1!@#USER_ID 80!@#ACTIVITY_CODE 3
12/23/2022 07:13:39 AM script INFO: SUCCESS!@#KODE 1!@#USER_ID 80!@#ACTIVITY_CODE 2
12/23/2022 07:13:40 AM script INFO: SUCCESS!@#KODE 1!@#USER_ID 80!@#ACTIVITY_CODE 2
12/23/2022 07:13:40 AM script INFO: SUCCESS!@#KODE 1!@#USER_ID 80!@#ACTIVITY_CODE 3
12/23/2022 07:13:40 AM script INFO: SUCCESS!@#KODE 1!@#USER_ID 80!@#ACTIVITY_CODE 2
12/23/2022 07:13:40 AM script INFO: SUCCESS!@#KODE 1!@#USER_ID 80!@#ACTIVITY_CODE 1
12/23/2022 07:13:40 AM script INFO: SUCCESS!@#KODE 1!@#USER_ID 80!@#ACTIVITY_CODE 1
12/23/2022 07:13:40 AM script INFO: SUCCESS!@#KODE 1!@#USER_ID 80!@#ACTIVITY_CODE 3
12/23/2022 07:13:40 AM script INFO: SUCCESS!@#KODE 1!@#USER_ID 80!@#ACTIVITY_CODE 1
12/23/2022 07:13:40 AM script INFO: SUCCESS!@#KODE 1!@#USER_ID 80!@#ACTIVITY_CODE 1
12/23/2022 07:13:40 AM script INFO: SUCCESS!@#KODE 1!@#USER_ID 80!@#ACTIVITY_CODE 3
12/23/2022 07:13:40 AM script INFO: SUCCESS!@#KODE 1!@#USER_ID 80!@#ACTIVITY_CODE 3
12/23/2022 07:13:40 AM script INFO: SUCCESS!@#KODE 1!@#USER_ID 80!@#ACTIVITY_CODE 4
12/23/2022 07:13:40 AM script INFO: SUCCESS!@#KODE 1!@#USER_ID 80!@#ACTIVITY_CODE 1
12/23/2022 07:13:40 AM script INFO: SUCCESS!@#KODE 1!@#USER_ID 80!@#ACTIVITY_CODE 4
12/23/2022 07:13:40 AM script INFO: SUCCESS!@#KODE 1!@#USER_ID 80!@#ACTIVITY_CODE 2
12/23/2022 07:13:40 AM script INFO: SUCCESS!@#KODE 1!@#USER_ID 80!@#ACTIVITY_CODE 1
12/23/2022 07:13:40 AM script INFO: SUCCESS!@#KODE 1!@#USER_ID 80!@#ACTIVITY_CODE 2
12/23/2022 07:13:40 AM script INFO: SUCCESS!@#KODE 1!@#USER_ID 80!@#ACTIVITY_CODE 1
12/23/2022 07:13:40 AM script INFO: SUCCESS!@#KODE 1!@#USER_ID 80!@#ACTIVITY_CODE 1
12/23/2022 07:13:40 AM script INFO: SUCCESS!@#KODE 1!@#USER_ID 80!@#ACTIVITY_CODE 3
12/23/2022 07:13:41 AM script INFO: SUCCESS!@#KODE 1!@#USER_ID 80!@#ACTIVITY_CODE 4
12/23/2022 07:13:41 AM script INFO: Duration: 32.88835644721985
12/23/2022 07:13:41 AM script INFO: mengakhiri-quiz
12/23/2022 07:13:41 AM script INFO: SUCCESS!@#KODE 1!@#USER_ID 80!@#ACTIVITY_CODE 5
12/23/2022 07:13:41 AM script INFO: berhasil-submit
