12/21/2022 02:35:01 PM script INFO: Prepared chrome options..
12/21/2022 02:35:02 PM script INFO: Initialized chrome browser..
12/21/2022 02:35:02 PM script INFO: mengakses-homepage
12/21/2022 02:35:48 PM script INFO: mengakses-login-page
12/21/2022 02:36:01 PM script INFO: mengakses-site-home
12/21/2022 02:36:02 PM script INFO: mengakses-site-course
12/21/2022 02:36:03 PM script INFO: mengakses-quiz
12/21/2022 02:36:03 PM script INFO: mengakses-start-quiz-page
12/21/2022 02:36:04 PM script INFO: memulai-quiz
12/21/2022 02:36:04 PM script INFO: SUCCESS!@#KODE 1!@#USER_ID 42!@#ACTIVITY_CODE 5
12/21/2022 02:36:15 PM script INFO: SUCCESS!@#KODE 1!@#USER_ID 42!@#ACTIVITY_CODE 5
12/21/2022 02:36:15 PM script INFO: SUCCESS!@#KODE 1!@#USER_ID 42!@#ACTIVITY_CODE 5
12/21/2022 02:36:17 PM script INFO: SUCCESS!@#KODE 1!@#USER_ID 42!@#ACTIVITY_CODE 3
12/21/2022 02:36:18 PM script INFO: SUCCESS!@#KODE 1!@#USER_ID 42!@#ACTIVITY_CODE 1
12/21/2022 02:36:18 PM script INFO: SUCCESS!@#KODE 1!@#USER_ID 42!@#ACTIVITY_CODE 3
12/21/2022 02:36:18 PM script INFO: SUCCESS!@#KODE 1!@#USER_ID 42!@#ACTIVITY_CODE 4
12/21/2022 02:36:18 PM script INFO: SUCCESS!@#KODE 1!@#USER_ID 42!@#ACTIVITY_CODE 5
12/21/2022 02:36:18 PM script INFO: SUCCESS!@#KODE 1!@#USER_ID 42!@#ACTIVITY_CODE 5
12/21/2022 02:36:20 PM script INFO: SUCCESS!@#KODE 1!@#USER_ID 42!@#ACTIVITY_CODE 5
12/21/2022 02:36:20 PM script INFO: SUCCESS!@#KODE 1!@#USER_ID 42!@#ACTIVITY_CODE 5
12/21/2022 02:36:23 PM script INFO: SUCCESS!@#KODE 1!@#USER_ID 42!@#ACTIVITY_CODE 5
12/21/2022 02:36:23 PM script INFO: SUCCESS!@#KODE 1!@#USER_ID 42!@#ACTIVITY_CODE 5
12/21/2022 02:36:25 PM script INFO: SUCCESS!@#KODE 1!@#USER_ID 42!@#ACTIVITY_CODE 5
12/21/2022 02:36:25 PM script INFO: SUCCESS!@#KODE 1!@#USER_ID 42!@#ACTIVITY_CODE 5
12/21/2022 02:36:28 PM script INFO: SUCCESS!@#KODE 1!@#USER_ID 42!@#ACTIVITY_CODE 3
12/21/2022 02:36:28 PM script INFO: SUCCESS!@#KODE 1!@#USER_ID 42!@#ACTIVITY_CODE 1
12/21/2022 02:36:28 PM script INFO: SUCCESS!@#KODE 1!@#USER_ID 42!@#ACTIVITY_CODE 3
12/21/2022 02:36:28 PM script INFO: SUCCESS!@#KODE 1!@#USER_ID 42!@#ACTIVITY_CODE 4
12/21/2022 02:36:28 PM script INFO: SUCCESS!@#KODE 1!@#USER_ID 42!@#ACTIVITY_CODE 1
12/21/2022 02:36:28 PM script INFO: SUCCESS!@#KODE 1!@#USER_ID 42!@#ACTIVITY_CODE 2
12/21/2022 02:36:28 PM script INFO: SUCCESS!@#KODE 1!@#USER_ID 42!@#ACTIVITY_CODE 1
12/21/2022 02:36:28 PM script INFO: SUCCESS!@#KODE 1!@#USER_ID 42!@#ACTIVITY_CODE 2
12/21/2022 02:36:28 PM script INFO: SUCCESS!@#KODE 1!@#USER_ID 42!@#ACTIVITY_CODE 1
12/21/2022 02:36:28 PM script INFO: SUCCESS!@#KODE 1!@#USER_ID 42!@#ACTIVITY_CODE 2
12/21/2022 02:36:28 PM script INFO: SUCCESS!@#KODE 1!@#USER_ID 42!@#ACTIVITY_CODE 5
12/21/2022 02:36:28 PM script INFO: SUCCESS!@#KODE 1!@#USER_ID 42!@#ACTIVITY_CODE 5
12/21/2022 02:36:31 PM script INFO: SUCCESS!@#KODE 1!@#USER_ID 42!@#ACTIVITY_CODE 2
12/21/2022 02:36:31 PM script INFO: SUCCESS!@#KODE 1!@#USER_ID 42!@#ACTIVITY_CODE 2
12/21/2022 02:36:31 PM script INFO: SUCCESS!@#KODE 1!@#USER_ID 42!@#ACTIVITY_CODE 3
12/21/2022 02:36:31 PM script INFO: SUCCESS!@#KODE 1!@#USER_ID 42!@#ACTIVITY_CODE 1
12/21/2022 02:36:31 PM script INFO: SUCCESS!@#KODE 1!@#USER_ID 42!@#ACTIVITY_CODE 2
12/21/2022 02:36:31 PM script INFO: SUCCESS!@#KODE 1!@#USER_ID 42!@#ACTIVITY_CODE 5
12/21/2022 02:36:31 PM script INFO: SUCCESS!@#KODE 1!@#USER_ID 42!@#ACTIVITY_CODE 5
12/21/2022 02:36:34 PM script INFO: SUCCESS!@#KODE 1!@#USER_ID 42!@#ACTIVITY_CODE 3
12/21/2022 02:36:34 PM script INFO: SUCCESS!@#KODE 1!@#USER_ID 42!@#ACTIVITY_CODE 2
12/21/2022 02:36:34 PM script INFO: SUCCESS!@#KODE 1!@#USER_ID 42!@#ACTIVITY_CODE 4
12/21/2022 02:36:34 PM script INFO: SUCCESS!@#KODE 1!@#USER_ID 42!@#ACTIVITY_CODE 2
12/21/2022 02:36:34 PM script INFO: SUCCESS!@#KODE 1!@#USER_ID 42!@#ACTIVITY_CODE 4
12/21/2022 02:36:34 PM script INFO: SUCCESS!@#KODE 1!@#USER_ID 42!@#ACTIVITY_CODE 5
12/21/2022 02:36:34 PM script INFO: SUCCESS!@#KODE 1!@#USER_ID 42!@#ACTIVITY_CODE 5
12/21/2022 02:36:37 PM script INFO: SUCCESS!@#KODE 1!@#USER_ID 42!@#ACTIVITY_CODE 1
12/21/2022 02:36:37 PM script INFO: SUCCESS!@#KODE 1!@#USER_ID 42!@#ACTIVITY_CODE 1
12/21/2022 02:36:37 PM script INFO: SUCCESS!@#KODE 1!@#USER_ID 42!@#ACTIVITY_CODE 4
12/21/2022 02:36:37 PM script INFO: SUCCESS!@#KODE 1!@#USER_ID 42!@#ACTIVITY_CODE 2
12/21/2022 02:36:37 PM script INFO: SUCCESS!@#KODE 1!@#USER_ID 42!@#ACTIVITY_CODE 2
12/21/2022 02:36:37 PM script INFO: SUCCESS!@#KODE 1!@#USER_ID 42!@#ACTIVITY_CODE 3
12/21/2022 02:36:37 PM script INFO: SUCCESS!@#KODE 1!@#USER_ID 42!@#ACTIVITY_CODE 5
12/21/2022 02:36:37 PM script INFO: SUCCESS!@#KODE 1!@#USER_ID 42!@#ACTIVITY_CODE 5
12/21/2022 02:36:40 PM script INFO: SUCCESS!@#KODE 1!@#USER_ID 42!@#ACTIVITY_CODE 5
12/21/2022 02:36:40 PM script INFO: SUCCESS!@#KODE 1!@#USER_ID 42!@#ACTIVITY_CODE 5
12/21/2022 02:36:42 PM script INFO: SUCCESS!@#KODE 1!@#USER_ID 42!@#ACTIVITY_CODE 2
12/21/2022 02:36:42 PM script INFO: SUCCESS!@#KODE 1!@#USER_ID 42!@#ACTIVITY_CODE 5
12/21/2022 02:36:42 PM script INFO: SUCCESS!@#KODE 1!@#USER_ID 42!@#ACTIVITY_CODE 5
12/21/2022 02:36:45 PM script INFO: SUCCESS!@#KODE 1!@#USER_ID 42!@#ACTIVITY_CODE 1
12/21/2022 02:36:45 PM script INFO: SUCCESS!@#KODE 1!@#USER_ID 42!@#ACTIVITY_CODE 3
12/21/2022 02:36:45 PM script INFO: SUCCESS!@#KODE 1!@#USER_ID 42!@#ACTIVITY_CODE 3
12/21/2022 02:36:45 PM script INFO: SUCCESS!@#KODE 1!@#USER_ID 42!@#ACTIVITY_CODE 1
12/21/2022 02:36:45 PM script INFO: SUCCESS!@#KODE 1!@#USER_ID 42!@#ACTIVITY_CODE 4
12/21/2022 02:36:45 PM script INFO: SUCCESS!@#KODE 1!@#USER_ID 42!@#ACTIVITY_CODE 3
12/21/2022 02:36:45 PM script INFO: SUCCESS!@#KODE 1!@#USER_ID 42!@#ACTIVITY_CODE 3
12/21/2022 02:36:45 PM script INFO: SUCCESS!@#KODE 1!@#USER_ID 42!@#ACTIVITY_CODE 1
12/21/2022 02:36:45 PM script INFO: SUCCESS!@#KODE 1!@#USER_ID 42!@#ACTIVITY_CODE 2
12/21/2022 02:36:46 PM script INFO: SUCCESS!@#KODE 1!@#USER_ID 42!@#ACTIVITY_CODE 1
12/21/2022 02:36:46 PM script INFO: SUCCESS!@#KODE 1!@#USER_ID 42!@#ACTIVITY_CODE 1
12/21/2022 02:36:46 PM script INFO: SUCCESS!@#KODE 1!@#USER_ID 42!@#ACTIVITY_CODE 2
12/21/2022 02:36:46 PM script INFO: SUCCESS!@#KODE 1!@#USER_ID 42!@#ACTIVITY_CODE 2
12/21/2022 02:36:46 PM script INFO: SUCCESS!@#KODE 1!@#USER_ID 42!@#ACTIVITY_CODE 1
12/21/2022 02:36:46 PM script INFO: SUCCESS!@#KODE 1!@#USER_ID 42!@#ACTIVITY_CODE 2
12/21/2022 02:36:46 PM script INFO: SUCCESS!@#KODE 1!@#USER_ID 42!@#ACTIVITY_CODE 1
12/21/2022 02:36:46 PM script INFO: SUCCESS!@#KODE 1!@#USER_ID 42!@#ACTIVITY_CODE 4
12/21/2022 02:36:46 PM script INFO: SUCCESS!@#KODE 1!@#USER_ID 42!@#ACTIVITY_CODE 1
12/21/2022 02:36:46 PM script INFO: SUCCESS!@#KODE 1!@#USER_ID 42!@#ACTIVITY_CODE 2
12/21/2022 02:36:46 PM script INFO: SUCCESS!@#KODE 1!@#USER_ID 42!@#ACTIVITY_CODE 2
12/21/2022 02:36:46 PM script INFO: SUCCESS!@#KODE 1!@#USER_ID 42!@#ACTIVITY_CODE 2
12/21/2022 02:36:46 PM script INFO: SUCCESS!@#KODE 1!@#USER_ID 42!@#ACTIVITY_CODE 1
12/21/2022 02:36:46 PM script INFO: SUCCESS!@#KODE 1!@#USER_ID 42!@#ACTIVITY_CODE 1
12/21/2022 02:36:47 PM script INFO: SUCCESS!@#KODE 1!@#USER_ID 42!@#ACTIVITY_CODE 2
12/21/2022 02:36:47 PM script INFO: SUCCESS!@#KODE 1!@#USER_ID 42!@#ACTIVITY_CODE 1
12/21/2022 02:36:47 PM script INFO: SUCCESS!@#KODE 1!@#USER_ID 42!@#ACTIVITY_CODE 2
12/21/2022 02:36:47 PM script INFO: SUCCESS!@#KODE 1!@#USER_ID 42!@#ACTIVITY_CODE 3
12/21/2022 02:36:47 PM script INFO: SUCCESS!@#KODE 1!@#USER_ID 42!@#ACTIVITY_CODE 1
12/21/2022 02:36:47 PM script INFO: SUCCESS!@#KODE 1!@#USER_ID 42!@#ACTIVITY_CODE 1
12/21/2022 02:36:47 PM script INFO: SUCCESS!@#KODE 1!@#USER_ID 42!@#ACTIVITY_CODE 1
12/21/2022 02:36:47 PM script INFO: SUCCESS!@#KODE 1!@#USER_ID 42!@#ACTIVITY_CODE 2
12/21/2022 02:36:47 PM script INFO: SUCCESS!@#KODE 1!@#USER_ID 42!@#ACTIVITY_CODE 4
12/21/2022 02:36:47 PM script INFO: SUCCESS!@#KODE 1!@#USER_ID 42!@#ACTIVITY_CODE 3
12/21/2022 02:36:47 PM script INFO: SUCCESS!@#KODE 1!@#USER_ID 42!@#ACTIVITY_CODE 1
12/21/2022 02:36:47 PM script INFO: SUCCESS!@#KODE 1!@#USER_ID 42!@#ACTIVITY_CODE 4
12/21/2022 02:36:47 PM script INFO: SUCCESS!@#KODE 1!@#USER_ID 42!@#ACTIVITY_CODE 2
12/21/2022 02:36:47 PM script INFO: SUCCESS!@#KODE 1!@#USER_ID 42!@#ACTIVITY_CODE 3
12/21/2022 02:36:47 PM script INFO: SUCCESS!@#KODE 1!@#USER_ID 42!@#ACTIVITY_CODE 3
12/21/2022 02:36:48 PM script INFO: SUCCESS!@#KODE 1!@#USER_ID 42!@#ACTIVITY_CODE 2
12/21/2022 02:36:48 PM script INFO: SUCCESS!@#KODE 1!@#USER_ID 42!@#ACTIVITY_CODE 4
12/21/2022 02:36:48 PM script INFO: SUCCESS!@#KODE 1!@#USER_ID 42!@#ACTIVITY_CODE 3
12/21/2022 02:36:48 PM script INFO: SUCCESS!@#KODE 1!@#USER_ID 42!@#ACTIVITY_CODE 1
12/21/2022 02:36:48 PM script INFO: SUCCESS!@#KODE 1!@#USER_ID 42!@#ACTIVITY_CODE 3
12/21/2022 02:36:48 PM script INFO: SUCCESS!@#KODE 1!@#USER_ID 42!@#ACTIVITY_CODE 2
12/21/2022 02:36:48 PM script INFO: SUCCESS!@#KODE 1!@#USER_ID 42!@#ACTIVITY_CODE 1
12/21/2022 02:36:48 PM script INFO: Duration: 33.009979248046875
12/21/2022 02:36:48 PM script INFO: mengakhiri-quiz
12/21/2022 02:36:49 PM script INFO: SUCCESS!@#KODE 1!@#USER_ID 42!@#ACTIVITY_CODE 5
12/21/2022 02:36:49 PM script INFO: berhasil-submit
