12/10/2022 08:53:26 AM script INFO: Prepared chrome options..
12/10/2022 08:53:28 AM script INFO: Initialized chrome browser..
12/10/2022 08:53:28 AM script INFO: mengakses-homepage
12/10/2022 08:53:45 AM script INFO: mengakses-login-page
12/10/2022 08:54:15 AM script INFO: mengakses-site-home
12/10/2022 08:54:18 AM script INFO: mengakses-site-course
12/10/2022 08:54:47 AM script INFO: mengakses-quiz
12/10/2022 08:54:51 AM script INFO: mengakses-start-quiz-page
12/10/2022 08:55:13 AM script INFO: memulai-quiz
12/10/2022 08:55:13 AM script INFO: SUCCESS!@#KODE 1!@#USER_ID 31!@#ACTIVITY_CODE 5
12/10/2022 08:55:24 AM script INFO: SUCCESS!@#KODE 1!@#USER_ID 31!@#ACTIVITY_CODE 1
12/10/2022 08:55:24 AM script INFO: SUCCESS!@#KODE 1!@#USER_ID 31!@#ACTIVITY_CODE 1
12/10/2022 08:55:24 AM script INFO: SUCCESS!@#KODE 1!@#USER_ID 31!@#ACTIVITY_CODE 4
12/10/2022 08:55:25 AM script INFO: SUCCESS!@#KODE 1!@#USER_ID 31!@#ACTIVITY_CODE 2
12/10/2022 08:55:25 AM script INFO: SUCCESS!@#KODE 1!@#USER_ID 31!@#ACTIVITY_CODE 3
12/10/2022 08:55:25 AM script INFO: SUCCESS!@#KODE 1!@#USER_ID 31!@#ACTIVITY_CODE 2
12/10/2022 08:55:25 AM script INFO: SUCCESS!@#KODE 1!@#USER_ID 31!@#ACTIVITY_CODE 5
12/10/2022 08:55:25 AM script INFO: SUCCESS!@#KODE 1!@#USER_ID 31!@#ACTIVITY_CODE 5
12/10/2022 08:55:28 AM script INFO: SUCCESS!@#KODE 1!@#USER_ID 31!@#ACTIVITY_CODE 2
12/10/2022 08:55:28 AM script INFO: SUCCESS!@#KODE 1!@#USER_ID 31!@#ACTIVITY_CODE 3
12/10/2022 08:55:28 AM script INFO: SUCCESS!@#KODE 1!@#USER_ID 31!@#ACTIVITY_CODE 3
12/10/2022 08:55:28 AM script INFO: SUCCESS!@#KODE 1!@#USER_ID 31!@#ACTIVITY_CODE 3
12/10/2022 08:55:29 AM script INFO: SUCCESS!@#KODE 1!@#USER_ID 31!@#ACTIVITY_CODE 3
12/10/2022 08:55:29 AM script INFO: SUCCESS!@#KODE 1!@#USER_ID 31!@#ACTIVITY_CODE 1
12/10/2022 08:55:29 AM script INFO: SUCCESS!@#KODE 1!@#USER_ID 31!@#ACTIVITY_CODE 1
12/10/2022 08:55:29 AM script INFO: SUCCESS!@#KODE 1!@#USER_ID 31!@#ACTIVITY_CODE 1
12/10/2022 08:55:29 AM script INFO: SUCCESS!@#KODE 1!@#USER_ID 31!@#ACTIVITY_CODE 1
12/10/2022 08:55:29 AM script INFO: SUCCESS!@#KODE 1!@#USER_ID 31!@#ACTIVITY_CODE 5
12/10/2022 08:55:29 AM script INFO: SUCCESS!@#KODE 1!@#USER_ID 31!@#ACTIVITY_CODE 5
12/10/2022 08:55:31 AM script INFO: SUCCESS!@#KODE 1!@#USER_ID 31!@#ACTIVITY_CODE 5
12/10/2022 08:55:31 AM script INFO: SUCCESS!@#KODE 1!@#USER_ID 31!@#ACTIVITY_CODE 5
12/10/2022 08:55:34 AM script INFO: SUCCESS!@#KODE 1!@#USER_ID 31!@#ACTIVITY_CODE 1
12/10/2022 08:55:34 AM script INFO: SUCCESS!@#KODE 1!@#USER_ID 31!@#ACTIVITY_CODE 3
12/10/2022 08:55:35 AM script INFO: SUCCESS!@#KODE 1!@#USER_ID 31!@#ACTIVITY_CODE 2
12/10/2022 08:55:35 AM script INFO: SUCCESS!@#KODE 1!@#USER_ID 31!@#ACTIVITY_CODE 2
12/10/2022 08:55:35 AM script INFO: SUCCESS!@#KODE 1!@#USER_ID 31!@#ACTIVITY_CODE 5
12/10/2022 08:55:35 AM script INFO: SUCCESS!@#KODE 1!@#USER_ID 31!@#ACTIVITY_CODE 5
12/10/2022 08:55:38 AM script INFO: SUCCESS!@#KODE 1!@#USER_ID 31!@#ACTIVITY_CODE 1
12/10/2022 08:55:38 AM script INFO: SUCCESS!@#KODE 1!@#USER_ID 31!@#ACTIVITY_CODE 4
12/10/2022 08:55:38 AM script INFO: SUCCESS!@#KODE 1!@#USER_ID 31!@#ACTIVITY_CODE 2
12/10/2022 08:55:39 AM script INFO: SUCCESS!@#KODE 1!@#USER_ID 31!@#ACTIVITY_CODE 3
12/10/2022 08:55:39 AM script INFO: SUCCESS!@#KODE 1!@#USER_ID 31!@#ACTIVITY_CODE 2
12/10/2022 08:55:40 AM script INFO: SUCCESS!@#KODE 1!@#USER_ID 31!@#ACTIVITY_CODE 2
12/10/2022 08:55:40 AM script INFO: SUCCESS!@#KODE 1!@#USER_ID 31!@#ACTIVITY_CODE 5
12/10/2022 08:55:40 AM script INFO: SUCCESS!@#KODE 1!@#USER_ID 31!@#ACTIVITY_CODE 5
12/10/2022 08:55:42 AM script INFO: SUCCESS!@#KODE 1!@#USER_ID 31!@#ACTIVITY_CODE 1
12/10/2022 08:55:42 AM script INFO: SUCCESS!@#KODE 1!@#USER_ID 31!@#ACTIVITY_CODE 4
12/10/2022 08:55:43 AM script INFO: SUCCESS!@#KODE 1!@#USER_ID 31!@#ACTIVITY_CODE 3
12/10/2022 08:55:43 AM script INFO: SUCCESS!@#KODE 1!@#USER_ID 31!@#ACTIVITY_CODE 5
12/10/2022 08:55:43 AM script INFO: SUCCESS!@#KODE 1!@#USER_ID 31!@#ACTIVITY_CODE 5
12/10/2022 08:55:45 AM script INFO: SUCCESS!@#KODE 1!@#USER_ID 31!@#ACTIVITY_CODE 2
12/10/2022 08:55:46 AM script INFO: SUCCESS!@#KODE 1!@#USER_ID 31!@#ACTIVITY_CODE 1
12/10/2022 08:55:46 AM script INFO: SUCCESS!@#KODE 1!@#USER_ID 31!@#ACTIVITY_CODE 3
12/10/2022 08:55:46 AM script INFO: SUCCESS!@#KODE 1!@#USER_ID 31!@#ACTIVITY_CODE 2
12/10/2022 08:55:46 AM script INFO: SUCCESS!@#KODE 1!@#USER_ID 31!@#ACTIVITY_CODE 2
12/10/2022 08:55:47 AM script INFO: SUCCESS!@#KODE 1!@#USER_ID 31!@#ACTIVITY_CODE 4
12/10/2022 08:55:47 AM script INFO: SUCCESS!@#KODE 1!@#USER_ID 31!@#ACTIVITY_CODE 1
12/10/2022 08:55:47 AM script INFO: SUCCESS!@#KODE 1!@#USER_ID 31!@#ACTIVITY_CODE 1
12/10/2022 08:55:47 AM script INFO: Duration: 22.696162939071655
12/10/2022 08:55:47 AM script INFO: mengakhiri-quiz
12/10/2022 08:55:48 AM script INFO: SUCCESS!@#KODE 1!@#USER_ID 31!@#ACTIVITY_CODE 5
12/10/2022 08:55:48 AM script INFO: berhasil-submit
12/10/2022 08:57:18 AM script ERROR: TIMEOUT EXCEPTION!@#KODE 0!@#LOCATION berhasil-submit
12/10/2022 08:57:18 AM main_worker ERROR: Message: None

