12/23/2022 05:52:03 AM script INFO: Prepared chrome options..
12/23/2022 05:52:04 AM script INFO: Initialized chrome browser..
12/23/2022 05:52:04 AM script INFO: mengakses-homepage
12/23/2022 05:52:58 AM script INFO: mengakses-login-page
12/23/2022 05:53:17 AM script INFO: mengakses-site-home
12/23/2022 05:54:47 AM script ERROR: TIMEOUT EXCEPTION!@#KODE 0!@#LOCATION mengakses-site-home
12/23/2022 05:54:47 AM main_worker ERROR: Message: None

