12/12/2022 01:09:55 AM script INFO: Prepared chrome options..
12/12/2022 01:09:56 AM script INFO: Initialized chrome browser..
12/12/2022 01:09:56 AM script INFO: mengakses-homepage
12/12/2022 01:10:40 AM script INFO: mengakses-login-page
12/12/2022 01:10:50 AM script INFO: mengakses-site-home
12/12/2022 01:10:50 AM script INFO: mengakses-site-course
12/12/2022 01:10:58 AM script INFO: mengakses-quiz
12/12/2022 01:10:59 AM script INFO: mengakses-start-quiz-page
12/12/2022 01:10:59 AM script INFO: memulai-quiz
12/12/2022 01:10:59 AM script INFO: SUCCESS!@#KODE 1!@#USER_ID 94!@#ACTIVITY_CODE 5
12/12/2022 01:11:10 AM script INFO: SUCCESS!@#KODE 1!@#USER_ID 94!@#ACTIVITY_CODE 2
12/12/2022 01:11:10 AM script INFO: SUCCESS!@#KODE 1!@#USER_ID 94!@#ACTIVITY_CODE 3
12/12/2022 01:11:10 AM script INFO: SUCCESS!@#KODE 1!@#USER_ID 94!@#ACTIVITY_CODE 2
12/12/2022 01:11:10 AM script INFO: SUCCESS!@#KODE 1!@#USER_ID 94!@#ACTIVITY_CODE 2
12/12/2022 01:11:11 AM script INFO: SUCCESS!@#KODE 1!@#USER_ID 94!@#ACTIVITY_CODE 3
12/12/2022 01:11:11 AM script INFO: SUCCESS!@#KODE 1!@#USER_ID 94!@#ACTIVITY_CODE 5
12/12/2022 01:11:11 AM script INFO: SUCCESS!@#KODE 1!@#USER_ID 94!@#ACTIVITY_CODE 5
12/12/2022 01:11:13 AM script INFO: SUCCESS!@#KODE 1!@#USER_ID 94!@#ACTIVITY_CODE 1
12/12/2022 01:11:13 AM script INFO: SUCCESS!@#KODE 1!@#USER_ID 94!@#ACTIVITY_CODE 1
12/12/2022 01:11:13 AM script INFO: SUCCESS!@#KODE 1!@#USER_ID 94!@#ACTIVITY_CODE 1
12/12/2022 01:11:13 AM script INFO: SUCCESS!@#KODE 1!@#USER_ID 94!@#ACTIVITY_CODE 5
12/12/2022 01:11:13 AM script INFO: SUCCESS!@#KODE 1!@#USER_ID 94!@#ACTIVITY_CODE 5
12/12/2022 01:11:16 AM script INFO: SUCCESS!@#KODE 1!@#USER_ID 94!@#ACTIVITY_CODE 2
12/12/2022 01:11:16 AM script INFO: SUCCESS!@#KODE 1!@#USER_ID 94!@#ACTIVITY_CODE 3
12/12/2022 01:11:16 AM script INFO: SUCCESS!@#KODE 1!@#USER_ID 94!@#ACTIVITY_CODE 2
12/12/2022 01:11:16 AM script INFO: SUCCESS!@#KODE 1!@#USER_ID 94!@#ACTIVITY_CODE 2
12/12/2022 01:11:16 AM script INFO: SUCCESS!@#KODE 1!@#USER_ID 94!@#ACTIVITY_CODE 2
12/12/2022 01:11:16 AM script INFO: SUCCESS!@#KODE 1!@#USER_ID 94!@#ACTIVITY_CODE 5
12/12/2022 01:11:16 AM script INFO: SUCCESS!@#KODE 1!@#USER_ID 94!@#ACTIVITY_CODE 5
12/12/2022 01:11:19 AM script INFO: SUCCESS!@#KODE 1!@#USER_ID 94!@#ACTIVITY_CODE 1
12/12/2022 01:11:19 AM script INFO: SUCCESS!@#KODE 1!@#USER_ID 94!@#ACTIVITY_CODE 5
12/12/2022 01:11:19 AM script INFO: SUCCESS!@#KODE 1!@#USER_ID 94!@#ACTIVITY_CODE 5
12/12/2022 01:11:21 AM script INFO: SUCCESS!@#KODE 1!@#USER_ID 94!@#ACTIVITY_CODE 1
12/12/2022 01:11:21 AM script INFO: SUCCESS!@#KODE 1!@#USER_ID 94!@#ACTIVITY_CODE 3
12/12/2022 01:11:21 AM script INFO: SUCCESS!@#KODE 1!@#USER_ID 94!@#ACTIVITY_CODE 3
12/12/2022 01:11:22 AM script INFO: SUCCESS!@#KODE 1!@#USER_ID 94!@#ACTIVITY_CODE 3
12/12/2022 01:11:22 AM script INFO: SUCCESS!@#KODE 1!@#USER_ID 94!@#ACTIVITY_CODE 5
12/12/2022 01:11:22 AM script INFO: SUCCESS!@#KODE 1!@#USER_ID 94!@#ACTIVITY_CODE 5
12/12/2022 01:11:24 AM script INFO: SUCCESS!@#KODE 1!@#USER_ID 94!@#ACTIVITY_CODE 2
12/12/2022 01:11:24 AM script INFO: SUCCESS!@#KODE 1!@#USER_ID 94!@#ACTIVITY_CODE 5
12/12/2022 01:11:24 AM script INFO: SUCCESS!@#KODE 1!@#USER_ID 94!@#ACTIVITY_CODE 5
12/12/2022 01:11:27 AM script INFO: SUCCESS!@#KODE 1!@#USER_ID 94!@#ACTIVITY_CODE 1
12/12/2022 01:11:27 AM script INFO: SUCCESS!@#KODE 1!@#USER_ID 94!@#ACTIVITY_CODE 4
12/12/2022 01:11:27 AM script INFO: SUCCESS!@#KODE 1!@#USER_ID 94!@#ACTIVITY_CODE 2
12/12/2022 01:11:27 AM script INFO: SUCCESS!@#KODE 1!@#USER_ID 94!@#ACTIVITY_CODE 2
12/12/2022 01:11:27 AM script INFO: SUCCESS!@#KODE 1!@#USER_ID 94!@#ACTIVITY_CODE 1
12/12/2022 01:11:27 AM script INFO: SUCCESS!@#KODE 1!@#USER_ID 94!@#ACTIVITY_CODE 2
12/12/2022 01:11:27 AM script INFO: SUCCESS!@#KODE 1!@#USER_ID 94!@#ACTIVITY_CODE 2
12/12/2022 01:11:27 AM script INFO: SUCCESS!@#KODE 1!@#USER_ID 94!@#ACTIVITY_CODE 1
12/12/2022 01:11:27 AM script INFO: SUCCESS!@#KODE 1!@#USER_ID 94!@#ACTIVITY_CODE 3
12/12/2022 01:11:28 AM script INFO: SUCCESS!@#KODE 1!@#USER_ID 94!@#ACTIVITY_CODE 2
12/12/2022 01:11:28 AM script INFO: SUCCESS!@#KODE 1!@#USER_ID 94!@#ACTIVITY_CODE 2
12/12/2022 01:11:28 AM script INFO: SUCCESS!@#KODE 1!@#USER_ID 94!@#ACTIVITY_CODE 3
12/12/2022 01:11:28 AM script INFO: SUCCESS!@#KODE 1!@#USER_ID 94!@#ACTIVITY_CODE 1
12/12/2022 01:11:28 AM script INFO: SUCCESS!@#KODE 1!@#USER_ID 94!@#ACTIVITY_CODE 3
12/12/2022 01:11:28 AM script INFO: SUCCESS!@#KODE 1!@#USER_ID 94!@#ACTIVITY_CODE 2
12/12/2022 01:11:28 AM script INFO: SUCCESS!@#KODE 1!@#USER_ID 94!@#ACTIVITY_CODE 2
12/12/2022 01:11:28 AM script INFO: SUCCESS!@#KODE 1!@#USER_ID 94!@#ACTIVITY_CODE 3
12/12/2022 01:11:28 AM script INFO: Duration: 18.021219491958618
12/12/2022 01:11:28 AM script INFO: mengakhiri-quiz
12/12/2022 01:11:29 AM script INFO: SUCCESS!@#KODE 1!@#USER_ID 94!@#ACTIVITY_CODE 5
12/12/2022 01:11:29 AM script INFO: berhasil-submit
