Nmap scan report for 10.96.0.1
Nmap scan report for 10.96.0.2
Nmap scan report for 10.96.0.3
Nmap scan report for kube-dns-598f9895c6-262zf (10.96.0.4)
Nmap scan report for 10.96.0.5
Nmap scan report for 10.96.0.6
Nmap scan report for 10.96.0.7
Nmap scan report for 10.96.0.9
Nmap scan report for 10.96.0.160
Nmap scan report for 10.96.0.161
Nmap scan report for 10.96.0.162
Nmap scan report for 10.96.0.163
Nmap scan report for 10.96.0.164
Nmap scan report for 10.96.0.165
Nmap scan report for 10.96.0.166
Nmap scan report for 10.96.0.167
Nmap scan report for 10.96.0.168
Nmap scan report for 10.96.0.169
Nmap scan report for 10.96.0.170
Nmap scan report for 10.96.0.171
Nmap scan report for 10.96.0.172
Nmap scan report for 10.96.0.173
Nmap scan report for 10.96.0.174
Nmap scan report for 10.96.0.175
Nmap scan report for 10.96.0.176
Nmap scan report for 10.96.0.177
Nmap scan report for 10.96.0.178
Nmap scan report for 10.96.0.179
Nmap scan report for 10.96.0.180
Nmap scan report for 10.96.0.181
Nmap scan report for 10.96.0.182
Nmap scan report for 10.96.0.183
Nmap scan report for 10.96.0.184
Nmap scan report for 10.96.0.185
Nmap scan report for 10.96.0.186
Nmap scan report for 10.96.0.187
Nmap scan report for 10.96.0.188
Nmap scan report for 10.96.0.189
Nmap scan report for 10.96.0.190
Nmap scan report for 10.96.0.191
Nmap scan report for 10.96.0.192
Nmap scan report for 10.96.0.193
Nmap scan report for 10.96.0.194
Nmap scan report for 10.96.0.195
Nmap scan report for 10.96.0.196
Nmap scan report for 10.96.0.197
Nmap scan report for 10.96.0.198
Nmap scan report for 10.96.0.199
Nmap scan report for 10.96.0.200
Nmap scan report for 10.96.0.201
Nmap scan report for 10.96.0.202
Nmap scan report for 10.96.0.203
Nmap scan report for 10.96.0.204
Nmap scan report for 10.96.0.205
Nmap scan report for 10.96.0.206
Nmap scan report for 10.96.0.207
Nmap scan report for 10.96.1.1
Nmap scan report for 10.96.1.2
Nmap scan report for 10.96.1.3
Nmap scan report for 10.96.1.156
Nmap scan report for 10.96.1.157
Nmap scan report for 10.96.1.158
Nmap scan report for 10.96.1.159
Nmap scan report for 10.96.1.160
Nmap scan report for 10.96.1.161
Nmap scan report for 10.96.1.162
Nmap scan report for 10.96.1.163
Nmap scan report for 10.96.1.164
Nmap scan report for 10.96.1.165
Nmap scan report for 10.96.1.166
Nmap scan report for 10.96.1.167
Nmap scan report for 10.96.1.168
Nmap scan report for 10.96.1.169
Nmap scan report for 10.96.1.170
Nmap scan report for 10.96.1.171
Nmap scan report for 10.96.1.172
Nmap scan report for 10.96.1.173
Nmap scan report for 10.96.1.174
Nmap scan report for 10.96.1.175
Nmap scan report for 10.96.1.176
Nmap scan report for 10.96.1.177
Nmap scan report for 10.96.1.178
Nmap scan report for 10.96.1.179
Nmap scan report for 10.96.1.180
Nmap scan report for 10.96.1.181
Nmap scan report for 10.96.1.182
Nmap scan report for 10.96.1.183
Nmap scan report for 10.96.1.184
Nmap scan report for 10.96.1.185
Nmap scan report for 10.96.1.186
Nmap scan report for 10.96.1.187
Nmap scan report for 10.96.1.188
Nmap scan report for 10.96.1.189
Nmap scan report for 10.96.1.190
Nmap scan report for 10.96.1.191
Nmap scan report for 10.96.1.192
Nmap scan report for 10.96.1.193
Nmap scan report for 10.96.1.194
Nmap scan report for 10.96.1.195
Nmap scan report for 10.96.1.196
Nmap scan report for 10.96.1.197
Nmap scan report for 10.96.1.198
Nmap scan report for 10.96.1.199
Nmap scan report for 10.96.1.200
Nmap scan report for 10.96.1.201
Nmap scan report for 10.96.1.202
Nmap scan report for 10.96.1.203
Nmap scan report for 10.96.1.204
Nmap scan report for 10.96.1.205
Nmap scan report for 10.96.1.206
Nmap scan report for 10.96.1.207
Nmap scan report for master-76d459876-cndp5 (10.96.0.109)
