user,password,target,amount
tool_generator_000001,examplepassword,http://34.67.116.119/,250
tool_generator_000002,examplepassword,http://34.67.116.119/,250
tool_generator_000003,examplepassword,http://34.67.116.119/,250
tool_generator_000004,examplepassword,http://34.67.116.119/,250
tool_generator_000005,examplepassword,http://34.67.116.119/,250
tool_generator_000006,examplepassword,http://34.67.116.119/,250
tool_generator_000007,examplepassword,http://34.67.116.119/,250
tool_generator_000008,examplepassword,http://34.67.116.119/,250
tool_generator_000009,examplepassword,http://34.67.116.119/,250
tool_generator_000010,examplepassword,http://34.67.116.119/,250
tool_generator_000011,examplepassword,http://34.67.116.119/,250
tool_generator_000012,examplepassword,http://34.67.116.119/,250
tool_generator_000013,examplepassword,http://34.67.116.119/,250
tool_generator_000014,examplepassword,http://34.67.116.119/,250
tool_generator_000015,examplepassword,http://34.67.116.119/,250
tool_generator_000016,examplepassword,http://34.67.116.119/,250
tool_generator_000017,examplepassword,http://34.67.116.119/,250
tool_generator_000018,examplepassword,http://34.67.116.119/,250
tool_generator_000019,examplepassword,http://34.67.116.119/,250
tool_generator_000020,examplepassword,http://34.67.116.119/,250
tool_generator_000021,examplepassword,http://34.67.116.119/,250
tool_generator_000022,examplepassword,http://34.67.116.119/,250
tool_generator_000023,examplepassword,http://34.67.116.119/,250
tool_generator_000024,examplepassword,http://34.67.116.119/,250
tool_generator_000025,examplepassword,http://34.67.116.119/,250
tool_generator_000026,examplepassword,http://34.67.116.119/,250
tool_generator_000027,examplepassword,http://34.67.116.119/,250
tool_generator_000028,examplepassword,http://34.67.116.119/,250
tool_generator_000029,examplepassword,http://34.67.116.119/,250
tool_generator_000030,examplepassword,http://34.67.116.119/,250
tool_generator_000031,examplepassword,http://34.67.116.119/,250
tool_generator_000032,examplepassword,http://34.67.116.119/,250
tool_generator_000033,examplepassword,http://34.67.116.119/,250
tool_generator_000034,examplepassword,http://34.67.116.119/,250
tool_generator_000035,examplepassword,http://34.67.116.119/,250
tool_generator_000036,examplepassword,http://34.67.116.119/,250
tool_generator_000037,examplepassword,http://34.67.116.119/,250
tool_generator_000038,examplepassword,http://34.67.116.119/,250
tool_generator_000039,examplepassword,http://34.67.116.119/,250
tool_generator_000040,examplepassword,http://34.67.116.119/,250
tool_generator_000041,examplepassword,http://34.67.116.119/,250
tool_generator_000042,examplepassword,http://34.67.116.119/,250
tool_generator_000043,examplepassword,http://34.67.116.119/,250
tool_generator_000044,examplepassword,http://34.67.116.119/,250
tool_generator_000045,examplepassword,http://34.67.116.119/,250
tool_generator_000046,examplepassword,http://34.67.116.119/,250
tool_generator_000047,examplepassword,http://34.67.116.119/,250
tool_generator_000048,examplepassword,http://34.67.116.119/,250
tool_generator_000049,examplepassword,http://34.67.116.119/,250
tool_generator_000050,examplepassword,http://34.67.116.119/,250
tool_generator_000051,examplepassword,http://34.67.116.119/,250
tool_generator_000052,examplepassword,http://34.67.116.119/,250
tool_generator_000053,examplepassword,http://34.67.116.119/,250
tool_generator_000054,examplepassword,http://34.67.116.119/,250
tool_generator_000055,examplepassword,http://34.67.116.119/,250
tool_generator_000056,examplepassword,http://34.67.116.119/,250
tool_generator_000057,examplepassword,http://34.67.116.119/,250
tool_generator_000058,examplepassword,http://34.67.116.119/,250
tool_generator_000059,examplepassword,http://34.67.116.119/,250
tool_generator_000060,examplepassword,http://34.67.116.119/,250
tool_generator_000061,examplepassword,http://34.67.116.119/,250
tool_generator_000062,examplepassword,http://34.67.116.119/,250
tool_generator_000063,examplepassword,http://34.67.116.119/,250
tool_generator_000064,examplepassword,http://34.67.116.119/,250
tool_generator_000065,examplepassword,http://34.67.116.119/,250
tool_generator_000066,examplepassword,http://34.67.116.119/,250
tool_generator_000067,examplepassword,http://34.67.116.119/,250
tool_generator_000068,examplepassword,http://34.67.116.119/,250
tool_generator_000069,examplepassword,http://34.67.116.119/,250
tool_generator_000070,examplepassword,http://34.67.116.119/,250
tool_generator_000071,examplepassword,http://34.67.116.119/,250
tool_generator_000072,examplepassword,http://34.67.116.119/,250
tool_generator_000073,examplepassword,http://34.67.116.119/,250
tool_generator_000074,examplepassword,http://34.67.116.119/,250
tool_generator_000075,examplepassword,http://34.67.116.119/,250
tool_generator_000076,examplepassword,http://34.67.116.119/,250
tool_generator_000077,examplepassword,http://34.67.116.119/,250
tool_generator_000078,examplepassword,http://34.67.116.119/,250
tool_generator_000079,examplepassword,http://34.67.116.119/,250
tool_generator_000080,examplepassword,http://34.67.116.119/,250
tool_generator_000081,examplepassword,http://34.67.116.119/,250
tool_generator_000082,examplepassword,http://34.67.116.119/,250
tool_generator_000083,examplepassword,http://34.67.116.119/,250
tool_generator_000084,examplepassword,http://34.67.116.119/,250
tool_generator_000085,examplepassword,http://34.67.116.119/,250
tool_generator_000086,examplepassword,http://34.67.116.119/,250
tool_generator_000087,examplepassword,http://34.67.116.119/,250
tool_generator_000088,examplepassword,http://34.67.116.119/,250
tool_generator_000089,examplepassword,http://34.67.116.119/,250
tool_generator_000090,examplepassword,http://34.67.116.119/,250
tool_generator_000091,examplepassword,http://34.67.116.119/,250
tool_generator_000092,examplepassword,http://34.67.116.119/,250
tool_generator_000093,examplepassword,http://34.67.116.119/,250
tool_generator_000094,examplepassword,http://34.67.116.119/,250
tool_generator_000095,examplepassword,http://34.67.116.119/,250
tool_generator_000096,examplepassword,http://34.67.116.119/,250
tool_generator_000097,examplepassword,http://34.67.116.119/,250
tool_generator_000098,examplepassword,http://34.67.116.119/,250
tool_generator_000099,examplepassword,http://34.67.116.119/,250
tool_generator_000100,examplepassword,http://34.67.116.119/,250
