12/21/2022 01:36:43 PM script INFO: Prepared chrome options..
12/21/2022 01:36:44 PM script INFO: Initialized chrome browser..
12/21/2022 01:36:44 PM script INFO: mengakses-homepage
12/21/2022 01:37:31 PM script INFO: mengakses-login-page
12/21/2022 01:37:54 PM script INFO: mengakses-site-home
12/21/2022 01:37:56 PM script INFO: mengakses-site-course
12/21/2022 01:38:20 PM script INFO: mengakses-quiz
12/21/2022 01:38:21 PM script INFO: mengakses-start-quiz-page
12/21/2022 01:38:25 PM script INFO: memulai-quiz
12/21/2022 01:38:25 PM script INFO: SUCCESS!@#KODE 1!@#USER_ID 88!@#ACTIVITY_CODE 5
12/21/2022 01:38:36 PM script INFO: SUCCESS!@#KODE 1!@#USER_ID 88!@#ACTIVITY_CODE 5
12/21/2022 01:38:36 PM script INFO: SUCCESS!@#KODE 1!@#USER_ID 88!@#ACTIVITY_CODE 5
12/21/2022 01:38:38 PM script INFO: SUCCESS!@#KODE 1!@#USER_ID 88!@#ACTIVITY_CODE 5
12/21/2022 01:38:38 PM script INFO: SUCCESS!@#KODE 1!@#USER_ID 88!@#ACTIVITY_CODE 5
12/21/2022 01:38:41 PM script INFO: SUCCESS!@#KODE 1!@#USER_ID 88!@#ACTIVITY_CODE 5
12/21/2022 01:38:41 PM script INFO: SUCCESS!@#KODE 1!@#USER_ID 88!@#ACTIVITY_CODE 5
12/21/2022 01:38:43 PM script INFO: SUCCESS!@#KODE 1!@#USER_ID 88!@#ACTIVITY_CODE 3
12/21/2022 01:38:44 PM script INFO: SUCCESS!@#KODE 1!@#USER_ID 88!@#ACTIVITY_CODE 1
12/21/2022 01:38:44 PM script INFO: SUCCESS!@#KODE 1!@#USER_ID 88!@#ACTIVITY_CODE 3
12/21/2022 01:38:44 PM script INFO: SUCCESS!@#KODE 1!@#USER_ID 88!@#ACTIVITY_CODE 4
12/21/2022 01:38:44 PM script INFO: SUCCESS!@#KODE 1!@#USER_ID 88!@#ACTIVITY_CODE 1
12/21/2022 01:38:44 PM script INFO: SUCCESS!@#KODE 1!@#USER_ID 88!@#ACTIVITY_CODE 5
12/21/2022 01:38:44 PM script INFO: SUCCESS!@#KODE 1!@#USER_ID 88!@#ACTIVITY_CODE 5
12/21/2022 01:38:46 PM script INFO: SUCCESS!@#KODE 1!@#USER_ID 88!@#ACTIVITY_CODE 2
12/21/2022 01:38:46 PM script INFO: SUCCESS!@#KODE 1!@#USER_ID 88!@#ACTIVITY_CODE 5
12/21/2022 01:38:46 PM script INFO: SUCCESS!@#KODE 1!@#USER_ID 88!@#ACTIVITY_CODE 5
12/21/2022 01:38:49 PM script INFO: SUCCESS!@#KODE 1!@#USER_ID 88!@#ACTIVITY_CODE 5
12/21/2022 01:38:49 PM script INFO: SUCCESS!@#KODE 1!@#USER_ID 88!@#ACTIVITY_CODE 5
12/21/2022 01:38:51 PM script INFO: SUCCESS!@#KODE 1!@#USER_ID 88!@#ACTIVITY_CODE 5
12/21/2022 01:38:51 PM script INFO: SUCCESS!@#KODE 1!@#USER_ID 88!@#ACTIVITY_CODE 5
12/21/2022 01:38:54 PM script INFO: SUCCESS!@#KODE 1!@#USER_ID 88!@#ACTIVITY_CODE 1
12/21/2022 01:38:54 PM script INFO: SUCCESS!@#KODE 1!@#USER_ID 88!@#ACTIVITY_CODE 2
12/21/2022 01:38:54 PM script INFO: SUCCESS!@#KODE 1!@#USER_ID 88!@#ACTIVITY_CODE 2
12/21/2022 01:38:54 PM script INFO: SUCCESS!@#KODE 1!@#USER_ID 88!@#ACTIVITY_CODE 5
12/21/2022 01:38:54 PM script INFO: SUCCESS!@#KODE 1!@#USER_ID 88!@#ACTIVITY_CODE 5
12/21/2022 01:38:57 PM script INFO: SUCCESS!@#KODE 1!@#USER_ID 88!@#ACTIVITY_CODE 2
12/21/2022 01:38:57 PM script INFO: SUCCESS!@#KODE 1!@#USER_ID 88!@#ACTIVITY_CODE 1
12/21/2022 01:38:57 PM script INFO: SUCCESS!@#KODE 1!@#USER_ID 88!@#ACTIVITY_CODE 1
12/21/2022 01:38:57 PM script INFO: SUCCESS!@#KODE 1!@#USER_ID 88!@#ACTIVITY_CODE 1
12/21/2022 01:38:57 PM script INFO: SUCCESS!@#KODE 1!@#USER_ID 88!@#ACTIVITY_CODE 5
12/21/2022 01:38:57 PM script INFO: SUCCESS!@#KODE 1!@#USER_ID 88!@#ACTIVITY_CODE 5
12/21/2022 01:39:00 PM script INFO: SUCCESS!@#KODE 1!@#USER_ID 88!@#ACTIVITY_CODE 1
12/21/2022 01:39:00 PM script INFO: SUCCESS!@#KODE 1!@#USER_ID 88!@#ACTIVITY_CODE 5
12/21/2022 01:39:00 PM script INFO: SUCCESS!@#KODE 1!@#USER_ID 88!@#ACTIVITY_CODE 5
12/21/2022 01:39:02 PM script INFO: SUCCESS!@#KODE 1!@#USER_ID 88!@#ACTIVITY_CODE 3
12/21/2022 01:39:02 PM script INFO: SUCCESS!@#KODE 1!@#USER_ID 88!@#ACTIVITY_CODE 3
12/21/2022 01:39:02 PM script INFO: SUCCESS!@#KODE 1!@#USER_ID 88!@#ACTIVITY_CODE 5
12/21/2022 01:39:02 PM script INFO: SUCCESS!@#KODE 1!@#USER_ID 88!@#ACTIVITY_CODE 5
12/21/2022 01:39:05 PM script INFO: SUCCESS!@#KODE 1!@#USER_ID 88!@#ACTIVITY_CODE 4
12/21/2022 01:39:05 PM script INFO: SUCCESS!@#KODE 1!@#USER_ID 88!@#ACTIVITY_CODE 1
12/21/2022 01:39:05 PM script INFO: SUCCESS!@#KODE 1!@#USER_ID 88!@#ACTIVITY_CODE 3
12/21/2022 01:39:05 PM script INFO: SUCCESS!@#KODE 1!@#USER_ID 88!@#ACTIVITY_CODE 4
12/21/2022 01:39:05 PM script INFO: SUCCESS!@#KODE 1!@#USER_ID 88!@#ACTIVITY_CODE 2
12/21/2022 01:39:05 PM script INFO: SUCCESS!@#KODE 1!@#USER_ID 88!@#ACTIVITY_CODE 3
12/21/2022 01:39:05 PM script INFO: SUCCESS!@#KODE 1!@#USER_ID 88!@#ACTIVITY_CODE 1
12/21/2022 01:39:05 PM script INFO: SUCCESS!@#KODE 1!@#USER_ID 88!@#ACTIVITY_CODE 3
12/21/2022 01:39:05 PM script INFO: SUCCESS!@#KODE 1!@#USER_ID 88!@#ACTIVITY_CODE 3
12/21/2022 01:39:06 PM script INFO: SUCCESS!@#KODE 1!@#USER_ID 88!@#ACTIVITY_CODE 2
12/21/2022 01:39:06 PM script INFO: SUCCESS!@#KODE 1!@#USER_ID 88!@#ACTIVITY_CODE 2
12/21/2022 01:39:06 PM script INFO: SUCCESS!@#KODE 1!@#USER_ID 88!@#ACTIVITY_CODE 2
12/21/2022 01:39:06 PM script INFO: SUCCESS!@#KODE 1!@#USER_ID 88!@#ACTIVITY_CODE 2
12/21/2022 01:39:06 PM script INFO: SUCCESS!@#KODE 1!@#USER_ID 88!@#ACTIVITY_CODE 2
12/21/2022 01:39:06 PM script INFO: SUCCESS!@#KODE 1!@#USER_ID 88!@#ACTIVITY_CODE 2
12/21/2022 01:39:06 PM script INFO: SUCCESS!@#KODE 1!@#USER_ID 88!@#ACTIVITY_CODE 3
12/21/2022 01:39:06 PM script INFO: SUCCESS!@#KODE 1!@#USER_ID 88!@#ACTIVITY_CODE 2
12/21/2022 01:39:06 PM script INFO: SUCCESS!@#KODE 1!@#USER_ID 88!@#ACTIVITY_CODE 3
12/21/2022 01:39:06 PM script INFO: SUCCESS!@#KODE 1!@#USER_ID 88!@#ACTIVITY_CODE 1
12/21/2022 01:39:06 PM script INFO: SUCCESS!@#KODE 1!@#USER_ID 88!@#ACTIVITY_CODE 2
12/21/2022 01:39:07 PM script INFO: SUCCESS!@#KODE 1!@#USER_ID 88!@#ACTIVITY_CODE 2
12/21/2022 01:39:07 PM script INFO: SUCCESS!@#KODE 1!@#USER_ID 88!@#ACTIVITY_CODE 3
12/21/2022 01:39:07 PM script INFO: SUCCESS!@#KODE 1!@#USER_ID 88!@#ACTIVITY_CODE 2
12/21/2022 01:39:07 PM script INFO: SUCCESS!@#KODE 1!@#USER_ID 88!@#ACTIVITY_CODE 3
12/21/2022 01:39:07 PM script INFO: SUCCESS!@#KODE 1!@#USER_ID 88!@#ACTIVITY_CODE 1
12/21/2022 01:39:07 PM script INFO: SUCCESS!@#KODE 1!@#USER_ID 88!@#ACTIVITY_CODE 1
12/21/2022 01:39:07 PM script INFO: SUCCESS!@#KODE 1!@#USER_ID 88!@#ACTIVITY_CODE 3
12/21/2022 01:39:07 PM script INFO: SUCCESS!@#KODE 1!@#USER_ID 88!@#ACTIVITY_CODE 4
12/21/2022 01:39:07 PM script INFO: SUCCESS!@#KODE 1!@#USER_ID 88!@#ACTIVITY_CODE 3
12/21/2022 01:39:07 PM script INFO: SUCCESS!@#KODE 1!@#USER_ID 88!@#ACTIVITY_CODE 3
12/21/2022 01:39:07 PM script INFO: SUCCESS!@#KODE 1!@#USER_ID 88!@#ACTIVITY_CODE 1
12/21/2022 01:39:07 PM script INFO: SUCCESS!@#KODE 1!@#USER_ID 88!@#ACTIVITY_CODE 2
12/21/2022 01:39:07 PM script INFO: SUCCESS!@#KODE 1!@#USER_ID 88!@#ACTIVITY_CODE 2
12/21/2022 01:39:07 PM script INFO: SUCCESS!@#KODE 1!@#USER_ID 88!@#ACTIVITY_CODE 4
12/21/2022 01:39:07 PM script INFO: SUCCESS!@#KODE 1!@#USER_ID 88!@#ACTIVITY_CODE 1
12/21/2022 01:39:08 PM script INFO: SUCCESS!@#KODE 1!@#USER_ID 88!@#ACTIVITY_CODE 2
12/21/2022 01:39:08 PM script INFO: SUCCESS!@#KODE 1!@#USER_ID 88!@#ACTIVITY_CODE 4
12/21/2022 01:39:08 PM script INFO: SUCCESS!@#KODE 1!@#USER_ID 88!@#ACTIVITY_CODE 2
12/21/2022 01:39:08 PM script INFO: SUCCESS!@#KODE 1!@#USER_ID 88!@#ACTIVITY_CODE 4
12/21/2022 01:39:08 PM script INFO: SUCCESS!@#KODE 1!@#USER_ID 88!@#ACTIVITY_CODE 3
12/21/2022 01:39:08 PM script INFO: SUCCESS!@#KODE 1!@#USER_ID 88!@#ACTIVITY_CODE 2
12/21/2022 01:39:08 PM script INFO: SUCCESS!@#KODE 1!@#USER_ID 88!@#ACTIVITY_CODE 2
12/21/2022 01:39:08 PM script INFO: SUCCESS!@#KODE 1!@#USER_ID 88!@#ACTIVITY_CODE 2
12/21/2022 01:39:08 PM script INFO: SUCCESS!@#KODE 1!@#USER_ID 88!@#ACTIVITY_CODE 3
12/21/2022 01:39:08 PM script INFO: SUCCESS!@#KODE 1!@#USER_ID 88!@#ACTIVITY_CODE 3
12/21/2022 01:39:08 PM script INFO: SUCCESS!@#KODE 1!@#USER_ID 88!@#ACTIVITY_CODE 1
12/21/2022 01:39:08 PM script INFO: SUCCESS!@#KODE 1!@#USER_ID 88!@#ACTIVITY_CODE 1
12/21/2022 01:39:08 PM script INFO: SUCCESS!@#KODE 1!@#USER_ID 88!@#ACTIVITY_CODE 2
12/21/2022 01:39:08 PM script INFO: SUCCESS!@#KODE 1!@#USER_ID 88!@#ACTIVITY_CODE 1
12/21/2022 01:39:08 PM script INFO: SUCCESS!@#KODE 1!@#USER_ID 88!@#ACTIVITY_CODE 1
12/21/2022 01:39:09 PM script INFO: SUCCESS!@#KODE 1!@#USER_ID 88!@#ACTIVITY_CODE 2
12/21/2022 01:39:09 PM script INFO: SUCCESS!@#KODE 1!@#USER_ID 88!@#ACTIVITY_CODE 3
12/21/2022 01:39:09 PM script INFO: SUCCESS!@#KODE 1!@#USER_ID 88!@#ACTIVITY_CODE 3
12/21/2022 01:39:09 PM script INFO: SUCCESS!@#KODE 1!@#USER_ID 88!@#ACTIVITY_CODE 3
12/21/2022 01:39:09 PM script INFO: SUCCESS!@#KODE 1!@#USER_ID 88!@#ACTIVITY_CODE 2
12/21/2022 01:39:09 PM script INFO: SUCCESS!@#KODE 1!@#USER_ID 88!@#ACTIVITY_CODE 1
12/21/2022 01:39:09 PM script INFO: SUCCESS!@#KODE 1!@#USER_ID 88!@#ACTIVITY_CODE 1
12/21/2022 01:39:09 PM script INFO: SUCCESS!@#KODE 1!@#USER_ID 88!@#ACTIVITY_CODE 1
12/21/2022 01:39:09 PM script INFO: SUCCESS!@#KODE 1!@#USER_ID 88!@#ACTIVITY_CODE 1
12/21/2022 01:39:09 PM script INFO: SUCCESS!@#KODE 1!@#USER_ID 88!@#ACTIVITY_CODE 1
12/21/2022 01:39:09 PM script INFO: Duration: 33.178175926208496
12/21/2022 01:39:09 PM script INFO: mengakhiri-quiz
12/21/2022 01:39:10 PM script INFO: SUCCESS!@#KODE 1!@#USER_ID 88!@#ACTIVITY_CODE 5
12/21/2022 01:39:10 PM script INFO: berhasil-submit
