12/23/2022 03:27:17 AM script INFO: Prepared chrome options..
12/23/2022 03:27:18 AM script INFO: Initialized chrome browser..
12/23/2022 03:27:18 AM script INFO: mengakses-homepage
12/23/2022 03:27:29 AM script INFO: mengakses-login-page
12/23/2022 03:27:30 AM script INFO: mengakses-site-home
12/23/2022 03:27:30 AM script INFO: mengakses-site-course
12/23/2022 03:27:31 AM script INFO: mengakses-quiz
12/23/2022 03:27:31 AM script INFO: mengakses-start-quiz-page
12/23/2022 03:27:32 AM script INFO: memulai-quiz
12/23/2022 03:27:32 AM script INFO: SUCCESS!@#KODE 1!@#USER_ID 15!@#ACTIVITY_CODE 5
12/23/2022 03:27:43 AM script INFO: SUCCESS!@#KODE 1!@#USER_ID 15!@#ACTIVITY_CODE 5
12/23/2022 03:27:43 AM script INFO: SUCCESS!@#KODE 1!@#USER_ID 15!@#ACTIVITY_CODE 5
12/23/2022 03:27:45 AM script INFO: SUCCESS!@#KODE 1!@#USER_ID 15!@#ACTIVITY_CODE 3
12/23/2022 03:27:46 AM script INFO: SUCCESS!@#KODE 1!@#USER_ID 15!@#ACTIVITY_CODE 1
12/23/2022 03:27:46 AM script INFO: SUCCESS!@#KODE 1!@#USER_ID 15!@#ACTIVITY_CODE 5
12/23/2022 03:27:46 AM script INFO: SUCCESS!@#KODE 1!@#USER_ID 15!@#ACTIVITY_CODE 5
12/23/2022 03:27:48 AM script INFO: SUCCESS!@#KODE 1!@#USER_ID 15!@#ACTIVITY_CODE 3
12/23/2022 03:27:48 AM script INFO: SUCCESS!@#KODE 1!@#USER_ID 15!@#ACTIVITY_CODE 4
12/23/2022 03:27:48 AM script INFO: SUCCESS!@#KODE 1!@#USER_ID 15!@#ACTIVITY_CODE 1
12/23/2022 03:27:48 AM script INFO: SUCCESS!@#KODE 1!@#USER_ID 15!@#ACTIVITY_CODE 1
12/23/2022 03:27:48 AM script INFO: SUCCESS!@#KODE 1!@#USER_ID 15!@#ACTIVITY_CODE 1
12/23/2022 03:27:48 AM script INFO: SUCCESS!@#KODE 1!@#USER_ID 15!@#ACTIVITY_CODE 5
12/23/2022 03:27:48 AM script INFO: SUCCESS!@#KODE 1!@#USER_ID 15!@#ACTIVITY_CODE 5
12/23/2022 03:27:51 AM script INFO: SUCCESS!@#KODE 1!@#USER_ID 15!@#ACTIVITY_CODE 5
12/23/2022 03:27:51 AM script INFO: SUCCESS!@#KODE 1!@#USER_ID 15!@#ACTIVITY_CODE 5
12/23/2022 03:27:54 AM script INFO: SUCCESS!@#KODE 1!@#USER_ID 15!@#ACTIVITY_CODE 2
12/23/2022 03:27:54 AM script INFO: SUCCESS!@#KODE 1!@#USER_ID 15!@#ACTIVITY_CODE 1
12/23/2022 03:27:54 AM script INFO: SUCCESS!@#KODE 1!@#USER_ID 15!@#ACTIVITY_CODE 2
12/23/2022 03:27:54 AM script INFO: SUCCESS!@#KODE 1!@#USER_ID 15!@#ACTIVITY_CODE 3
12/23/2022 03:27:54 AM script INFO: SUCCESS!@#KODE 1!@#USER_ID 15!@#ACTIVITY_CODE 5
12/23/2022 03:27:54 AM script INFO: SUCCESS!@#KODE 1!@#USER_ID 15!@#ACTIVITY_CODE 5
12/23/2022 03:27:57 AM script INFO: SUCCESS!@#KODE 1!@#USER_ID 15!@#ACTIVITY_CODE 5
12/23/2022 03:27:57 AM script INFO: SUCCESS!@#KODE 1!@#USER_ID 15!@#ACTIVITY_CODE 5
12/23/2022 03:28:00 AM script INFO: SUCCESS!@#KODE 1!@#USER_ID 15!@#ACTIVITY_CODE 1
12/23/2022 03:28:00 AM script INFO: SUCCESS!@#KODE 1!@#USER_ID 15!@#ACTIVITY_CODE 1
12/23/2022 03:28:00 AM script INFO: SUCCESS!@#KODE 1!@#USER_ID 15!@#ACTIVITY_CODE 5
12/23/2022 03:28:00 AM script INFO: SUCCESS!@#KODE 1!@#USER_ID 15!@#ACTIVITY_CODE 5
12/23/2022 03:28:02 AM script INFO: SUCCESS!@#KODE 1!@#USER_ID 15!@#ACTIVITY_CODE 3
12/23/2022 03:28:02 AM script INFO: SUCCESS!@#KODE 1!@#USER_ID 15!@#ACTIVITY_CODE 5
12/23/2022 03:28:02 AM script INFO: SUCCESS!@#KODE 1!@#USER_ID 15!@#ACTIVITY_CODE 5
12/23/2022 03:28:05 AM script INFO: SUCCESS!@#KODE 1!@#USER_ID 15!@#ACTIVITY_CODE 4
12/23/2022 03:28:05 AM script INFO: SUCCESS!@#KODE 1!@#USER_ID 15!@#ACTIVITY_CODE 5
12/23/2022 03:28:05 AM script INFO: SUCCESS!@#KODE 1!@#USER_ID 15!@#ACTIVITY_CODE 5
12/23/2022 03:28:08 AM script INFO: SUCCESS!@#KODE 1!@#USER_ID 15!@#ACTIVITY_CODE 2
12/23/2022 03:28:08 AM script INFO: SUCCESS!@#KODE 1!@#USER_ID 15!@#ACTIVITY_CODE 4
12/23/2022 03:28:08 AM script INFO: SUCCESS!@#KODE 1!@#USER_ID 15!@#ACTIVITY_CODE 3
12/23/2022 03:28:09 AM script INFO: SUCCESS!@#KODE 1!@#USER_ID 15!@#ACTIVITY_CODE 1
12/23/2022 03:28:09 AM script INFO: SUCCESS!@#KODE 1!@#USER_ID 15!@#ACTIVITY_CODE 4
12/23/2022 03:28:09 AM script INFO: SUCCESS!@#KODE 1!@#USER_ID 15!@#ACTIVITY_CODE 2
12/23/2022 03:28:09 AM script INFO: SUCCESS!@#KODE 1!@#USER_ID 15!@#ACTIVITY_CODE 5
12/23/2022 03:28:09 AM script INFO: SUCCESS!@#KODE 1!@#USER_ID 15!@#ACTIVITY_CODE 5
12/23/2022 03:28:12 AM script INFO: SUCCESS!@#KODE 1!@#USER_ID 15!@#ACTIVITY_CODE 2
12/23/2022 03:28:12 AM script INFO: SUCCESS!@#KODE 1!@#USER_ID 15!@#ACTIVITY_CODE 5
12/23/2022 03:28:12 AM script INFO: SUCCESS!@#KODE 1!@#USER_ID 15!@#ACTIVITY_CODE 5
12/23/2022 03:28:14 AM script INFO: SUCCESS!@#KODE 1!@#USER_ID 15!@#ACTIVITY_CODE 5
12/23/2022 03:28:14 AM script INFO: SUCCESS!@#KODE 1!@#USER_ID 15!@#ACTIVITY_CODE 5
12/23/2022 03:28:17 AM script INFO: SUCCESS!@#KODE 1!@#USER_ID 15!@#ACTIVITY_CODE 1
12/23/2022 03:28:17 AM script INFO: SUCCESS!@#KODE 1!@#USER_ID 15!@#ACTIVITY_CODE 1
12/23/2022 03:28:17 AM script INFO: SUCCESS!@#KODE 1!@#USER_ID 15!@#ACTIVITY_CODE 2
12/23/2022 03:28:17 AM script INFO: SUCCESS!@#KODE 1!@#USER_ID 15!@#ACTIVITY_CODE 5
12/23/2022 03:28:17 AM script INFO: SUCCESS!@#KODE 1!@#USER_ID 15!@#ACTIVITY_CODE 5
12/23/2022 03:28:20 AM script INFO: SUCCESS!@#KODE 1!@#USER_ID 15!@#ACTIVITY_CODE 3
12/23/2022 03:28:20 AM script INFO: SUCCESS!@#KODE 1!@#USER_ID 15!@#ACTIVITY_CODE 2
12/23/2022 03:28:20 AM script INFO: SUCCESS!@#KODE 1!@#USER_ID 15!@#ACTIVITY_CODE 5
12/23/2022 03:28:20 AM script INFO: SUCCESS!@#KODE 1!@#USER_ID 15!@#ACTIVITY_CODE 5
12/23/2022 03:28:22 AM script INFO: SUCCESS!@#KODE 1!@#USER_ID 15!@#ACTIVITY_CODE 5
12/23/2022 03:28:22 AM script INFO: SUCCESS!@#KODE 1!@#USER_ID 15!@#ACTIVITY_CODE 5
12/23/2022 03:28:25 AM script INFO: SUCCESS!@#KODE 1!@#USER_ID 15!@#ACTIVITY_CODE 1
12/23/2022 03:28:25 AM script INFO: SUCCESS!@#KODE 1!@#USER_ID 15!@#ACTIVITY_CODE 5
12/23/2022 03:28:25 AM script INFO: SUCCESS!@#KODE 1!@#USER_ID 15!@#ACTIVITY_CODE 5
12/23/2022 03:28:28 AM script INFO: SUCCESS!@#KODE 1!@#USER_ID 15!@#ACTIVITY_CODE 1
12/23/2022 03:28:28 AM script INFO: SUCCESS!@#KODE 1!@#USER_ID 15!@#ACTIVITY_CODE 4
12/23/2022 03:28:28 AM script INFO: SUCCESS!@#KODE 1!@#USER_ID 15!@#ACTIVITY_CODE 2
12/23/2022 03:28:28 AM script INFO: SUCCESS!@#KODE 1!@#USER_ID 15!@#ACTIVITY_CODE 2
12/23/2022 03:28:28 AM script INFO: SUCCESS!@#KODE 1!@#USER_ID 15!@#ACTIVITY_CODE 2
12/23/2022 03:28:29 AM script INFO: SUCCESS!@#KODE 1!@#USER_ID 15!@#ACTIVITY_CODE 2
12/23/2022 03:28:29 AM script INFO: SUCCESS!@#KODE 1!@#USER_ID 15!@#ACTIVITY_CODE 3
12/23/2022 03:28:29 AM script INFO: SUCCESS!@#KODE 1!@#USER_ID 15!@#ACTIVITY_CODE 3
12/23/2022 03:28:29 AM script INFO: SUCCESS!@#KODE 1!@#USER_ID 15!@#ACTIVITY_CODE 2
12/23/2022 03:28:29 AM script INFO: SUCCESS!@#KODE 1!@#USER_ID 15!@#ACTIVITY_CODE 1
12/23/2022 03:28:29 AM script INFO: SUCCESS!@#KODE 1!@#USER_ID 15!@#ACTIVITY_CODE 4
12/23/2022 03:28:29 AM script INFO: SUCCESS!@#KODE 1!@#USER_ID 15!@#ACTIVITY_CODE 2
12/23/2022 03:28:29 AM script INFO: SUCCESS!@#KODE 1!@#USER_ID 15!@#ACTIVITY_CODE 1
12/23/2022 03:28:30 AM script INFO: SUCCESS!@#KODE 1!@#USER_ID 15!@#ACTIVITY_CODE 2
12/23/2022 03:28:30 AM script INFO: SUCCESS!@#KODE 1!@#USER_ID 15!@#ACTIVITY_CODE 2
12/23/2022 03:28:30 AM script INFO: SUCCESS!@#KODE 1!@#USER_ID 15!@#ACTIVITY_CODE 1
12/23/2022 03:28:30 AM script INFO: SUCCESS!@#KODE 1!@#USER_ID 15!@#ACTIVITY_CODE 3
12/23/2022 03:28:30 AM script INFO: SUCCESS!@#KODE 1!@#USER_ID 15!@#ACTIVITY_CODE 2
12/23/2022 03:28:30 AM script INFO: SUCCESS!@#KODE 1!@#USER_ID 15!@#ACTIVITY_CODE 2
12/23/2022 03:28:30 AM script INFO: SUCCESS!@#KODE 1!@#USER_ID 15!@#ACTIVITY_CODE 1
12/23/2022 03:28:31 AM script INFO: SUCCESS!@#KODE 1!@#USER_ID 15!@#ACTIVITY_CODE 2
12/23/2022 03:28:31 AM script INFO: SUCCESS!@#KODE 1!@#USER_ID 15!@#ACTIVITY_CODE 1
12/23/2022 03:28:31 AM script INFO: SUCCESS!@#KODE 1!@#USER_ID 15!@#ACTIVITY_CODE 2
12/23/2022 03:28:31 AM script INFO: SUCCESS!@#KODE 1!@#USER_ID 15!@#ACTIVITY_CODE 3
12/23/2022 03:28:31 AM script INFO: SUCCESS!@#KODE 1!@#USER_ID 15!@#ACTIVITY_CODE 2
12/23/2022 03:28:31 AM script INFO: SUCCESS!@#KODE 1!@#USER_ID 15!@#ACTIVITY_CODE 3
12/23/2022 03:28:31 AM script INFO: SUCCESS!@#KODE 1!@#USER_ID 15!@#ACTIVITY_CODE 3
12/23/2022 03:28:31 AM script INFO: SUCCESS!@#KODE 1!@#USER_ID 15!@#ACTIVITY_CODE 1
12/23/2022 03:28:32 AM script INFO: SUCCESS!@#KODE 1!@#USER_ID 15!@#ACTIVITY_CODE 1
12/23/2022 03:28:32 AM script INFO: SUCCESS!@#KODE 1!@#USER_ID 15!@#ACTIVITY_CODE 1
12/23/2022 03:28:32 AM script INFO: SUCCESS!@#KODE 1!@#USER_ID 15!@#ACTIVITY_CODE 4
12/23/2022 03:28:32 AM script INFO: SUCCESS!@#KODE 1!@#USER_ID 15!@#ACTIVITY_CODE 2
12/23/2022 03:28:32 AM script INFO: SUCCESS!@#KODE 1!@#USER_ID 15!@#ACTIVITY_CODE 2
12/23/2022 03:28:32 AM script INFO: SUCCESS!@#KODE 1!@#USER_ID 15!@#ACTIVITY_CODE 1
12/23/2022 03:28:32 AM script INFO: SUCCESS!@#KODE 1!@#USER_ID 15!@#ACTIVITY_CODE 1
12/23/2022 03:28:32 AM script INFO: SUCCESS!@#KODE 1!@#USER_ID 15!@#ACTIVITY_CODE 2
12/23/2022 03:28:33 AM script INFO: SUCCESS!@#KODE 1!@#USER_ID 15!@#ACTIVITY_CODE 3
12/23/2022 03:28:33 AM script INFO: SUCCESS!@#KODE 1!@#USER_ID 15!@#ACTIVITY_CODE 3
12/23/2022 03:28:33 AM script INFO: SUCCESS!@#KODE 1!@#USER_ID 15!@#ACTIVITY_CODE 2
12/23/2022 03:28:33 AM script INFO: SUCCESS!@#KODE 1!@#USER_ID 15!@#ACTIVITY_CODE 3
12/23/2022 03:28:33 AM script INFO: SUCCESS!@#KODE 1!@#USER_ID 15!@#ACTIVITY_CODE 3
12/23/2022 03:28:33 AM script INFO: SUCCESS!@#KODE 1!@#USER_ID 15!@#ACTIVITY_CODE 3
12/23/2022 03:28:33 AM script INFO: SUCCESS!@#KODE 1!@#USER_ID 15!@#ACTIVITY_CODE 2
12/23/2022 03:28:34 AM script INFO: SUCCESS!@#KODE 1!@#USER_ID 15!@#ACTIVITY_CODE 1
12/23/2022 03:28:34 AM script INFO: SUCCESS!@#KODE 1!@#USER_ID 15!@#ACTIVITY_CODE 3
12/23/2022 03:28:34 AM script INFO: SUCCESS!@#KODE 1!@#USER_ID 15!@#ACTIVITY_CODE 2
12/23/2022 03:28:34 AM script INFO: SUCCESS!@#KODE 1!@#USER_ID 15!@#ACTIVITY_CODE 1
12/23/2022 03:28:34 AM script INFO: SUCCESS!@#KODE 1!@#USER_ID 15!@#ACTIVITY_CODE 4
12/23/2022 03:28:34 AM script INFO: SUCCESS!@#KODE 1!@#USER_ID 15!@#ACTIVITY_CODE 3
12/23/2022 03:28:34 AM script INFO: SUCCESS!@#KODE 1!@#USER_ID 15!@#ACTIVITY_CODE 1
12/23/2022 03:28:35 AM script INFO: SUCCESS!@#KODE 1!@#USER_ID 15!@#ACTIVITY_CODE 4
12/23/2022 03:28:35 AM script INFO: SUCCESS!@#KODE 1!@#USER_ID 15!@#ACTIVITY_CODE 1
12/23/2022 03:28:35 AM script INFO: SUCCESS!@#KODE 1!@#USER_ID 15!@#ACTIVITY_CODE 2
12/23/2022 03:28:35 AM script INFO: SUCCESS!@#KODE 1!@#USER_ID 15!@#ACTIVITY_CODE 2
12/23/2022 03:28:35 AM script INFO: SUCCESS!@#KODE 1!@#USER_ID 15!@#ACTIVITY_CODE 2
12/23/2022 03:28:36 AM script INFO: SUCCESS!@#KODE 1!@#USER_ID 15!@#ACTIVITY_CODE 1
12/23/2022 03:28:36 AM script INFO: SUCCESS!@#KODE 1!@#USER_ID 15!@#ACTIVITY_CODE 3
12/23/2022 03:28:36 AM script INFO: SUCCESS!@#KODE 1!@#USER_ID 15!@#ACTIVITY_CODE 2
12/23/2022 03:28:36 AM script INFO: SUCCESS!@#KODE 1!@#USER_ID 15!@#ACTIVITY_CODE 4
12/23/2022 03:28:36 AM script INFO: SUCCESS!@#KODE 1!@#USER_ID 15!@#ACTIVITY_CODE 2
12/23/2022 03:28:36 AM script INFO: SUCCESS!@#KODE 1!@#USER_ID 15!@#ACTIVITY_CODE 1
12/23/2022 03:28:37 AM script INFO: SUCCESS!@#KODE 1!@#USER_ID 15!@#ACTIVITY_CODE 4
12/23/2022 03:28:37 AM script INFO: SUCCESS!@#KODE 1!@#USER_ID 15!@#ACTIVITY_CODE 3
12/23/2022 03:28:37 AM script INFO: SUCCESS!@#KODE 1!@#USER_ID 15!@#ACTIVITY_CODE 3
12/23/2022 03:28:37 AM script INFO: SUCCESS!@#KODE 1!@#USER_ID 15!@#ACTIVITY_CODE 1
12/23/2022 03:28:37 AM script INFO: SUCCESS!@#KODE 1!@#USER_ID 15!@#ACTIVITY_CODE 1
12/23/2022 03:28:37 AM script INFO: SUCCESS!@#KODE 1!@#USER_ID 15!@#ACTIVITY_CODE 4
12/23/2022 03:28:37 AM script INFO: SUCCESS!@#KODE 1!@#USER_ID 15!@#ACTIVITY_CODE 1
12/23/2022 03:28:37 AM script INFO: SUCCESS!@#KODE 1!@#USER_ID 15!@#ACTIVITY_CODE 3
12/23/2022 03:28:38 AM script INFO: SUCCESS!@#KODE 1!@#USER_ID 15!@#ACTIVITY_CODE 2
12/23/2022 03:28:38 AM script INFO: SUCCESS!@#KODE 1!@#USER_ID 15!@#ACTIVITY_CODE 2
12/23/2022 03:28:38 AM script INFO: SUCCESS!@#KODE 1!@#USER_ID 15!@#ACTIVITY_CODE 4
12/23/2022 03:28:38 AM script INFO: SUCCESS!@#KODE 1!@#USER_ID 15!@#ACTIVITY_CODE 2
12/23/2022 03:28:38 AM script INFO: SUCCESS!@#KODE 1!@#USER_ID 15!@#ACTIVITY_CODE 3
12/23/2022 03:28:39 AM script INFO: SUCCESS!@#KODE 1!@#USER_ID 15!@#ACTIVITY_CODE 2
12/23/2022 03:28:39 AM script INFO: SUCCESS!@#KODE 1!@#USER_ID 15!@#ACTIVITY_CODE 3
12/23/2022 03:28:39 AM script INFO: SUCCESS!@#KODE 1!@#USER_ID 15!@#ACTIVITY_CODE 3
12/23/2022 03:28:39 AM script INFO: SUCCESS!@#KODE 1!@#USER_ID 15!@#ACTIVITY_CODE 3
12/23/2022 03:28:39 AM script INFO: SUCCESS!@#KODE 1!@#USER_ID 15!@#ACTIVITY_CODE 1
12/23/2022 03:28:39 AM script INFO: SUCCESS!@#KODE 1!@#USER_ID 15!@#ACTIVITY_CODE 3
12/23/2022 03:28:39 AM script INFO: SUCCESS!@#KODE 1!@#USER_ID 15!@#ACTIVITY_CODE 1
12/23/2022 03:28:40 AM script INFO: SUCCESS!@#KODE 1!@#USER_ID 15!@#ACTIVITY_CODE 1
12/23/2022 03:28:40 AM script INFO: SUCCESS!@#KODE 1!@#USER_ID 15!@#ACTIVITY_CODE 2
12/23/2022 03:28:40 AM script INFO: SUCCESS!@#KODE 1!@#USER_ID 15!@#ACTIVITY_CODE 2
12/23/2022 03:28:40 AM script INFO: SUCCESS!@#KODE 1!@#USER_ID 15!@#ACTIVITY_CODE 3
12/23/2022 03:28:40 AM script INFO: SUCCESS!@#KODE 1!@#USER_ID 15!@#ACTIVITY_CODE 3
12/23/2022 03:28:41 AM script INFO: SUCCESS!@#KODE 1!@#USER_ID 15!@#ACTIVITY_CODE 1
12/23/2022 03:28:41 AM script INFO: SUCCESS!@#KODE 1!@#USER_ID 15!@#ACTIVITY_CODE 2
12/23/2022 03:28:41 AM script INFO: SUCCESS!@#KODE 1!@#USER_ID 15!@#ACTIVITY_CODE 1
12/23/2022 03:28:41 AM script INFO: SUCCESS!@#KODE 1!@#USER_ID 15!@#ACTIVITY_CODE 2
12/23/2022 03:28:41 AM script INFO: SUCCESS!@#KODE 1!@#USER_ID 15!@#ACTIVITY_CODE 4
12/23/2022 03:28:41 AM script INFO: SUCCESS!@#KODE 1!@#USER_ID 15!@#ACTIVITY_CODE 3
12/23/2022 03:28:42 AM script INFO: SUCCESS!@#KODE 1!@#USER_ID 15!@#ACTIVITY_CODE 1
12/23/2022 03:28:42 AM script INFO: SUCCESS!@#KODE 1!@#USER_ID 15!@#ACTIVITY_CODE 4
12/23/2022 03:28:42 AM script INFO: SUCCESS!@#KODE 1!@#USER_ID 15!@#ACTIVITY_CODE 3
12/23/2022 03:28:42 AM script INFO: SUCCESS!@#KODE 1!@#USER_ID 15!@#ACTIVITY_CODE 3
12/23/2022 03:28:42 AM script INFO: SUCCESS!@#KODE 1!@#USER_ID 15!@#ACTIVITY_CODE 1
12/23/2022 03:28:42 AM script INFO: SUCCESS!@#KODE 1!@#USER_ID 15!@#ACTIVITY_CODE 4
12/23/2022 03:28:42 AM script INFO: SUCCESS!@#KODE 1!@#USER_ID 15!@#ACTIVITY_CODE 2
12/23/2022 03:28:43 AM script INFO: SUCCESS!@#KODE 1!@#USER_ID 15!@#ACTIVITY_CODE 4
12/23/2022 03:28:43 AM script INFO: SUCCESS!@#KODE 1!@#USER_ID 15!@#ACTIVITY_CODE 3
12/23/2022 03:28:43 AM script INFO: SUCCESS!@#KODE 1!@#USER_ID 15!@#ACTIVITY_CODE 2
12/23/2022 03:28:43 AM script INFO: SUCCESS!@#KODE 1!@#USER_ID 15!@#ACTIVITY_CODE 1
12/23/2022 03:28:43 AM script INFO: SUCCESS!@#KODE 1!@#USER_ID 15!@#ACTIVITY_CODE 2
12/23/2022 03:28:44 AM script INFO: SUCCESS!@#KODE 1!@#USER_ID 15!@#ACTIVITY_CODE 2
12/23/2022 03:28:44 AM script INFO: SUCCESS!@#KODE 1!@#USER_ID 15!@#ACTIVITY_CODE 1
12/23/2022 03:28:44 AM script INFO: SUCCESS!@#KODE 1!@#USER_ID 15!@#ACTIVITY_CODE 1
12/23/2022 03:28:44 AM script INFO: SUCCESS!@#KODE 1!@#USER_ID 15!@#ACTIVITY_CODE 3
12/23/2022 03:28:44 AM script INFO: SUCCESS!@#KODE 1!@#USER_ID 15!@#ACTIVITY_CODE 2
12/23/2022 03:28:44 AM script INFO: SUCCESS!@#KODE 1!@#USER_ID 15!@#ACTIVITY_CODE 3
12/23/2022 03:28:45 AM script INFO: SUCCESS!@#KODE 1!@#USER_ID 15!@#ACTIVITY_CODE 1
12/23/2022 03:28:45 AM script INFO: SUCCESS!@#KODE 1!@#USER_ID 15!@#ACTIVITY_CODE 2
12/23/2022 03:28:45 AM script INFO: SUCCESS!@#KODE 1!@#USER_ID 15!@#ACTIVITY_CODE 4
12/23/2022 03:28:45 AM script INFO: SUCCESS!@#KODE 1!@#USER_ID 15!@#ACTIVITY_CODE 3
12/23/2022 03:28:45 AM script INFO: SUCCESS!@#KODE 1!@#USER_ID 15!@#ACTIVITY_CODE 2
12/23/2022 03:28:46 AM script INFO: SUCCESS!@#KODE 1!@#USER_ID 15!@#ACTIVITY_CODE 3
12/23/2022 03:28:46 AM script INFO: SUCCESS!@#KODE 1!@#USER_ID 15!@#ACTIVITY_CODE 4
12/23/2022 03:28:46 AM script INFO: SUCCESS!@#KODE 1!@#USER_ID 15!@#ACTIVITY_CODE 2
12/23/2022 03:28:46 AM script INFO: SUCCESS!@#KODE 1!@#USER_ID 15!@#ACTIVITY_CODE 2
12/23/2022 03:28:47 AM script INFO: SUCCESS!@#KODE 1!@#USER_ID 15!@#ACTIVITY_CODE 2
12/23/2022 03:28:47 AM script INFO: SUCCESS!@#KODE 1!@#USER_ID 15!@#ACTIVITY_CODE 3
12/23/2022 03:28:47 AM script INFO: SUCCESS!@#KODE 1!@#USER_ID 15!@#ACTIVITY_CODE 2
12/23/2022 03:28:47 AM script INFO: SUCCESS!@#KODE 1!@#USER_ID 15!@#ACTIVITY_CODE 1
12/23/2022 03:28:47 AM script INFO: SUCCESS!@#KODE 1!@#USER_ID 15!@#ACTIVITY_CODE 1
12/23/2022 03:28:47 AM script INFO: SUCCESS!@#KODE 1!@#USER_ID 15!@#ACTIVITY_CODE 1
12/23/2022 03:28:48 AM script INFO: SUCCESS!@#KODE 1!@#USER_ID 15!@#ACTIVITY_CODE 1
12/23/2022 03:28:48 AM script INFO: SUCCESS!@#KODE 1!@#USER_ID 15!@#ACTIVITY_CODE 2
12/23/2022 03:28:48 AM script INFO: SUCCESS!@#KODE 1!@#USER_ID 15!@#ACTIVITY_CODE 1
12/23/2022 03:28:48 AM script INFO: SUCCESS!@#KODE 1!@#USER_ID 15!@#ACTIVITY_CODE 3
12/23/2022 03:28:48 AM script INFO: SUCCESS!@#KODE 1!@#USER_ID 15!@#ACTIVITY_CODE 3
12/23/2022 03:28:49 AM script INFO: SUCCESS!@#KODE 1!@#USER_ID 15!@#ACTIVITY_CODE 2
12/23/2022 03:28:49 AM script INFO: SUCCESS!@#KODE 1!@#USER_ID 15!@#ACTIVITY_CODE 3
12/23/2022 03:28:49 AM script INFO: SUCCESS!@#KODE 1!@#USER_ID 15!@#ACTIVITY_CODE 3
12/23/2022 03:28:49 AM script INFO: SUCCESS!@#KODE 1!@#USER_ID 15!@#ACTIVITY_CODE 2
12/23/2022 03:28:49 AM script INFO: SUCCESS!@#KODE 1!@#USER_ID 15!@#ACTIVITY_CODE 1
12/23/2022 03:28:50 AM script INFO: SUCCESS!@#KODE 1!@#USER_ID 15!@#ACTIVITY_CODE 3
12/23/2022 03:28:50 AM script INFO: SUCCESS!@#KODE 1!@#USER_ID 15!@#ACTIVITY_CODE 3
12/23/2022 03:28:50 AM script INFO: SUCCESS!@#KODE 1!@#USER_ID 15!@#ACTIVITY_CODE 1
12/23/2022 03:28:50 AM script INFO: SUCCESS!@#KODE 1!@#USER_ID 15!@#ACTIVITY_CODE 2
12/23/2022 03:28:50 AM script INFO: SUCCESS!@#KODE 1!@#USER_ID 15!@#ACTIVITY_CODE 3
12/23/2022 03:28:50 AM script INFO: SUCCESS!@#KODE 1!@#USER_ID 15!@#ACTIVITY_CODE 1
12/23/2022 03:28:51 AM script INFO: SUCCESS!@#KODE 1!@#USER_ID 15!@#ACTIVITY_CODE 3
12/23/2022 03:28:51 AM script INFO: SUCCESS!@#KODE 1!@#USER_ID 15!@#ACTIVITY_CODE 4
12/23/2022 03:28:51 AM script INFO: SUCCESS!@#KODE 1!@#USER_ID 15!@#ACTIVITY_CODE 2
12/23/2022 03:28:51 AM script INFO: SUCCESS!@#KODE 1!@#USER_ID 15!@#ACTIVITY_CODE 2
12/23/2022 03:28:51 AM script INFO: SUCCESS!@#KODE 1!@#USER_ID 15!@#ACTIVITY_CODE 1
12/23/2022 03:28:52 AM script INFO: SUCCESS!@#KODE 1!@#USER_ID 15!@#ACTIVITY_CODE 3
12/23/2022 03:28:52 AM script INFO: SUCCESS!@#KODE 1!@#USER_ID 15!@#ACTIVITY_CODE 4
12/23/2022 03:28:52 AM script INFO: SUCCESS!@#KODE 1!@#USER_ID 15!@#ACTIVITY_CODE 3
12/23/2022 03:28:52 AM script INFO: SUCCESS!@#KODE 1!@#USER_ID 15!@#ACTIVITY_CODE 2
12/23/2022 03:28:52 AM script INFO: SUCCESS!@#KODE 1!@#USER_ID 15!@#ACTIVITY_CODE 3
12/23/2022 03:28:53 AM script INFO: SUCCESS!@#KODE 1!@#USER_ID 15!@#ACTIVITY_CODE 3
12/23/2022 03:28:53 AM script INFO: SUCCESS!@#KODE 1!@#USER_ID 15!@#ACTIVITY_CODE 1
12/23/2022 03:28:53 AM script INFO: SUCCESS!@#KODE 1!@#USER_ID 15!@#ACTIVITY_CODE 2
12/23/2022 03:28:53 AM script INFO: SUCCESS!@#KODE 1!@#USER_ID 15!@#ACTIVITY_CODE 2
12/23/2022 03:28:54 AM script INFO: SUCCESS!@#KODE 1!@#USER_ID 15!@#ACTIVITY_CODE 3
12/23/2022 03:28:54 AM script INFO: SUCCESS!@#KODE 1!@#USER_ID 15!@#ACTIVITY_CODE 2
12/23/2022 03:28:54 AM script INFO: SUCCESS!@#KODE 1!@#USER_ID 15!@#ACTIVITY_CODE 4
12/23/2022 03:28:54 AM script INFO: SUCCESS!@#KODE 1!@#USER_ID 15!@#ACTIVITY_CODE 1
12/23/2022 03:28:54 AM script INFO: SUCCESS!@#KODE 1!@#USER_ID 15!@#ACTIVITY_CODE 3
12/23/2022 03:28:54 AM script INFO: SUCCESS!@#KODE 1!@#USER_ID 15!@#ACTIVITY_CODE 3
12/23/2022 03:28:55 AM script INFO: SUCCESS!@#KODE 1!@#USER_ID 15!@#ACTIVITY_CODE 1
12/23/2022 03:28:55 AM script INFO: SUCCESS!@#KODE 1!@#USER_ID 15!@#ACTIVITY_CODE 2
12/23/2022 03:28:55 AM script INFO: SUCCESS!@#KODE 1!@#USER_ID 15!@#ACTIVITY_CODE 1
12/23/2022 03:28:55 AM script INFO: SUCCESS!@#KODE 1!@#USER_ID 15!@#ACTIVITY_CODE 3
12/23/2022 03:28:55 AM script INFO: SUCCESS!@#KODE 1!@#USER_ID 15!@#ACTIVITY_CODE 3
12/23/2022 03:28:55 AM script INFO: SUCCESS!@#KODE 1!@#USER_ID 15!@#ACTIVITY_CODE 3
12/23/2022 03:28:56 AM script INFO: SUCCESS!@#KODE 1!@#USER_ID 15!@#ACTIVITY_CODE 2
12/23/2022 03:28:56 AM script INFO: SUCCESS!@#KODE 1!@#USER_ID 15!@#ACTIVITY_CODE 2
12/23/2022 03:28:56 AM script INFO: SUCCESS!@#KODE 1!@#USER_ID 15!@#ACTIVITY_CODE 3
12/23/2022 03:28:56 AM script INFO: SUCCESS!@#KODE 1!@#USER_ID 15!@#ACTIVITY_CODE 2
12/23/2022 03:28:57 AM script INFO: SUCCESS!@#KODE 1!@#USER_ID 15!@#ACTIVITY_CODE 4
12/23/2022 03:28:57 AM script INFO: SUCCESS!@#KODE 1!@#USER_ID 15!@#ACTIVITY_CODE 1
12/23/2022 03:28:57 AM script INFO: SUCCESS!@#KODE 1!@#USER_ID 15!@#ACTIVITY_CODE 4
12/23/2022 03:28:57 AM script INFO: SUCCESS!@#KODE 1!@#USER_ID 15!@#ACTIVITY_CODE 3
12/23/2022 03:28:57 AM script INFO: SUCCESS!@#KODE 1!@#USER_ID 15!@#ACTIVITY_CODE 2
12/23/2022 03:28:57 AM script INFO: SUCCESS!@#KODE 1!@#USER_ID 15!@#ACTIVITY_CODE 1
12/23/2022 03:28:57 AM script INFO: SUCCESS!@#KODE 1!@#USER_ID 15!@#ACTIVITY_CODE 3
12/23/2022 03:28:58 AM script INFO: SUCCESS!@#KODE 1!@#USER_ID 15!@#ACTIVITY_CODE 1
12/23/2022 03:28:58 AM script INFO: SUCCESS!@#KODE 1!@#USER_ID 15!@#ACTIVITY_CODE 2
12/23/2022 03:28:58 AM script INFO: SUCCESS!@#KODE 1!@#USER_ID 15!@#ACTIVITY_CODE 3
12/23/2022 03:28:58 AM script INFO: SUCCESS!@#KODE 1!@#USER_ID 15!@#ACTIVITY_CODE 1
12/23/2022 03:28:58 AM script INFO: SUCCESS!@#KODE 1!@#USER_ID 15!@#ACTIVITY_CODE 4
12/23/2022 03:28:58 AM script INFO: SUCCESS!@#KODE 1!@#USER_ID 15!@#ACTIVITY_CODE 1
12/23/2022 03:28:58 AM script INFO: SUCCESS!@#KODE 1!@#USER_ID 15!@#ACTIVITY_CODE 3
12/23/2022 03:28:59 AM script INFO: SUCCESS!@#KODE 1!@#USER_ID 15!@#ACTIVITY_CODE 3
12/23/2022 03:28:59 AM script INFO: SUCCESS!@#KODE 1!@#USER_ID 15!@#ACTIVITY_CODE 2
12/23/2022 03:28:59 AM script INFO: SUCCESS!@#KODE 1!@#USER_ID 15!@#ACTIVITY_CODE 3
12/23/2022 03:28:59 AM script INFO: Duration: 76.10094594955444
12/23/2022 03:28:59 AM script INFO: mengakhiri-quiz
12/23/2022 03:29:00 AM script INFO: SUCCESS!@#KODE 1!@#USER_ID 15!@#ACTIVITY_CODE 5
12/23/2022 03:29:00 AM script INFO: berhasil-submit
