12/12/2022 01:44:27 AM script INFO: Prepared chrome options..
12/12/2022 01:44:28 AM script INFO: Initialized chrome browser..
12/12/2022 01:44:28 AM script INFO: mengakses-homepage
12/12/2022 01:44:38 AM script INFO: mengakses-login-page
12/12/2022 01:44:39 AM script INFO: mengakses-site-home
12/12/2022 01:44:39 AM script INFO: mengakses-site-course
12/12/2022 01:45:06 AM script INFO: mengakses-quiz
12/12/2022 01:45:20 AM script INFO: mengakses-start-quiz-page
12/12/2022 01:45:34 AM script INFO: memulai-quiz
12/12/2022 01:45:34 AM script INFO: SUCCESS!@#KODE 1!@#USER_ID 25!@#ACTIVITY_CODE 5
12/12/2022 01:45:44 AM script INFO: SUCCESS!@#KODE 1!@#USER_ID 25!@#ACTIVITY_CODE 5
12/12/2022 01:45:44 AM script INFO: SUCCESS!@#KODE 1!@#USER_ID 25!@#ACTIVITY_CODE 5
12/12/2022 01:45:47 AM script INFO: SUCCESS!@#KODE 1!@#USER_ID 25!@#ACTIVITY_CODE 3
12/12/2022 01:45:47 AM script INFO: SUCCESS!@#KODE 1!@#USER_ID 25!@#ACTIVITY_CODE 3
12/12/2022 01:45:47 AM script INFO: SUCCESS!@#KODE 1!@#USER_ID 25!@#ACTIVITY_CODE 1
12/12/2022 01:45:47 AM script INFO: SUCCESS!@#KODE 1!@#USER_ID 25!@#ACTIVITY_CODE 2
12/12/2022 01:45:47 AM script INFO: SUCCESS!@#KODE 1!@#USER_ID 25!@#ACTIVITY_CODE 2
12/12/2022 01:45:47 AM script INFO: SUCCESS!@#KODE 1!@#USER_ID 25!@#ACTIVITY_CODE 3
12/12/2022 01:45:47 AM script INFO: SUCCESS!@#KODE 1!@#USER_ID 25!@#ACTIVITY_CODE 2
12/12/2022 01:45:48 AM script INFO: SUCCESS!@#KODE 1!@#USER_ID 25!@#ACTIVITY_CODE 2
12/12/2022 01:45:48 AM script INFO: SUCCESS!@#KODE 1!@#USER_ID 25!@#ACTIVITY_CODE 3
12/12/2022 01:45:48 AM script INFO: SUCCESS!@#KODE 1!@#USER_ID 25!@#ACTIVITY_CODE 5
12/12/2022 01:45:48 AM script INFO: SUCCESS!@#KODE 1!@#USER_ID 25!@#ACTIVITY_CODE 5
12/12/2022 01:45:50 AM script INFO: SUCCESS!@#KODE 1!@#USER_ID 25!@#ACTIVITY_CODE 5
12/12/2022 01:45:50 AM script INFO: SUCCESS!@#KODE 1!@#USER_ID 25!@#ACTIVITY_CODE 5
12/12/2022 01:45:53 AM script INFO: SUCCESS!@#KODE 1!@#USER_ID 25!@#ACTIVITY_CODE 3
12/12/2022 01:45:53 AM script INFO: SUCCESS!@#KODE 1!@#USER_ID 25!@#ACTIVITY_CODE 5
12/12/2022 01:45:53 AM script INFO: SUCCESS!@#KODE 1!@#USER_ID 25!@#ACTIVITY_CODE 5
12/12/2022 01:45:55 AM script INFO: SUCCESS!@#KODE 1!@#USER_ID 25!@#ACTIVITY_CODE 2
12/12/2022 01:45:55 AM script INFO: SUCCESS!@#KODE 1!@#USER_ID 25!@#ACTIVITY_CODE 3
12/12/2022 01:45:55 AM script INFO: SUCCESS!@#KODE 1!@#USER_ID 25!@#ACTIVITY_CODE 1
12/12/2022 01:45:55 AM script INFO: SUCCESS!@#KODE 1!@#USER_ID 25!@#ACTIVITY_CODE 5
12/12/2022 01:45:55 AM script INFO: SUCCESS!@#KODE 1!@#USER_ID 25!@#ACTIVITY_CODE 5
12/12/2022 01:45:58 AM script INFO: SUCCESS!@#KODE 1!@#USER_ID 25!@#ACTIVITY_CODE 1
12/12/2022 01:45:58 AM script INFO: SUCCESS!@#KODE 1!@#USER_ID 25!@#ACTIVITY_CODE 4
12/12/2022 01:45:58 AM script INFO: SUCCESS!@#KODE 1!@#USER_ID 25!@#ACTIVITY_CODE 3
12/12/2022 01:45:58 AM script INFO: SUCCESS!@#KODE 1!@#USER_ID 25!@#ACTIVITY_CODE 2
12/12/2022 01:45:58 AM script INFO: SUCCESS!@#KODE 1!@#USER_ID 25!@#ACTIVITY_CODE 4
12/12/2022 01:45:58 AM script INFO: SUCCESS!@#KODE 1!@#USER_ID 25!@#ACTIVITY_CODE 1
12/12/2022 01:45:58 AM script INFO: SUCCESS!@#KODE 1!@#USER_ID 25!@#ACTIVITY_CODE 1
12/12/2022 01:45:58 AM script INFO: SUCCESS!@#KODE 1!@#USER_ID 25!@#ACTIVITY_CODE 3
12/12/2022 01:45:58 AM script INFO: SUCCESS!@#KODE 1!@#USER_ID 25!@#ACTIVITY_CODE 5
12/12/2022 01:45:58 AM script INFO: SUCCESS!@#KODE 1!@#USER_ID 25!@#ACTIVITY_CODE 5
12/12/2022 01:46:01 AM script INFO: SUCCESS!@#KODE 1!@#USER_ID 25!@#ACTIVITY_CODE 5
12/12/2022 01:46:01 AM script INFO: SUCCESS!@#KODE 1!@#USER_ID 25!@#ACTIVITY_CODE 5
12/12/2022 01:46:04 AM script INFO: SUCCESS!@#KODE 1!@#USER_ID 25!@#ACTIVITY_CODE 2
12/12/2022 01:46:04 AM script INFO: SUCCESS!@#KODE 1!@#USER_ID 25!@#ACTIVITY_CODE 3
12/12/2022 01:46:04 AM script INFO: SUCCESS!@#KODE 1!@#USER_ID 25!@#ACTIVITY_CODE 1
12/12/2022 01:46:04 AM script INFO: SUCCESS!@#KODE 1!@#USER_ID 25!@#ACTIVITY_CODE 2
12/12/2022 01:46:04 AM script INFO: SUCCESS!@#KODE 1!@#USER_ID 25!@#ACTIVITY_CODE 5
12/12/2022 01:46:04 AM script INFO: SUCCESS!@#KODE 1!@#USER_ID 25!@#ACTIVITY_CODE 5
12/12/2022 01:46:06 AM script INFO: SUCCESS!@#KODE 1!@#USER_ID 25!@#ACTIVITY_CODE 2
12/12/2022 01:46:06 AM script INFO: SUCCESS!@#KODE 1!@#USER_ID 25!@#ACTIVITY_CODE 3
12/12/2022 01:46:06 AM script INFO: SUCCESS!@#KODE 1!@#USER_ID 25!@#ACTIVITY_CODE 5
12/12/2022 01:46:06 AM script INFO: SUCCESS!@#KODE 1!@#USER_ID 25!@#ACTIVITY_CODE 5
12/12/2022 01:46:09 AM script INFO: SUCCESS!@#KODE 1!@#USER_ID 25!@#ACTIVITY_CODE 2
12/12/2022 01:46:09 AM script INFO: SUCCESS!@#KODE 1!@#USER_ID 25!@#ACTIVITY_CODE 1
12/12/2022 01:46:09 AM script INFO: SUCCESS!@#KODE 1!@#USER_ID 25!@#ACTIVITY_CODE 3
12/12/2022 01:46:09 AM script INFO: SUCCESS!@#KODE 1!@#USER_ID 25!@#ACTIVITY_CODE 5
12/12/2022 01:46:09 AM script INFO: SUCCESS!@#KODE 1!@#USER_ID 25!@#ACTIVITY_CODE 5
12/12/2022 01:46:12 AM script INFO: SUCCESS!@#KODE 1!@#USER_ID 25!@#ACTIVITY_CODE 2
12/12/2022 01:46:12 AM script INFO: SUCCESS!@#KODE 1!@#USER_ID 25!@#ACTIVITY_CODE 5
12/12/2022 01:46:12 AM script INFO: SUCCESS!@#KODE 1!@#USER_ID 25!@#ACTIVITY_CODE 5
12/12/2022 01:46:14 AM script INFO: SUCCESS!@#KODE 1!@#USER_ID 25!@#ACTIVITY_CODE 1
12/12/2022 01:46:14 AM script INFO: SUCCESS!@#KODE 1!@#USER_ID 25!@#ACTIVITY_CODE 1
12/12/2022 01:46:14 AM script INFO: SUCCESS!@#KODE 1!@#USER_ID 25!@#ACTIVITY_CODE 2
12/12/2022 01:46:15 AM script INFO: SUCCESS!@#KODE 1!@#USER_ID 25!@#ACTIVITY_CODE 3
12/12/2022 01:46:15 AM script INFO: SUCCESS!@#KODE 1!@#USER_ID 25!@#ACTIVITY_CODE 2
12/12/2022 01:46:15 AM script INFO: SUCCESS!@#KODE 1!@#USER_ID 25!@#ACTIVITY_CODE 2
12/12/2022 01:46:15 AM script INFO: SUCCESS!@#KODE 1!@#USER_ID 25!@#ACTIVITY_CODE 2
12/12/2022 01:46:15 AM script INFO: SUCCESS!@#KODE 1!@#USER_ID 25!@#ACTIVITY_CODE 3
12/12/2022 01:46:15 AM script INFO: SUCCESS!@#KODE 1!@#USER_ID 25!@#ACTIVITY_CODE 2
12/12/2022 01:46:15 AM script INFO: SUCCESS!@#KODE 1!@#USER_ID 25!@#ACTIVITY_CODE 3
12/12/2022 01:46:15 AM script INFO: SUCCESS!@#KODE 1!@#USER_ID 25!@#ACTIVITY_CODE 2
12/12/2022 01:46:15 AM script INFO: SUCCESS!@#KODE 1!@#USER_ID 25!@#ACTIVITY_CODE 2
12/12/2022 01:46:15 AM script INFO: SUCCESS!@#KODE 1!@#USER_ID 25!@#ACTIVITY_CODE 2
12/12/2022 01:46:15 AM script INFO: SUCCESS!@#KODE 1!@#USER_ID 25!@#ACTIVITY_CODE 1
12/12/2022 01:46:15 AM script INFO: SUCCESS!@#KODE 1!@#USER_ID 25!@#ACTIVITY_CODE 1
12/12/2022 01:46:15 AM script INFO: SUCCESS!@#KODE 1!@#USER_ID 25!@#ACTIVITY_CODE 3
12/12/2022 01:46:16 AM script INFO: SUCCESS!@#KODE 1!@#USER_ID 25!@#ACTIVITY_CODE 2
12/12/2022 01:46:16 AM script INFO: SUCCESS!@#KODE 1!@#USER_ID 25!@#ACTIVITY_CODE 2
12/12/2022 01:46:16 AM script INFO: SUCCESS!@#KODE 1!@#USER_ID 25!@#ACTIVITY_CODE 3
12/12/2022 01:46:16 AM script INFO: SUCCESS!@#KODE 1!@#USER_ID 25!@#ACTIVITY_CODE 4
12/12/2022 01:46:16 AM script INFO: SUCCESS!@#KODE 1!@#USER_ID 25!@#ACTIVITY_CODE 2
12/12/2022 01:46:16 AM script INFO: SUCCESS!@#KODE 1!@#USER_ID 25!@#ACTIVITY_CODE 2
12/12/2022 01:46:16 AM script INFO: SUCCESS!@#KODE 1!@#USER_ID 25!@#ACTIVITY_CODE 1
12/12/2022 01:46:16 AM script INFO: SUCCESS!@#KODE 1!@#USER_ID 25!@#ACTIVITY_CODE 3
12/12/2022 01:46:16 AM script INFO: SUCCESS!@#KODE 1!@#USER_ID 25!@#ACTIVITY_CODE 4
12/12/2022 01:46:16 AM script INFO: SUCCESS!@#KODE 1!@#USER_ID 25!@#ACTIVITY_CODE 2
12/12/2022 01:46:16 AM script INFO: SUCCESS!@#KODE 1!@#USER_ID 25!@#ACTIVITY_CODE 1
12/12/2022 01:46:16 AM script INFO: SUCCESS!@#KODE 1!@#USER_ID 25!@#ACTIVITY_CODE 1
12/12/2022 01:46:16 AM script INFO: SUCCESS!@#KODE 1!@#USER_ID 25!@#ACTIVITY_CODE 3
12/12/2022 01:46:16 AM script INFO: SUCCESS!@#KODE 1!@#USER_ID 25!@#ACTIVITY_CODE 3
12/12/2022 01:46:17 AM script INFO: SUCCESS!@#KODE 1!@#USER_ID 25!@#ACTIVITY_CODE 1
12/12/2022 01:46:17 AM script INFO: SUCCESS!@#KODE 1!@#USER_ID 25!@#ACTIVITY_CODE 3
12/12/2022 01:46:17 AM script INFO: SUCCESS!@#KODE 1!@#USER_ID 25!@#ACTIVITY_CODE 2
12/12/2022 01:46:17 AM script INFO: SUCCESS!@#KODE 1!@#USER_ID 25!@#ACTIVITY_CODE 4
12/12/2022 01:46:17 AM script INFO: SUCCESS!@#KODE 1!@#USER_ID 25!@#ACTIVITY_CODE 1
12/12/2022 01:46:17 AM script INFO: SUCCESS!@#KODE 1!@#USER_ID 25!@#ACTIVITY_CODE 1
12/12/2022 01:46:17 AM script INFO: SUCCESS!@#KODE 1!@#USER_ID 25!@#ACTIVITY_CODE 3
12/12/2022 01:46:17 AM script INFO: SUCCESS!@#KODE 1!@#USER_ID 25!@#ACTIVITY_CODE 1
12/12/2022 01:46:17 AM script INFO: SUCCESS!@#KODE 1!@#USER_ID 25!@#ACTIVITY_CODE 3
12/12/2022 01:46:17 AM script INFO: SUCCESS!@#KODE 1!@#USER_ID 25!@#ACTIVITY_CODE 1
12/12/2022 01:46:17 AM script INFO: SUCCESS!@#KODE 1!@#USER_ID 25!@#ACTIVITY_CODE 2
12/12/2022 01:46:17 AM script INFO: SUCCESS!@#KODE 1!@#USER_ID 25!@#ACTIVITY_CODE 2
12/12/2022 01:46:17 AM script INFO: SUCCESS!@#KODE 1!@#USER_ID 25!@#ACTIVITY_CODE 2
12/12/2022 01:46:17 AM script INFO: SUCCESS!@#KODE 1!@#USER_ID 25!@#ACTIVITY_CODE 2
12/12/2022 01:46:18 AM script INFO: SUCCESS!@#KODE 1!@#USER_ID 25!@#ACTIVITY_CODE 2
12/12/2022 01:46:18 AM script INFO: Duration: 33.30805230140686
12/12/2022 01:46:18 AM script INFO: mengakhiri-quiz
12/12/2022 01:46:18 AM script INFO: SUCCESS!@#KODE 1!@#USER_ID 25!@#ACTIVITY_CODE 5
12/12/2022 01:46:18 AM script INFO: berhasil-submit
