12/23/2022 01:40:09 AM script INFO: Prepared chrome options..
12/23/2022 01:40:11 AM script INFO: Initialized chrome browser..
12/23/2022 01:40:11 AM script INFO: mengakses-homepage
12/23/2022 01:41:31 AM script INFO: mengakses-login-page
12/23/2022 01:42:04 AM script INFO: mengakses-site-home
12/23/2022 01:42:11 AM script INFO: mengakses-site-course
12/23/2022 01:42:36 AM script INFO: mengakses-quiz
12/23/2022 01:42:46 AM script INFO: mengakses-start-quiz-page
12/23/2022 01:43:11 AM script INFO: memulai-quiz
12/23/2022 01:43:11 AM script INFO: SUCCESS!@#KODE 1!@#USER_ID 12!@#ACTIVITY_CODE 5
12/23/2022 01:43:21 AM script INFO: SUCCESS!@#KODE 1!@#USER_ID 12!@#ACTIVITY_CODE 3
12/23/2022 01:43:22 AM script INFO: SUCCESS!@#KODE 1!@#USER_ID 12!@#ACTIVITY_CODE 2
12/23/2022 01:43:22 AM script INFO: SUCCESS!@#KODE 1!@#USER_ID 12!@#ACTIVITY_CODE 5
12/23/2022 01:43:22 AM script INFO: SUCCESS!@#KODE 1!@#USER_ID 12!@#ACTIVITY_CODE 5
12/23/2022 01:43:24 AM script INFO: SUCCESS!@#KODE 1!@#USER_ID 12!@#ACTIVITY_CODE 3
12/23/2022 01:43:24 AM script INFO: SUCCESS!@#KODE 1!@#USER_ID 12!@#ACTIVITY_CODE 3
12/23/2022 01:43:24 AM script INFO: SUCCESS!@#KODE 1!@#USER_ID 12!@#ACTIVITY_CODE 3
12/23/2022 01:43:24 AM script INFO: SUCCESS!@#KODE 1!@#USER_ID 12!@#ACTIVITY_CODE 1
12/23/2022 01:43:24 AM script INFO: SUCCESS!@#KODE 1!@#USER_ID 12!@#ACTIVITY_CODE 2
12/23/2022 01:43:24 AM script INFO: SUCCESS!@#KODE 1!@#USER_ID 12!@#ACTIVITY_CODE 1
12/23/2022 01:43:24 AM script INFO: SUCCESS!@#KODE 1!@#USER_ID 12!@#ACTIVITY_CODE 5
12/23/2022 01:43:24 AM script INFO: SUCCESS!@#KODE 1!@#USER_ID 12!@#ACTIVITY_CODE 5
12/23/2022 01:43:27 AM script INFO: SUCCESS!@#KODE 1!@#USER_ID 12!@#ACTIVITY_CODE 2
12/23/2022 01:43:27 AM script INFO: SUCCESS!@#KODE 1!@#USER_ID 12!@#ACTIVITY_CODE 2
12/23/2022 01:43:27 AM script INFO: SUCCESS!@#KODE 1!@#USER_ID 12!@#ACTIVITY_CODE 3
12/23/2022 01:43:27 AM script INFO: SUCCESS!@#KODE 1!@#USER_ID 12!@#ACTIVITY_CODE 1
12/23/2022 01:43:27 AM script INFO: SUCCESS!@#KODE 1!@#USER_ID 12!@#ACTIVITY_CODE 2
12/23/2022 01:43:27 AM script INFO: SUCCESS!@#KODE 1!@#USER_ID 12!@#ACTIVITY_CODE 3
12/23/2022 01:43:28 AM script INFO: SUCCESS!@#KODE 1!@#USER_ID 12!@#ACTIVITY_CODE 3
12/23/2022 01:43:28 AM script INFO: SUCCESS!@#KODE 1!@#USER_ID 12!@#ACTIVITY_CODE 3
12/23/2022 01:43:28 AM script INFO: SUCCESS!@#KODE 1!@#USER_ID 12!@#ACTIVITY_CODE 2
12/23/2022 01:43:28 AM script INFO: SUCCESS!@#KODE 1!@#USER_ID 12!@#ACTIVITY_CODE 2
12/23/2022 01:43:28 AM script INFO: SUCCESS!@#KODE 1!@#USER_ID 12!@#ACTIVITY_CODE 1
12/23/2022 01:43:28 AM script INFO: SUCCESS!@#KODE 1!@#USER_ID 12!@#ACTIVITY_CODE 2
12/23/2022 01:43:28 AM script INFO: SUCCESS!@#KODE 1!@#USER_ID 12!@#ACTIVITY_CODE 5
12/23/2022 01:43:28 AM script INFO: SUCCESS!@#KODE 1!@#USER_ID 12!@#ACTIVITY_CODE 5
12/23/2022 01:43:31 AM script INFO: SUCCESS!@#KODE 1!@#USER_ID 12!@#ACTIVITY_CODE 3
12/23/2022 01:43:31 AM script INFO: SUCCESS!@#KODE 1!@#USER_ID 12!@#ACTIVITY_CODE 3
12/23/2022 01:43:31 AM script INFO: SUCCESS!@#KODE 1!@#USER_ID 12!@#ACTIVITY_CODE 5
12/23/2022 01:43:31 AM script INFO: SUCCESS!@#KODE 1!@#USER_ID 12!@#ACTIVITY_CODE 5
12/23/2022 01:43:33 AM script INFO: SUCCESS!@#KODE 1!@#USER_ID 12!@#ACTIVITY_CODE 3
12/23/2022 01:43:33 AM script INFO: SUCCESS!@#KODE 1!@#USER_ID 12!@#ACTIVITY_CODE 3
12/23/2022 01:43:33 AM script INFO: SUCCESS!@#KODE 1!@#USER_ID 12!@#ACTIVITY_CODE 1
12/23/2022 01:43:33 AM script INFO: SUCCESS!@#KODE 1!@#USER_ID 12!@#ACTIVITY_CODE 5
12/23/2022 01:43:33 AM script INFO: SUCCESS!@#KODE 1!@#USER_ID 12!@#ACTIVITY_CODE 5
12/23/2022 01:43:36 AM script INFO: SUCCESS!@#KODE 1!@#USER_ID 12!@#ACTIVITY_CODE 2
12/23/2022 01:43:36 AM script INFO: SUCCESS!@#KODE 1!@#USER_ID 12!@#ACTIVITY_CODE 1
12/23/2022 01:43:36 AM script INFO: SUCCESS!@#KODE 1!@#USER_ID 12!@#ACTIVITY_CODE 5
12/23/2022 01:43:36 AM script INFO: SUCCESS!@#KODE 1!@#USER_ID 12!@#ACTIVITY_CODE 5
12/23/2022 01:43:38 AM script INFO: SUCCESS!@#KODE 1!@#USER_ID 12!@#ACTIVITY_CODE 5
12/23/2022 01:43:38 AM script INFO: SUCCESS!@#KODE 1!@#USER_ID 12!@#ACTIVITY_CODE 5
12/23/2022 01:43:41 AM script INFO: SUCCESS!@#KODE 1!@#USER_ID 12!@#ACTIVITY_CODE 3
12/23/2022 01:43:41 AM script INFO: SUCCESS!@#KODE 1!@#USER_ID 12!@#ACTIVITY_CODE 5
12/23/2022 01:43:41 AM script INFO: SUCCESS!@#KODE 1!@#USER_ID 12!@#ACTIVITY_CODE 5
12/23/2022 01:43:44 AM script INFO: SUCCESS!@#KODE 1!@#USER_ID 12!@#ACTIVITY_CODE 2
12/23/2022 01:43:44 AM script INFO: SUCCESS!@#KODE 1!@#USER_ID 12!@#ACTIVITY_CODE 2
12/23/2022 01:43:44 AM script INFO: SUCCESS!@#KODE 1!@#USER_ID 12!@#ACTIVITY_CODE 2
12/23/2022 01:43:44 AM script INFO: SUCCESS!@#KODE 1!@#USER_ID 12!@#ACTIVITY_CODE 1
12/23/2022 01:43:44 AM script INFO: SUCCESS!@#KODE 1!@#USER_ID 12!@#ACTIVITY_CODE 2
12/23/2022 01:43:44 AM script INFO: SUCCESS!@#KODE 1!@#USER_ID 12!@#ACTIVITY_CODE 3
12/23/2022 01:43:44 AM script INFO: SUCCESS!@#KODE 1!@#USER_ID 12!@#ACTIVITY_CODE 2
12/23/2022 01:43:44 AM script INFO: SUCCESS!@#KODE 1!@#USER_ID 12!@#ACTIVITY_CODE 1
12/23/2022 01:43:44 AM script INFO: SUCCESS!@#KODE 1!@#USER_ID 12!@#ACTIVITY_CODE 4
12/23/2022 01:43:44 AM script INFO: SUCCESS!@#KODE 1!@#USER_ID 12!@#ACTIVITY_CODE 5
12/23/2022 01:43:44 AM script INFO: SUCCESS!@#KODE 1!@#USER_ID 12!@#ACTIVITY_CODE 5
12/23/2022 01:43:47 AM script INFO: SUCCESS!@#KODE 1!@#USER_ID 12!@#ACTIVITY_CODE 3
12/23/2022 01:43:47 AM script INFO: SUCCESS!@#KODE 1!@#USER_ID 12!@#ACTIVITY_CODE 2
12/23/2022 01:43:47 AM script INFO: SUCCESS!@#KODE 1!@#USER_ID 12!@#ACTIVITY_CODE 4
12/23/2022 01:43:47 AM script INFO: SUCCESS!@#KODE 1!@#USER_ID 12!@#ACTIVITY_CODE 1
12/23/2022 01:43:47 AM script INFO: SUCCESS!@#KODE 1!@#USER_ID 12!@#ACTIVITY_CODE 2
12/23/2022 01:43:47 AM script INFO: SUCCESS!@#KODE 1!@#USER_ID 12!@#ACTIVITY_CODE 3
12/23/2022 01:43:47 AM script INFO: SUCCESS!@#KODE 1!@#USER_ID 12!@#ACTIVITY_CODE 5
12/23/2022 01:43:47 AM script INFO: SUCCESS!@#KODE 1!@#USER_ID 12!@#ACTIVITY_CODE 5
12/23/2022 01:43:50 AM script INFO: SUCCESS!@#KODE 1!@#USER_ID 12!@#ACTIVITY_CODE 5
12/23/2022 01:43:50 AM script INFO: SUCCESS!@#KODE 1!@#USER_ID 12!@#ACTIVITY_CODE 5
12/23/2022 01:43:52 AM script INFO: SUCCESS!@#KODE 1!@#USER_ID 12!@#ACTIVITY_CODE 2
12/23/2022 01:43:53 AM script INFO: SUCCESS!@#KODE 1!@#USER_ID 12!@#ACTIVITY_CODE 1
12/23/2022 01:43:53 AM script INFO: SUCCESS!@#KODE 1!@#USER_ID 12!@#ACTIVITY_CODE 3
12/23/2022 01:43:53 AM script INFO: SUCCESS!@#KODE 1!@#USER_ID 12!@#ACTIVITY_CODE 5
12/23/2022 01:43:53 AM script INFO: SUCCESS!@#KODE 1!@#USER_ID 12!@#ACTIVITY_CODE 5
12/23/2022 01:43:55 AM script INFO: SUCCESS!@#KODE 1!@#USER_ID 12!@#ACTIVITY_CODE 2
12/23/2022 01:43:55 AM script INFO: SUCCESS!@#KODE 1!@#USER_ID 12!@#ACTIVITY_CODE 1
12/23/2022 01:43:55 AM script INFO: SUCCESS!@#KODE 1!@#USER_ID 12!@#ACTIVITY_CODE 2
12/23/2022 01:43:55 AM script INFO: SUCCESS!@#KODE 1!@#USER_ID 12!@#ACTIVITY_CODE 3
12/23/2022 01:43:56 AM script INFO: SUCCESS!@#KODE 1!@#USER_ID 12!@#ACTIVITY_CODE 2
12/23/2022 01:43:56 AM script INFO: SUCCESS!@#KODE 1!@#USER_ID 12!@#ACTIVITY_CODE 1
12/23/2022 01:43:56 AM script INFO: SUCCESS!@#KODE 1!@#USER_ID 12!@#ACTIVITY_CODE 5
12/23/2022 01:43:56 AM script INFO: SUCCESS!@#KODE 1!@#USER_ID 12!@#ACTIVITY_CODE 5
12/23/2022 01:43:58 AM script INFO: SUCCESS!@#KODE 1!@#USER_ID 12!@#ACTIVITY_CODE 4
12/23/2022 01:43:58 AM script INFO: SUCCESS!@#KODE 1!@#USER_ID 12!@#ACTIVITY_CODE 1
12/23/2022 01:43:58 AM script INFO: SUCCESS!@#KODE 1!@#USER_ID 12!@#ACTIVITY_CODE 5
12/23/2022 01:43:58 AM script INFO: SUCCESS!@#KODE 1!@#USER_ID 12!@#ACTIVITY_CODE 5
12/23/2022 01:44:01 AM script INFO: SUCCESS!@#KODE 1!@#USER_ID 12!@#ACTIVITY_CODE 1
12/23/2022 01:44:01 AM script INFO: SUCCESS!@#KODE 1!@#USER_ID 12!@#ACTIVITY_CODE 3
12/23/2022 01:44:01 AM script INFO: SUCCESS!@#KODE 1!@#USER_ID 12!@#ACTIVITY_CODE 4
12/23/2022 01:44:01 AM script INFO: SUCCESS!@#KODE 1!@#USER_ID 12!@#ACTIVITY_CODE 5
12/23/2022 01:44:01 AM script INFO: SUCCESS!@#KODE 1!@#USER_ID 12!@#ACTIVITY_CODE 5
12/23/2022 01:44:04 AM script INFO: SUCCESS!@#KODE 1!@#USER_ID 12!@#ACTIVITY_CODE 2
12/23/2022 01:44:04 AM script INFO: SUCCESS!@#KODE 1!@#USER_ID 12!@#ACTIVITY_CODE 1
12/23/2022 01:44:04 AM script INFO: SUCCESS!@#KODE 1!@#USER_ID 12!@#ACTIVITY_CODE 3
12/23/2022 01:44:04 AM script INFO: SUCCESS!@#KODE 1!@#USER_ID 12!@#ACTIVITY_CODE 3
12/23/2022 01:44:04 AM script INFO: SUCCESS!@#KODE 1!@#USER_ID 12!@#ACTIVITY_CODE 3
12/23/2022 01:44:04 AM script INFO: SUCCESS!@#KODE 1!@#USER_ID 12!@#ACTIVITY_CODE 5
12/23/2022 01:44:04 AM script INFO: SUCCESS!@#KODE 1!@#USER_ID 12!@#ACTIVITY_CODE 5
12/23/2022 01:44:06 AM script INFO: SUCCESS!@#KODE 1!@#USER_ID 12!@#ACTIVITY_CODE 1
12/23/2022 01:44:07 AM script INFO: SUCCESS!@#KODE 1!@#USER_ID 12!@#ACTIVITY_CODE 3
12/23/2022 01:44:07 AM script INFO: SUCCESS!@#KODE 1!@#USER_ID 12!@#ACTIVITY_CODE 2
12/23/2022 01:44:07 AM script INFO: SUCCESS!@#KODE 1!@#USER_ID 12!@#ACTIVITY_CODE 3
12/23/2022 01:44:07 AM script INFO: SUCCESS!@#KODE 1!@#USER_ID 12!@#ACTIVITY_CODE 3
12/23/2022 01:44:07 AM script INFO: SUCCESS!@#KODE 1!@#USER_ID 12!@#ACTIVITY_CODE 3
12/23/2022 01:44:07 AM script INFO: SUCCESS!@#KODE 1!@#USER_ID 12!@#ACTIVITY_CODE 3
12/23/2022 01:44:07 AM script INFO: SUCCESS!@#KODE 1!@#USER_ID 12!@#ACTIVITY_CODE 3
12/23/2022 01:44:07 AM script INFO: SUCCESS!@#KODE 1!@#USER_ID 12!@#ACTIVITY_CODE 2
12/23/2022 01:44:07 AM script INFO: SUCCESS!@#KODE 1!@#USER_ID 12!@#ACTIVITY_CODE 2
12/23/2022 01:44:07 AM script INFO: SUCCESS!@#KODE 1!@#USER_ID 12!@#ACTIVITY_CODE 1
12/23/2022 01:44:07 AM script INFO: SUCCESS!@#KODE 1!@#USER_ID 12!@#ACTIVITY_CODE 1
12/23/2022 01:44:07 AM script INFO: SUCCESS!@#KODE 1!@#USER_ID 12!@#ACTIVITY_CODE 1
12/23/2022 01:44:07 AM script INFO: SUCCESS!@#KODE 1!@#USER_ID 12!@#ACTIVITY_CODE 3
12/23/2022 01:44:07 AM script INFO: SUCCESS!@#KODE 1!@#USER_ID 12!@#ACTIVITY_CODE 1
12/23/2022 01:44:07 AM script INFO: SUCCESS!@#KODE 1!@#USER_ID 12!@#ACTIVITY_CODE 2
12/23/2022 01:44:08 AM script INFO: SUCCESS!@#KODE 1!@#USER_ID 12!@#ACTIVITY_CODE 3
12/23/2022 01:44:08 AM script INFO: SUCCESS!@#KODE 1!@#USER_ID 12!@#ACTIVITY_CODE 1
12/23/2022 01:44:08 AM script INFO: SUCCESS!@#KODE 1!@#USER_ID 12!@#ACTIVITY_CODE 3
12/23/2022 01:44:08 AM script INFO: SUCCESS!@#KODE 1!@#USER_ID 12!@#ACTIVITY_CODE 1
12/23/2022 01:44:08 AM script INFO: SUCCESS!@#KODE 1!@#USER_ID 12!@#ACTIVITY_CODE 2
12/23/2022 01:44:08 AM script INFO: SUCCESS!@#KODE 1!@#USER_ID 12!@#ACTIVITY_CODE 3
12/23/2022 01:44:08 AM script INFO: SUCCESS!@#KODE 1!@#USER_ID 12!@#ACTIVITY_CODE 3
12/23/2022 01:44:08 AM script INFO: SUCCESS!@#KODE 1!@#USER_ID 12!@#ACTIVITY_CODE 3
12/23/2022 01:44:08 AM script INFO: SUCCESS!@#KODE 1!@#USER_ID 12!@#ACTIVITY_CODE 1
12/23/2022 01:44:08 AM script INFO: SUCCESS!@#KODE 1!@#USER_ID 12!@#ACTIVITY_CODE 4
12/23/2022 01:44:08 AM script INFO: SUCCESS!@#KODE 1!@#USER_ID 12!@#ACTIVITY_CODE 2
12/23/2022 01:44:08 AM script INFO: SUCCESS!@#KODE 1!@#USER_ID 12!@#ACTIVITY_CODE 4
12/23/2022 01:44:08 AM script INFO: SUCCESS!@#KODE 1!@#USER_ID 12!@#ACTIVITY_CODE 1
12/23/2022 01:44:08 AM script INFO: SUCCESS!@#KODE 1!@#USER_ID 12!@#ACTIVITY_CODE 1
12/23/2022 01:44:08 AM script INFO: SUCCESS!@#KODE 1!@#USER_ID 12!@#ACTIVITY_CODE 2
12/23/2022 01:44:09 AM script INFO: SUCCESS!@#KODE 1!@#USER_ID 12!@#ACTIVITY_CODE 4
12/23/2022 01:44:09 AM script INFO: SUCCESS!@#KODE 1!@#USER_ID 12!@#ACTIVITY_CODE 2
12/23/2022 01:44:09 AM script INFO: SUCCESS!@#KODE 1!@#USER_ID 12!@#ACTIVITY_CODE 2
12/23/2022 01:44:09 AM script INFO: SUCCESS!@#KODE 1!@#USER_ID 12!@#ACTIVITY_CODE 2
12/23/2022 01:44:09 AM script INFO: SUCCESS!@#KODE 1!@#USER_ID 12!@#ACTIVITY_CODE 3
12/23/2022 01:44:09 AM script INFO: SUCCESS!@#KODE 1!@#USER_ID 12!@#ACTIVITY_CODE 2
12/23/2022 01:44:09 AM script INFO: SUCCESS!@#KODE 1!@#USER_ID 12!@#ACTIVITY_CODE 3
12/23/2022 01:44:09 AM script INFO: SUCCESS!@#KODE 1!@#USER_ID 12!@#ACTIVITY_CODE 1
12/23/2022 01:44:09 AM script INFO: SUCCESS!@#KODE 1!@#USER_ID 12!@#ACTIVITY_CODE 4
12/23/2022 01:44:09 AM script INFO: SUCCESS!@#KODE 1!@#USER_ID 12!@#ACTIVITY_CODE 2
12/23/2022 01:44:10 AM script INFO: SUCCESS!@#KODE 1!@#USER_ID 12!@#ACTIVITY_CODE 2
12/23/2022 01:44:10 AM script INFO: SUCCESS!@#KODE 1!@#USER_ID 12!@#ACTIVITY_CODE 2
12/23/2022 01:44:10 AM script INFO: SUCCESS!@#KODE 1!@#USER_ID 12!@#ACTIVITY_CODE 2
12/23/2022 01:44:10 AM script INFO: SUCCESS!@#KODE 1!@#USER_ID 12!@#ACTIVITY_CODE 2
12/23/2022 01:44:10 AM script INFO: SUCCESS!@#KODE 1!@#USER_ID 12!@#ACTIVITY_CODE 1
12/23/2022 01:44:10 AM script INFO: SUCCESS!@#KODE 1!@#USER_ID 12!@#ACTIVITY_CODE 4
12/23/2022 01:44:10 AM script INFO: SUCCESS!@#KODE 1!@#USER_ID 12!@#ACTIVITY_CODE 3
12/23/2022 01:44:10 AM script INFO: SUCCESS!@#KODE 1!@#USER_ID 12!@#ACTIVITY_CODE 3
12/23/2022 01:44:10 AM script INFO: SUCCESS!@#KODE 1!@#USER_ID 12!@#ACTIVITY_CODE 2
12/23/2022 01:44:10 AM script INFO: SUCCESS!@#KODE 1!@#USER_ID 12!@#ACTIVITY_CODE 2
12/23/2022 01:44:10 AM script INFO: SUCCESS!@#KODE 1!@#USER_ID 12!@#ACTIVITY_CODE 1
12/23/2022 01:44:11 AM script INFO: SUCCESS!@#KODE 1!@#USER_ID 12!@#ACTIVITY_CODE 2
12/23/2022 01:44:11 AM script INFO: SUCCESS!@#KODE 1!@#USER_ID 12!@#ACTIVITY_CODE 1
12/23/2022 01:44:11 AM script INFO: SUCCESS!@#KODE 1!@#USER_ID 12!@#ACTIVITY_CODE 2
12/23/2022 01:44:11 AM script INFO: SUCCESS!@#KODE 1!@#USER_ID 12!@#ACTIVITY_CODE 3
12/23/2022 01:44:11 AM script INFO: SUCCESS!@#KODE 1!@#USER_ID 12!@#ACTIVITY_CODE 2
12/23/2022 01:44:11 AM script INFO: SUCCESS!@#KODE 1!@#USER_ID 12!@#ACTIVITY_CODE 1
12/23/2022 01:44:11 AM script INFO: SUCCESS!@#KODE 1!@#USER_ID 12!@#ACTIVITY_CODE 4
12/23/2022 01:44:11 AM script INFO: SUCCESS!@#KODE 1!@#USER_ID 12!@#ACTIVITY_CODE 2
12/23/2022 01:44:11 AM script INFO: SUCCESS!@#KODE 1!@#USER_ID 12!@#ACTIVITY_CODE 2
12/23/2022 01:44:11 AM script INFO: SUCCESS!@#KODE 1!@#USER_ID 12!@#ACTIVITY_CODE 3
12/23/2022 01:44:11 AM script INFO: SUCCESS!@#KODE 1!@#USER_ID 12!@#ACTIVITY_CODE 3
12/23/2022 01:44:11 AM script INFO: SUCCESS!@#KODE 1!@#USER_ID 12!@#ACTIVITY_CODE 3
12/23/2022 01:44:12 AM script INFO: SUCCESS!@#KODE 1!@#USER_ID 12!@#ACTIVITY_CODE 2
12/23/2022 01:44:12 AM script INFO: SUCCESS!@#KODE 1!@#USER_ID 12!@#ACTIVITY_CODE 3
12/23/2022 01:44:12 AM script INFO: SUCCESS!@#KODE 1!@#USER_ID 12!@#ACTIVITY_CODE 1
12/23/2022 01:44:12 AM script INFO: SUCCESS!@#KODE 1!@#USER_ID 12!@#ACTIVITY_CODE 1
12/23/2022 01:44:12 AM script INFO: SUCCESS!@#KODE 1!@#USER_ID 12!@#ACTIVITY_CODE 3
12/23/2022 01:44:12 AM script INFO: SUCCESS!@#KODE 1!@#USER_ID 12!@#ACTIVITY_CODE 1
12/23/2022 01:44:12 AM script INFO: SUCCESS!@#KODE 1!@#USER_ID 12!@#ACTIVITY_CODE 3
12/23/2022 01:44:12 AM script INFO: SUCCESS!@#KODE 1!@#USER_ID 12!@#ACTIVITY_CODE 1
12/23/2022 01:44:12 AM script INFO: SUCCESS!@#KODE 1!@#USER_ID 12!@#ACTIVITY_CODE 3
12/23/2022 01:44:12 AM script INFO: SUCCESS!@#KODE 1!@#USER_ID 12!@#ACTIVITY_CODE 3
12/23/2022 01:44:12 AM script INFO: SUCCESS!@#KODE 1!@#USER_ID 12!@#ACTIVITY_CODE 2
12/23/2022 01:44:12 AM script INFO: SUCCESS!@#KODE 1!@#USER_ID 12!@#ACTIVITY_CODE 2
12/23/2022 01:44:12 AM script INFO: SUCCESS!@#KODE 1!@#USER_ID 12!@#ACTIVITY_CODE 3
12/23/2022 01:44:13 AM script INFO: SUCCESS!@#KODE 1!@#USER_ID 12!@#ACTIVITY_CODE 4
12/23/2022 01:44:13 AM script INFO: SUCCESS!@#KODE 1!@#USER_ID 12!@#ACTIVITY_CODE 1
12/23/2022 01:44:13 AM script INFO: SUCCESS!@#KODE 1!@#USER_ID 12!@#ACTIVITY_CODE 3
12/23/2022 01:44:13 AM script INFO: SUCCESS!@#KODE 1!@#USER_ID 12!@#ACTIVITY_CODE 4
12/23/2022 01:44:13 AM script INFO: SUCCESS!@#KODE 1!@#USER_ID 12!@#ACTIVITY_CODE 1
12/23/2022 01:44:13 AM script INFO: SUCCESS!@#KODE 1!@#USER_ID 12!@#ACTIVITY_CODE 4
12/23/2022 01:44:13 AM script INFO: SUCCESS!@#KODE 1!@#USER_ID 12!@#ACTIVITY_CODE 2
12/23/2022 01:44:13 AM script INFO: SUCCESS!@#KODE 1!@#USER_ID 12!@#ACTIVITY_CODE 2
12/23/2022 01:44:13 AM script INFO: SUCCESS!@#KODE 1!@#USER_ID 12!@#ACTIVITY_CODE 1
12/23/2022 01:44:13 AM script INFO: SUCCESS!@#KODE 1!@#USER_ID 12!@#ACTIVITY_CODE 2
12/23/2022 01:44:13 AM script INFO: SUCCESS!@#KODE 1!@#USER_ID 12!@#ACTIVITY_CODE 1
12/23/2022 01:44:13 AM script INFO: SUCCESS!@#KODE 1!@#USER_ID 12!@#ACTIVITY_CODE 1
12/23/2022 01:44:13 AM script INFO: SUCCESS!@#KODE 1!@#USER_ID 12!@#ACTIVITY_CODE 1
12/23/2022 01:44:14 AM script INFO: SUCCESS!@#KODE 1!@#USER_ID 12!@#ACTIVITY_CODE 4
12/23/2022 01:44:14 AM script INFO: SUCCESS!@#KODE 1!@#USER_ID 12!@#ACTIVITY_CODE 3
12/23/2022 01:44:14 AM script INFO: SUCCESS!@#KODE 1!@#USER_ID 12!@#ACTIVITY_CODE 2
12/23/2022 01:44:14 AM script INFO: SUCCESS!@#KODE 1!@#USER_ID 12!@#ACTIVITY_CODE 3
12/23/2022 01:44:14 AM script INFO: SUCCESS!@#KODE 1!@#USER_ID 12!@#ACTIVITY_CODE 3
12/23/2022 01:44:14 AM script INFO: SUCCESS!@#KODE 1!@#USER_ID 12!@#ACTIVITY_CODE 3
12/23/2022 01:44:14 AM script INFO: SUCCESS!@#KODE 1!@#USER_ID 12!@#ACTIVITY_CODE 1
12/23/2022 01:44:14 AM script INFO: SUCCESS!@#KODE 1!@#USER_ID 12!@#ACTIVITY_CODE 1
12/23/2022 01:44:14 AM script INFO: SUCCESS!@#KODE 1!@#USER_ID 12!@#ACTIVITY_CODE 1
12/23/2022 01:44:14 AM script INFO: SUCCESS!@#KODE 1!@#USER_ID 12!@#ACTIVITY_CODE 2
12/23/2022 01:44:14 AM script INFO: SUCCESS!@#KODE 1!@#USER_ID 12!@#ACTIVITY_CODE 1
12/23/2022 01:44:15 AM script INFO: SUCCESS!@#KODE 1!@#USER_ID 12!@#ACTIVITY_CODE 2
12/23/2022 01:44:15 AM script INFO: SUCCESS!@#KODE 1!@#USER_ID 12!@#ACTIVITY_CODE 2
12/23/2022 01:44:15 AM script INFO: SUCCESS!@#KODE 1!@#USER_ID 12!@#ACTIVITY_CODE 1
12/23/2022 01:44:15 AM script INFO: SUCCESS!@#KODE 1!@#USER_ID 12!@#ACTIVITY_CODE 4
12/23/2022 01:44:15 AM script INFO: SUCCESS!@#KODE 1!@#USER_ID 12!@#ACTIVITY_CODE 3
12/23/2022 01:44:15 AM script INFO: SUCCESS!@#KODE 1!@#USER_ID 12!@#ACTIVITY_CODE 2
12/23/2022 01:44:15 AM script INFO: SUCCESS!@#KODE 1!@#USER_ID 12!@#ACTIVITY_CODE 1
12/23/2022 01:44:15 AM script INFO: SUCCESS!@#KODE 1!@#USER_ID 12!@#ACTIVITY_CODE 1
12/23/2022 01:44:15 AM script INFO: SUCCESS!@#KODE 1!@#USER_ID 12!@#ACTIVITY_CODE 2
12/23/2022 01:44:15 AM script INFO: SUCCESS!@#KODE 1!@#USER_ID 12!@#ACTIVITY_CODE 2
12/23/2022 01:44:15 AM script INFO: SUCCESS!@#KODE 1!@#USER_ID 12!@#ACTIVITY_CODE 3
12/23/2022 01:44:15 AM script INFO: SUCCESS!@#KODE 1!@#USER_ID 12!@#ACTIVITY_CODE 3
12/23/2022 01:44:16 AM script INFO: SUCCESS!@#KODE 1!@#USER_ID 12!@#ACTIVITY_CODE 4
12/23/2022 01:44:16 AM script INFO: SUCCESS!@#KODE 1!@#USER_ID 12!@#ACTIVITY_CODE 3
12/23/2022 01:44:16 AM script INFO: SUCCESS!@#KODE 1!@#USER_ID 12!@#ACTIVITY_CODE 2
12/23/2022 01:44:16 AM script INFO: SUCCESS!@#KODE 1!@#USER_ID 12!@#ACTIVITY_CODE 2
12/23/2022 01:44:16 AM script INFO: SUCCESS!@#KODE 1!@#USER_ID 12!@#ACTIVITY_CODE 3
12/23/2022 01:44:16 AM script INFO: SUCCESS!@#KODE 1!@#USER_ID 12!@#ACTIVITY_CODE 3
12/23/2022 01:44:16 AM script INFO: SUCCESS!@#KODE 1!@#USER_ID 12!@#ACTIVITY_CODE 2
12/23/2022 01:44:16 AM script INFO: SUCCESS!@#KODE 1!@#USER_ID 12!@#ACTIVITY_CODE 1
12/23/2022 01:44:16 AM script INFO: SUCCESS!@#KODE 1!@#USER_ID 12!@#ACTIVITY_CODE 1
12/23/2022 01:44:16 AM script INFO: SUCCESS!@#KODE 1!@#USER_ID 12!@#ACTIVITY_CODE 1
12/23/2022 01:44:16 AM script INFO: SUCCESS!@#KODE 1!@#USER_ID 12!@#ACTIVITY_CODE 1
12/23/2022 01:44:16 AM script INFO: SUCCESS!@#KODE 1!@#USER_ID 12!@#ACTIVITY_CODE 2
12/23/2022 01:44:16 AM script INFO: SUCCESS!@#KODE 1!@#USER_ID 12!@#ACTIVITY_CODE 3
12/23/2022 01:44:16 AM script INFO: SUCCESS!@#KODE 1!@#USER_ID 12!@#ACTIVITY_CODE 3
12/23/2022 01:44:17 AM script INFO: SUCCESS!@#KODE 1!@#USER_ID 12!@#ACTIVITY_CODE 3
12/23/2022 01:44:17 AM script INFO: SUCCESS!@#KODE 1!@#USER_ID 12!@#ACTIVITY_CODE 1
12/23/2022 01:44:17 AM script INFO: SUCCESS!@#KODE 1!@#USER_ID 12!@#ACTIVITY_CODE 1
12/23/2022 01:44:17 AM script INFO: SUCCESS!@#KODE 1!@#USER_ID 12!@#ACTIVITY_CODE 4
12/23/2022 01:44:17 AM script INFO: SUCCESS!@#KODE 1!@#USER_ID 12!@#ACTIVITY_CODE 1
12/23/2022 01:44:17 AM script INFO: SUCCESS!@#KODE 1!@#USER_ID 12!@#ACTIVITY_CODE 4
12/23/2022 01:44:17 AM script INFO: SUCCESS!@#KODE 1!@#USER_ID 12!@#ACTIVITY_CODE 2
12/23/2022 01:44:17 AM script INFO: SUCCESS!@#KODE 1!@#USER_ID 12!@#ACTIVITY_CODE 2
12/23/2022 01:44:17 AM script INFO: SUCCESS!@#KODE 1!@#USER_ID 12!@#ACTIVITY_CODE 2
12/23/2022 01:44:17 AM script INFO: SUCCESS!@#KODE 1!@#USER_ID 12!@#ACTIVITY_CODE 2
12/23/2022 01:44:17 AM script INFO: SUCCESS!@#KODE 1!@#USER_ID 12!@#ACTIVITY_CODE 1
12/23/2022 01:44:17 AM script INFO: SUCCESS!@#KODE 1!@#USER_ID 12!@#ACTIVITY_CODE 1
12/23/2022 01:44:17 AM script INFO: SUCCESS!@#KODE 1!@#USER_ID 12!@#ACTIVITY_CODE 1
12/23/2022 01:44:17 AM script INFO: SUCCESS!@#KODE 1!@#USER_ID 12!@#ACTIVITY_CODE 3
12/23/2022 01:44:18 AM script INFO: SUCCESS!@#KODE 1!@#USER_ID 12!@#ACTIVITY_CODE 4
12/23/2022 01:44:18 AM script INFO: SUCCESS!@#KODE 1!@#USER_ID 12!@#ACTIVITY_CODE 1
12/23/2022 01:44:18 AM script INFO: SUCCESS!@#KODE 1!@#USER_ID 12!@#ACTIVITY_CODE 2
12/23/2022 01:44:18 AM script INFO: SUCCESS!@#KODE 1!@#USER_ID 12!@#ACTIVITY_CODE 3
12/23/2022 01:44:18 AM script INFO: SUCCESS!@#KODE 1!@#USER_ID 12!@#ACTIVITY_CODE 1
12/23/2022 01:44:18 AM script INFO: SUCCESS!@#KODE 1!@#USER_ID 12!@#ACTIVITY_CODE 2
12/23/2022 01:44:18 AM script INFO: SUCCESS!@#KODE 1!@#USER_ID 12!@#ACTIVITY_CODE 1
12/23/2022 01:44:18 AM script INFO: SUCCESS!@#KODE 1!@#USER_ID 12!@#ACTIVITY_CODE 1
12/23/2022 01:44:18 AM script INFO: SUCCESS!@#KODE 1!@#USER_ID 12!@#ACTIVITY_CODE 4
12/23/2022 01:44:18 AM script INFO: SUCCESS!@#KODE 1!@#USER_ID 12!@#ACTIVITY_CODE 2
12/23/2022 01:44:18 AM script INFO: SUCCESS!@#KODE 1!@#USER_ID 12!@#ACTIVITY_CODE 1
12/23/2022 01:44:18 AM script INFO: SUCCESS!@#KODE 1!@#USER_ID 12!@#ACTIVITY_CODE 2
12/23/2022 01:44:18 AM script INFO: SUCCESS!@#KODE 1!@#USER_ID 12!@#ACTIVITY_CODE 3
12/23/2022 01:44:18 AM script INFO: Duration: 56.99639582633972
12/23/2022 01:44:18 AM script INFO: mengakhiri-quiz
12/23/2022 01:44:19 AM script INFO: SUCCESS!@#KODE 1!@#USER_ID 12!@#ACTIVITY_CODE 5
12/23/2022 01:44:19 AM script INFO: berhasil-submit
12/23/2022 01:45:49 AM script ERROR: TIMEOUT EXCEPTION!@#KODE 0!@#LOCATION berhasil-submit
12/23/2022 01:45:49 AM main_worker ERROR: Message: None

