12/21/2022 02:29:40 PM script INFO: Prepared chrome options..
12/21/2022 02:29:41 PM script INFO: Initialized chrome browser..
12/21/2022 02:29:41 PM script INFO: mengakses-homepage
12/21/2022 02:30:20 PM script INFO: mengakses-login-page
12/21/2022 02:30:37 PM script INFO: mengakses-site-home
12/21/2022 02:30:37 PM script INFO: mengakses-site-course
12/21/2022 02:30:47 PM script INFO: mengakses-quiz
12/21/2022 02:30:48 PM script INFO: mengakses-start-quiz-page
12/21/2022 02:30:48 PM script INFO: memulai-quiz
12/21/2022 02:30:48 PM script INFO: SUCCESS!@#KODE 1!@#USER_ID 6!@#ACTIVITY_CODE 5
12/21/2022 02:30:59 PM script INFO: SUCCESS!@#KODE 1!@#USER_ID 6!@#ACTIVITY_CODE 1
12/21/2022 02:30:59 PM script INFO: SUCCESS!@#KODE 1!@#USER_ID 6!@#ACTIVITY_CODE 2
12/21/2022 02:30:59 PM script INFO: SUCCESS!@#KODE 1!@#USER_ID 6!@#ACTIVITY_CODE 3
12/21/2022 02:30:59 PM script INFO: SUCCESS!@#KODE 1!@#USER_ID 6!@#ACTIVITY_CODE 2
12/21/2022 02:31:00 PM script INFO: SUCCESS!@#KODE 1!@#USER_ID 6!@#ACTIVITY_CODE 2
12/21/2022 02:31:00 PM script INFO: SUCCESS!@#KODE 1!@#USER_ID 6!@#ACTIVITY_CODE 2
12/21/2022 02:31:00 PM script INFO: SUCCESS!@#KODE 1!@#USER_ID 6!@#ACTIVITY_CODE 1
12/21/2022 02:31:00 PM script INFO: SUCCESS!@#KODE 1!@#USER_ID 6!@#ACTIVITY_CODE 2
12/21/2022 02:31:00 PM script INFO: SUCCESS!@#KODE 1!@#USER_ID 6!@#ACTIVITY_CODE 5
12/21/2022 02:31:00 PM script INFO: SUCCESS!@#KODE 1!@#USER_ID 6!@#ACTIVITY_CODE 5
12/21/2022 02:31:02 PM script INFO: SUCCESS!@#KODE 1!@#USER_ID 6!@#ACTIVITY_CODE 3
12/21/2022 02:31:02 PM script INFO: SUCCESS!@#KODE 1!@#USER_ID 6!@#ACTIVITY_CODE 4
12/21/2022 02:31:02 PM script INFO: SUCCESS!@#KODE 1!@#USER_ID 6!@#ACTIVITY_CODE 5
12/21/2022 02:31:02 PM script INFO: SUCCESS!@#KODE 1!@#USER_ID 6!@#ACTIVITY_CODE 5
12/21/2022 02:31:05 PM script INFO: SUCCESS!@#KODE 1!@#USER_ID 6!@#ACTIVITY_CODE 5
12/21/2022 02:31:05 PM script INFO: SUCCESS!@#KODE 1!@#USER_ID 6!@#ACTIVITY_CODE 5
12/21/2022 02:31:07 PM script INFO: SUCCESS!@#KODE 1!@#USER_ID 6!@#ACTIVITY_CODE 5
12/21/2022 02:31:07 PM script INFO: SUCCESS!@#KODE 1!@#USER_ID 6!@#ACTIVITY_CODE 5
12/21/2022 02:31:10 PM script INFO: SUCCESS!@#KODE 1!@#USER_ID 6!@#ACTIVITY_CODE 1
12/21/2022 02:31:10 PM script INFO: SUCCESS!@#KODE 1!@#USER_ID 6!@#ACTIVITY_CODE 2
12/21/2022 02:31:10 PM script INFO: SUCCESS!@#KODE 1!@#USER_ID 6!@#ACTIVITY_CODE 1
12/21/2022 02:31:10 PM script INFO: SUCCESS!@#KODE 1!@#USER_ID 6!@#ACTIVITY_CODE 3
12/21/2022 02:31:10 PM script INFO: SUCCESS!@#KODE 1!@#USER_ID 6!@#ACTIVITY_CODE 3
12/21/2022 02:31:10 PM script INFO: SUCCESS!@#KODE 1!@#USER_ID 6!@#ACTIVITY_CODE 4
12/21/2022 02:31:10 PM script INFO: SUCCESS!@#KODE 1!@#USER_ID 6!@#ACTIVITY_CODE 5
12/21/2022 02:31:10 PM script INFO: SUCCESS!@#KODE 1!@#USER_ID 6!@#ACTIVITY_CODE 5
12/21/2022 02:31:13 PM script INFO: SUCCESS!@#KODE 1!@#USER_ID 6!@#ACTIVITY_CODE 2
12/21/2022 02:31:13 PM script INFO: SUCCESS!@#KODE 1!@#USER_ID 6!@#ACTIVITY_CODE 5
12/21/2022 02:31:13 PM script INFO: SUCCESS!@#KODE 1!@#USER_ID 6!@#ACTIVITY_CODE 5
12/21/2022 02:31:16 PM script INFO: SUCCESS!@#KODE 1!@#USER_ID 6!@#ACTIVITY_CODE 1
12/21/2022 02:31:16 PM script INFO: SUCCESS!@#KODE 1!@#USER_ID 6!@#ACTIVITY_CODE 2
12/21/2022 02:31:16 PM script INFO: SUCCESS!@#KODE 1!@#USER_ID 6!@#ACTIVITY_CODE 3
12/21/2022 02:31:16 PM script INFO: SUCCESS!@#KODE 1!@#USER_ID 6!@#ACTIVITY_CODE 1
12/21/2022 02:31:16 PM script INFO: SUCCESS!@#KODE 1!@#USER_ID 6!@#ACTIVITY_CODE 2
12/21/2022 02:31:16 PM script INFO: SUCCESS!@#KODE 1!@#USER_ID 6!@#ACTIVITY_CODE 2
12/21/2022 02:31:16 PM script INFO: SUCCESS!@#KODE 1!@#USER_ID 6!@#ACTIVITY_CODE 1
12/21/2022 02:31:16 PM script INFO: SUCCESS!@#KODE 1!@#USER_ID 6!@#ACTIVITY_CODE 4
12/21/2022 02:31:16 PM script INFO: SUCCESS!@#KODE 1!@#USER_ID 6!@#ACTIVITY_CODE 1
12/21/2022 02:31:16 PM script INFO: SUCCESS!@#KODE 1!@#USER_ID 6!@#ACTIVITY_CODE 3
12/21/2022 02:31:16 PM script INFO: SUCCESS!@#KODE 1!@#USER_ID 6!@#ACTIVITY_CODE 1
12/21/2022 02:31:16 PM script INFO: SUCCESS!@#KODE 1!@#USER_ID 6!@#ACTIVITY_CODE 4
12/21/2022 02:31:17 PM script INFO: SUCCESS!@#KODE 1!@#USER_ID 6!@#ACTIVITY_CODE 2
12/21/2022 02:31:17 PM script INFO: SUCCESS!@#KODE 1!@#USER_ID 6!@#ACTIVITY_CODE 1
12/21/2022 02:31:17 PM script INFO: SUCCESS!@#KODE 1!@#USER_ID 6!@#ACTIVITY_CODE 3
12/21/2022 02:31:17 PM script INFO: SUCCESS!@#KODE 1!@#USER_ID 6!@#ACTIVITY_CODE 3
12/21/2022 02:31:17 PM script INFO: SUCCESS!@#KODE 1!@#USER_ID 6!@#ACTIVITY_CODE 1
12/21/2022 02:31:17 PM script INFO: SUCCESS!@#KODE 1!@#USER_ID 6!@#ACTIVITY_CODE 4
12/21/2022 02:31:17 PM script INFO: SUCCESS!@#KODE 1!@#USER_ID 6!@#ACTIVITY_CODE 1
12/21/2022 02:31:17 PM script INFO: Duration: 17.835692882537842
12/21/2022 02:31:17 PM script INFO: mengakhiri-quiz
12/21/2022 02:31:17 PM script INFO: SUCCESS!@#KODE 1!@#USER_ID 6!@#ACTIVITY_CODE 5
12/21/2022 02:31:17 PM script INFO: berhasil-submit
