12/21/2022 02:41:06 PM script INFO: Prepared chrome options..
12/21/2022 02:41:07 PM script INFO: Initialized chrome browser..
12/21/2022 02:41:07 PM script INFO: mengakses-homepage
12/21/2022 02:41:27 PM script INFO: mengakses-login-page
12/21/2022 02:41:28 PM script INFO: mengakses-site-home
12/21/2022 02:41:28 PM script INFO: mengakses-site-course
12/21/2022 02:41:45 PM script INFO: mengakses-quiz
12/21/2022 02:42:00 PM script INFO: mengakses-start-quiz-page
12/21/2022 02:42:16 PM script INFO: memulai-quiz
12/21/2022 02:42:16 PM script INFO: SUCCESS!@#KODE 1!@#USER_ID 66!@#ACTIVITY_CODE 5
12/21/2022 02:42:27 PM script INFO: SUCCESS!@#KODE 1!@#USER_ID 66!@#ACTIVITY_CODE 3
12/21/2022 02:42:27 PM script INFO: SUCCESS!@#KODE 1!@#USER_ID 66!@#ACTIVITY_CODE 1
12/21/2022 02:42:27 PM script INFO: SUCCESS!@#KODE 1!@#USER_ID 66!@#ACTIVITY_CODE 2
12/21/2022 02:42:27 PM script INFO: SUCCESS!@#KODE 1!@#USER_ID 66!@#ACTIVITY_CODE 1
12/21/2022 02:42:28 PM script INFO: SUCCESS!@#KODE 1!@#USER_ID 66!@#ACTIVITY_CODE 4
12/21/2022 02:42:28 PM script INFO: SUCCESS!@#KODE 1!@#USER_ID 66!@#ACTIVITY_CODE 5
12/21/2022 02:42:28 PM script INFO: SUCCESS!@#KODE 1!@#USER_ID 66!@#ACTIVITY_CODE 5
12/21/2022 02:42:30 PM script INFO: SUCCESS!@#KODE 1!@#USER_ID 66!@#ACTIVITY_CODE 3
12/21/2022 02:42:30 PM script INFO: SUCCESS!@#KODE 1!@#USER_ID 66!@#ACTIVITY_CODE 5
12/21/2022 02:42:30 PM script INFO: SUCCESS!@#KODE 1!@#USER_ID 66!@#ACTIVITY_CODE 5
12/21/2022 02:42:33 PM script INFO: SUCCESS!@#KODE 1!@#USER_ID 66!@#ACTIVITY_CODE 3
12/21/2022 02:42:33 PM script INFO: SUCCESS!@#KODE 1!@#USER_ID 66!@#ACTIVITY_CODE 1
12/21/2022 02:42:33 PM script INFO: SUCCESS!@#KODE 1!@#USER_ID 66!@#ACTIVITY_CODE 3
12/21/2022 02:42:33 PM script INFO: SUCCESS!@#KODE 1!@#USER_ID 66!@#ACTIVITY_CODE 4
12/21/2022 02:42:33 PM script INFO: SUCCESS!@#KODE 1!@#USER_ID 66!@#ACTIVITY_CODE 2
12/21/2022 02:42:33 PM script INFO: SUCCESS!@#KODE 1!@#USER_ID 66!@#ACTIVITY_CODE 2
12/21/2022 02:42:33 PM script INFO: SUCCESS!@#KODE 1!@#USER_ID 66!@#ACTIVITY_CODE 1
12/21/2022 02:42:34 PM script INFO: SUCCESS!@#KODE 1!@#USER_ID 66!@#ACTIVITY_CODE 3
12/21/2022 02:42:34 PM script INFO: SUCCESS!@#KODE 1!@#USER_ID 66!@#ACTIVITY_CODE 1
12/21/2022 02:42:34 PM script INFO: SUCCESS!@#KODE 1!@#USER_ID 66!@#ACTIVITY_CODE 2
12/21/2022 02:42:34 PM script INFO: SUCCESS!@#KODE 1!@#USER_ID 66!@#ACTIVITY_CODE 1
12/21/2022 02:42:34 PM script INFO: SUCCESS!@#KODE 1!@#USER_ID 66!@#ACTIVITY_CODE 3
12/21/2022 02:42:34 PM script INFO: SUCCESS!@#KODE 1!@#USER_ID 66!@#ACTIVITY_CODE 1
12/21/2022 02:42:34 PM script INFO: SUCCESS!@#KODE 1!@#USER_ID 66!@#ACTIVITY_CODE 5
12/21/2022 02:42:34 PM script INFO: SUCCESS!@#KODE 1!@#USER_ID 66!@#ACTIVITY_CODE 5
12/21/2022 02:42:37 PM script INFO: SUCCESS!@#KODE 1!@#USER_ID 66!@#ACTIVITY_CODE 5
12/21/2022 02:42:37 PM script INFO: SUCCESS!@#KODE 1!@#USER_ID 66!@#ACTIVITY_CODE 5
12/21/2022 02:42:39 PM script INFO: SUCCESS!@#KODE 1!@#USER_ID 66!@#ACTIVITY_CODE 4
12/21/2022 02:42:39 PM script INFO: SUCCESS!@#KODE 1!@#USER_ID 66!@#ACTIVITY_CODE 3
12/21/2022 02:42:39 PM script INFO: SUCCESS!@#KODE 1!@#USER_ID 66!@#ACTIVITY_CODE 3
12/21/2022 02:42:40 PM script INFO: SUCCESS!@#KODE 1!@#USER_ID 66!@#ACTIVITY_CODE 2
12/21/2022 02:42:40 PM script INFO: SUCCESS!@#KODE 1!@#USER_ID 66!@#ACTIVITY_CODE 5
12/21/2022 02:42:40 PM script INFO: SUCCESS!@#KODE 1!@#USER_ID 66!@#ACTIVITY_CODE 5
12/21/2022 02:42:42 PM script INFO: SUCCESS!@#KODE 1!@#USER_ID 66!@#ACTIVITY_CODE 1
12/21/2022 02:42:42 PM script INFO: SUCCESS!@#KODE 1!@#USER_ID 66!@#ACTIVITY_CODE 5
12/21/2022 02:42:42 PM script INFO: SUCCESS!@#KODE 1!@#USER_ID 66!@#ACTIVITY_CODE 5
12/21/2022 02:42:45 PM script INFO: SUCCESS!@#KODE 1!@#USER_ID 66!@#ACTIVITY_CODE 2
12/21/2022 02:42:45 PM script INFO: SUCCESS!@#KODE 1!@#USER_ID 66!@#ACTIVITY_CODE 1
12/21/2022 02:42:45 PM script INFO: SUCCESS!@#KODE 1!@#USER_ID 66!@#ACTIVITY_CODE 1
12/21/2022 02:42:45 PM script INFO: SUCCESS!@#KODE 1!@#USER_ID 66!@#ACTIVITY_CODE 5
12/21/2022 02:42:45 PM script INFO: SUCCESS!@#KODE 1!@#USER_ID 66!@#ACTIVITY_CODE 5
12/21/2022 02:42:48 PM script INFO: SUCCESS!@#KODE 1!@#USER_ID 66!@#ACTIVITY_CODE 3
12/21/2022 02:42:48 PM script INFO: SUCCESS!@#KODE 1!@#USER_ID 66!@#ACTIVITY_CODE 5
12/21/2022 02:42:48 PM script INFO: SUCCESS!@#KODE 1!@#USER_ID 66!@#ACTIVITY_CODE 5
12/21/2022 02:42:51 PM script INFO: SUCCESS!@#KODE 1!@#USER_ID 66!@#ACTIVITY_CODE 2
12/21/2022 02:42:51 PM script INFO: SUCCESS!@#KODE 1!@#USER_ID 66!@#ACTIVITY_CODE 2
12/21/2022 02:42:51 PM script INFO: SUCCESS!@#KODE 1!@#USER_ID 66!@#ACTIVITY_CODE 4
12/21/2022 02:42:51 PM script INFO: SUCCESS!@#KODE 1!@#USER_ID 66!@#ACTIVITY_CODE 5
12/21/2022 02:42:51 PM script INFO: SUCCESS!@#KODE 1!@#USER_ID 66!@#ACTIVITY_CODE 5
12/21/2022 02:42:54 PM script INFO: SUCCESS!@#KODE 1!@#USER_ID 66!@#ACTIVITY_CODE 1
12/21/2022 02:42:54 PM script INFO: SUCCESS!@#KODE 1!@#USER_ID 66!@#ACTIVITY_CODE 2
12/21/2022 02:42:54 PM script INFO: SUCCESS!@#KODE 1!@#USER_ID 66!@#ACTIVITY_CODE 2
12/21/2022 02:42:54 PM script INFO: SUCCESS!@#KODE 1!@#USER_ID 66!@#ACTIVITY_CODE 1
12/21/2022 02:42:54 PM script INFO: SUCCESS!@#KODE 1!@#USER_ID 66!@#ACTIVITY_CODE 1
12/21/2022 02:42:55 PM script INFO: SUCCESS!@#KODE 1!@#USER_ID 66!@#ACTIVITY_CODE 3
12/21/2022 02:42:55 PM script INFO: SUCCESS!@#KODE 1!@#USER_ID 66!@#ACTIVITY_CODE 3
12/21/2022 02:42:55 PM script INFO: SUCCESS!@#KODE 1!@#USER_ID 66!@#ACTIVITY_CODE 2
12/21/2022 02:42:55 PM script INFO: SUCCESS!@#KODE 1!@#USER_ID 66!@#ACTIVITY_CODE 5
12/21/2022 02:42:55 PM script INFO: SUCCESS!@#KODE 1!@#USER_ID 66!@#ACTIVITY_CODE 5
12/21/2022 02:42:58 PM script INFO: SUCCESS!@#KODE 1!@#USER_ID 66!@#ACTIVITY_CODE 3
12/21/2022 02:42:58 PM script INFO: SUCCESS!@#KODE 1!@#USER_ID 66!@#ACTIVITY_CODE 1
12/21/2022 02:42:58 PM script INFO: SUCCESS!@#KODE 1!@#USER_ID 66!@#ACTIVITY_CODE 5
12/21/2022 02:42:58 PM script INFO: SUCCESS!@#KODE 1!@#USER_ID 66!@#ACTIVITY_CODE 5
12/21/2022 02:43:00 PM script INFO: SUCCESS!@#KODE 1!@#USER_ID 66!@#ACTIVITY_CODE 1
12/21/2022 02:43:00 PM script INFO: SUCCESS!@#KODE 1!@#USER_ID 66!@#ACTIVITY_CODE 1
12/21/2022 02:43:00 PM script INFO: SUCCESS!@#KODE 1!@#USER_ID 66!@#ACTIVITY_CODE 1
12/21/2022 02:43:00 PM script INFO: SUCCESS!@#KODE 1!@#USER_ID 66!@#ACTIVITY_CODE 1
12/21/2022 02:43:01 PM script INFO: SUCCESS!@#KODE 1!@#USER_ID 66!@#ACTIVITY_CODE 2
12/21/2022 02:43:01 PM script INFO: SUCCESS!@#KODE 1!@#USER_ID 66!@#ACTIVITY_CODE 2
12/21/2022 02:43:01 PM script INFO: SUCCESS!@#KODE 1!@#USER_ID 66!@#ACTIVITY_CODE 5
12/21/2022 02:43:01 PM script INFO: SUCCESS!@#KODE 1!@#USER_ID 66!@#ACTIVITY_CODE 5
12/21/2022 02:43:03 PM script INFO: SUCCESS!@#KODE 1!@#USER_ID 66!@#ACTIVITY_CODE 1
12/21/2022 02:43:03 PM script INFO: SUCCESS!@#KODE 1!@#USER_ID 66!@#ACTIVITY_CODE 1
12/21/2022 02:43:03 PM script INFO: SUCCESS!@#KODE 1!@#USER_ID 66!@#ACTIVITY_CODE 3
12/21/2022 02:43:04 PM script INFO: SUCCESS!@#KODE 1!@#USER_ID 66!@#ACTIVITY_CODE 3
12/21/2022 02:43:04 PM script INFO: SUCCESS!@#KODE 1!@#USER_ID 66!@#ACTIVITY_CODE 3
12/21/2022 02:43:04 PM script INFO: SUCCESS!@#KODE 1!@#USER_ID 66!@#ACTIVITY_CODE 4
12/21/2022 02:43:04 PM script INFO: SUCCESS!@#KODE 1!@#USER_ID 66!@#ACTIVITY_CODE 1
12/21/2022 02:43:04 PM script INFO: SUCCESS!@#KODE 1!@#USER_ID 66!@#ACTIVITY_CODE 1
12/21/2022 02:43:04 PM script INFO: SUCCESS!@#KODE 1!@#USER_ID 66!@#ACTIVITY_CODE 5
12/21/2022 02:43:04 PM script INFO: SUCCESS!@#KODE 1!@#USER_ID 66!@#ACTIVITY_CODE 5
12/21/2022 02:43:06 PM script INFO: SUCCESS!@#KODE 1!@#USER_ID 66!@#ACTIVITY_CODE 5
12/21/2022 02:43:06 PM script INFO: SUCCESS!@#KODE 1!@#USER_ID 66!@#ACTIVITY_CODE 5
12/21/2022 02:43:09 PM script INFO: SUCCESS!@#KODE 1!@#USER_ID 66!@#ACTIVITY_CODE 4
12/21/2022 02:43:09 PM script INFO: SUCCESS!@#KODE 1!@#USER_ID 66!@#ACTIVITY_CODE 5
12/21/2022 02:43:09 PM script INFO: SUCCESS!@#KODE 1!@#USER_ID 66!@#ACTIVITY_CODE 5
12/21/2022 02:43:11 PM script INFO: SUCCESS!@#KODE 1!@#USER_ID 66!@#ACTIVITY_CODE 5
12/21/2022 02:43:11 PM script INFO: SUCCESS!@#KODE 1!@#USER_ID 66!@#ACTIVITY_CODE 5
12/21/2022 02:43:14 PM script INFO: SUCCESS!@#KODE 1!@#USER_ID 66!@#ACTIVITY_CODE 3
12/21/2022 02:43:14 PM script INFO: SUCCESS!@#KODE 1!@#USER_ID 66!@#ACTIVITY_CODE 1
12/21/2022 02:43:14 PM script INFO: SUCCESS!@#KODE 1!@#USER_ID 66!@#ACTIVITY_CODE 4
12/21/2022 02:43:14 PM script INFO: SUCCESS!@#KODE 1!@#USER_ID 66!@#ACTIVITY_CODE 3
12/21/2022 02:43:14 PM script INFO: SUCCESS!@#KODE 1!@#USER_ID 66!@#ACTIVITY_CODE 2
12/21/2022 02:43:14 PM script INFO: SUCCESS!@#KODE 1!@#USER_ID 66!@#ACTIVITY_CODE 2
12/21/2022 02:43:14 PM script INFO: SUCCESS!@#KODE 1!@#USER_ID 66!@#ACTIVITY_CODE 2
12/21/2022 02:43:15 PM script INFO: SUCCESS!@#KODE 1!@#USER_ID 66!@#ACTIVITY_CODE 2
12/21/2022 02:43:15 PM script INFO: SUCCESS!@#KODE 1!@#USER_ID 66!@#ACTIVITY_CODE 4
12/21/2022 02:43:15 PM script INFO: SUCCESS!@#KODE 1!@#USER_ID 66!@#ACTIVITY_CODE 3
12/21/2022 02:43:15 PM script INFO: SUCCESS!@#KODE 1!@#USER_ID 66!@#ACTIVITY_CODE 2
12/21/2022 02:43:15 PM script INFO: SUCCESS!@#KODE 1!@#USER_ID 66!@#ACTIVITY_CODE 1
12/21/2022 02:43:15 PM script INFO: SUCCESS!@#KODE 1!@#USER_ID 66!@#ACTIVITY_CODE 2
12/21/2022 02:43:15 PM script INFO: SUCCESS!@#KODE 1!@#USER_ID 66!@#ACTIVITY_CODE 1
12/21/2022 02:43:15 PM script INFO: SUCCESS!@#KODE 1!@#USER_ID 66!@#ACTIVITY_CODE 3
12/21/2022 02:43:15 PM script INFO: SUCCESS!@#KODE 1!@#USER_ID 66!@#ACTIVITY_CODE 2
12/21/2022 02:43:15 PM script INFO: SUCCESS!@#KODE 1!@#USER_ID 66!@#ACTIVITY_CODE 3
12/21/2022 02:43:15 PM script INFO: SUCCESS!@#KODE 1!@#USER_ID 66!@#ACTIVITY_CODE 3
12/21/2022 02:43:15 PM script INFO: SUCCESS!@#KODE 1!@#USER_ID 66!@#ACTIVITY_CODE 1
12/21/2022 02:43:16 PM script INFO: SUCCESS!@#KODE 1!@#USER_ID 66!@#ACTIVITY_CODE 2
12/21/2022 02:43:16 PM script INFO: SUCCESS!@#KODE 1!@#USER_ID 66!@#ACTIVITY_CODE 3
12/21/2022 02:43:16 PM script INFO: SUCCESS!@#KODE 1!@#USER_ID 66!@#ACTIVITY_CODE 4
12/21/2022 02:43:16 PM script INFO: SUCCESS!@#KODE 1!@#USER_ID 66!@#ACTIVITY_CODE 3
12/21/2022 02:43:16 PM script INFO: SUCCESS!@#KODE 1!@#USER_ID 66!@#ACTIVITY_CODE 2
12/21/2022 02:43:16 PM script INFO: SUCCESS!@#KODE 1!@#USER_ID 66!@#ACTIVITY_CODE 3
12/21/2022 02:43:16 PM script INFO: SUCCESS!@#KODE 1!@#USER_ID 66!@#ACTIVITY_CODE 4
12/21/2022 02:43:16 PM script INFO: SUCCESS!@#KODE 1!@#USER_ID 66!@#ACTIVITY_CODE 3
12/21/2022 02:43:16 PM script INFO: SUCCESS!@#KODE 1!@#USER_ID 66!@#ACTIVITY_CODE 1
12/21/2022 02:43:16 PM script INFO: SUCCESS!@#KODE 1!@#USER_ID 66!@#ACTIVITY_CODE 4
12/21/2022 02:43:16 PM script INFO: SUCCESS!@#KODE 1!@#USER_ID 66!@#ACTIVITY_CODE 3
12/21/2022 02:43:16 PM script INFO: SUCCESS!@#KODE 1!@#USER_ID 66!@#ACTIVITY_CODE 3
12/21/2022 02:43:16 PM script INFO: SUCCESS!@#KODE 1!@#USER_ID 66!@#ACTIVITY_CODE 2
12/21/2022 02:43:16 PM script INFO: SUCCESS!@#KODE 1!@#USER_ID 66!@#ACTIVITY_CODE 1
12/21/2022 02:43:17 PM script INFO: SUCCESS!@#KODE 1!@#USER_ID 66!@#ACTIVITY_CODE 3
12/21/2022 02:43:17 PM script INFO: SUCCESS!@#KODE 1!@#USER_ID 66!@#ACTIVITY_CODE 1
12/21/2022 02:43:17 PM script INFO: SUCCESS!@#KODE 1!@#USER_ID 66!@#ACTIVITY_CODE 4
12/21/2022 02:43:17 PM script INFO: SUCCESS!@#KODE 1!@#USER_ID 66!@#ACTIVITY_CODE 1
12/21/2022 02:43:17 PM script INFO: SUCCESS!@#KODE 1!@#USER_ID 66!@#ACTIVITY_CODE 3
12/21/2022 02:43:17 PM script INFO: SUCCESS!@#KODE 1!@#USER_ID 66!@#ACTIVITY_CODE 1
12/21/2022 02:43:17 PM script INFO: SUCCESS!@#KODE 1!@#USER_ID 66!@#ACTIVITY_CODE 1
12/21/2022 02:43:17 PM script INFO: SUCCESS!@#KODE 1!@#USER_ID 66!@#ACTIVITY_CODE 4
12/21/2022 02:43:17 PM script INFO: SUCCESS!@#KODE 1!@#USER_ID 66!@#ACTIVITY_CODE 3
12/21/2022 02:43:17 PM script INFO: SUCCESS!@#KODE 1!@#USER_ID 66!@#ACTIVITY_CODE 3
12/21/2022 02:43:17 PM script INFO: SUCCESS!@#KODE 1!@#USER_ID 66!@#ACTIVITY_CODE 1
12/21/2022 02:43:17 PM script INFO: SUCCESS!@#KODE 1!@#USER_ID 66!@#ACTIVITY_CODE 1
12/21/2022 02:43:17 PM script INFO: SUCCESS!@#KODE 1!@#USER_ID 66!@#ACTIVITY_CODE 4
12/21/2022 02:43:17 PM script INFO: SUCCESS!@#KODE 1!@#USER_ID 66!@#ACTIVITY_CODE 1
12/21/2022 02:43:17 PM script INFO: SUCCESS!@#KODE 1!@#USER_ID 66!@#ACTIVITY_CODE 1
12/21/2022 02:43:17 PM script INFO: SUCCESS!@#KODE 1!@#USER_ID 66!@#ACTIVITY_CODE 4
12/21/2022 02:43:17 PM script INFO: SUCCESS!@#KODE 1!@#USER_ID 66!@#ACTIVITY_CODE 1
12/21/2022 02:43:17 PM script INFO: SUCCESS!@#KODE 1!@#USER_ID 66!@#ACTIVITY_CODE 2
12/21/2022 02:43:18 PM script INFO: SUCCESS!@#KODE 1!@#USER_ID 66!@#ACTIVITY_CODE 3
12/21/2022 02:43:18 PM script INFO: SUCCESS!@#KODE 1!@#USER_ID 66!@#ACTIVITY_CODE 1
12/21/2022 02:43:18 PM script INFO: SUCCESS!@#KODE 1!@#USER_ID 66!@#ACTIVITY_CODE 3
12/21/2022 02:43:18 PM script INFO: SUCCESS!@#KODE 1!@#USER_ID 66!@#ACTIVITY_CODE 1
12/21/2022 02:43:18 PM script INFO: SUCCESS!@#KODE 1!@#USER_ID 66!@#ACTIVITY_CODE 3
12/21/2022 02:43:18 PM script INFO: SUCCESS!@#KODE 1!@#USER_ID 66!@#ACTIVITY_CODE 1
12/21/2022 02:43:18 PM script INFO: SUCCESS!@#KODE 1!@#USER_ID 66!@#ACTIVITY_CODE 1
12/21/2022 02:43:18 PM script INFO: SUCCESS!@#KODE 1!@#USER_ID 66!@#ACTIVITY_CODE 1
12/21/2022 02:43:18 PM script INFO: SUCCESS!@#KODE 1!@#USER_ID 66!@#ACTIVITY_CODE 2
12/21/2022 02:43:18 PM script INFO: SUCCESS!@#KODE 1!@#USER_ID 66!@#ACTIVITY_CODE 2
12/21/2022 02:43:18 PM script INFO: SUCCESS!@#KODE 1!@#USER_ID 66!@#ACTIVITY_CODE 3
12/21/2022 02:43:18 PM script INFO: SUCCESS!@#KODE 1!@#USER_ID 66!@#ACTIVITY_CODE 3
12/21/2022 02:43:18 PM script INFO: SUCCESS!@#KODE 1!@#USER_ID 66!@#ACTIVITY_CODE 2
12/21/2022 02:43:18 PM script INFO: SUCCESS!@#KODE 1!@#USER_ID 66!@#ACTIVITY_CODE 2
12/21/2022 02:43:19 PM script INFO: SUCCESS!@#KODE 1!@#USER_ID 66!@#ACTIVITY_CODE 2
12/21/2022 02:43:19 PM script INFO: SUCCESS!@#KODE 1!@#USER_ID 66!@#ACTIVITY_CODE 1
12/21/2022 02:43:19 PM script INFO: SUCCESS!@#KODE 1!@#USER_ID 66!@#ACTIVITY_CODE 3
12/21/2022 02:43:19 PM script INFO: SUCCESS!@#KODE 1!@#USER_ID 66!@#ACTIVITY_CODE 4
12/21/2022 02:43:19 PM script INFO: SUCCESS!@#KODE 1!@#USER_ID 66!@#ACTIVITY_CODE 1
12/21/2022 02:43:19 PM script INFO: SUCCESS!@#KODE 1!@#USER_ID 66!@#ACTIVITY_CODE 1
12/21/2022 02:43:19 PM script INFO: SUCCESS!@#KODE 1!@#USER_ID 66!@#ACTIVITY_CODE 4
12/21/2022 02:43:19 PM script INFO: SUCCESS!@#KODE 1!@#USER_ID 66!@#ACTIVITY_CODE 3
12/21/2022 02:43:19 PM script INFO: SUCCESS!@#KODE 1!@#USER_ID 66!@#ACTIVITY_CODE 2
12/21/2022 02:43:19 PM script INFO: SUCCESS!@#KODE 1!@#USER_ID 66!@#ACTIVITY_CODE 2
12/21/2022 02:43:19 PM script INFO: SUCCESS!@#KODE 1!@#USER_ID 66!@#ACTIVITY_CODE 3
12/21/2022 02:43:19 PM script INFO: SUCCESS!@#KODE 1!@#USER_ID 66!@#ACTIVITY_CODE 2
12/21/2022 02:43:19 PM script INFO: SUCCESS!@#KODE 1!@#USER_ID 66!@#ACTIVITY_CODE 2
12/21/2022 02:43:19 PM script INFO: SUCCESS!@#KODE 1!@#USER_ID 66!@#ACTIVITY_CODE 1
12/21/2022 02:43:19 PM script INFO: SUCCESS!@#KODE 1!@#USER_ID 66!@#ACTIVITY_CODE 3
12/21/2022 02:43:19 PM script INFO: SUCCESS!@#KODE 1!@#USER_ID 66!@#ACTIVITY_CODE 1
12/21/2022 02:43:20 PM script INFO: SUCCESS!@#KODE 1!@#USER_ID 66!@#ACTIVITY_CODE 4
12/21/2022 02:43:20 PM script INFO: SUCCESS!@#KODE 1!@#USER_ID 66!@#ACTIVITY_CODE 1
12/21/2022 02:43:20 PM script INFO: SUCCESS!@#KODE 1!@#USER_ID 66!@#ACTIVITY_CODE 3
12/21/2022 02:43:20 PM script INFO: SUCCESS!@#KODE 1!@#USER_ID 66!@#ACTIVITY_CODE 4
12/21/2022 02:43:20 PM script INFO: SUCCESS!@#KODE 1!@#USER_ID 66!@#ACTIVITY_CODE 2
12/21/2022 02:43:20 PM script INFO: SUCCESS!@#KODE 1!@#USER_ID 66!@#ACTIVITY_CODE 3
12/21/2022 02:43:20 PM script INFO: SUCCESS!@#KODE 1!@#USER_ID 66!@#ACTIVITY_CODE 2
12/21/2022 02:43:20 PM script INFO: SUCCESS!@#KODE 1!@#USER_ID 66!@#ACTIVITY_CODE 2
12/21/2022 02:43:20 PM script INFO: SUCCESS!@#KODE 1!@#USER_ID 66!@#ACTIVITY_CODE 2
12/21/2022 02:43:20 PM script INFO: SUCCESS!@#KODE 1!@#USER_ID 66!@#ACTIVITY_CODE 3
12/21/2022 02:43:20 PM script INFO: SUCCESS!@#KODE 1!@#USER_ID 66!@#ACTIVITY_CODE 3
12/21/2022 02:43:20 PM script INFO: SUCCESS!@#KODE 1!@#USER_ID 66!@#ACTIVITY_CODE 2
12/21/2022 02:43:20 PM script INFO: SUCCESS!@#KODE 1!@#USER_ID 66!@#ACTIVITY_CODE 3
12/21/2022 02:43:21 PM script INFO: SUCCESS!@#KODE 1!@#USER_ID 66!@#ACTIVITY_CODE 1
12/21/2022 02:43:21 PM script INFO: SUCCESS!@#KODE 1!@#USER_ID 66!@#ACTIVITY_CODE 1
12/21/2022 02:43:21 PM script INFO: SUCCESS!@#KODE 1!@#USER_ID 66!@#ACTIVITY_CODE 1
12/21/2022 02:43:21 PM script INFO: SUCCESS!@#KODE 1!@#USER_ID 66!@#ACTIVITY_CODE 1
12/21/2022 02:43:21 PM script INFO: SUCCESS!@#KODE 1!@#USER_ID 66!@#ACTIVITY_CODE 2
12/21/2022 02:43:21 PM script INFO: SUCCESS!@#KODE 1!@#USER_ID 66!@#ACTIVITY_CODE 1
12/21/2022 02:43:21 PM script INFO: SUCCESS!@#KODE 1!@#USER_ID 66!@#ACTIVITY_CODE 3
12/21/2022 02:43:21 PM script INFO: SUCCESS!@#KODE 1!@#USER_ID 66!@#ACTIVITY_CODE 3
12/21/2022 02:43:21 PM script INFO: SUCCESS!@#KODE 1!@#USER_ID 66!@#ACTIVITY_CODE 1
12/21/2022 02:43:21 PM script INFO: SUCCESS!@#KODE 1!@#USER_ID 66!@#ACTIVITY_CODE 1
12/21/2022 02:43:21 PM script INFO: SUCCESS!@#KODE 1!@#USER_ID 66!@#ACTIVITY_CODE 1
12/21/2022 02:43:21 PM script INFO: SUCCESS!@#KODE 1!@#USER_ID 66!@#ACTIVITY_CODE 1
12/21/2022 02:43:21 PM script INFO: SUCCESS!@#KODE 1!@#USER_ID 66!@#ACTIVITY_CODE 1
12/21/2022 02:43:21 PM script INFO: SUCCESS!@#KODE 1!@#USER_ID 66!@#ACTIVITY_CODE 1
12/21/2022 02:43:21 PM script INFO: SUCCESS!@#KODE 1!@#USER_ID 66!@#ACTIVITY_CODE 1
12/21/2022 02:43:21 PM script INFO: SUCCESS!@#KODE 1!@#USER_ID 66!@#ACTIVITY_CODE 2
12/21/2022 02:43:21 PM script INFO: SUCCESS!@#KODE 1!@#USER_ID 66!@#ACTIVITY_CODE 1
12/21/2022 02:43:21 PM script INFO: SUCCESS!@#KODE 1!@#USER_ID 66!@#ACTIVITY_CODE 3
12/21/2022 02:43:21 PM script INFO: SUCCESS!@#KODE 1!@#USER_ID 66!@#ACTIVITY_CODE 1
12/21/2022 02:43:21 PM script INFO: SUCCESS!@#KODE 1!@#USER_ID 66!@#ACTIVITY_CODE 3
12/21/2022 02:43:21 PM script INFO: SUCCESS!@#KODE 1!@#USER_ID 66!@#ACTIVITY_CODE 1
12/21/2022 02:43:22 PM script INFO: SUCCESS!@#KODE 1!@#USER_ID 66!@#ACTIVITY_CODE 2
12/21/2022 02:43:22 PM script INFO: SUCCESS!@#KODE 1!@#USER_ID 66!@#ACTIVITY_CODE 3
12/21/2022 02:43:22 PM script INFO: SUCCESS!@#KODE 1!@#USER_ID 66!@#ACTIVITY_CODE 3
12/21/2022 02:43:22 PM script INFO: SUCCESS!@#KODE 1!@#USER_ID 66!@#ACTIVITY_CODE 1
12/21/2022 02:43:22 PM script INFO: SUCCESS!@#KODE 1!@#USER_ID 66!@#ACTIVITY_CODE 4
12/21/2022 02:43:22 PM script INFO: SUCCESS!@#KODE 1!@#USER_ID 66!@#ACTIVITY_CODE 1
12/21/2022 02:43:22 PM script INFO: SUCCESS!@#KODE 1!@#USER_ID 66!@#ACTIVITY_CODE 1
12/21/2022 02:43:22 PM script INFO: SUCCESS!@#KODE 1!@#USER_ID 66!@#ACTIVITY_CODE 2
12/21/2022 02:43:22 PM script INFO: SUCCESS!@#KODE 1!@#USER_ID 66!@#ACTIVITY_CODE 3
12/21/2022 02:43:22 PM script INFO: SUCCESS!@#KODE 1!@#USER_ID 66!@#ACTIVITY_CODE 2
12/21/2022 02:43:22 PM script INFO: SUCCESS!@#KODE 1!@#USER_ID 66!@#ACTIVITY_CODE 4
12/21/2022 02:43:22 PM script INFO: SUCCESS!@#KODE 1!@#USER_ID 66!@#ACTIVITY_CODE 2
12/21/2022 02:43:22 PM script INFO: SUCCESS!@#KODE 1!@#USER_ID 66!@#ACTIVITY_CODE 3
12/21/2022 02:43:22 PM script INFO: SUCCESS!@#KODE 1!@#USER_ID 66!@#ACTIVITY_CODE 1
12/21/2022 02:43:22 PM script INFO: SUCCESS!@#KODE 1!@#USER_ID 66!@#ACTIVITY_CODE 1
12/21/2022 02:43:22 PM script INFO: SUCCESS!@#KODE 1!@#USER_ID 66!@#ACTIVITY_CODE 2
12/21/2022 02:43:23 PM script INFO: SUCCESS!@#KODE 1!@#USER_ID 66!@#ACTIVITY_CODE 1
12/21/2022 02:43:23 PM script INFO: SUCCESS!@#KODE 1!@#USER_ID 66!@#ACTIVITY_CODE 3
12/21/2022 02:43:23 PM script INFO: SUCCESS!@#KODE 1!@#USER_ID 66!@#ACTIVITY_CODE 1
12/21/2022 02:43:23 PM script INFO: SUCCESS!@#KODE 1!@#USER_ID 66!@#ACTIVITY_CODE 2
12/21/2022 02:43:23 PM script INFO: SUCCESS!@#KODE 1!@#USER_ID 66!@#ACTIVITY_CODE 3
12/21/2022 02:43:23 PM script INFO: SUCCESS!@#KODE 1!@#USER_ID 66!@#ACTIVITY_CODE 1
12/21/2022 02:43:23 PM script INFO: SUCCESS!@#KODE 1!@#USER_ID 66!@#ACTIVITY_CODE 4
12/21/2022 02:43:23 PM script INFO: SUCCESS!@#KODE 1!@#USER_ID 66!@#ACTIVITY_CODE 1
12/21/2022 02:43:23 PM script INFO: SUCCESS!@#KODE 1!@#USER_ID 66!@#ACTIVITY_CODE 4
12/21/2022 02:43:23 PM script INFO: SUCCESS!@#KODE 1!@#USER_ID 66!@#ACTIVITY_CODE 2
12/21/2022 02:43:23 PM script INFO: SUCCESS!@#KODE 1!@#USER_ID 66!@#ACTIVITY_CODE 3
12/21/2022 02:43:23 PM script INFO: SUCCESS!@#KODE 1!@#USER_ID 66!@#ACTIVITY_CODE 4
12/21/2022 02:43:23 PM script INFO: SUCCESS!@#KODE 1!@#USER_ID 66!@#ACTIVITY_CODE 3
12/21/2022 02:43:23 PM script INFO: SUCCESS!@#KODE 1!@#USER_ID 66!@#ACTIVITY_CODE 2
12/21/2022 02:43:23 PM script INFO: SUCCESS!@#KODE 1!@#USER_ID 66!@#ACTIVITY_CODE 3
12/21/2022 02:43:24 PM script INFO: SUCCESS!@#KODE 1!@#USER_ID 66!@#ACTIVITY_CODE 2
12/21/2022 02:43:24 PM script INFO: SUCCESS!@#KODE 1!@#USER_ID 66!@#ACTIVITY_CODE 1
12/21/2022 02:43:24 PM script INFO: SUCCESS!@#KODE 1!@#USER_ID 66!@#ACTIVITY_CODE 2
12/21/2022 02:43:24 PM script INFO: SUCCESS!@#KODE 1!@#USER_ID 66!@#ACTIVITY_CODE 3
12/21/2022 02:43:24 PM script INFO: SUCCESS!@#KODE 1!@#USER_ID 66!@#ACTIVITY_CODE 1
12/21/2022 02:43:24 PM script INFO: SUCCESS!@#KODE 1!@#USER_ID 66!@#ACTIVITY_CODE 1
12/21/2022 02:43:24 PM script INFO: SUCCESS!@#KODE 1!@#USER_ID 66!@#ACTIVITY_CODE 2
12/21/2022 02:43:24 PM script INFO: SUCCESS!@#KODE 1!@#USER_ID 66!@#ACTIVITY_CODE 3
12/21/2022 02:43:24 PM script INFO: SUCCESS!@#KODE 1!@#USER_ID 66!@#ACTIVITY_CODE 3
12/21/2022 02:43:24 PM script INFO: SUCCESS!@#KODE 1!@#USER_ID 66!@#ACTIVITY_CODE 3
12/21/2022 02:43:24 PM script INFO: SUCCESS!@#KODE 1!@#USER_ID 66!@#ACTIVITY_CODE 2
12/21/2022 02:43:24 PM script INFO: SUCCESS!@#KODE 1!@#USER_ID 66!@#ACTIVITY_CODE 2
12/21/2022 02:43:24 PM script INFO: SUCCESS!@#KODE 1!@#USER_ID 66!@#ACTIVITY_CODE 3
12/21/2022 02:43:24 PM script INFO: SUCCESS!@#KODE 1!@#USER_ID 66!@#ACTIVITY_CODE 2
12/21/2022 02:43:24 PM script INFO: Duration: 57.28953528404236
12/21/2022 02:43:24 PM script INFO: mengakhiri-quiz
12/21/2022 02:43:27 PM script INFO: SUCCESS!@#KODE 1!@#USER_ID 66!@#ACTIVITY_CODE 5
12/21/2022 02:43:27 PM script INFO: berhasil-submit
