12/23/2022 01:40:09 AM script INFO: Prepared chrome options..
12/23/2022 01:40:11 AM script INFO: Initialized chrome browser..
12/23/2022 01:40:11 AM script INFO: mengakses-homepage
12/23/2022 01:41:31 AM script INFO: mengakses-login-page
12/23/2022 01:42:04 AM script INFO: mengakses-site-home
12/23/2022 01:42:11 AM script INFO: mengakses-site-course
12/23/2022 01:42:36 AM script INFO: mengakses-quiz
12/23/2022 01:42:45 AM script INFO: mengakses-start-quiz-page
12/23/2022 01:43:07 AM script INFO: memulai-quiz
12/23/2022 01:43:07 AM script INFO: SUCCESS!@#KODE 1!@#USER_ID 95!@#ACTIVITY_CODE 5
12/23/2022 01:43:18 AM script INFO: SUCCESS!@#KODE 1!@#USER_ID 95!@#ACTIVITY_CODE 2
12/23/2022 01:43:18 AM script INFO: SUCCESS!@#KODE 1!@#USER_ID 95!@#ACTIVITY_CODE 5
12/23/2022 01:43:18 AM script INFO: SUCCESS!@#KODE 1!@#USER_ID 95!@#ACTIVITY_CODE 5
12/23/2022 01:43:20 AM script INFO: SUCCESS!@#KODE 1!@#USER_ID 95!@#ACTIVITY_CODE 1
12/23/2022 01:43:20 AM script INFO: SUCCESS!@#KODE 1!@#USER_ID 95!@#ACTIVITY_CODE 4
12/23/2022 01:43:20 AM script INFO: SUCCESS!@#KODE 1!@#USER_ID 95!@#ACTIVITY_CODE 3
12/23/2022 01:43:20 AM script INFO: SUCCESS!@#KODE 1!@#USER_ID 95!@#ACTIVITY_CODE 5
12/23/2022 01:43:20 AM script INFO: SUCCESS!@#KODE 1!@#USER_ID 95!@#ACTIVITY_CODE 5
12/23/2022 01:43:23 AM script INFO: SUCCESS!@#KODE 1!@#USER_ID 95!@#ACTIVITY_CODE 3
12/23/2022 01:43:23 AM script INFO: SUCCESS!@#KODE 1!@#USER_ID 95!@#ACTIVITY_CODE 3
12/23/2022 01:43:23 AM script INFO: SUCCESS!@#KODE 1!@#USER_ID 95!@#ACTIVITY_CODE 3
12/23/2022 01:43:23 AM script INFO: SUCCESS!@#KODE 1!@#USER_ID 95!@#ACTIVITY_CODE 3
12/23/2022 01:43:23 AM script INFO: SUCCESS!@#KODE 1!@#USER_ID 95!@#ACTIVITY_CODE 2
12/23/2022 01:43:23 AM script INFO: SUCCESS!@#KODE 1!@#USER_ID 95!@#ACTIVITY_CODE 3
12/23/2022 01:43:23 AM script INFO: SUCCESS!@#KODE 1!@#USER_ID 95!@#ACTIVITY_CODE 2
12/23/2022 01:43:23 AM script INFO: SUCCESS!@#KODE 1!@#USER_ID 95!@#ACTIVITY_CODE 2
12/23/2022 01:43:24 AM script INFO: SUCCESS!@#KODE 1!@#USER_ID 95!@#ACTIVITY_CODE 1
12/23/2022 01:43:24 AM script INFO: SUCCESS!@#KODE 1!@#USER_ID 95!@#ACTIVITY_CODE 2
12/23/2022 01:43:24 AM script INFO: SUCCESS!@#KODE 1!@#USER_ID 95!@#ACTIVITY_CODE 2
12/23/2022 01:43:24 AM script INFO: SUCCESS!@#KODE 1!@#USER_ID 95!@#ACTIVITY_CODE 1
12/23/2022 01:43:24 AM script INFO: SUCCESS!@#KODE 1!@#USER_ID 95!@#ACTIVITY_CODE 2
12/23/2022 01:43:24 AM script INFO: SUCCESS!@#KODE 1!@#USER_ID 95!@#ACTIVITY_CODE 3
12/23/2022 01:43:24 AM script INFO: SUCCESS!@#KODE 1!@#USER_ID 95!@#ACTIVITY_CODE 3
12/23/2022 01:43:24 AM script INFO: SUCCESS!@#KODE 1!@#USER_ID 95!@#ACTIVITY_CODE 5
12/23/2022 01:43:24 AM script INFO: SUCCESS!@#KODE 1!@#USER_ID 95!@#ACTIVITY_CODE 5
12/23/2022 01:43:27 AM script INFO: SUCCESS!@#KODE 1!@#USER_ID 95!@#ACTIVITY_CODE 3
12/23/2022 01:43:27 AM script INFO: SUCCESS!@#KODE 1!@#USER_ID 95!@#ACTIVITY_CODE 5
12/23/2022 01:43:27 AM script INFO: SUCCESS!@#KODE 1!@#USER_ID 95!@#ACTIVITY_CODE 5
12/23/2022 01:43:29 AM script INFO: SUCCESS!@#KODE 1!@#USER_ID 95!@#ACTIVITY_CODE 3
12/23/2022 01:43:29 AM script INFO: SUCCESS!@#KODE 1!@#USER_ID 95!@#ACTIVITY_CODE 5
12/23/2022 01:43:29 AM script INFO: SUCCESS!@#KODE 1!@#USER_ID 95!@#ACTIVITY_CODE 5
12/23/2022 01:43:32 AM script INFO: SUCCESS!@#KODE 1!@#USER_ID 95!@#ACTIVITY_CODE 3
12/23/2022 01:43:32 AM script INFO: SUCCESS!@#KODE 1!@#USER_ID 95!@#ACTIVITY_CODE 1
12/23/2022 01:43:32 AM script INFO: SUCCESS!@#KODE 1!@#USER_ID 95!@#ACTIVITY_CODE 1
12/23/2022 01:43:32 AM script INFO: SUCCESS!@#KODE 1!@#USER_ID 95!@#ACTIVITY_CODE 2
12/23/2022 01:43:32 AM script INFO: SUCCESS!@#KODE 1!@#USER_ID 95!@#ACTIVITY_CODE 2
12/23/2022 01:43:32 AM script INFO: SUCCESS!@#KODE 1!@#USER_ID 95!@#ACTIVITY_CODE 2
12/23/2022 01:43:32 AM script INFO: SUCCESS!@#KODE 1!@#USER_ID 95!@#ACTIVITY_CODE 2
12/23/2022 01:43:32 AM script INFO: SUCCESS!@#KODE 1!@#USER_ID 95!@#ACTIVITY_CODE 5
12/23/2022 01:43:32 AM script INFO: SUCCESS!@#KODE 1!@#USER_ID 95!@#ACTIVITY_CODE 5
12/23/2022 01:43:35 AM script INFO: SUCCESS!@#KODE 1!@#USER_ID 95!@#ACTIVITY_CODE 3
12/23/2022 01:43:35 AM script INFO: SUCCESS!@#KODE 1!@#USER_ID 95!@#ACTIVITY_CODE 3
12/23/2022 01:43:35 AM script INFO: SUCCESS!@#KODE 1!@#USER_ID 95!@#ACTIVITY_CODE 2
12/23/2022 01:43:35 AM script INFO: SUCCESS!@#KODE 1!@#USER_ID 95!@#ACTIVITY_CODE 4
12/23/2022 01:43:35 AM script INFO: SUCCESS!@#KODE 1!@#USER_ID 95!@#ACTIVITY_CODE 1
12/23/2022 01:43:35 AM script INFO: SUCCESS!@#KODE 1!@#USER_ID 95!@#ACTIVITY_CODE 1
12/23/2022 01:43:35 AM script INFO: SUCCESS!@#KODE 1!@#USER_ID 95!@#ACTIVITY_CODE 3
12/23/2022 01:43:35 AM script INFO: SUCCESS!@#KODE 1!@#USER_ID 95!@#ACTIVITY_CODE 4
12/23/2022 01:43:35 AM script INFO: SUCCESS!@#KODE 1!@#USER_ID 95!@#ACTIVITY_CODE 3
12/23/2022 01:43:35 AM script INFO: SUCCESS!@#KODE 1!@#USER_ID 95!@#ACTIVITY_CODE 1
12/23/2022 01:43:35 AM script INFO: SUCCESS!@#KODE 1!@#USER_ID 95!@#ACTIVITY_CODE 3
12/23/2022 01:43:35 AM script INFO: SUCCESS!@#KODE 1!@#USER_ID 95!@#ACTIVITY_CODE 4
12/23/2022 01:43:35 AM script INFO: SUCCESS!@#KODE 1!@#USER_ID 95!@#ACTIVITY_CODE 5
12/23/2022 01:43:35 AM script INFO: SUCCESS!@#KODE 1!@#USER_ID 95!@#ACTIVITY_CODE 5
12/23/2022 01:43:38 AM script INFO: SUCCESS!@#KODE 1!@#USER_ID 95!@#ACTIVITY_CODE 3
12/23/2022 01:43:38 AM script INFO: SUCCESS!@#KODE 1!@#USER_ID 95!@#ACTIVITY_CODE 2
12/23/2022 01:43:38 AM script INFO: SUCCESS!@#KODE 1!@#USER_ID 95!@#ACTIVITY_CODE 3
12/23/2022 01:43:38 AM script INFO: SUCCESS!@#KODE 1!@#USER_ID 95!@#ACTIVITY_CODE 2
12/23/2022 01:43:38 AM script INFO: SUCCESS!@#KODE 1!@#USER_ID 95!@#ACTIVITY_CODE 4
12/23/2022 01:43:38 AM script INFO: SUCCESS!@#KODE 1!@#USER_ID 95!@#ACTIVITY_CODE 5
12/23/2022 01:43:38 AM script INFO: SUCCESS!@#KODE 1!@#USER_ID 95!@#ACTIVITY_CODE 5
12/23/2022 01:43:41 AM script INFO: SUCCESS!@#KODE 1!@#USER_ID 95!@#ACTIVITY_CODE 1
12/23/2022 01:43:41 AM script INFO: SUCCESS!@#KODE 1!@#USER_ID 95!@#ACTIVITY_CODE 4
12/23/2022 01:43:41 AM script INFO: SUCCESS!@#KODE 1!@#USER_ID 95!@#ACTIVITY_CODE 1
12/23/2022 01:43:41 AM script INFO: SUCCESS!@#KODE 1!@#USER_ID 95!@#ACTIVITY_CODE 3
12/23/2022 01:43:41 AM script INFO: SUCCESS!@#KODE 1!@#USER_ID 95!@#ACTIVITY_CODE 3
12/23/2022 01:43:41 AM script INFO: SUCCESS!@#KODE 1!@#USER_ID 95!@#ACTIVITY_CODE 5
12/23/2022 01:43:41 AM script INFO: SUCCESS!@#KODE 1!@#USER_ID 95!@#ACTIVITY_CODE 5
12/23/2022 01:43:44 AM script INFO: SUCCESS!@#KODE 1!@#USER_ID 95!@#ACTIVITY_CODE 4
12/23/2022 01:43:44 AM script INFO: SUCCESS!@#KODE 1!@#USER_ID 95!@#ACTIVITY_CODE 1
12/23/2022 01:43:44 AM script INFO: SUCCESS!@#KODE 1!@#USER_ID 95!@#ACTIVITY_CODE 5
12/23/2022 01:43:44 AM script INFO: SUCCESS!@#KODE 1!@#USER_ID 95!@#ACTIVITY_CODE 5
12/23/2022 01:43:46 AM script INFO: SUCCESS!@#KODE 1!@#USER_ID 95!@#ACTIVITY_CODE 5
12/23/2022 01:43:46 AM script INFO: SUCCESS!@#KODE 1!@#USER_ID 95!@#ACTIVITY_CODE 5
12/23/2022 01:43:49 AM script INFO: SUCCESS!@#KODE 1!@#USER_ID 95!@#ACTIVITY_CODE 4
12/23/2022 01:43:49 AM script INFO: SUCCESS!@#KODE 1!@#USER_ID 95!@#ACTIVITY_CODE 1
12/23/2022 01:43:49 AM script INFO: SUCCESS!@#KODE 1!@#USER_ID 95!@#ACTIVITY_CODE 1
12/23/2022 01:43:49 AM script INFO: SUCCESS!@#KODE 1!@#USER_ID 95!@#ACTIVITY_CODE 2
12/23/2022 01:43:49 AM script INFO: SUCCESS!@#KODE 1!@#USER_ID 95!@#ACTIVITY_CODE 1
12/23/2022 01:43:49 AM script INFO: SUCCESS!@#KODE 1!@#USER_ID 95!@#ACTIVITY_CODE 2
12/23/2022 01:43:49 AM script INFO: SUCCESS!@#KODE 1!@#USER_ID 95!@#ACTIVITY_CODE 1
12/23/2022 01:43:49 AM script INFO: SUCCESS!@#KODE 1!@#USER_ID 95!@#ACTIVITY_CODE 1
12/23/2022 01:43:49 AM script INFO: SUCCESS!@#KODE 1!@#USER_ID 95!@#ACTIVITY_CODE 2
12/23/2022 01:43:50 AM script INFO: SUCCESS!@#KODE 1!@#USER_ID 95!@#ACTIVITY_CODE 1
12/23/2022 01:43:50 AM script INFO: SUCCESS!@#KODE 1!@#USER_ID 95!@#ACTIVITY_CODE 2
12/23/2022 01:43:50 AM script INFO: SUCCESS!@#KODE 1!@#USER_ID 95!@#ACTIVITY_CODE 5
12/23/2022 01:43:50 AM script INFO: SUCCESS!@#KODE 1!@#USER_ID 95!@#ACTIVITY_CODE 5
12/23/2022 01:43:52 AM script INFO: SUCCESS!@#KODE 1!@#USER_ID 95!@#ACTIVITY_CODE 2
12/23/2022 01:43:52 AM script INFO: SUCCESS!@#KODE 1!@#USER_ID 95!@#ACTIVITY_CODE 5
12/23/2022 01:43:52 AM script INFO: SUCCESS!@#KODE 1!@#USER_ID 95!@#ACTIVITY_CODE 5
12/23/2022 01:43:55 AM script INFO: SUCCESS!@#KODE 1!@#USER_ID 95!@#ACTIVITY_CODE 2
12/23/2022 01:43:55 AM script INFO: SUCCESS!@#KODE 1!@#USER_ID 95!@#ACTIVITY_CODE 3
12/23/2022 01:43:55 AM script INFO: SUCCESS!@#KODE 1!@#USER_ID 95!@#ACTIVITY_CODE 5
12/23/2022 01:43:55 AM script INFO: SUCCESS!@#KODE 1!@#USER_ID 95!@#ACTIVITY_CODE 5
12/23/2022 01:43:58 AM script INFO: SUCCESS!@#KODE 1!@#USER_ID 95!@#ACTIVITY_CODE 3
12/23/2022 01:43:58 AM script INFO: SUCCESS!@#KODE 1!@#USER_ID 95!@#ACTIVITY_CODE 3
12/23/2022 01:43:58 AM script INFO: SUCCESS!@#KODE 1!@#USER_ID 95!@#ACTIVITY_CODE 5
12/23/2022 01:43:58 AM script INFO: SUCCESS!@#KODE 1!@#USER_ID 95!@#ACTIVITY_CODE 5
12/23/2022 01:44:00 AM script INFO: SUCCESS!@#KODE 1!@#USER_ID 95!@#ACTIVITY_CODE 1
12/23/2022 01:44:00 AM script INFO: SUCCESS!@#KODE 1!@#USER_ID 95!@#ACTIVITY_CODE 4
12/23/2022 01:44:00 AM script INFO: SUCCESS!@#KODE 1!@#USER_ID 95!@#ACTIVITY_CODE 5
12/23/2022 01:44:00 AM script INFO: SUCCESS!@#KODE 1!@#USER_ID 95!@#ACTIVITY_CODE 5
12/23/2022 01:44:03 AM script INFO: SUCCESS!@#KODE 1!@#USER_ID 95!@#ACTIVITY_CODE 2
12/23/2022 01:44:03 AM script INFO: SUCCESS!@#KODE 1!@#USER_ID 95!@#ACTIVITY_CODE 2
12/23/2022 01:44:03 AM script INFO: SUCCESS!@#KODE 1!@#USER_ID 95!@#ACTIVITY_CODE 2
12/23/2022 01:44:03 AM script INFO: SUCCESS!@#KODE 1!@#USER_ID 95!@#ACTIVITY_CODE 3
12/23/2022 01:44:03 AM script INFO: SUCCESS!@#KODE 1!@#USER_ID 95!@#ACTIVITY_CODE 2
12/23/2022 01:44:03 AM script INFO: SUCCESS!@#KODE 1!@#USER_ID 95!@#ACTIVITY_CODE 2
12/23/2022 01:44:04 AM script INFO: SUCCESS!@#KODE 1!@#USER_ID 95!@#ACTIVITY_CODE 3
12/23/2022 01:44:04 AM script INFO: SUCCESS!@#KODE 1!@#USER_ID 95!@#ACTIVITY_CODE 2
12/23/2022 01:44:04 AM script INFO: SUCCESS!@#KODE 1!@#USER_ID 95!@#ACTIVITY_CODE 1
12/23/2022 01:44:04 AM script INFO: SUCCESS!@#KODE 1!@#USER_ID 95!@#ACTIVITY_CODE 1
12/23/2022 01:44:04 AM script INFO: SUCCESS!@#KODE 1!@#USER_ID 95!@#ACTIVITY_CODE 1
12/23/2022 01:44:04 AM script INFO: SUCCESS!@#KODE 1!@#USER_ID 95!@#ACTIVITY_CODE 4
12/23/2022 01:44:04 AM script INFO: SUCCESS!@#KODE 1!@#USER_ID 95!@#ACTIVITY_CODE 2
12/23/2022 01:44:04 AM script INFO: SUCCESS!@#KODE 1!@#USER_ID 95!@#ACTIVITY_CODE 2
12/23/2022 01:44:04 AM script INFO: SUCCESS!@#KODE 1!@#USER_ID 95!@#ACTIVITY_CODE 3
12/23/2022 01:44:04 AM script INFO: SUCCESS!@#KODE 1!@#USER_ID 95!@#ACTIVITY_CODE 1
12/23/2022 01:44:04 AM script INFO: SUCCESS!@#KODE 1!@#USER_ID 95!@#ACTIVITY_CODE 4
12/23/2022 01:44:04 AM script INFO: SUCCESS!@#KODE 1!@#USER_ID 95!@#ACTIVITY_CODE 2
12/23/2022 01:44:05 AM script INFO: SUCCESS!@#KODE 1!@#USER_ID 95!@#ACTIVITY_CODE 4
12/23/2022 01:44:05 AM script INFO: SUCCESS!@#KODE 1!@#USER_ID 95!@#ACTIVITY_CODE 3
12/23/2022 01:44:05 AM script INFO: SUCCESS!@#KODE 1!@#USER_ID 95!@#ACTIVITY_CODE 1
12/23/2022 01:44:05 AM script INFO: SUCCESS!@#KODE 1!@#USER_ID 95!@#ACTIVITY_CODE 3
12/23/2022 01:44:05 AM script INFO: SUCCESS!@#KODE 1!@#USER_ID 95!@#ACTIVITY_CODE 2
12/23/2022 01:44:05 AM script INFO: SUCCESS!@#KODE 1!@#USER_ID 95!@#ACTIVITY_CODE 4
12/23/2022 01:44:05 AM script INFO: SUCCESS!@#KODE 1!@#USER_ID 95!@#ACTIVITY_CODE 1
12/23/2022 01:44:05 AM script INFO: SUCCESS!@#KODE 1!@#USER_ID 95!@#ACTIVITY_CODE 1
12/23/2022 01:44:05 AM script INFO: SUCCESS!@#KODE 1!@#USER_ID 95!@#ACTIVITY_CODE 3
12/23/2022 01:44:05 AM script INFO: SUCCESS!@#KODE 1!@#USER_ID 95!@#ACTIVITY_CODE 1
12/23/2022 01:44:05 AM script INFO: SUCCESS!@#KODE 1!@#USER_ID 95!@#ACTIVITY_CODE 4
12/23/2022 01:44:05 AM script INFO: SUCCESS!@#KODE 1!@#USER_ID 95!@#ACTIVITY_CODE 2
12/23/2022 01:44:05 AM script INFO: SUCCESS!@#KODE 1!@#USER_ID 95!@#ACTIVITY_CODE 3
12/23/2022 01:44:05 AM script INFO: SUCCESS!@#KODE 1!@#USER_ID 95!@#ACTIVITY_CODE 3
12/23/2022 01:44:05 AM script INFO: SUCCESS!@#KODE 1!@#USER_ID 95!@#ACTIVITY_CODE 1
12/23/2022 01:44:06 AM script INFO: SUCCESS!@#KODE 1!@#USER_ID 95!@#ACTIVITY_CODE 2
12/23/2022 01:44:06 AM script INFO: SUCCESS!@#KODE 1!@#USER_ID 95!@#ACTIVITY_CODE 3
12/23/2022 01:44:06 AM script INFO: SUCCESS!@#KODE 1!@#USER_ID 95!@#ACTIVITY_CODE 3
12/23/2022 01:44:06 AM script INFO: SUCCESS!@#KODE 1!@#USER_ID 95!@#ACTIVITY_CODE 3
12/23/2022 01:44:06 AM script INFO: SUCCESS!@#KODE 1!@#USER_ID 95!@#ACTIVITY_CODE 2
12/23/2022 01:44:06 AM script INFO: SUCCESS!@#KODE 1!@#USER_ID 95!@#ACTIVITY_CODE 1
12/23/2022 01:44:06 AM script INFO: SUCCESS!@#KODE 1!@#USER_ID 95!@#ACTIVITY_CODE 1
12/23/2022 01:44:06 AM script INFO: SUCCESS!@#KODE 1!@#USER_ID 95!@#ACTIVITY_CODE 2
12/23/2022 01:44:06 AM script INFO: SUCCESS!@#KODE 1!@#USER_ID 95!@#ACTIVITY_CODE 2
12/23/2022 01:44:06 AM script INFO: SUCCESS!@#KODE 1!@#USER_ID 95!@#ACTIVITY_CODE 2
12/23/2022 01:44:06 AM script INFO: SUCCESS!@#KODE 1!@#USER_ID 95!@#ACTIVITY_CODE 1
12/23/2022 01:44:06 AM script INFO: SUCCESS!@#KODE 1!@#USER_ID 95!@#ACTIVITY_CODE 3
12/23/2022 01:44:06 AM script INFO: SUCCESS!@#KODE 1!@#USER_ID 95!@#ACTIVITY_CODE 1
12/23/2022 01:44:07 AM script INFO: SUCCESS!@#KODE 1!@#USER_ID 95!@#ACTIVITY_CODE 2
12/23/2022 01:44:07 AM script INFO: SUCCESS!@#KODE 1!@#USER_ID 95!@#ACTIVITY_CODE 2
12/23/2022 01:44:07 AM script INFO: SUCCESS!@#KODE 1!@#USER_ID 95!@#ACTIVITY_CODE 1
12/23/2022 01:44:07 AM script INFO: SUCCESS!@#KODE 1!@#USER_ID 95!@#ACTIVITY_CODE 4
12/23/2022 01:44:07 AM script INFO: SUCCESS!@#KODE 1!@#USER_ID 95!@#ACTIVITY_CODE 1
12/23/2022 01:44:07 AM script INFO: SUCCESS!@#KODE 1!@#USER_ID 95!@#ACTIVITY_CODE 2
12/23/2022 01:44:07 AM script INFO: SUCCESS!@#KODE 1!@#USER_ID 95!@#ACTIVITY_CODE 3
12/23/2022 01:44:07 AM script INFO: SUCCESS!@#KODE 1!@#USER_ID 95!@#ACTIVITY_CODE 1
12/23/2022 01:44:07 AM script INFO: SUCCESS!@#KODE 1!@#USER_ID 95!@#ACTIVITY_CODE 1
12/23/2022 01:44:07 AM script INFO: SUCCESS!@#KODE 1!@#USER_ID 95!@#ACTIVITY_CODE 1
12/23/2022 01:44:07 AM script INFO: SUCCESS!@#KODE 1!@#USER_ID 95!@#ACTIVITY_CODE 3
12/23/2022 01:44:07 AM script INFO: SUCCESS!@#KODE 1!@#USER_ID 95!@#ACTIVITY_CODE 2
12/23/2022 01:44:07 AM script INFO: SUCCESS!@#KODE 1!@#USER_ID 95!@#ACTIVITY_CODE 1
12/23/2022 01:44:07 AM script INFO: SUCCESS!@#KODE 1!@#USER_ID 95!@#ACTIVITY_CODE 3
12/23/2022 01:44:07 AM script INFO: SUCCESS!@#KODE 1!@#USER_ID 95!@#ACTIVITY_CODE 2
12/23/2022 01:44:08 AM script INFO: SUCCESS!@#KODE 1!@#USER_ID 95!@#ACTIVITY_CODE 2
12/23/2022 01:44:08 AM script INFO: SUCCESS!@#KODE 1!@#USER_ID 95!@#ACTIVITY_CODE 4
12/23/2022 01:44:08 AM script INFO: SUCCESS!@#KODE 1!@#USER_ID 95!@#ACTIVITY_CODE 1
12/23/2022 01:44:08 AM script INFO: SUCCESS!@#KODE 1!@#USER_ID 95!@#ACTIVITY_CODE 2
12/23/2022 01:44:08 AM script INFO: SUCCESS!@#KODE 1!@#USER_ID 95!@#ACTIVITY_CODE 3
12/23/2022 01:44:08 AM script INFO: SUCCESS!@#KODE 1!@#USER_ID 95!@#ACTIVITY_CODE 1
12/23/2022 01:44:08 AM script INFO: SUCCESS!@#KODE 1!@#USER_ID 95!@#ACTIVITY_CODE 4
12/23/2022 01:44:08 AM script INFO: SUCCESS!@#KODE 1!@#USER_ID 95!@#ACTIVITY_CODE 3
12/23/2022 01:44:08 AM script INFO: SUCCESS!@#KODE 1!@#USER_ID 95!@#ACTIVITY_CODE 2
12/23/2022 01:44:08 AM script INFO: SUCCESS!@#KODE 1!@#USER_ID 95!@#ACTIVITY_CODE 3
12/23/2022 01:44:08 AM script INFO: SUCCESS!@#KODE 1!@#USER_ID 95!@#ACTIVITY_CODE 4
12/23/2022 01:44:08 AM script INFO: SUCCESS!@#KODE 1!@#USER_ID 95!@#ACTIVITY_CODE 1
12/23/2022 01:44:08 AM script INFO: SUCCESS!@#KODE 1!@#USER_ID 95!@#ACTIVITY_CODE 3
12/23/2022 01:44:09 AM script INFO: SUCCESS!@#KODE 1!@#USER_ID 95!@#ACTIVITY_CODE 2
12/23/2022 01:44:09 AM script INFO: SUCCESS!@#KODE 1!@#USER_ID 95!@#ACTIVITY_CODE 2
12/23/2022 01:44:09 AM script INFO: SUCCESS!@#KODE 1!@#USER_ID 95!@#ACTIVITY_CODE 2
12/23/2022 01:44:09 AM script INFO: SUCCESS!@#KODE 1!@#USER_ID 95!@#ACTIVITY_CODE 3
12/23/2022 01:44:09 AM script INFO: SUCCESS!@#KODE 1!@#USER_ID 95!@#ACTIVITY_CODE 2
12/23/2022 01:44:09 AM script INFO: SUCCESS!@#KODE 1!@#USER_ID 95!@#ACTIVITY_CODE 2
12/23/2022 01:44:09 AM script INFO: SUCCESS!@#KODE 1!@#USER_ID 95!@#ACTIVITY_CODE 3
12/23/2022 01:44:09 AM script INFO: SUCCESS!@#KODE 1!@#USER_ID 95!@#ACTIVITY_CODE 1
12/23/2022 01:44:09 AM script INFO: SUCCESS!@#KODE 1!@#USER_ID 95!@#ACTIVITY_CODE 1
12/23/2022 01:44:09 AM script INFO: SUCCESS!@#KODE 1!@#USER_ID 95!@#ACTIVITY_CODE 2
12/23/2022 01:44:09 AM script INFO: SUCCESS!@#KODE 1!@#USER_ID 95!@#ACTIVITY_CODE 3
12/23/2022 01:44:10 AM script INFO: SUCCESS!@#KODE 1!@#USER_ID 95!@#ACTIVITY_CODE 2
12/23/2022 01:44:10 AM script INFO: SUCCESS!@#KODE 1!@#USER_ID 95!@#ACTIVITY_CODE 2
12/23/2022 01:44:10 AM script INFO: SUCCESS!@#KODE 1!@#USER_ID 95!@#ACTIVITY_CODE 3
12/23/2022 01:44:10 AM script INFO: SUCCESS!@#KODE 1!@#USER_ID 95!@#ACTIVITY_CODE 1
12/23/2022 01:44:10 AM script INFO: SUCCESS!@#KODE 1!@#USER_ID 95!@#ACTIVITY_CODE 1
12/23/2022 01:44:10 AM script INFO: SUCCESS!@#KODE 1!@#USER_ID 95!@#ACTIVITY_CODE 2
12/23/2022 01:44:10 AM script INFO: SUCCESS!@#KODE 1!@#USER_ID 95!@#ACTIVITY_CODE 1
12/23/2022 01:44:10 AM script INFO: SUCCESS!@#KODE 1!@#USER_ID 95!@#ACTIVITY_CODE 2
12/23/2022 01:44:10 AM script INFO: SUCCESS!@#KODE 1!@#USER_ID 95!@#ACTIVITY_CODE 1
12/23/2022 01:44:10 AM script INFO: SUCCESS!@#KODE 1!@#USER_ID 95!@#ACTIVITY_CODE 1
12/23/2022 01:44:10 AM script INFO: SUCCESS!@#KODE 1!@#USER_ID 95!@#ACTIVITY_CODE 2
12/23/2022 01:44:10 AM script INFO: SUCCESS!@#KODE 1!@#USER_ID 95!@#ACTIVITY_CODE 2
12/23/2022 01:44:11 AM script INFO: SUCCESS!@#KODE 1!@#USER_ID 95!@#ACTIVITY_CODE 4
12/23/2022 01:44:11 AM script INFO: SUCCESS!@#KODE 1!@#USER_ID 95!@#ACTIVITY_CODE 1
12/23/2022 01:44:11 AM script INFO: SUCCESS!@#KODE 1!@#USER_ID 95!@#ACTIVITY_CODE 3
12/23/2022 01:44:11 AM script INFO: SUCCESS!@#KODE 1!@#USER_ID 95!@#ACTIVITY_CODE 2
12/23/2022 01:44:11 AM script INFO: SUCCESS!@#KODE 1!@#USER_ID 95!@#ACTIVITY_CODE 2
12/23/2022 01:44:11 AM script INFO: SUCCESS!@#KODE 1!@#USER_ID 95!@#ACTIVITY_CODE 3
12/23/2022 01:44:11 AM script INFO: SUCCESS!@#KODE 1!@#USER_ID 95!@#ACTIVITY_CODE 2
12/23/2022 01:44:11 AM script INFO: SUCCESS!@#KODE 1!@#USER_ID 95!@#ACTIVITY_CODE 4
12/23/2022 01:44:11 AM script INFO: SUCCESS!@#KODE 1!@#USER_ID 95!@#ACTIVITY_CODE 2
12/23/2022 01:44:11 AM script INFO: SUCCESS!@#KODE 1!@#USER_ID 95!@#ACTIVITY_CODE 4
12/23/2022 01:44:12 AM script INFO: SUCCESS!@#KODE 1!@#USER_ID 95!@#ACTIVITY_CODE 2
12/23/2022 01:44:12 AM script INFO: SUCCESS!@#KODE 1!@#USER_ID 95!@#ACTIVITY_CODE 1
12/23/2022 01:44:12 AM script INFO: SUCCESS!@#KODE 1!@#USER_ID 95!@#ACTIVITY_CODE 4
12/23/2022 01:44:12 AM script INFO: SUCCESS!@#KODE 1!@#USER_ID 95!@#ACTIVITY_CODE 3
12/23/2022 01:44:12 AM script INFO: SUCCESS!@#KODE 1!@#USER_ID 95!@#ACTIVITY_CODE 2
12/23/2022 01:44:12 AM script INFO: SUCCESS!@#KODE 1!@#USER_ID 95!@#ACTIVITY_CODE 1
12/23/2022 01:44:12 AM script INFO: SUCCESS!@#KODE 1!@#USER_ID 95!@#ACTIVITY_CODE 1
12/23/2022 01:44:12 AM script INFO: SUCCESS!@#KODE 1!@#USER_ID 95!@#ACTIVITY_CODE 1
12/23/2022 01:44:12 AM script INFO: SUCCESS!@#KODE 1!@#USER_ID 95!@#ACTIVITY_CODE 1
12/23/2022 01:44:12 AM script INFO: SUCCESS!@#KODE 1!@#USER_ID 95!@#ACTIVITY_CODE 2
12/23/2022 01:44:12 AM script INFO: SUCCESS!@#KODE 1!@#USER_ID 95!@#ACTIVITY_CODE 2
12/23/2022 01:44:12 AM script INFO: SUCCESS!@#KODE 1!@#USER_ID 95!@#ACTIVITY_CODE 2
12/23/2022 01:44:13 AM script INFO: SUCCESS!@#KODE 1!@#USER_ID 95!@#ACTIVITY_CODE 3
12/23/2022 01:44:13 AM script INFO: SUCCESS!@#KODE 1!@#USER_ID 95!@#ACTIVITY_CODE 1
12/23/2022 01:44:13 AM script INFO: SUCCESS!@#KODE 1!@#USER_ID 95!@#ACTIVITY_CODE 2
12/23/2022 01:44:13 AM script INFO: SUCCESS!@#KODE 1!@#USER_ID 95!@#ACTIVITY_CODE 4
12/23/2022 01:44:13 AM script INFO: SUCCESS!@#KODE 1!@#USER_ID 95!@#ACTIVITY_CODE 2
12/23/2022 01:44:13 AM script INFO: SUCCESS!@#KODE 1!@#USER_ID 95!@#ACTIVITY_CODE 1
12/23/2022 01:44:13 AM script INFO: SUCCESS!@#KODE 1!@#USER_ID 95!@#ACTIVITY_CODE 1
12/23/2022 01:44:13 AM script INFO: SUCCESS!@#KODE 1!@#USER_ID 95!@#ACTIVITY_CODE 2
12/23/2022 01:44:13 AM script INFO: SUCCESS!@#KODE 1!@#USER_ID 95!@#ACTIVITY_CODE 1
12/23/2022 01:44:13 AM script INFO: SUCCESS!@#KODE 1!@#USER_ID 95!@#ACTIVITY_CODE 4
12/23/2022 01:44:13 AM script INFO: SUCCESS!@#KODE 1!@#USER_ID 95!@#ACTIVITY_CODE 2
12/23/2022 01:44:14 AM script INFO: SUCCESS!@#KODE 1!@#USER_ID 95!@#ACTIVITY_CODE 4
12/23/2022 01:44:14 AM script INFO: SUCCESS!@#KODE 1!@#USER_ID 95!@#ACTIVITY_CODE 3
12/23/2022 01:44:14 AM script INFO: SUCCESS!@#KODE 1!@#USER_ID 95!@#ACTIVITY_CODE 1
12/23/2022 01:44:14 AM script INFO: SUCCESS!@#KODE 1!@#USER_ID 95!@#ACTIVITY_CODE 4
12/23/2022 01:44:14 AM script INFO: SUCCESS!@#KODE 1!@#USER_ID 95!@#ACTIVITY_CODE 1
12/23/2022 01:44:14 AM script INFO: SUCCESS!@#KODE 1!@#USER_ID 95!@#ACTIVITY_CODE 1
12/23/2022 01:44:14 AM script INFO: SUCCESS!@#KODE 1!@#USER_ID 95!@#ACTIVITY_CODE 2
12/23/2022 01:44:14 AM script INFO: SUCCESS!@#KODE 1!@#USER_ID 95!@#ACTIVITY_CODE 1
12/23/2022 01:44:14 AM script INFO: SUCCESS!@#KODE 1!@#USER_ID 95!@#ACTIVITY_CODE 2
12/23/2022 01:44:14 AM script INFO: SUCCESS!@#KODE 1!@#USER_ID 95!@#ACTIVITY_CODE 3
12/23/2022 01:44:14 AM script INFO: SUCCESS!@#KODE 1!@#USER_ID 95!@#ACTIVITY_CODE 2
12/23/2022 01:44:14 AM script INFO: SUCCESS!@#KODE 1!@#USER_ID 95!@#ACTIVITY_CODE 2
12/23/2022 01:44:15 AM script INFO: SUCCESS!@#KODE 1!@#USER_ID 95!@#ACTIVITY_CODE 2
12/23/2022 01:44:15 AM script INFO: SUCCESS!@#KODE 1!@#USER_ID 95!@#ACTIVITY_CODE 3
12/23/2022 01:44:15 AM script INFO: SUCCESS!@#KODE 1!@#USER_ID 95!@#ACTIVITY_CODE 1
12/23/2022 01:44:15 AM script INFO: SUCCESS!@#KODE 1!@#USER_ID 95!@#ACTIVITY_CODE 3
12/23/2022 01:44:15 AM script INFO: Duration: 57.253308057785034
12/23/2022 01:44:15 AM script INFO: mengakhiri-quiz
12/23/2022 01:44:16 AM script INFO: SUCCESS!@#KODE 1!@#USER_ID 95!@#ACTIVITY_CODE 5
12/23/2022 01:44:16 AM script INFO: berhasil-submit
12/23/2022 01:45:46 AM script ERROR: TIMEOUT EXCEPTION!@#KODE 0!@#LOCATION berhasil-submit
12/23/2022 01:45:46 AM main_worker ERROR: Message: None

