12/23/2022 07:04:05 AM script INFO: Prepared chrome options..
12/23/2022 07:04:07 AM script INFO: Initialized chrome browser..
12/23/2022 07:04:07 AM script INFO: mengakses-homepage
12/23/2022 07:04:35 AM script INFO: mengakses-login-page
12/23/2022 07:04:37 AM script INFO: mengakses-site-home
12/23/2022 07:04:37 AM script INFO: mengakses-site-course
12/23/2022 07:04:38 AM script INFO: mengakses-quiz
12/23/2022 07:04:39 AM script INFO: mengakses-start-quiz-page
12/23/2022 07:04:40 AM script INFO: memulai-quiz
12/23/2022 07:04:40 AM script INFO: SUCCESS!@#KODE 1!@#USER_ID 34!@#ACTIVITY_CODE 5
12/23/2022 07:04:51 AM script INFO: SUCCESS!@#KODE 1!@#USER_ID 34!@#ACTIVITY_CODE 1
12/23/2022 07:04:51 AM script INFO: SUCCESS!@#KODE 1!@#USER_ID 34!@#ACTIVITY_CODE 1
12/23/2022 07:04:51 AM script INFO: SUCCESS!@#KODE 1!@#USER_ID 34!@#ACTIVITY_CODE 3
12/23/2022 07:04:51 AM script INFO: SUCCESS!@#KODE 1!@#USER_ID 34!@#ACTIVITY_CODE 1
12/23/2022 07:04:51 AM script INFO: SUCCESS!@#KODE 1!@#USER_ID 34!@#ACTIVITY_CODE 5
12/23/2022 07:04:51 AM script INFO: SUCCESS!@#KODE 1!@#USER_ID 34!@#ACTIVITY_CODE 5
12/23/2022 07:04:54 AM script INFO: SUCCESS!@#KODE 1!@#USER_ID 34!@#ACTIVITY_CODE 2
12/23/2022 07:04:54 AM script INFO: SUCCESS!@#KODE 1!@#USER_ID 34!@#ACTIVITY_CODE 2
12/23/2022 07:04:54 AM script INFO: SUCCESS!@#KODE 1!@#USER_ID 34!@#ACTIVITY_CODE 4
12/23/2022 07:04:54 AM script INFO: SUCCESS!@#KODE 1!@#USER_ID 34!@#ACTIVITY_CODE 1
12/23/2022 07:04:54 AM script INFO: SUCCESS!@#KODE 1!@#USER_ID 34!@#ACTIVITY_CODE 2
12/23/2022 07:04:54 AM script INFO: SUCCESS!@#KODE 1!@#USER_ID 34!@#ACTIVITY_CODE 5
12/23/2022 07:04:54 AM script INFO: SUCCESS!@#KODE 1!@#USER_ID 34!@#ACTIVITY_CODE 5
12/23/2022 07:04:57 AM script INFO: SUCCESS!@#KODE 1!@#USER_ID 34!@#ACTIVITY_CODE 1
12/23/2022 07:04:57 AM script INFO: SUCCESS!@#KODE 1!@#USER_ID 34!@#ACTIVITY_CODE 2
12/23/2022 07:04:57 AM script INFO: SUCCESS!@#KODE 1!@#USER_ID 34!@#ACTIVITY_CODE 3
12/23/2022 07:04:57 AM script INFO: SUCCESS!@#KODE 1!@#USER_ID 34!@#ACTIVITY_CODE 5
12/23/2022 07:04:57 AM script INFO: SUCCESS!@#KODE 1!@#USER_ID 34!@#ACTIVITY_CODE 5
12/23/2022 07:05:00 AM script INFO: SUCCESS!@#KODE 1!@#USER_ID 34!@#ACTIVITY_CODE 3
12/23/2022 07:05:00 AM script INFO: SUCCESS!@#KODE 1!@#USER_ID 34!@#ACTIVITY_CODE 1
12/23/2022 07:05:00 AM script INFO: SUCCESS!@#KODE 1!@#USER_ID 34!@#ACTIVITY_CODE 3
12/23/2022 07:05:00 AM script INFO: SUCCESS!@#KODE 1!@#USER_ID 34!@#ACTIVITY_CODE 1
12/23/2022 07:05:00 AM script INFO: SUCCESS!@#KODE 1!@#USER_ID 34!@#ACTIVITY_CODE 4
12/23/2022 07:05:00 AM script INFO: SUCCESS!@#KODE 1!@#USER_ID 34!@#ACTIVITY_CODE 5
12/23/2022 07:05:00 AM script INFO: SUCCESS!@#KODE 1!@#USER_ID 34!@#ACTIVITY_CODE 5
12/23/2022 07:05:02 AM script INFO: SUCCESS!@#KODE 1!@#USER_ID 34!@#ACTIVITY_CODE 3
12/23/2022 07:05:02 AM script INFO: SUCCESS!@#KODE 1!@#USER_ID 34!@#ACTIVITY_CODE 5
12/23/2022 07:05:02 AM script INFO: SUCCESS!@#KODE 1!@#USER_ID 34!@#ACTIVITY_CODE 5
12/23/2022 07:05:05 AM script INFO: SUCCESS!@#KODE 1!@#USER_ID 34!@#ACTIVITY_CODE 2
12/23/2022 07:05:05 AM script INFO: SUCCESS!@#KODE 1!@#USER_ID 34!@#ACTIVITY_CODE 1
12/23/2022 07:05:05 AM script INFO: SUCCESS!@#KODE 1!@#USER_ID 34!@#ACTIVITY_CODE 2
12/23/2022 07:05:06 AM script INFO: SUCCESS!@#KODE 1!@#USER_ID 34!@#ACTIVITY_CODE 2
12/23/2022 07:05:06 AM script INFO: SUCCESS!@#KODE 1!@#USER_ID 34!@#ACTIVITY_CODE 2
12/23/2022 07:05:06 AM script INFO: SUCCESS!@#KODE 1!@#USER_ID 34!@#ACTIVITY_CODE 3
12/23/2022 07:05:06 AM script INFO: SUCCESS!@#KODE 1!@#USER_ID 34!@#ACTIVITY_CODE 3
12/23/2022 07:05:06 AM script INFO: SUCCESS!@#KODE 1!@#USER_ID 34!@#ACTIVITY_CODE 5
12/23/2022 07:05:06 AM script INFO: SUCCESS!@#KODE 1!@#USER_ID 34!@#ACTIVITY_CODE 5
12/23/2022 07:05:08 AM script INFO: SUCCESS!@#KODE 1!@#USER_ID 34!@#ACTIVITY_CODE 1
12/23/2022 07:05:09 AM script INFO: SUCCESS!@#KODE 1!@#USER_ID 34!@#ACTIVITY_CODE 2
12/23/2022 07:05:09 AM script INFO: SUCCESS!@#KODE 1!@#USER_ID 34!@#ACTIVITY_CODE 1
12/23/2022 07:05:09 AM script INFO: SUCCESS!@#KODE 1!@#USER_ID 34!@#ACTIVITY_CODE 2
12/23/2022 07:05:09 AM script INFO: SUCCESS!@#KODE 1!@#USER_ID 34!@#ACTIVITY_CODE 3
12/23/2022 07:05:09 AM script INFO: SUCCESS!@#KODE 1!@#USER_ID 34!@#ACTIVITY_CODE 2
12/23/2022 07:05:09 AM script INFO: SUCCESS!@#KODE 1!@#USER_ID 34!@#ACTIVITY_CODE 1
12/23/2022 07:05:09 AM script INFO: SUCCESS!@#KODE 1!@#USER_ID 34!@#ACTIVITY_CODE 3
12/23/2022 07:05:09 AM script INFO: SUCCESS!@#KODE 1!@#USER_ID 34!@#ACTIVITY_CODE 2
12/23/2022 07:05:09 AM script INFO: SUCCESS!@#KODE 1!@#USER_ID 34!@#ACTIVITY_CODE 1
12/23/2022 07:05:09 AM script INFO: SUCCESS!@#KODE 1!@#USER_ID 34!@#ACTIVITY_CODE 2
12/23/2022 07:05:09 AM script INFO: Duration: 18.844440698623657
12/23/2022 07:05:09 AM script INFO: mengakhiri-quiz
12/23/2022 07:05:10 AM script INFO: SUCCESS!@#KODE 1!@#USER_ID 34!@#ACTIVITY_CODE 5
12/23/2022 07:05:10 AM script INFO: berhasil-submit
