12/23/2022 02:03:35 AM script INFO: Prepared chrome options..
12/23/2022 02:03:37 AM script INFO: Initialized chrome browser..
12/23/2022 02:03:37 AM script INFO: mengakses-homepage
12/23/2022 02:05:06 AM script INFO: mengakses-login-page
12/23/2022 02:05:22 AM script INFO: mengakses-site-home
12/23/2022 02:06:53 AM script ERROR: TIMEOUT EXCEPTION!@#KODE 0!@#LOCATION mengakses-site-home
12/23/2022 02:06:53 AM main_worker ERROR: Message: None

