12/23/2022 02:03:35 AM script INFO: Prepared chrome options..
12/23/2022 02:03:37 AM script INFO: Initialized chrome browser..
12/23/2022 02:03:37 AM script INFO: mengakses-homepage
12/23/2022 02:05:09 AM script INFO: mengakses-login-page
12/23/2022 02:05:42 AM script INFO: mengakses-site-home
12/23/2022 02:05:50 AM script INFO: mengakses-site-course
12/23/2022 02:06:15 AM script INFO: mengakses-quiz
12/23/2022 02:06:27 AM script INFO: mengakses-start-quiz-page
12/23/2022 02:08:36 AM script INFO: memulai-quiz
12/23/2022 02:08:36 AM script INFO: SUCCESS!@#KODE 1!@#USER_ID 7!@#ACTIVITY_CODE 5
12/23/2022 02:08:47 AM script INFO: SUCCESS!@#KODE 1!@#USER_ID 7!@#ACTIVITY_CODE 2
12/23/2022 02:08:47 AM script INFO: SUCCESS!@#KODE 1!@#USER_ID 7!@#ACTIVITY_CODE 5
12/23/2022 02:08:47 AM script INFO: SUCCESS!@#KODE 1!@#USER_ID 7!@#ACTIVITY_CODE 5
12/23/2022 02:08:49 AM script INFO: SUCCESS!@#KODE 1!@#USER_ID 7!@#ACTIVITY_CODE 1
12/23/2022 02:08:49 AM script INFO: SUCCESS!@#KODE 1!@#USER_ID 7!@#ACTIVITY_CODE 5
12/23/2022 02:08:49 AM script INFO: SUCCESS!@#KODE 1!@#USER_ID 7!@#ACTIVITY_CODE 5
12/23/2022 02:08:52 AM script INFO: SUCCESS!@#KODE 1!@#USER_ID 7!@#ACTIVITY_CODE 5
12/23/2022 02:08:52 AM script INFO: SUCCESS!@#KODE 1!@#USER_ID 7!@#ACTIVITY_CODE 5
12/23/2022 02:08:54 AM script INFO: SUCCESS!@#KODE 1!@#USER_ID 7!@#ACTIVITY_CODE 5
12/23/2022 02:08:54 AM script INFO: SUCCESS!@#KODE 1!@#USER_ID 7!@#ACTIVITY_CODE 5
12/23/2022 02:08:57 AM script INFO: SUCCESS!@#KODE 1!@#USER_ID 7!@#ACTIVITY_CODE 5
12/23/2022 02:08:57 AM script INFO: SUCCESS!@#KODE 1!@#USER_ID 7!@#ACTIVITY_CODE 5
12/23/2022 02:08:59 AM script INFO: SUCCESS!@#KODE 1!@#USER_ID 7!@#ACTIVITY_CODE 2
12/23/2022 02:08:59 AM script INFO: SUCCESS!@#KODE 1!@#USER_ID 7!@#ACTIVITY_CODE 3
12/23/2022 02:09:00 AM script INFO: SUCCESS!@#KODE 1!@#USER_ID 7!@#ACTIVITY_CODE 2
12/23/2022 02:09:00 AM script INFO: SUCCESS!@#KODE 1!@#USER_ID 7!@#ACTIVITY_CODE 5
12/23/2022 02:09:00 AM script INFO: SUCCESS!@#KODE 1!@#USER_ID 7!@#ACTIVITY_CODE 5
12/23/2022 02:09:02 AM script INFO: SUCCESS!@#KODE 1!@#USER_ID 7!@#ACTIVITY_CODE 5
12/23/2022 02:09:02 AM script INFO: SUCCESS!@#KODE 1!@#USER_ID 7!@#ACTIVITY_CODE 5
12/23/2022 02:09:05 AM script INFO: SUCCESS!@#KODE 1!@#USER_ID 7!@#ACTIVITY_CODE 3
12/23/2022 02:09:05 AM script INFO: SUCCESS!@#KODE 1!@#USER_ID 7!@#ACTIVITY_CODE 3
12/23/2022 02:09:05 AM script INFO: SUCCESS!@#KODE 1!@#USER_ID 7!@#ACTIVITY_CODE 1
12/23/2022 02:09:05 AM script INFO: SUCCESS!@#KODE 1!@#USER_ID 7!@#ACTIVITY_CODE 4
12/23/2022 02:09:05 AM script INFO: SUCCESS!@#KODE 1!@#USER_ID 7!@#ACTIVITY_CODE 2
12/23/2022 02:09:05 AM script INFO: SUCCESS!@#KODE 1!@#USER_ID 7!@#ACTIVITY_CODE 5
12/23/2022 02:09:05 AM script INFO: SUCCESS!@#KODE 1!@#USER_ID 7!@#ACTIVITY_CODE 5
12/23/2022 02:09:08 AM script INFO: SUCCESS!@#KODE 1!@#USER_ID 7!@#ACTIVITY_CODE 1
12/23/2022 02:09:08 AM script INFO: SUCCESS!@#KODE 1!@#USER_ID 7!@#ACTIVITY_CODE 5
12/23/2022 02:09:08 AM script INFO: SUCCESS!@#KODE 1!@#USER_ID 7!@#ACTIVITY_CODE 5
12/23/2022 02:09:10 AM script INFO: SUCCESS!@#KODE 1!@#USER_ID 7!@#ACTIVITY_CODE 5
12/23/2022 02:09:10 AM script INFO: SUCCESS!@#KODE 1!@#USER_ID 7!@#ACTIVITY_CODE 5
12/23/2022 02:09:13 AM script INFO: SUCCESS!@#KODE 1!@#USER_ID 7!@#ACTIVITY_CODE 4
12/23/2022 02:09:13 AM script INFO: SUCCESS!@#KODE 1!@#USER_ID 7!@#ACTIVITY_CODE 3
12/23/2022 02:09:13 AM script INFO: SUCCESS!@#KODE 1!@#USER_ID 7!@#ACTIVITY_CODE 5
12/23/2022 02:09:13 AM script INFO: SUCCESS!@#KODE 1!@#USER_ID 7!@#ACTIVITY_CODE 5
12/23/2022 02:09:15 AM script INFO: SUCCESS!@#KODE 1!@#USER_ID 7!@#ACTIVITY_CODE 5
12/23/2022 02:09:15 AM script INFO: SUCCESS!@#KODE 1!@#USER_ID 7!@#ACTIVITY_CODE 5
12/23/2022 02:09:18 AM script INFO: SUCCESS!@#KODE 1!@#USER_ID 7!@#ACTIVITY_CODE 3
12/23/2022 02:09:18 AM script INFO: SUCCESS!@#KODE 1!@#USER_ID 7!@#ACTIVITY_CODE 2
12/23/2022 02:09:18 AM script INFO: SUCCESS!@#KODE 1!@#USER_ID 7!@#ACTIVITY_CODE 3
12/23/2022 02:09:18 AM script INFO: SUCCESS!@#KODE 1!@#USER_ID 7!@#ACTIVITY_CODE 3
12/23/2022 02:09:18 AM script INFO: SUCCESS!@#KODE 1!@#USER_ID 7!@#ACTIVITY_CODE 3
12/23/2022 02:09:18 AM script INFO: SUCCESS!@#KODE 1!@#USER_ID 7!@#ACTIVITY_CODE 1
12/23/2022 02:09:18 AM script INFO: SUCCESS!@#KODE 1!@#USER_ID 7!@#ACTIVITY_CODE 5
12/23/2022 02:09:18 AM script INFO: SUCCESS!@#KODE 1!@#USER_ID 7!@#ACTIVITY_CODE 5
12/23/2022 02:09:21 AM script INFO: SUCCESS!@#KODE 1!@#USER_ID 7!@#ACTIVITY_CODE 1
12/23/2022 02:09:21 AM script INFO: SUCCESS!@#KODE 1!@#USER_ID 7!@#ACTIVITY_CODE 4
12/23/2022 02:09:21 AM script INFO: SUCCESS!@#KODE 1!@#USER_ID 7!@#ACTIVITY_CODE 2
12/23/2022 02:09:21 AM script INFO: SUCCESS!@#KODE 1!@#USER_ID 7!@#ACTIVITY_CODE 3
12/23/2022 02:09:21 AM script INFO: SUCCESS!@#KODE 1!@#USER_ID 7!@#ACTIVITY_CODE 2
12/23/2022 02:09:21 AM script INFO: SUCCESS!@#KODE 1!@#USER_ID 7!@#ACTIVITY_CODE 3
12/23/2022 02:09:21 AM script INFO: SUCCESS!@#KODE 1!@#USER_ID 7!@#ACTIVITY_CODE 3
12/23/2022 02:09:21 AM script INFO: SUCCESS!@#KODE 1!@#USER_ID 7!@#ACTIVITY_CODE 2
12/23/2022 02:09:21 AM script INFO: SUCCESS!@#KODE 1!@#USER_ID 7!@#ACTIVITY_CODE 1
12/23/2022 02:09:21 AM script INFO: SUCCESS!@#KODE 1!@#USER_ID 7!@#ACTIVITY_CODE 1
12/23/2022 02:09:21 AM script INFO: SUCCESS!@#KODE 1!@#USER_ID 7!@#ACTIVITY_CODE 3
12/23/2022 02:09:21 AM script INFO: SUCCESS!@#KODE 1!@#USER_ID 7!@#ACTIVITY_CODE 4
12/23/2022 02:09:21 AM script INFO: SUCCESS!@#KODE 1!@#USER_ID 7!@#ACTIVITY_CODE 1
12/23/2022 02:09:22 AM script INFO: SUCCESS!@#KODE 1!@#USER_ID 7!@#ACTIVITY_CODE 4
12/23/2022 02:09:22 AM script INFO: SUCCESS!@#KODE 1!@#USER_ID 7!@#ACTIVITY_CODE 1
12/23/2022 02:09:22 AM script INFO: SUCCESS!@#KODE 1!@#USER_ID 7!@#ACTIVITY_CODE 2
12/23/2022 02:09:22 AM script INFO: SUCCESS!@#KODE 1!@#USER_ID 7!@#ACTIVITY_CODE 5
12/23/2022 02:09:22 AM script INFO: SUCCESS!@#KODE 1!@#USER_ID 7!@#ACTIVITY_CODE 5
12/23/2022 02:09:24 AM script INFO: SUCCESS!@#KODE 1!@#USER_ID 7!@#ACTIVITY_CODE 3
12/23/2022 02:09:24 AM script INFO: SUCCESS!@#KODE 1!@#USER_ID 7!@#ACTIVITY_CODE 5
12/23/2022 02:09:24 AM script INFO: SUCCESS!@#KODE 1!@#USER_ID 7!@#ACTIVITY_CODE 5
12/23/2022 02:09:27 AM script INFO: SUCCESS!@#KODE 1!@#USER_ID 7!@#ACTIVITY_CODE 3
12/23/2022 02:09:27 AM script INFO: SUCCESS!@#KODE 1!@#USER_ID 7!@#ACTIVITY_CODE 5
12/23/2022 02:09:27 AM script INFO: SUCCESS!@#KODE 1!@#USER_ID 7!@#ACTIVITY_CODE 5
12/23/2022 02:09:29 AM script INFO: SUCCESS!@#KODE 1!@#USER_ID 7!@#ACTIVITY_CODE 3
12/23/2022 02:09:29 AM script INFO: SUCCESS!@#KODE 1!@#USER_ID 7!@#ACTIVITY_CODE 1
12/23/2022 02:09:30 AM script INFO: SUCCESS!@#KODE 1!@#USER_ID 7!@#ACTIVITY_CODE 2
12/23/2022 02:09:30 AM script INFO: SUCCESS!@#KODE 1!@#USER_ID 7!@#ACTIVITY_CODE 1
12/23/2022 02:09:30 AM script INFO: SUCCESS!@#KODE 1!@#USER_ID 7!@#ACTIVITY_CODE 3
12/23/2022 02:09:30 AM script INFO: SUCCESS!@#KODE 1!@#USER_ID 7!@#ACTIVITY_CODE 3
12/23/2022 02:09:30 AM script INFO: SUCCESS!@#KODE 1!@#USER_ID 7!@#ACTIVITY_CODE 3
12/23/2022 02:09:30 AM script INFO: SUCCESS!@#KODE 1!@#USER_ID 7!@#ACTIVITY_CODE 5
12/23/2022 02:09:30 AM script INFO: SUCCESS!@#KODE 1!@#USER_ID 7!@#ACTIVITY_CODE 5
12/23/2022 02:09:32 AM script INFO: SUCCESS!@#KODE 1!@#USER_ID 7!@#ACTIVITY_CODE 1
12/23/2022 02:09:32 AM script INFO: SUCCESS!@#KODE 1!@#USER_ID 7!@#ACTIVITY_CODE 1
12/23/2022 02:09:32 AM script INFO: SUCCESS!@#KODE 1!@#USER_ID 7!@#ACTIVITY_CODE 2
12/23/2022 02:09:33 AM script INFO: SUCCESS!@#KODE 1!@#USER_ID 7!@#ACTIVITY_CODE 1
12/23/2022 02:09:33 AM script INFO: SUCCESS!@#KODE 1!@#USER_ID 7!@#ACTIVITY_CODE 5
12/23/2022 02:09:33 AM script INFO: SUCCESS!@#KODE 1!@#USER_ID 7!@#ACTIVITY_CODE 5
12/23/2022 02:09:35 AM script INFO: SUCCESS!@#KODE 1!@#USER_ID 7!@#ACTIVITY_CODE 5
12/23/2022 02:09:35 AM script INFO: SUCCESS!@#KODE 1!@#USER_ID 7!@#ACTIVITY_CODE 5
12/23/2022 02:09:38 AM script INFO: SUCCESS!@#KODE 1!@#USER_ID 7!@#ACTIVITY_CODE 2
12/23/2022 02:09:38 AM script INFO: SUCCESS!@#KODE 1!@#USER_ID 7!@#ACTIVITY_CODE 3
12/23/2022 02:09:38 AM script INFO: SUCCESS!@#KODE 1!@#USER_ID 7!@#ACTIVITY_CODE 5
12/23/2022 02:09:38 AM script INFO: SUCCESS!@#KODE 1!@#USER_ID 7!@#ACTIVITY_CODE 5
12/23/2022 02:09:40 AM script INFO: SUCCESS!@#KODE 1!@#USER_ID 7!@#ACTIVITY_CODE 2
12/23/2022 02:09:40 AM script INFO: SUCCESS!@#KODE 1!@#USER_ID 7!@#ACTIVITY_CODE 2
12/23/2022 02:09:41 AM script INFO: SUCCESS!@#KODE 1!@#USER_ID 7!@#ACTIVITY_CODE 1
12/23/2022 02:09:41 AM script INFO: SUCCESS!@#KODE 1!@#USER_ID 7!@#ACTIVITY_CODE 1
12/23/2022 02:09:41 AM script INFO: SUCCESS!@#KODE 1!@#USER_ID 7!@#ACTIVITY_CODE 5
12/23/2022 02:09:41 AM script INFO: SUCCESS!@#KODE 1!@#USER_ID 7!@#ACTIVITY_CODE 5
12/23/2022 02:09:43 AM script INFO: SUCCESS!@#KODE 1!@#USER_ID 7!@#ACTIVITY_CODE 2
12/23/2022 02:09:43 AM script INFO: SUCCESS!@#KODE 1!@#USER_ID 7!@#ACTIVITY_CODE 4
12/23/2022 02:09:43 AM script INFO: SUCCESS!@#KODE 1!@#USER_ID 7!@#ACTIVITY_CODE 3
12/23/2022 02:09:43 AM script INFO: SUCCESS!@#KODE 1!@#USER_ID 7!@#ACTIVITY_CODE 1
12/23/2022 02:09:43 AM script INFO: SUCCESS!@#KODE 1!@#USER_ID 7!@#ACTIVITY_CODE 3
12/23/2022 02:09:44 AM script INFO: SUCCESS!@#KODE 1!@#USER_ID 7!@#ACTIVITY_CODE 3
12/23/2022 02:09:44 AM script INFO: SUCCESS!@#KODE 1!@#USER_ID 7!@#ACTIVITY_CODE 1
12/23/2022 02:09:44 AM script INFO: SUCCESS!@#KODE 1!@#USER_ID 7!@#ACTIVITY_CODE 2
12/23/2022 02:09:44 AM script INFO: SUCCESS!@#KODE 1!@#USER_ID 7!@#ACTIVITY_CODE 3
12/23/2022 02:09:44 AM script INFO: SUCCESS!@#KODE 1!@#USER_ID 7!@#ACTIVITY_CODE 3
12/23/2022 02:09:44 AM script INFO: SUCCESS!@#KODE 1!@#USER_ID 7!@#ACTIVITY_CODE 3
12/23/2022 02:09:44 AM script INFO: SUCCESS!@#KODE 1!@#USER_ID 7!@#ACTIVITY_CODE 3
12/23/2022 02:09:44 AM script INFO: SUCCESS!@#KODE 1!@#USER_ID 7!@#ACTIVITY_CODE 1
12/23/2022 02:09:44 AM script INFO: SUCCESS!@#KODE 1!@#USER_ID 7!@#ACTIVITY_CODE 1
12/23/2022 02:09:44 AM script INFO: SUCCESS!@#KODE 1!@#USER_ID 7!@#ACTIVITY_CODE 2
12/23/2022 02:09:44 AM script INFO: SUCCESS!@#KODE 1!@#USER_ID 7!@#ACTIVITY_CODE 3
12/23/2022 02:09:44 AM script INFO: SUCCESS!@#KODE 1!@#USER_ID 7!@#ACTIVITY_CODE 3
12/23/2022 02:09:44 AM script INFO: SUCCESS!@#KODE 1!@#USER_ID 7!@#ACTIVITY_CODE 1
12/23/2022 02:09:44 AM script INFO: SUCCESS!@#KODE 1!@#USER_ID 7!@#ACTIVITY_CODE 2
12/23/2022 02:09:45 AM script INFO: SUCCESS!@#KODE 1!@#USER_ID 7!@#ACTIVITY_CODE 2
12/23/2022 02:09:45 AM script INFO: SUCCESS!@#KODE 1!@#USER_ID 7!@#ACTIVITY_CODE 1
12/23/2022 02:09:45 AM script INFO: SUCCESS!@#KODE 1!@#USER_ID 7!@#ACTIVITY_CODE 1
12/23/2022 02:09:45 AM script INFO: SUCCESS!@#KODE 1!@#USER_ID 7!@#ACTIVITY_CODE 2
12/23/2022 02:09:45 AM script INFO: SUCCESS!@#KODE 1!@#USER_ID 7!@#ACTIVITY_CODE 1
12/23/2022 02:09:45 AM script INFO: SUCCESS!@#KODE 1!@#USER_ID 7!@#ACTIVITY_CODE 3
12/23/2022 02:09:45 AM script INFO: SUCCESS!@#KODE 1!@#USER_ID 7!@#ACTIVITY_CODE 3
12/23/2022 02:09:45 AM script INFO: SUCCESS!@#KODE 1!@#USER_ID 7!@#ACTIVITY_CODE 1
12/23/2022 02:09:45 AM script INFO: SUCCESS!@#KODE 1!@#USER_ID 7!@#ACTIVITY_CODE 2
12/23/2022 02:09:45 AM script INFO: SUCCESS!@#KODE 1!@#USER_ID 7!@#ACTIVITY_CODE 3
12/23/2022 02:09:45 AM script INFO: SUCCESS!@#KODE 1!@#USER_ID 7!@#ACTIVITY_CODE 1
12/23/2022 02:09:45 AM script INFO: SUCCESS!@#KODE 1!@#USER_ID 7!@#ACTIVITY_CODE 3
12/23/2022 02:09:45 AM script INFO: SUCCESS!@#KODE 1!@#USER_ID 7!@#ACTIVITY_CODE 4
12/23/2022 02:09:45 AM script INFO: SUCCESS!@#KODE 1!@#USER_ID 7!@#ACTIVITY_CODE 3
12/23/2022 02:09:45 AM script INFO: SUCCESS!@#KODE 1!@#USER_ID 7!@#ACTIVITY_CODE 2
12/23/2022 02:09:46 AM script INFO: SUCCESS!@#KODE 1!@#USER_ID 7!@#ACTIVITY_CODE 1
12/23/2022 02:09:46 AM script INFO: SUCCESS!@#KODE 1!@#USER_ID 7!@#ACTIVITY_CODE 2
12/23/2022 02:09:46 AM script INFO: SUCCESS!@#KODE 1!@#USER_ID 7!@#ACTIVITY_CODE 3
12/23/2022 02:09:46 AM script INFO: SUCCESS!@#KODE 1!@#USER_ID 7!@#ACTIVITY_CODE 2
12/23/2022 02:09:46 AM script INFO: SUCCESS!@#KODE 1!@#USER_ID 7!@#ACTIVITY_CODE 3
12/23/2022 02:09:46 AM script INFO: SUCCESS!@#KODE 1!@#USER_ID 7!@#ACTIVITY_CODE 1
12/23/2022 02:09:46 AM script INFO: SUCCESS!@#KODE 1!@#USER_ID 7!@#ACTIVITY_CODE 2
12/23/2022 02:09:46 AM script INFO: SUCCESS!@#KODE 1!@#USER_ID 7!@#ACTIVITY_CODE 3
12/23/2022 02:09:46 AM script INFO: SUCCESS!@#KODE 1!@#USER_ID 7!@#ACTIVITY_CODE 3
12/23/2022 02:09:46 AM script INFO: SUCCESS!@#KODE 1!@#USER_ID 7!@#ACTIVITY_CODE 3
12/23/2022 02:09:46 AM script INFO: SUCCESS!@#KODE 1!@#USER_ID 7!@#ACTIVITY_CODE 4
12/23/2022 02:09:46 AM script INFO: SUCCESS!@#KODE 1!@#USER_ID 7!@#ACTIVITY_CODE 1
12/23/2022 02:09:46 AM script INFO: SUCCESS!@#KODE 1!@#USER_ID 7!@#ACTIVITY_CODE 3
12/23/2022 02:09:47 AM script INFO: SUCCESS!@#KODE 1!@#USER_ID 7!@#ACTIVITY_CODE 3
12/23/2022 02:09:47 AM script INFO: SUCCESS!@#KODE 1!@#USER_ID 7!@#ACTIVITY_CODE 4
12/23/2022 02:09:47 AM script INFO: SUCCESS!@#KODE 1!@#USER_ID 7!@#ACTIVITY_CODE 2
12/23/2022 02:09:47 AM script INFO: SUCCESS!@#KODE 1!@#USER_ID 7!@#ACTIVITY_CODE 2
12/23/2022 02:09:47 AM script INFO: SUCCESS!@#KODE 1!@#USER_ID 7!@#ACTIVITY_CODE 1
12/23/2022 02:09:47 AM script INFO: SUCCESS!@#KODE 1!@#USER_ID 7!@#ACTIVITY_CODE 2
12/23/2022 02:09:47 AM script INFO: SUCCESS!@#KODE 1!@#USER_ID 7!@#ACTIVITY_CODE 3
12/23/2022 02:09:47 AM script INFO: SUCCESS!@#KODE 1!@#USER_ID 7!@#ACTIVITY_CODE 1
12/23/2022 02:09:47 AM script INFO: SUCCESS!@#KODE 1!@#USER_ID 7!@#ACTIVITY_CODE 1
12/23/2022 02:09:47 AM script INFO: SUCCESS!@#KODE 1!@#USER_ID 7!@#ACTIVITY_CODE 2
12/23/2022 02:09:47 AM script INFO: SUCCESS!@#KODE 1!@#USER_ID 7!@#ACTIVITY_CODE 2
12/23/2022 02:09:48 AM script INFO: SUCCESS!@#KODE 1!@#USER_ID 7!@#ACTIVITY_CODE 4
12/23/2022 02:09:48 AM script INFO: SUCCESS!@#KODE 1!@#USER_ID 7!@#ACTIVITY_CODE 3
12/23/2022 02:09:48 AM script INFO: SUCCESS!@#KODE 1!@#USER_ID 7!@#ACTIVITY_CODE 2
12/23/2022 02:09:48 AM script INFO: SUCCESS!@#KODE 1!@#USER_ID 7!@#ACTIVITY_CODE 3
12/23/2022 02:09:48 AM script INFO: SUCCESS!@#KODE 1!@#USER_ID 7!@#ACTIVITY_CODE 2
12/23/2022 02:09:48 AM script INFO: SUCCESS!@#KODE 1!@#USER_ID 7!@#ACTIVITY_CODE 2
12/23/2022 02:09:48 AM script INFO: SUCCESS!@#KODE 1!@#USER_ID 7!@#ACTIVITY_CODE 1
12/23/2022 02:09:48 AM script INFO: SUCCESS!@#KODE 1!@#USER_ID 7!@#ACTIVITY_CODE 4
12/23/2022 02:09:48 AM script INFO: SUCCESS!@#KODE 1!@#USER_ID 7!@#ACTIVITY_CODE 3
12/23/2022 02:09:48 AM script INFO: SUCCESS!@#KODE 1!@#USER_ID 7!@#ACTIVITY_CODE 1
12/23/2022 02:09:48 AM script INFO: SUCCESS!@#KODE 1!@#USER_ID 7!@#ACTIVITY_CODE 1
12/23/2022 02:09:48 AM script INFO: SUCCESS!@#KODE 1!@#USER_ID 7!@#ACTIVITY_CODE 3
12/23/2022 02:09:48 AM script INFO: SUCCESS!@#KODE 1!@#USER_ID 7!@#ACTIVITY_CODE 1
12/23/2022 02:09:49 AM script INFO: SUCCESS!@#KODE 1!@#USER_ID 7!@#ACTIVITY_CODE 4
12/23/2022 02:09:49 AM script INFO: SUCCESS!@#KODE 1!@#USER_ID 7!@#ACTIVITY_CODE 3
12/23/2022 02:09:49 AM script INFO: SUCCESS!@#KODE 1!@#USER_ID 7!@#ACTIVITY_CODE 2
12/23/2022 02:09:49 AM script INFO: SUCCESS!@#KODE 1!@#USER_ID 7!@#ACTIVITY_CODE 2
12/23/2022 02:09:49 AM script INFO: SUCCESS!@#KODE 1!@#USER_ID 7!@#ACTIVITY_CODE 2
12/23/2022 02:09:49 AM script INFO: SUCCESS!@#KODE 1!@#USER_ID 7!@#ACTIVITY_CODE 4
12/23/2022 02:09:49 AM script INFO: SUCCESS!@#KODE 1!@#USER_ID 7!@#ACTIVITY_CODE 3
12/23/2022 02:09:49 AM script INFO: SUCCESS!@#KODE 1!@#USER_ID 7!@#ACTIVITY_CODE 1
12/23/2022 02:09:49 AM script INFO: SUCCESS!@#KODE 1!@#USER_ID 7!@#ACTIVITY_CODE 4
12/23/2022 02:09:49 AM script INFO: SUCCESS!@#KODE 1!@#USER_ID 7!@#ACTIVITY_CODE 1
12/23/2022 02:09:50 AM script INFO: SUCCESS!@#KODE 1!@#USER_ID 7!@#ACTIVITY_CODE 2
12/23/2022 02:09:50 AM script INFO: SUCCESS!@#KODE 1!@#USER_ID 7!@#ACTIVITY_CODE 3
12/23/2022 02:09:50 AM script INFO: SUCCESS!@#KODE 1!@#USER_ID 7!@#ACTIVITY_CODE 1
12/23/2022 02:09:50 AM script INFO: SUCCESS!@#KODE 1!@#USER_ID 7!@#ACTIVITY_CODE 1
12/23/2022 02:09:50 AM script INFO: SUCCESS!@#KODE 1!@#USER_ID 7!@#ACTIVITY_CODE 3
12/23/2022 02:09:50 AM script INFO: SUCCESS!@#KODE 1!@#USER_ID 7!@#ACTIVITY_CODE 1
12/23/2022 02:09:50 AM script INFO: SUCCESS!@#KODE 1!@#USER_ID 7!@#ACTIVITY_CODE 3
12/23/2022 02:09:50 AM script INFO: SUCCESS!@#KODE 1!@#USER_ID 7!@#ACTIVITY_CODE 4
12/23/2022 02:09:50 AM script INFO: SUCCESS!@#KODE 1!@#USER_ID 7!@#ACTIVITY_CODE 3
12/23/2022 02:09:50 AM script INFO: SUCCESS!@#KODE 1!@#USER_ID 7!@#ACTIVITY_CODE 2
12/23/2022 02:09:50 AM script INFO: SUCCESS!@#KODE 1!@#USER_ID 7!@#ACTIVITY_CODE 2
12/23/2022 02:09:50 AM script INFO: SUCCESS!@#KODE 1!@#USER_ID 7!@#ACTIVITY_CODE 1
12/23/2022 02:09:50 AM script INFO: SUCCESS!@#KODE 1!@#USER_ID 7!@#ACTIVITY_CODE 3
12/23/2022 02:09:51 AM script INFO: SUCCESS!@#KODE 1!@#USER_ID 7!@#ACTIVITY_CODE 3
12/23/2022 02:09:51 AM script INFO: SUCCESS!@#KODE 1!@#USER_ID 7!@#ACTIVITY_CODE 2
12/23/2022 02:09:51 AM script INFO: SUCCESS!@#KODE 1!@#USER_ID 7!@#ACTIVITY_CODE 3
12/23/2022 02:09:51 AM script INFO: SUCCESS!@#KODE 1!@#USER_ID 7!@#ACTIVITY_CODE 1
12/23/2022 02:09:51 AM script INFO: SUCCESS!@#KODE 1!@#USER_ID 7!@#ACTIVITY_CODE 1
12/23/2022 02:09:51 AM script INFO: SUCCESS!@#KODE 1!@#USER_ID 7!@#ACTIVITY_CODE 2
12/23/2022 02:09:51 AM script INFO: SUCCESS!@#KODE 1!@#USER_ID 7!@#ACTIVITY_CODE 1
12/23/2022 02:09:51 AM script INFO: SUCCESS!@#KODE 1!@#USER_ID 7!@#ACTIVITY_CODE 3
12/23/2022 02:09:51 AM script INFO: SUCCESS!@#KODE 1!@#USER_ID 7!@#ACTIVITY_CODE 3
12/23/2022 02:09:51 AM script INFO: SUCCESS!@#KODE 1!@#USER_ID 7!@#ACTIVITY_CODE 1
12/23/2022 02:09:51 AM script INFO: SUCCESS!@#KODE 1!@#USER_ID 7!@#ACTIVITY_CODE 2
12/23/2022 02:09:51 AM script INFO: SUCCESS!@#KODE 1!@#USER_ID 7!@#ACTIVITY_CODE 1
12/23/2022 02:09:52 AM script INFO: SUCCESS!@#KODE 1!@#USER_ID 7!@#ACTIVITY_CODE 2
12/23/2022 02:09:52 AM script INFO: SUCCESS!@#KODE 1!@#USER_ID 7!@#ACTIVITY_CODE 2
12/23/2022 02:09:52 AM script INFO: SUCCESS!@#KODE 1!@#USER_ID 7!@#ACTIVITY_CODE 1
12/23/2022 02:09:52 AM script INFO: SUCCESS!@#KODE 1!@#USER_ID 7!@#ACTIVITY_CODE 3
12/23/2022 02:09:52 AM script INFO: SUCCESS!@#KODE 1!@#USER_ID 7!@#ACTIVITY_CODE 3
12/23/2022 02:09:52 AM script INFO: SUCCESS!@#KODE 1!@#USER_ID 7!@#ACTIVITY_CODE 3
12/23/2022 02:09:52 AM script INFO: SUCCESS!@#KODE 1!@#USER_ID 7!@#ACTIVITY_CODE 2
12/23/2022 02:09:52 AM script INFO: SUCCESS!@#KODE 1!@#USER_ID 7!@#ACTIVITY_CODE 2
12/23/2022 02:09:52 AM script INFO: SUCCESS!@#KODE 1!@#USER_ID 7!@#ACTIVITY_CODE 2
12/23/2022 02:09:52 AM script INFO: SUCCESS!@#KODE 1!@#USER_ID 7!@#ACTIVITY_CODE 1
12/23/2022 02:09:53 AM script INFO: SUCCESS!@#KODE 1!@#USER_ID 7!@#ACTIVITY_CODE 2
12/23/2022 02:09:53 AM script INFO: SUCCESS!@#KODE 1!@#USER_ID 7!@#ACTIVITY_CODE 2
12/23/2022 02:09:53 AM script INFO: SUCCESS!@#KODE 1!@#USER_ID 7!@#ACTIVITY_CODE 1
12/23/2022 02:09:53 AM script INFO: SUCCESS!@#KODE 1!@#USER_ID 7!@#ACTIVITY_CODE 3
12/23/2022 02:09:53 AM script INFO: SUCCESS!@#KODE 1!@#USER_ID 7!@#ACTIVITY_CODE 1
12/23/2022 02:09:53 AM script INFO: SUCCESS!@#KODE 1!@#USER_ID 7!@#ACTIVITY_CODE 2
12/23/2022 02:09:53 AM script INFO: SUCCESS!@#KODE 1!@#USER_ID 7!@#ACTIVITY_CODE 2
12/23/2022 02:09:53 AM script INFO: SUCCESS!@#KODE 1!@#USER_ID 7!@#ACTIVITY_CODE 1
12/23/2022 02:09:53 AM script INFO: SUCCESS!@#KODE 1!@#USER_ID 7!@#ACTIVITY_CODE 4
12/23/2022 02:09:53 AM script INFO: SUCCESS!@#KODE 1!@#USER_ID 7!@#ACTIVITY_CODE 2
12/23/2022 02:09:54 AM script INFO: SUCCESS!@#KODE 1!@#USER_ID 7!@#ACTIVITY_CODE 2
12/23/2022 02:09:54 AM script INFO: SUCCESS!@#KODE 1!@#USER_ID 7!@#ACTIVITY_CODE 2
12/23/2022 02:09:54 AM script INFO: SUCCESS!@#KODE 1!@#USER_ID 7!@#ACTIVITY_CODE 3
12/23/2022 02:09:54 AM script INFO: SUCCESS!@#KODE 1!@#USER_ID 7!@#ACTIVITY_CODE 3
12/23/2022 02:09:54 AM script INFO: SUCCESS!@#KODE 1!@#USER_ID 7!@#ACTIVITY_CODE 4
12/23/2022 02:09:54 AM script INFO: SUCCESS!@#KODE 1!@#USER_ID 7!@#ACTIVITY_CODE 3
12/23/2022 02:09:54 AM script INFO: SUCCESS!@#KODE 1!@#USER_ID 7!@#ACTIVITY_CODE 1
12/23/2022 02:09:54 AM script INFO: SUCCESS!@#KODE 1!@#USER_ID 7!@#ACTIVITY_CODE 4
12/23/2022 02:09:54 AM script INFO: SUCCESS!@#KODE 1!@#USER_ID 7!@#ACTIVITY_CODE 3
12/23/2022 02:09:54 AM script INFO: SUCCESS!@#KODE 1!@#USER_ID 7!@#ACTIVITY_CODE 2
12/23/2022 02:09:55 AM script INFO: SUCCESS!@#KODE 1!@#USER_ID 7!@#ACTIVITY_CODE 1
12/23/2022 02:09:55 AM script INFO: SUCCESS!@#KODE 1!@#USER_ID 7!@#ACTIVITY_CODE 2
12/23/2022 02:09:55 AM script INFO: SUCCESS!@#KODE 1!@#USER_ID 7!@#ACTIVITY_CODE 3
12/23/2022 02:09:55 AM script INFO: SUCCESS!@#KODE 1!@#USER_ID 7!@#ACTIVITY_CODE 2
12/23/2022 02:09:55 AM script INFO: SUCCESS!@#KODE 1!@#USER_ID 7!@#ACTIVITY_CODE 3
12/23/2022 02:09:55 AM script INFO: SUCCESS!@#KODE 1!@#USER_ID 7!@#ACTIVITY_CODE 2
12/23/2022 02:09:55 AM script INFO: SUCCESS!@#KODE 1!@#USER_ID 7!@#ACTIVITY_CODE 2
12/23/2022 02:09:55 AM script INFO: SUCCESS!@#KODE 1!@#USER_ID 7!@#ACTIVITY_CODE 1
12/23/2022 02:09:55 AM script INFO: SUCCESS!@#KODE 1!@#USER_ID 7!@#ACTIVITY_CODE 1
12/23/2022 02:09:56 AM script INFO: SUCCESS!@#KODE 1!@#USER_ID 7!@#ACTIVITY_CODE 2
12/23/2022 02:09:56 AM script INFO: SUCCESS!@#KODE 1!@#USER_ID 7!@#ACTIVITY_CODE 2
12/23/2022 02:09:56 AM script INFO: SUCCESS!@#KODE 1!@#USER_ID 7!@#ACTIVITY_CODE 3
12/23/2022 02:09:56 AM script INFO: SUCCESS!@#KODE 1!@#USER_ID 7!@#ACTIVITY_CODE 1
12/23/2022 02:09:56 AM script INFO: SUCCESS!@#KODE 1!@#USER_ID 7!@#ACTIVITY_CODE 4
12/23/2022 02:09:56 AM script INFO: SUCCESS!@#KODE 1!@#USER_ID 7!@#ACTIVITY_CODE 2
12/23/2022 02:09:56 AM script INFO: SUCCESS!@#KODE 1!@#USER_ID 7!@#ACTIVITY_CODE 1
12/23/2022 02:09:56 AM script INFO: SUCCESS!@#KODE 1!@#USER_ID 7!@#ACTIVITY_CODE 3
12/23/2022 02:09:56 AM script INFO: SUCCESS!@#KODE 1!@#USER_ID 7!@#ACTIVITY_CODE 1
12/23/2022 02:09:56 AM script INFO: SUCCESS!@#KODE 1!@#USER_ID 7!@#ACTIVITY_CODE 4
12/23/2022 02:09:56 AM script INFO: SUCCESS!@#KODE 1!@#USER_ID 7!@#ACTIVITY_CODE 1
12/23/2022 02:09:56 AM script INFO: SUCCESS!@#KODE 1!@#USER_ID 7!@#ACTIVITY_CODE 4
12/23/2022 02:09:56 AM script INFO: SUCCESS!@#KODE 1!@#USER_ID 7!@#ACTIVITY_CODE 1
12/23/2022 02:09:57 AM script INFO: SUCCESS!@#KODE 1!@#USER_ID 7!@#ACTIVITY_CODE 4
12/23/2022 02:09:57 AM script INFO: SUCCESS!@#KODE 1!@#USER_ID 7!@#ACTIVITY_CODE 3
12/23/2022 02:09:57 AM script INFO: SUCCESS!@#KODE 1!@#USER_ID 7!@#ACTIVITY_CODE 2
12/23/2022 02:09:57 AM script INFO: SUCCESS!@#KODE 1!@#USER_ID 7!@#ACTIVITY_CODE 3
12/23/2022 02:09:57 AM script INFO: SUCCESS!@#KODE 1!@#USER_ID 7!@#ACTIVITY_CODE 2
12/23/2022 02:09:57 AM script INFO: SUCCESS!@#KODE 1!@#USER_ID 7!@#ACTIVITY_CODE 2
12/23/2022 02:09:57 AM script INFO: SUCCESS!@#KODE 1!@#USER_ID 7!@#ACTIVITY_CODE 3
12/23/2022 02:09:57 AM script INFO: SUCCESS!@#KODE 1!@#USER_ID 7!@#ACTIVITY_CODE 3
12/23/2022 02:09:57 AM script INFO: SUCCESS!@#KODE 1!@#USER_ID 7!@#ACTIVITY_CODE 3
12/23/2022 02:09:57 AM script INFO: SUCCESS!@#KODE 1!@#USER_ID 7!@#ACTIVITY_CODE 3
12/23/2022 02:09:57 AM script INFO: SUCCESS!@#KODE 1!@#USER_ID 7!@#ACTIVITY_CODE 1
12/23/2022 02:09:58 AM script INFO: SUCCESS!@#KODE 1!@#USER_ID 7!@#ACTIVITY_CODE 2
12/23/2022 02:09:58 AM script INFO: SUCCESS!@#KODE 1!@#USER_ID 7!@#ACTIVITY_CODE 3
12/23/2022 02:09:58 AM script INFO: SUCCESS!@#KODE 1!@#USER_ID 7!@#ACTIVITY_CODE 2
12/23/2022 02:09:58 AM script INFO: SUCCESS!@#KODE 1!@#USER_ID 7!@#ACTIVITY_CODE 1
12/23/2022 02:09:58 AM script INFO: SUCCESS!@#KODE 1!@#USER_ID 7!@#ACTIVITY_CODE 4
12/23/2022 02:09:58 AM script INFO: SUCCESS!@#KODE 1!@#USER_ID 7!@#ACTIVITY_CODE 3
12/23/2022 02:09:58 AM script INFO: SUCCESS!@#KODE 1!@#USER_ID 7!@#ACTIVITY_CODE 1
12/23/2022 02:09:58 AM script INFO: SUCCESS!@#KODE 1!@#USER_ID 7!@#ACTIVITY_CODE 4
12/23/2022 02:09:58 AM script INFO: SUCCESS!@#KODE 1!@#USER_ID 7!@#ACTIVITY_CODE 1
12/23/2022 02:09:58 AM script INFO: SUCCESS!@#KODE 1!@#USER_ID 7!@#ACTIVITY_CODE 4
12/23/2022 02:09:58 AM script INFO: SUCCESS!@#KODE 1!@#USER_ID 7!@#ACTIVITY_CODE 1
12/23/2022 02:09:58 AM script INFO: SUCCESS!@#KODE 1!@#USER_ID 7!@#ACTIVITY_CODE 2
12/23/2022 02:09:58 AM script INFO: SUCCESS!@#KODE 1!@#USER_ID 7!@#ACTIVITY_CODE 1
12/23/2022 02:09:59 AM script INFO: SUCCESS!@#KODE 1!@#USER_ID 7!@#ACTIVITY_CODE 2
12/23/2022 02:09:59 AM script INFO: SUCCESS!@#KODE 1!@#USER_ID 7!@#ACTIVITY_CODE 4
12/23/2022 02:09:59 AM script INFO: SUCCESS!@#KODE 1!@#USER_ID 7!@#ACTIVITY_CODE 3
12/23/2022 02:09:59 AM script INFO: SUCCESS!@#KODE 1!@#USER_ID 7!@#ACTIVITY_CODE 1
12/23/2022 02:09:59 AM script INFO: SUCCESS!@#KODE 1!@#USER_ID 7!@#ACTIVITY_CODE 1
12/23/2022 02:09:59 AM script INFO: SUCCESS!@#KODE 1!@#USER_ID 7!@#ACTIVITY_CODE 2
12/23/2022 02:09:59 AM script INFO: SUCCESS!@#KODE 1!@#USER_ID 7!@#ACTIVITY_CODE 1
12/23/2022 02:09:59 AM script INFO: SUCCESS!@#KODE 1!@#USER_ID 7!@#ACTIVITY_CODE 1
12/23/2022 02:09:59 AM script INFO: SUCCESS!@#KODE 1!@#USER_ID 7!@#ACTIVITY_CODE 2
12/23/2022 02:09:59 AM script INFO: SUCCESS!@#KODE 1!@#USER_ID 7!@#ACTIVITY_CODE 1
12/23/2022 02:09:59 AM script INFO: SUCCESS!@#KODE 1!@#USER_ID 7!@#ACTIVITY_CODE 1
12/23/2022 02:09:59 AM script INFO: SUCCESS!@#KODE 1!@#USER_ID 7!@#ACTIVITY_CODE 4
12/23/2022 02:09:59 AM script INFO: SUCCESS!@#KODE 1!@#USER_ID 7!@#ACTIVITY_CODE 3
12/23/2022 02:10:00 AM script INFO: SUCCESS!@#KODE 1!@#USER_ID 7!@#ACTIVITY_CODE 3
12/23/2022 02:10:00 AM script INFO: SUCCESS!@#KODE 1!@#USER_ID 7!@#ACTIVITY_CODE 3
12/23/2022 02:10:00 AM script INFO: SUCCESS!@#KODE 1!@#USER_ID 7!@#ACTIVITY_CODE 2
12/23/2022 02:10:00 AM script INFO: SUCCESS!@#KODE 1!@#USER_ID 7!@#ACTIVITY_CODE 4
12/23/2022 02:10:00 AM script INFO: SUCCESS!@#KODE 1!@#USER_ID 7!@#ACTIVITY_CODE 3
12/23/2022 02:10:00 AM script INFO: SUCCESS!@#KODE 1!@#USER_ID 7!@#ACTIVITY_CODE 1
12/23/2022 02:10:00 AM script INFO: SUCCESS!@#KODE 1!@#USER_ID 7!@#ACTIVITY_CODE 1
12/23/2022 02:10:00 AM script INFO: SUCCESS!@#KODE 1!@#USER_ID 7!@#ACTIVITY_CODE 3
12/23/2022 02:10:00 AM script INFO: SUCCESS!@#KODE 1!@#USER_ID 7!@#ACTIVITY_CODE 4
12/23/2022 02:10:00 AM script INFO: SUCCESS!@#KODE 1!@#USER_ID 7!@#ACTIVITY_CODE 2
12/23/2022 02:10:00 AM script INFO: SUCCESS!@#KODE 1!@#USER_ID 7!@#ACTIVITY_CODE 2
12/23/2022 02:10:01 AM script INFO: SUCCESS!@#KODE 1!@#USER_ID 7!@#ACTIVITY_CODE 2
12/23/2022 02:10:01 AM script INFO: SUCCESS!@#KODE 1!@#USER_ID 7!@#ACTIVITY_CODE 3
12/23/2022 02:10:01 AM script INFO: SUCCESS!@#KODE 1!@#USER_ID 7!@#ACTIVITY_CODE 3
12/23/2022 02:10:01 AM script INFO: SUCCESS!@#KODE 1!@#USER_ID 7!@#ACTIVITY_CODE 2
12/23/2022 02:10:01 AM script INFO: SUCCESS!@#KODE 1!@#USER_ID 7!@#ACTIVITY_CODE 1
12/23/2022 02:10:01 AM script INFO: SUCCESS!@#KODE 1!@#USER_ID 7!@#ACTIVITY_CODE 1
12/23/2022 02:10:01 AM script INFO: SUCCESS!@#KODE 1!@#USER_ID 7!@#ACTIVITY_CODE 2
12/23/2022 02:10:01 AM script INFO: SUCCESS!@#KODE 1!@#USER_ID 7!@#ACTIVITY_CODE 3
12/23/2022 02:10:01 AM script INFO: SUCCESS!@#KODE 1!@#USER_ID 7!@#ACTIVITY_CODE 1
12/23/2022 02:10:01 AM script INFO: SUCCESS!@#KODE 1!@#USER_ID 7!@#ACTIVITY_CODE 2
12/23/2022 02:10:02 AM script INFO: SUCCESS!@#KODE 1!@#USER_ID 7!@#ACTIVITY_CODE 1
12/23/2022 02:10:02 AM script INFO: SUCCESS!@#KODE 1!@#USER_ID 7!@#ACTIVITY_CODE 3
12/23/2022 02:10:02 AM script INFO: SUCCESS!@#KODE 1!@#USER_ID 7!@#ACTIVITY_CODE 2
12/23/2022 02:10:02 AM script INFO: SUCCESS!@#KODE 1!@#USER_ID 7!@#ACTIVITY_CODE 1
12/23/2022 02:10:02 AM script INFO: SUCCESS!@#KODE 1!@#USER_ID 7!@#ACTIVITY_CODE 1
12/23/2022 02:10:02 AM script INFO: SUCCESS!@#KODE 1!@#USER_ID 7!@#ACTIVITY_CODE 2
12/23/2022 02:10:02 AM script INFO: SUCCESS!@#KODE 1!@#USER_ID 7!@#ACTIVITY_CODE 3
12/23/2022 02:10:02 AM script INFO: SUCCESS!@#KODE 1!@#USER_ID 7!@#ACTIVITY_CODE 3
12/23/2022 02:10:02 AM script INFO: SUCCESS!@#KODE 1!@#USER_ID 7!@#ACTIVITY_CODE 2
12/23/2022 02:10:02 AM script INFO: SUCCESS!@#KODE 1!@#USER_ID 7!@#ACTIVITY_CODE 2
12/23/2022 02:10:03 AM script INFO: SUCCESS!@#KODE 1!@#USER_ID 7!@#ACTIVITY_CODE 2
12/23/2022 02:10:03 AM script INFO: SUCCESS!@#KODE 1!@#USER_ID 7!@#ACTIVITY_CODE 2
12/23/2022 02:10:03 AM script INFO: SUCCESS!@#KODE 1!@#USER_ID 7!@#ACTIVITY_CODE 2
12/23/2022 02:10:03 AM script INFO: SUCCESS!@#KODE 1!@#USER_ID 7!@#ACTIVITY_CODE 1
12/23/2022 02:10:03 AM script INFO: SUCCESS!@#KODE 1!@#USER_ID 7!@#ACTIVITY_CODE 1
12/23/2022 02:10:03 AM script INFO: SUCCESS!@#KODE 1!@#USER_ID 7!@#ACTIVITY_CODE 1
12/23/2022 02:10:03 AM script INFO: SUCCESS!@#KODE 1!@#USER_ID 7!@#ACTIVITY_CODE 2
12/23/2022 02:10:03 AM script INFO: SUCCESS!@#KODE 1!@#USER_ID 7!@#ACTIVITY_CODE 3
12/23/2022 02:10:03 AM script INFO: SUCCESS!@#KODE 1!@#USER_ID 7!@#ACTIVITY_CODE 3
12/23/2022 02:10:03 AM script INFO: SUCCESS!@#KODE 1!@#USER_ID 7!@#ACTIVITY_CODE 2
12/23/2022 02:10:04 AM script INFO: SUCCESS!@#KODE 1!@#USER_ID 7!@#ACTIVITY_CODE 1
12/23/2022 02:10:04 AM script INFO: SUCCESS!@#KODE 1!@#USER_ID 7!@#ACTIVITY_CODE 2
12/23/2022 02:10:04 AM script INFO: SUCCESS!@#KODE 1!@#USER_ID 7!@#ACTIVITY_CODE 2
12/23/2022 02:10:04 AM script INFO: SUCCESS!@#KODE 1!@#USER_ID 7!@#ACTIVITY_CODE 1
12/23/2022 02:10:04 AM script INFO: SUCCESS!@#KODE 1!@#USER_ID 7!@#ACTIVITY_CODE 2
12/23/2022 02:10:04 AM script INFO: SUCCESS!@#KODE 1!@#USER_ID 7!@#ACTIVITY_CODE 1
12/23/2022 02:10:04 AM script INFO: SUCCESS!@#KODE 1!@#USER_ID 7!@#ACTIVITY_CODE 1
12/23/2022 02:10:04 AM script INFO: SUCCESS!@#KODE 1!@#USER_ID 7!@#ACTIVITY_CODE 4
12/23/2022 02:10:04 AM script INFO: SUCCESS!@#KODE 1!@#USER_ID 7!@#ACTIVITY_CODE 2
12/23/2022 02:10:04 AM script INFO: SUCCESS!@#KODE 1!@#USER_ID 7!@#ACTIVITY_CODE 3
12/23/2022 02:10:05 AM script INFO: SUCCESS!@#KODE 1!@#USER_ID 7!@#ACTIVITY_CODE 1
12/23/2022 02:10:05 AM script INFO: SUCCESS!@#KODE 1!@#USER_ID 7!@#ACTIVITY_CODE 2
12/23/2022 02:10:05 AM script INFO: SUCCESS!@#KODE 1!@#USER_ID 7!@#ACTIVITY_CODE 1
12/23/2022 02:10:05 AM script INFO: SUCCESS!@#KODE 1!@#USER_ID 7!@#ACTIVITY_CODE 2
12/23/2022 02:10:05 AM script INFO: SUCCESS!@#KODE 1!@#USER_ID 7!@#ACTIVITY_CODE 3
12/23/2022 02:10:05 AM script INFO: SUCCESS!@#KODE 1!@#USER_ID 7!@#ACTIVITY_CODE 2
12/23/2022 02:10:05 AM script INFO: SUCCESS!@#KODE 1!@#USER_ID 7!@#ACTIVITY_CODE 3
12/23/2022 02:10:05 AM script INFO: SUCCESS!@#KODE 1!@#USER_ID 7!@#ACTIVITY_CODE 2
12/23/2022 02:10:05 AM script INFO: SUCCESS!@#KODE 1!@#USER_ID 7!@#ACTIVITY_CODE 4
12/23/2022 02:10:05 AM script INFO: SUCCESS!@#KODE 1!@#USER_ID 7!@#ACTIVITY_CODE 1
12/23/2022 02:10:05 AM script INFO: SUCCESS!@#KODE 1!@#USER_ID 7!@#ACTIVITY_CODE 1
12/23/2022 02:10:06 AM script INFO: SUCCESS!@#KODE 1!@#USER_ID 7!@#ACTIVITY_CODE 2
12/23/2022 02:10:06 AM script INFO: SUCCESS!@#KODE 1!@#USER_ID 7!@#ACTIVITY_CODE 2
12/23/2022 02:10:06 AM script INFO: SUCCESS!@#KODE 1!@#USER_ID 7!@#ACTIVITY_CODE 2
12/23/2022 02:10:06 AM script INFO: SUCCESS!@#KODE 1!@#USER_ID 7!@#ACTIVITY_CODE 3
12/23/2022 02:10:06 AM script INFO: SUCCESS!@#KODE 1!@#USER_ID 7!@#ACTIVITY_CODE 3
12/23/2022 02:10:06 AM script INFO: SUCCESS!@#KODE 1!@#USER_ID 7!@#ACTIVITY_CODE 3
12/23/2022 02:10:06 AM script INFO: SUCCESS!@#KODE 1!@#USER_ID 7!@#ACTIVITY_CODE 3
12/23/2022 02:10:06 AM script INFO: SUCCESS!@#KODE 1!@#USER_ID 7!@#ACTIVITY_CODE 3
12/23/2022 02:10:06 AM script INFO: SUCCESS!@#KODE 1!@#USER_ID 7!@#ACTIVITY_CODE 3
12/23/2022 02:10:07 AM script INFO: SUCCESS!@#KODE 1!@#USER_ID 7!@#ACTIVITY_CODE 2
12/23/2022 02:10:07 AM script INFO: SUCCESS!@#KODE 1!@#USER_ID 7!@#ACTIVITY_CODE 4
12/23/2022 02:10:07 AM script INFO: SUCCESS!@#KODE 1!@#USER_ID 7!@#ACTIVITY_CODE 2
12/23/2022 02:10:07 AM script INFO: SUCCESS!@#KODE 1!@#USER_ID 7!@#ACTIVITY_CODE 3
12/23/2022 02:10:07 AM script INFO: SUCCESS!@#KODE 1!@#USER_ID 7!@#ACTIVITY_CODE 2
12/23/2022 02:10:07 AM script INFO: SUCCESS!@#KODE 1!@#USER_ID 7!@#ACTIVITY_CODE 2
12/23/2022 02:10:07 AM script INFO: SUCCESS!@#KODE 1!@#USER_ID 7!@#ACTIVITY_CODE 1
12/23/2022 02:10:07 AM script INFO: SUCCESS!@#KODE 1!@#USER_ID 7!@#ACTIVITY_CODE 3
12/23/2022 02:10:07 AM script INFO: SUCCESS!@#KODE 1!@#USER_ID 7!@#ACTIVITY_CODE 4
12/23/2022 02:10:07 AM script INFO: SUCCESS!@#KODE 1!@#USER_ID 7!@#ACTIVITY_CODE 3
12/23/2022 02:10:07 AM script INFO: SUCCESS!@#KODE 1!@#USER_ID 7!@#ACTIVITY_CODE 1
12/23/2022 02:10:08 AM script INFO: SUCCESS!@#KODE 1!@#USER_ID 7!@#ACTIVITY_CODE 3
12/23/2022 02:10:08 AM script INFO: SUCCESS!@#KODE 1!@#USER_ID 7!@#ACTIVITY_CODE 1
12/23/2022 02:10:08 AM script INFO: SUCCESS!@#KODE 1!@#USER_ID 7!@#ACTIVITY_CODE 4
12/23/2022 02:10:08 AM script INFO: SUCCESS!@#KODE 1!@#USER_ID 7!@#ACTIVITY_CODE 2
12/23/2022 02:10:08 AM script INFO: SUCCESS!@#KODE 1!@#USER_ID 7!@#ACTIVITY_CODE 2
12/23/2022 02:10:08 AM script INFO: SUCCESS!@#KODE 1!@#USER_ID 7!@#ACTIVITY_CODE 2
12/23/2022 02:10:08 AM script INFO: SUCCESS!@#KODE 1!@#USER_ID 7!@#ACTIVITY_CODE 1
12/23/2022 02:10:08 AM script INFO: SUCCESS!@#KODE 1!@#USER_ID 7!@#ACTIVITY_CODE 2
12/23/2022 02:10:08 AM script INFO: SUCCESS!@#KODE 1!@#USER_ID 7!@#ACTIVITY_CODE 2
12/23/2022 02:10:09 AM script INFO: SUCCESS!@#KODE 1!@#USER_ID 7!@#ACTIVITY_CODE 3
12/23/2022 02:10:09 AM script INFO: SUCCESS!@#KODE 1!@#USER_ID 7!@#ACTIVITY_CODE 1
12/23/2022 02:10:09 AM script INFO: SUCCESS!@#KODE 1!@#USER_ID 7!@#ACTIVITY_CODE 3
12/23/2022 02:10:09 AM script INFO: SUCCESS!@#KODE 1!@#USER_ID 7!@#ACTIVITY_CODE 2
12/23/2022 02:10:09 AM script INFO: SUCCESS!@#KODE 1!@#USER_ID 7!@#ACTIVITY_CODE 1
12/23/2022 02:10:09 AM script INFO: SUCCESS!@#KODE 1!@#USER_ID 7!@#ACTIVITY_CODE 3
12/23/2022 02:10:09 AM script INFO: SUCCESS!@#KODE 1!@#USER_ID 7!@#ACTIVITY_CODE 1
12/23/2022 02:10:09 AM script INFO: SUCCESS!@#KODE 1!@#USER_ID 7!@#ACTIVITY_CODE 1
12/23/2022 02:10:09 AM script INFO: SUCCESS!@#KODE 1!@#USER_ID 7!@#ACTIVITY_CODE 4
12/23/2022 02:10:09 AM script INFO: SUCCESS!@#KODE 1!@#USER_ID 7!@#ACTIVITY_CODE 1
12/23/2022 02:10:09 AM script INFO: SUCCESS!@#KODE 1!@#USER_ID 7!@#ACTIVITY_CODE 3
12/23/2022 02:10:09 AM script INFO: SUCCESS!@#KODE 1!@#USER_ID 7!@#ACTIVITY_CODE 3
12/23/2022 02:10:09 AM script INFO: SUCCESS!@#KODE 1!@#USER_ID 7!@#ACTIVITY_CODE 2
12/23/2022 02:10:09 AM script INFO: SUCCESS!@#KODE 1!@#USER_ID 7!@#ACTIVITY_CODE 1
12/23/2022 02:10:09 AM script INFO: SUCCESS!@#KODE 1!@#USER_ID 7!@#ACTIVITY_CODE 1
12/23/2022 02:10:10 AM script INFO: SUCCESS!@#KODE 1!@#USER_ID 7!@#ACTIVITY_CODE 1
12/23/2022 02:10:10 AM script INFO: SUCCESS!@#KODE 1!@#USER_ID 7!@#ACTIVITY_CODE 1
12/23/2022 02:10:10 AM script INFO: SUCCESS!@#KODE 1!@#USER_ID 7!@#ACTIVITY_CODE 3
12/23/2022 02:10:10 AM script INFO: SUCCESS!@#KODE 1!@#USER_ID 7!@#ACTIVITY_CODE 1
12/23/2022 02:10:10 AM script INFO: SUCCESS!@#KODE 1!@#USER_ID 7!@#ACTIVITY_CODE 4
12/23/2022 02:10:10 AM script INFO: SUCCESS!@#KODE 1!@#USER_ID 7!@#ACTIVITY_CODE 2
12/23/2022 02:10:10 AM script INFO: SUCCESS!@#KODE 1!@#USER_ID 7!@#ACTIVITY_CODE 3
12/23/2022 02:10:10 AM script INFO: SUCCESS!@#KODE 1!@#USER_ID 7!@#ACTIVITY_CODE 3
12/23/2022 02:10:10 AM script INFO: SUCCESS!@#KODE 1!@#USER_ID 7!@#ACTIVITY_CODE 1
12/23/2022 02:10:10 AM script INFO: SUCCESS!@#KODE 1!@#USER_ID 7!@#ACTIVITY_CODE 4
12/23/2022 02:10:10 AM script INFO: SUCCESS!@#KODE 1!@#USER_ID 7!@#ACTIVITY_CODE 1
12/23/2022 02:10:10 AM script INFO: SUCCESS!@#KODE 1!@#USER_ID 7!@#ACTIVITY_CODE 3
12/23/2022 02:10:10 AM script INFO: SUCCESS!@#KODE 1!@#USER_ID 7!@#ACTIVITY_CODE 3
12/23/2022 02:10:10 AM script INFO: SUCCESS!@#KODE 1!@#USER_ID 7!@#ACTIVITY_CODE 4
12/23/2022 02:10:11 AM script INFO: SUCCESS!@#KODE 1!@#USER_ID 7!@#ACTIVITY_CODE 2
12/23/2022 02:10:11 AM script INFO: SUCCESS!@#KODE 1!@#USER_ID 7!@#ACTIVITY_CODE 2
12/23/2022 02:10:11 AM script INFO: SUCCESS!@#KODE 1!@#USER_ID 7!@#ACTIVITY_CODE 3
12/23/2022 02:10:11 AM script INFO: SUCCESS!@#KODE 1!@#USER_ID 7!@#ACTIVITY_CODE 1
12/23/2022 02:10:11 AM script INFO: SUCCESS!@#KODE 1!@#USER_ID 7!@#ACTIVITY_CODE 2
12/23/2022 02:10:11 AM script INFO: SUCCESS!@#KODE 1!@#USER_ID 7!@#ACTIVITY_CODE 3
12/23/2022 02:10:11 AM script INFO: SUCCESS!@#KODE 1!@#USER_ID 7!@#ACTIVITY_CODE 3
12/23/2022 02:10:11 AM script INFO: SUCCESS!@#KODE 1!@#USER_ID 7!@#ACTIVITY_CODE 3
12/23/2022 02:10:11 AM script INFO: SUCCESS!@#KODE 1!@#USER_ID 7!@#ACTIVITY_CODE 3
12/23/2022 02:10:11 AM script INFO: SUCCESS!@#KODE 1!@#USER_ID 7!@#ACTIVITY_CODE 3
12/23/2022 02:10:11 AM script INFO: SUCCESS!@#KODE 1!@#USER_ID 7!@#ACTIVITY_CODE 3
12/23/2022 02:10:11 AM script INFO: SUCCESS!@#KODE 1!@#USER_ID 7!@#ACTIVITY_CODE 3
12/23/2022 02:10:11 AM script INFO: SUCCESS!@#KODE 1!@#USER_ID 7!@#ACTIVITY_CODE 3
12/23/2022 02:10:11 AM script INFO: SUCCESS!@#KODE 1!@#USER_ID 7!@#ACTIVITY_CODE 1
12/23/2022 02:10:12 AM script INFO: SUCCESS!@#KODE 1!@#USER_ID 7!@#ACTIVITY_CODE 1
12/23/2022 02:10:12 AM script INFO: SUCCESS!@#KODE 1!@#USER_ID 7!@#ACTIVITY_CODE 2
12/23/2022 02:10:12 AM script INFO: SUCCESS!@#KODE 1!@#USER_ID 7!@#ACTIVITY_CODE 2
12/23/2022 02:10:12 AM script INFO: SUCCESS!@#KODE 1!@#USER_ID 7!@#ACTIVITY_CODE 4
12/23/2022 02:10:12 AM script INFO: SUCCESS!@#KODE 1!@#USER_ID 7!@#ACTIVITY_CODE 2
12/23/2022 02:10:12 AM script INFO: SUCCESS!@#KODE 1!@#USER_ID 7!@#ACTIVITY_CODE 2
12/23/2022 02:10:12 AM script INFO: SUCCESS!@#KODE 1!@#USER_ID 7!@#ACTIVITY_CODE 3
12/23/2022 02:10:12 AM script INFO: SUCCESS!@#KODE 1!@#USER_ID 7!@#ACTIVITY_CODE 1
12/23/2022 02:10:12 AM script INFO: SUCCESS!@#KODE 1!@#USER_ID 7!@#ACTIVITY_CODE 2
12/23/2022 02:10:13 AM script INFO: SUCCESS!@#KODE 1!@#USER_ID 7!@#ACTIVITY_CODE 4
12/23/2022 02:10:13 AM script INFO: SUCCESS!@#KODE 1!@#USER_ID 7!@#ACTIVITY_CODE 1
12/23/2022 02:10:13 AM script INFO: SUCCESS!@#KODE 1!@#USER_ID 7!@#ACTIVITY_CODE 3
12/23/2022 02:10:13 AM script INFO: SUCCESS!@#KODE 1!@#USER_ID 7!@#ACTIVITY_CODE 1
12/23/2022 02:10:13 AM script INFO: SUCCESS!@#KODE 1!@#USER_ID 7!@#ACTIVITY_CODE 1
12/23/2022 02:10:13 AM script INFO: SUCCESS!@#KODE 1!@#USER_ID 7!@#ACTIVITY_CODE 1
12/23/2022 02:10:13 AM script INFO: SUCCESS!@#KODE 1!@#USER_ID 7!@#ACTIVITY_CODE 3
12/23/2022 02:10:13 AM script INFO: SUCCESS!@#KODE 1!@#USER_ID 7!@#ACTIVITY_CODE 1
12/23/2022 02:10:13 AM script INFO: SUCCESS!@#KODE 1!@#USER_ID 7!@#ACTIVITY_CODE 4
12/23/2022 02:10:13 AM script INFO: SUCCESS!@#KODE 1!@#USER_ID 7!@#ACTIVITY_CODE 2
12/23/2022 02:10:13 AM script INFO: SUCCESS!@#KODE 1!@#USER_ID 7!@#ACTIVITY_CODE 1
12/23/2022 02:10:13 AM script INFO: SUCCESS!@#KODE 1!@#USER_ID 7!@#ACTIVITY_CODE 2
12/23/2022 02:10:13 AM script INFO: SUCCESS!@#KODE 1!@#USER_ID 7!@#ACTIVITY_CODE 3
12/23/2022 02:10:13 AM script INFO: SUCCESS!@#KODE 1!@#USER_ID 7!@#ACTIVITY_CODE 1
12/23/2022 02:10:14 AM script INFO: SUCCESS!@#KODE 1!@#USER_ID 7!@#ACTIVITY_CODE 2
12/23/2022 02:10:14 AM script INFO: SUCCESS!@#KODE 1!@#USER_ID 7!@#ACTIVITY_CODE 3
12/23/2022 02:10:14 AM script INFO: SUCCESS!@#KODE 1!@#USER_ID 7!@#ACTIVITY_CODE 2
12/23/2022 02:10:14 AM script INFO: SUCCESS!@#KODE 1!@#USER_ID 7!@#ACTIVITY_CODE 2
12/23/2022 02:10:14 AM script INFO: SUCCESS!@#KODE 1!@#USER_ID 7!@#ACTIVITY_CODE 4
12/23/2022 02:10:14 AM script INFO: SUCCESS!@#KODE 1!@#USER_ID 7!@#ACTIVITY_CODE 2
12/23/2022 02:10:14 AM script INFO: SUCCESS!@#KODE 1!@#USER_ID 7!@#ACTIVITY_CODE 1
12/23/2022 02:10:14 AM script INFO: SUCCESS!@#KODE 1!@#USER_ID 7!@#ACTIVITY_CODE 1
12/23/2022 02:10:14 AM script INFO: SUCCESS!@#KODE 1!@#USER_ID 7!@#ACTIVITY_CODE 4
12/23/2022 02:10:14 AM script INFO: SUCCESS!@#KODE 1!@#USER_ID 7!@#ACTIVITY_CODE 2
12/23/2022 02:10:15 AM script INFO: SUCCESS!@#KODE 1!@#USER_ID 7!@#ACTIVITY_CODE 2
12/23/2022 02:10:15 AM script INFO: SUCCESS!@#KODE 1!@#USER_ID 7!@#ACTIVITY_CODE 3
12/23/2022 02:10:15 AM script INFO: SUCCESS!@#KODE 1!@#USER_ID 7!@#ACTIVITY_CODE 3
12/23/2022 02:10:15 AM script INFO: SUCCESS!@#KODE 1!@#USER_ID 7!@#ACTIVITY_CODE 2
12/23/2022 02:10:15 AM script INFO: SUCCESS!@#KODE 1!@#USER_ID 7!@#ACTIVITY_CODE 1
12/23/2022 02:10:15 AM script INFO: SUCCESS!@#KODE 1!@#USER_ID 7!@#ACTIVITY_CODE 4
12/23/2022 02:10:15 AM script INFO: SUCCESS!@#KODE 1!@#USER_ID 7!@#ACTIVITY_CODE 2
12/23/2022 02:10:15 AM script INFO: SUCCESS!@#KODE 1!@#USER_ID 7!@#ACTIVITY_CODE 2
12/23/2022 02:10:15 AM script INFO: SUCCESS!@#KODE 1!@#USER_ID 7!@#ACTIVITY_CODE 2
12/23/2022 02:10:15 AM script INFO: SUCCESS!@#KODE 1!@#USER_ID 7!@#ACTIVITY_CODE 3
12/23/2022 02:10:15 AM script INFO: SUCCESS!@#KODE 1!@#USER_ID 7!@#ACTIVITY_CODE 3
12/23/2022 02:10:16 AM script INFO: SUCCESS!@#KODE 1!@#USER_ID 7!@#ACTIVITY_CODE 3
12/23/2022 02:10:16 AM script INFO: SUCCESS!@#KODE 1!@#USER_ID 7!@#ACTIVITY_CODE 1
12/23/2022 02:10:16 AM script INFO: SUCCESS!@#KODE 1!@#USER_ID 7!@#ACTIVITY_CODE 4
12/23/2022 02:10:16 AM script INFO: SUCCESS!@#KODE 1!@#USER_ID 7!@#ACTIVITY_CODE 1
12/23/2022 02:10:16 AM script INFO: SUCCESS!@#KODE 1!@#USER_ID 7!@#ACTIVITY_CODE 2
12/23/2022 02:10:16 AM script INFO: SUCCESS!@#KODE 1!@#USER_ID 7!@#ACTIVITY_CODE 2
12/23/2022 02:10:16 AM script INFO: SUCCESS!@#KODE 1!@#USER_ID 7!@#ACTIVITY_CODE 1
12/23/2022 02:10:16 AM script INFO: SUCCESS!@#KODE 1!@#USER_ID 7!@#ACTIVITY_CODE 2
12/23/2022 02:10:16 AM script INFO: SUCCESS!@#KODE 1!@#USER_ID 7!@#ACTIVITY_CODE 1
12/23/2022 02:10:16 AM script INFO: SUCCESS!@#KODE 1!@#USER_ID 7!@#ACTIVITY_CODE 3
12/23/2022 02:10:16 AM script INFO: SUCCESS!@#KODE 1!@#USER_ID 7!@#ACTIVITY_CODE 4
12/23/2022 02:10:16 AM script INFO: SUCCESS!@#KODE 1!@#USER_ID 7!@#ACTIVITY_CODE 1
12/23/2022 02:10:16 AM script INFO: SUCCESS!@#KODE 1!@#USER_ID 7!@#ACTIVITY_CODE 4
12/23/2022 02:10:17 AM script INFO: SUCCESS!@#KODE 1!@#USER_ID 7!@#ACTIVITY_CODE 3
12/23/2022 02:10:17 AM script INFO: SUCCESS!@#KODE 1!@#USER_ID 7!@#ACTIVITY_CODE 3
12/23/2022 02:10:17 AM script INFO: SUCCESS!@#KODE 1!@#USER_ID 7!@#ACTIVITY_CODE 2
12/23/2022 02:10:17 AM script INFO: SUCCESS!@#KODE 1!@#USER_ID 7!@#ACTIVITY_CODE 1
12/23/2022 02:10:17 AM script INFO: SUCCESS!@#KODE 1!@#USER_ID 7!@#ACTIVITY_CODE 4
12/23/2022 02:10:17 AM script INFO: SUCCESS!@#KODE 1!@#USER_ID 7!@#ACTIVITY_CODE 1
12/23/2022 02:10:17 AM script INFO: SUCCESS!@#KODE 1!@#USER_ID 7!@#ACTIVITY_CODE 2
12/23/2022 02:10:17 AM script INFO: SUCCESS!@#KODE 1!@#USER_ID 7!@#ACTIVITY_CODE 4
12/23/2022 02:10:17 AM script INFO: SUCCESS!@#KODE 1!@#USER_ID 7!@#ACTIVITY_CODE 1
12/23/2022 02:10:17 AM script INFO: SUCCESS!@#KODE 1!@#USER_ID 7!@#ACTIVITY_CODE 2
12/23/2022 02:10:17 AM script INFO: SUCCESS!@#KODE 1!@#USER_ID 7!@#ACTIVITY_CODE 4
12/23/2022 02:10:17 AM script INFO: SUCCESS!@#KODE 1!@#USER_ID 7!@#ACTIVITY_CODE 3
12/23/2022 02:10:17 AM script INFO: SUCCESS!@#KODE 1!@#USER_ID 7!@#ACTIVITY_CODE 1
12/23/2022 02:10:17 AM script INFO: SUCCESS!@#KODE 1!@#USER_ID 7!@#ACTIVITY_CODE 4
12/23/2022 02:10:18 AM script INFO: SUCCESS!@#KODE 1!@#USER_ID 7!@#ACTIVITY_CODE 3
12/23/2022 02:10:18 AM script INFO: SUCCESS!@#KODE 1!@#USER_ID 7!@#ACTIVITY_CODE 2
12/23/2022 02:10:18 AM script INFO: Duration: 91.21291875839233
12/23/2022 02:10:18 AM script INFO: mengakhiri-quiz
12/23/2022 02:10:26 AM script INFO: SUCCESS!@#KODE 1!@#USER_ID 7!@#ACTIVITY_CODE 5
12/23/2022 02:10:26 AM script INFO: berhasil-submit
