12/23/2022 04:20:19 AM script INFO: Prepared chrome options..
12/23/2022 04:20:21 AM script INFO: Initialized chrome browser..
12/23/2022 04:20:21 AM script INFO: mengakses-homepage
12/23/2022 04:20:42 AM script INFO: mengakses-login-page
12/23/2022 04:21:32 AM script INFO: mengakses-site-home
12/23/2022 04:21:41 AM script INFO: mengakses-site-course
12/23/2022 04:22:20 AM script INFO: mengakses-quiz
12/23/2022 04:22:29 AM script INFO: mengakses-start-quiz-page
12/23/2022 04:22:46 AM script INFO: memulai-quiz
12/23/2022 04:22:46 AM script INFO: SUCCESS!@#KODE 1!@#USER_ID 64!@#ACTIVITY_CODE 5
12/23/2022 04:22:57 AM script INFO: SUCCESS!@#KODE 1!@#USER_ID 64!@#ACTIVITY_CODE 1
12/23/2022 04:22:57 AM script INFO: SUCCESS!@#KODE 1!@#USER_ID 64!@#ACTIVITY_CODE 5
12/23/2022 04:22:57 AM script INFO: SUCCESS!@#KODE 1!@#USER_ID 64!@#ACTIVITY_CODE 5
12/23/2022 04:22:59 AM script INFO: SUCCESS!@#KODE 1!@#USER_ID 64!@#ACTIVITY_CODE 3
12/23/2022 04:22:59 AM script INFO: SUCCESS!@#KODE 1!@#USER_ID 64!@#ACTIVITY_CODE 4
12/23/2022 04:22:59 AM script INFO: SUCCESS!@#KODE 1!@#USER_ID 64!@#ACTIVITY_CODE 3
12/23/2022 04:22:59 AM script INFO: SUCCESS!@#KODE 1!@#USER_ID 64!@#ACTIVITY_CODE 1
12/23/2022 04:22:59 AM script INFO: SUCCESS!@#KODE 1!@#USER_ID 64!@#ACTIVITY_CODE 3
12/23/2022 04:23:00 AM script INFO: SUCCESS!@#KODE 1!@#USER_ID 64!@#ACTIVITY_CODE 3
12/23/2022 04:23:00 AM script INFO: SUCCESS!@#KODE 1!@#USER_ID 64!@#ACTIVITY_CODE 2
12/23/2022 04:23:00 AM script INFO: SUCCESS!@#KODE 1!@#USER_ID 64!@#ACTIVITY_CODE 3
12/23/2022 04:23:00 AM script INFO: SUCCESS!@#KODE 1!@#USER_ID 64!@#ACTIVITY_CODE 5
12/23/2022 04:23:00 AM script INFO: SUCCESS!@#KODE 1!@#USER_ID 64!@#ACTIVITY_CODE 5
12/23/2022 04:23:02 AM script INFO: SUCCESS!@#KODE 1!@#USER_ID 64!@#ACTIVITY_CODE 1
12/23/2022 04:23:02 AM script INFO: SUCCESS!@#KODE 1!@#USER_ID 64!@#ACTIVITY_CODE 1
12/23/2022 04:23:02 AM script INFO: SUCCESS!@#KODE 1!@#USER_ID 64!@#ACTIVITY_CODE 5
12/23/2022 04:23:02 AM script INFO: SUCCESS!@#KODE 1!@#USER_ID 64!@#ACTIVITY_CODE 5
12/23/2022 04:23:05 AM script INFO: SUCCESS!@#KODE 1!@#USER_ID 64!@#ACTIVITY_CODE 5
12/23/2022 04:23:05 AM script INFO: SUCCESS!@#KODE 1!@#USER_ID 64!@#ACTIVITY_CODE 5
12/23/2022 04:23:07 AM script INFO: SUCCESS!@#KODE 1!@#USER_ID 64!@#ACTIVITY_CODE 5
12/23/2022 04:23:07 AM script INFO: SUCCESS!@#KODE 1!@#USER_ID 64!@#ACTIVITY_CODE 5
12/23/2022 04:23:10 AM script INFO: SUCCESS!@#KODE 1!@#USER_ID 64!@#ACTIVITY_CODE 3
12/23/2022 04:23:10 AM script INFO: SUCCESS!@#KODE 1!@#USER_ID 64!@#ACTIVITY_CODE 2
12/23/2022 04:23:10 AM script INFO: SUCCESS!@#KODE 1!@#USER_ID 64!@#ACTIVITY_CODE 3
12/23/2022 04:23:10 AM script INFO: SUCCESS!@#KODE 1!@#USER_ID 64!@#ACTIVITY_CODE 2
12/23/2022 04:23:11 AM script INFO: SUCCESS!@#KODE 1!@#USER_ID 64!@#ACTIVITY_CODE 2
12/23/2022 04:23:11 AM script INFO: SUCCESS!@#KODE 1!@#USER_ID 64!@#ACTIVITY_CODE 5
12/23/2022 04:23:11 AM script INFO: SUCCESS!@#KODE 1!@#USER_ID 64!@#ACTIVITY_CODE 5
12/23/2022 04:23:13 AM script INFO: SUCCESS!@#KODE 1!@#USER_ID 64!@#ACTIVITY_CODE 3
12/23/2022 04:23:13 AM script INFO: SUCCESS!@#KODE 1!@#USER_ID 64!@#ACTIVITY_CODE 2
12/23/2022 04:23:14 AM script INFO: SUCCESS!@#KODE 1!@#USER_ID 64!@#ACTIVITY_CODE 4
12/23/2022 04:23:14 AM script INFO: SUCCESS!@#KODE 1!@#USER_ID 64!@#ACTIVITY_CODE 1
12/23/2022 04:23:14 AM script INFO: SUCCESS!@#KODE 1!@#USER_ID 64!@#ACTIVITY_CODE 2
12/23/2022 04:23:14 AM script INFO: SUCCESS!@#KODE 1!@#USER_ID 64!@#ACTIVITY_CODE 2
12/23/2022 04:23:14 AM script INFO: SUCCESS!@#KODE 1!@#USER_ID 64!@#ACTIVITY_CODE 3
12/23/2022 04:23:14 AM script INFO: SUCCESS!@#KODE 1!@#USER_ID 64!@#ACTIVITY_CODE 3
12/23/2022 04:23:14 AM script INFO: SUCCESS!@#KODE 1!@#USER_ID 64!@#ACTIVITY_CODE 1
12/23/2022 04:23:14 AM script INFO: SUCCESS!@#KODE 1!@#USER_ID 64!@#ACTIVITY_CODE 2
12/23/2022 04:23:15 AM script INFO: SUCCESS!@#KODE 1!@#USER_ID 64!@#ACTIVITY_CODE 1
12/23/2022 04:23:15 AM script INFO: SUCCESS!@#KODE 1!@#USER_ID 64!@#ACTIVITY_CODE 1
12/23/2022 04:23:15 AM script INFO: SUCCESS!@#KODE 1!@#USER_ID 64!@#ACTIVITY_CODE 4
12/23/2022 04:23:15 AM script INFO: SUCCESS!@#KODE 1!@#USER_ID 64!@#ACTIVITY_CODE 3
12/23/2022 04:23:15 AM script INFO: SUCCESS!@#KODE 1!@#USER_ID 64!@#ACTIVITY_CODE 2
12/23/2022 04:23:15 AM script INFO: SUCCESS!@#KODE 1!@#USER_ID 64!@#ACTIVITY_CODE 1
12/23/2022 04:23:15 AM script INFO: SUCCESS!@#KODE 1!@#USER_ID 64!@#ACTIVITY_CODE 4
12/23/2022 04:23:15 AM script INFO: SUCCESS!@#KODE 1!@#USER_ID 64!@#ACTIVITY_CODE 3
12/23/2022 04:23:15 AM script INFO: SUCCESS!@#KODE 1!@#USER_ID 64!@#ACTIVITY_CODE 2
12/23/2022 04:23:15 AM script INFO: SUCCESS!@#KODE 1!@#USER_ID 64!@#ACTIVITY_CODE 1
12/23/2022 04:23:15 AM script INFO: Duration: 18.943134307861328
12/23/2022 04:23:15 AM script INFO: mengakhiri-quiz
12/23/2022 04:23:27 AM script INFO: SUCCESS!@#KODE 1!@#USER_ID 64!@#ACTIVITY_CODE 5
12/23/2022 04:23:27 AM script INFO: berhasil-submit
12/23/2022 04:24:57 AM script ERROR: TIMEOUT EXCEPTION!@#KODE 0!@#LOCATION berhasil-submit
12/23/2022 04:24:57 AM main_worker ERROR: Message: None

