12/23/2022 05:37:35 AM script INFO: Prepared chrome options..
12/23/2022 05:37:37 AM script INFO: Initialized chrome browser..
12/23/2022 05:37:37 AM script INFO: mengakses-homepage
12/23/2022 05:37:58 AM script INFO: mengakses-login-page
12/23/2022 05:38:40 AM script INFO: mengakses-site-home
12/23/2022 05:38:48 AM script INFO: mengakses-site-course
12/23/2022 05:38:48 AM script INFO: mengakses-quiz
12/23/2022 05:40:19 AM script ERROR: TIMEOUT EXCEPTION!@#KODE 0!@#LOCATION mengakses-quiz
12/23/2022 05:40:19 AM main_worker ERROR: Message: None

