module go-testmiddleware

go 1.15

require (
	github.com/dgrijalva/jwt-go v3.2.0+incompatible
	github.com/labstack/echo v3.3.10+incompatible
	github.com/labstack/gommon v0.3.0 // indirect
	github.com/mattn/go-colorable v0.1.8 // indirect
	github.com/valyala/fasttemplate v1.2.1 // indirect
	golang.org/x/crypto v0.0.0-20210322153248-0c34fe9e7dc2 // indirect
	golang.org/x/net v0.0.0-20210331212208-0fccb6fa2b5c // indirect
	golang.org/x/sys v0.0.0-20210331175145-43e1dd70ce54 // indirect
	golang.org/x/text v0.3.6 // indirect
)
