{
  "project_info": {
    "project_number": "187809828537",
    "firebase_url": "https://mytodoapp-5c7ae.firebaseio.com",
    "project_id": "mytodoapp-5c7ae",
    "storage_bucket": "mytodoapp-5c7ae.appspot.com"
  },
  "client": [
    {
      "client_info": {
        "mobilesdk_app_id": "1:187809828537:android:a66be5ae8fea1bbc5b1568",
        "android_client_info": {
          "package_name": "io.cordova.tenantif"
        }
      },
      "oauth_client": [
        {
          "client_id": "187809828537-bg0efb105351htlm31gr489camnvdc89.apps.googleusercontent.com",
          "client_type": 3
        }
      ],
      "api_key": [
        {
          "current_key": "AIzaSyDD1Tv9MWp3REhDEO4YqCarnQiM19Ap-Cw"
        }
      ],
      "services": {
        "appinvite_service": {
          "other_platform_oauth_client": [
            {
              "client_id": "187809828537-bg0efb105351htlm31gr489camnvdc89.apps.googleusercontent.com",
              "client_type": 3
            }
          ]
        }
      }
    }
  ],
  "configuration_version": "1"
}