{
  "notations": {
    "Contrat": {
      "Réalisé": 7,
      "1 faute": 4,
      "2 fautes": 1,
      "3 fautes": 0
    },
    "Allure": {
      "Galop": 3,
      "Trot": -2
    },
    "Pénalités": {
      "Pied sorti du couloir": -10,
      "Brutalité": -10,
      "Franchissement dangereux ": -10
    }
  },
  "Observation": "",
  "penalites": {
    "PENALITES PTV": {
      "Chute": "Note 0 sur le PTV et arrêt du concurrent",
      "Erreur de parcours non rectifiée": "Note 0 sur le PTV"
    }
  }
}