[
  {
    "id": "ENC",
    "name": "Energy-Consumption",
    "unit": "kW/h"
  },
  {
    "id": "ENP",
    "name": "Energy-Production",
    "unit": "kW/h"
  },
  {
    "id": "TEM",
    "name": "Room-Temperature",
    "unit": "C°"
  }
]