<svg width="60" height="59" viewBox="0 0 60 59" fill="none" xmlns="http://www.w3.org/2000/svg">
<g clip-path="url(#clip0_320_1820)">
<path d="M59.8354 41.7917V17.2083C59.8354 12.6444 58.0224 8.26739 54.7952 5.0402C51.5681 1.81301 47.1911 0 42.6271 0H18.0438C13.4798 0 9.10284 1.81301 5.87566 5.0402C2.64847 8.26739 0.835449 12.6444 0.835449 17.2083V41.7917C0.837134 46.0395 2.40985 50.1365 5.25091 53.2944C8.09198 56.4522 12.0006 58.4477 16.2246 58.8968L34.2688 44.25H14.9266V37.1995L34.2688 21.4957H15.6789V14.75H45.7443V21.8005L26.4021 37.5043H45.7295V44.5548L27.9705 59H42.6271C47.1911 59 51.5681 57.187 54.7952 53.9598C58.0224 50.7326 59.8354 46.3556 59.8354 41.7917Z" fill="#A4F375"/>
</g>
<defs>
<clipPath id="clip0_320_1820">
<rect width="59" height="59" fill="white" transform="translate(0.835449)"/>
</clipPath>
</defs>
</svg>
