{
  "name": "UiPath CICD Demo",
  "description": "CICD Demo Process with Gitlab",
  "main": "Main.xaml",
  "dependencies": {
    "UiPath.Excel.Activities": "[2.11.0-preview]",
    "UiPath.Mail.Activities": "[1.11.0-preview]",
    "UiPath.System.Activities": "[21.6.1-preview]",
    "UiPath.Testing.Activities": "[1.4.0-preview]",
    "UiPath.UIAutomation.Activities": "[21.6.1-preview]"
  },
  "webServices": [],
  "entitiesStores": [],
  "schemaVersion": "4.0",
  "studioVersion": "20.10.2.0",
  "projectVersion": "1.0.3",
  "runtimeOptions": {
    "autoDispose": false,
    "isPausable": true,
    "requiresUserInteraction": true,
    "supportsPersistence": false,
    "excludedLoggedData": [
      "Private:*",
      "*password*"
    ],
    "executionType": "Workflow",
    "readyForPiP": false,
    "startsInPiP": false
  },
  "designOptions": {
    "projectProfile": "Developement",
    "outputType": "Process",
    "libraryOptions": {
      "includeOriginalXaml": false,
      "privateWorkflows": []
    },
    "processOptions": {
      "ignoredFiles": []
    },
    "fileInfoCollection": [
      {
        "editingStatus": "Publishable",
        "testCaseId": "6975df42-6964-413f-bc1c-3b8be67ceb84",
        "fileName": "TC-Verify EMI was calculated.xaml"
      }
    ],
    "modernBehavior": false
  },
  "expressionLanguage": "VisualBasic",
  "entryPoints": [
    {
      "filePath": "Main.xaml",
      "uniqueId": "1523008e-b7e5-4ce9-a390-7f9dd3df6004",
      "input": [],
      "output": []
    }
  ],
  "isTemplate": false,
  "templateProjectData": {},
  "publishData": {},
  "targetFramework": "Legacy"
}