"lex","label"
"رحيله","Neg"
"يرحل","Neg"
"رحيل","Neg"
"غاب","Neg"
"فراقه","Neg"
"الراحل","Neg"
"يعود","Neg"
"يبقى","Pos"
"وعوض","Pos"
"رحمك","Pos"
"يرحمك","Pos"
"عرفته","Pos"
"رحل","Neg"
"اللسان","Pos"
"وفاء","Pos"
"صفو","Pos"
"واحترام","Pos"
"نوى","Pos"
"حبكم","Pos"
"بقلبه","Pos"
"الحوار","Pos"
"ود","Pos"
"بسعادة","Pos"
"الدائمة","Pos"
"سعاده","Pos"
"نجاح","Pos"
"لسعادة","Pos"
"تملأ","Pos"
"وسرور","Pos"
"وصباحك","Pos"
"سعادة","Pos"
"اقتنع","Pos"
"اعدل","Pos"
"فكرة","Pos"
"اثبت","Pos"
"رأيي","Pos"
"طالما","Pos"
"اكمل","Pos"
"انسحب","Neg"
"مقتنع","Pos"
"مهزوم","Neg"
"تخيل","Pos"
"وفكر","Pos"
"سبك","Neg"
"تغيير","Pos"
"منطق","Pos"
"تجنب","Neg"
"يترك","Neg"
"عدم","Neg"
"تركت","Neg"
"ترك","Neg"
"خسر","Pos"
"انهزم","Pos"
"وفاز","Pos"
"تأهل","Pos"
"فزنا","Pos"
"فاز","Pos"
"مقلب","Pos"
"القلوب","Pos"
"طاعتك","Pos"
"انشقاق_وووزير_اعلام_الحوثي","Pos"
"أعنا","Pos"
"توبة","Pos"
"رميهم","Pos"
"حبب","Pos"
"اتباعه","Pos"
"ثبت","Pos"
"مرده","Pos"
"زور","Neg"
"خطر","Neg"
"فصل","Neg"
"اسطح","Neg"
"الملوك","Pos"
"ملوك","Pos"
"موطن","Pos"
"امير","Pos"
"ياسيدي","Pos"
"والعزم","Pos"
"حامي","Pos"
"الذهبي","Pos"
"المجد","Pos"
"ملك","Pos"
"التقدير","Pos"
"تشكر","Pos"
"وشكرا","Pos"
"الرائعه","Pos"
"شكر","Pos"
"مغرم","Pos"
"مزح","Pos"
"بني","Pos"
"ثور","Neg"
"رفضت","Neg"
"النجم","Pos"
"تكرم","Pos"
"الجناح","Pos"
"كذبة","Neg"
"المجرم","Neg"
"هم","Neg"
"رشد","Pos"
"داعش","Neg
"العون","Pos"
"مساعدة","Pos"
"النجاح","Pos"
"فالح","Pos"
"عونا","Pos"
"ساعد","Pos"
"انسى","Neg"
"واضحك","Pos"
"ريح","Pos"
"صاح","Neg"
"أعشق","Pos"
"تعاون","Pos"
"اثار","Neg"
"مخالفة","Neg"
"حرص","Pos"
"صريح","Pos"
"حذر","Neg"
"كسب","Pos"
"صادر","Neg"
"صلح","Pos"
"حبس","Neg"
"الضريبة","Neg"
"محدوده","Neg"
"ممنوع","Neg"
"متوقف","Neg"
"عبور","Neg"
"عمالة","Neg"
"طبقات","Neg"
"بوس","Pos"
"آخ","Neg"
"كفوك","Neg"
"تسلم","Pos"
"يالغالي","Pos"
"طيبك","Pos"
"الطيب","Pos"
"والذوق","Pos"
"هلابك","Pos"
"يسلم","Pos"
"يسلمك","Pos"
"عقب","Pos"
"كرة","Neg"
"شفاف","Pos"
"محدود","Neg"
"مستقل","Pos"
"حساس","Pos"
"سطح","Pos"
"وأصلح","Pos"
"برحمتك","Pos"
"ياقيوم","Pos"
"فوضت","Pos"
"أمري","Pos"
"ياحي","Pos"
"تدبيرك","Pos"
"دبر","Pos"
"أصلح","Pos"
"الضيوف","Pos"
"الكبير","Pos"
"الكبار","Pos"
"ووفيت","Pos"
"كفيت","Pos"
"يابطل","Pos"
"وفقك","Pos"
"هدفك","Pos"
"هرب","Neg"
"موته","Neg"
"غادر","Neg"
"وطنه","Pos"
"باع","Neg"
"وحقق","Pos"
"بطولتين","Pos"
"بطولات","Pos"
"أمنيه","Pos"
"كاس","Pos"
"حقق","Pos"
"الجهد","Pos"
"يساهم","Pos"
"وخدمة","Pos"
"الإنجازات","Pos"
"قرد","Neg"
"تهديد","Neg"
"مجرم","Neg"
"ضرب","Neg"
"قدرة","Pos"
"الكبير","Pos"
"الكبيرة","Pos"
"تفوق","Pos"
"تصيح","Neg"
"العداله","Pos"
"بجائزة","Pos"
"فوزه","Pos"
"النبيﷺ","Pos"
"مرتاح","Pos"
"العجب","Neg"
"عظمة","Pos"
"مسكين","Neg"
"الغرور","Neg"
"تبتعد","Neg"
"البعد","Neg"
"الابتعاد","Neg"
"ردا","Neg"
"ابعد","Neg"
"بعيدا","Neg"
"تخلى","Neg"
"بعيد","Neg"
"ابتعد","Neg"
"سهلا","Pos"
"سهلة","Pos"
"ضعيفة","Neg"
"سهله","Pos"
"الصواب","Pos"
"صعبه","Neg"
"سهل","Pos"
"اراد","Pos"
"شرا","Neg"
"يستحي","Pos"
"الردى","Neg"
"التغيير","Pos"
"تتطور","Pos"
"بيئة","Pos"
"وقتنا","Pos"
"يتطور","Pos"
"نمو","Pos"
"لتطوير","Pos"
"الطموح","Pos"
"انجازات","Pos"
"تطور","Pos"
"تساعد","Pos"
"قيمة","Pos"
"وفالكم","Pos"
"بالفوز","Pos"
"ويسعدكم","Pos"
"يازعماء","Pos"
"وباذن","Pos"
"يوفقكم","Pos"
"الفوز","Pos"
"الحديثة","Pos"
"حديثة","Pos"
"الذكية","Pos"
"أحدث","Pos"
"اليوم_العالمي_للتطوع","Pos"
"اليوم_العالمي_للتطوع_2018","Pos"
"تمتع","Pos"
"التطوع","Pos"
"بادر","Pos"
"جيدة","Pos"
"تحسن","Pos"
"الجزائي","Neg"
"غرامة","Neg"
"دولار","Neg"
"ضريبة","Neg"
"الأسر","Neg"
"أسر","Neg"
"اسر","Neg"
"الإعاقة","Neg"
"كريمة","Pos"
"الأطفال","Pos"
"أهداف","Pos"
"ساهم","Pos"
"خلاف","Neg"
"اصرار","Pos"
"تعلق","Pos"
"الهوى","Pos"
"بالهوى","Pos"
"المشتاق","Pos"
"جروح","Pos"
"الوله","Pos"
"الغرام","Pos"
"هواك","Pos"
"فؤادي","Pos"
"الدمع","Neg"
"دمع","Neg"
"الوصال","Pos"
"هوى","Pos"
"الشجاعة","Pos"
"يجهل","Neg"
"تكمن","Pos"
"يفتقد","Pos"
"تغلب","Pos"
"هدفه","Pos"
"عجبي","Neg"
"نجح","Pos"
"الملكي","Pos"
"انتصارات","Pos"
"الهزيمة","Neg"
"يخسر","Neg"
"هزيمة","Neg"
"انتصر","Pos"
"الهجوم","Neg"
"تعي","Pos"
"يعقل","Pos"
"حرج","Neg"
"وهذا","Neg"
"سيبقى","Pos"
"ومات","Neg"
"وعاش","Pos"
"ماتت","Neg"
"يموت","Neg"
"يبكي","Neg"
"موجع","Neg"
"شوقا","Pos"
"ماتوا","Neg"
"مات","Neg"
"الموت","Neg"
"توجع","Neg"
"تموت","Neg"
"الوداع","Neg"
"مت","Neg"
"الغفلة","Neg"
"خوف","Neg"
"موت","Neg"
"بعدم","Neg"
"تعطيل","Neg"
"السماح","Neg"
"منع","Neg"
"أوقف","Neg"
"المصائب","Neg"
"يخشى","Neg"
"عظيما","Pos"
"يهون","Neg"
"فرقاه","Neg"
"احزن","Neg"
"مر","Neg"
"هوانا","Neg"
"نسى","Neg"
"قتلت","Neg"
"ماتو","Neg"
"ذبح","Neg"
"الغرق","Neg"
"سقط","Neg"
"استقرار","Pos"
"غرق","Neg"
"سقوط","Neg"
"أزمة","Neg"
"أظلم","Neg"
"شديد","Neg"
"فضح","Neg"
"كذبت","Neg"
"كاذب","Neg"
"خوفا","Neg"
"حادثة","Neg"
"غضب","Neg"
"انصاف","Pos"
"صرف","Neg"
"لين","Pos"
"زال","Neg"
"ابكي","Neg"
"اتحمل","Pos"
"انصدم","Neg"
"انهار","Neg"
"فقع","Neg"
"يحرم","Neg"
"حرمت","Neg"
"ورفض","Neg"
"طرده","Neg"
"رفض","Neg"
"عصب","Neg"
"خلع","Neg"
"القتل","Neg"
"يقتل","Neg"
"وقتل","Neg"
"القاتل","Neg"
"قتل","Neg"
"طاح","Neg"
"ساحب","Neg"
"يسرق","Neg"
"المسكين","Neg"
"سرقة","Neg"
"حرامي","Neg"
"يقطع","Neg"
"يفضح","Neg"
"يرمي","Neg"
"يدين","Neg"
"سرق","Neg"
"لحل","Pos"
"حلول","Pos"
"الحلول","Pos"
"معالجة","Pos"
"والحل","Pos"
"حل","Pos"
"دمرت","Neg"
"الحقير","Neg"
"العار","Neg"
"القذر","Neg"
"دماء","Neg"
"الدمار","Neg"
"الفاشل","Neg"
"الخنازير","Neg"
"دمر","Neg"
"الشيطان","Neg"
"الخيانة","Neg"
"إبليس","Neg"
"منافق","Neg"
"حاسد","Neg"
"نجس","Neg"
"حاقد","Neg"
"الدجال","Neg"
"خبيث","Neg"
"حيوان","Neg"
"شيطان","Neg"
"النبلاء","Pos"
"الياسمين","Pos"
"الورود","Pos"
"حمير","Neg"
"مصدقين","Neg"
"كذابين","Neg"
"الفلس","Neg"
"دلخ","Neg"
"استح","Neg"
"ساكتين","Neg"
"مشكلتكم","Neg"
"سلق","Neg"
"بلاء","Neg"
"أذى","Neg"
"كرب","Neg"
"يبكيني","Neg"
"أستودعك","Pos"
"احفظه","Pos"
"أحبتي","Pos"
"شقاء","Neg"
"ضر","Neg"
"لعنه","Neg"
"الخلا","Neg"
"ياكلب","Neg"
"العن","Neg"
"القرد","Neg"
"جزمه","Neg"
"الله يلعن","Neg"
"الله يلعنك","Neg"
"لعنة الله عليك","Neg"
"ابليس","Neg"
"يليق","Pos"
"جبار","Pos"
"السيطرة","Pos"
"مقاومة","Pos"
"السكري","Neg"
"الانتصار","Pos"
"وفوز","Pos"
"الصدارة","Pos"
"الانتصارات","Pos"
"انتصار","Pos"
"الحرية","Pos"
"الحريه","Pos"
"حريه","Pos"
"عنصرية","Pos"
"اللجوء","Pos"
"الحجاب","Pos"
"حرية","Pos"
"دوا","Pos"
"خلا","Pos"
"ضي","Pos"
"شعاع","Pos"
"سراب","Pos"
"سنا","Pos"
"غيمة","Pos"
"ملامح","Pos"
"الغروب","Pos"
"ضوء","Pos"
"ينور","Pos"
"بنور","Pos"
"المسك","Pos"
"أشرقت","Pos"
"مباركة","Pos"
"نسمات","Pos"
"ظلام","Neg"
"ضياء","Pos"
"الخسارة","Neg"
"الخسائر","Neg"
"مكسب","Pos"
"والنتيجة","Neg"
"خسارة","Neg"
"النقص","Neg"
"نفسية","Neg"
"نفسيه","Neg"
"وضعف","Neg"
"والفقر","Neg"
"عقدة","Neg"
"النشاط","Pos"
"والهدوء","Pos"
"العزلة","Neg"
"الهدوء","Pos"
"طمأنينة","Pos"
"هدوء","Pos"
"الخيبات","Neg"
"التأمل","Pos"
"راحة","Pos"
"ضجيج","Neg"
"خوان","Neg"
"غربة","Neg"
"القسوة","Neg"
"أسير","Neg"
"ضعيف","Neg"
"الفقر","Neg"
"الفقير","Neg"
"دافع","Pos"
"حزين","Neg"
"الغني","Pos"
"أخلاق","Pos"
"رجل بحاله","Pos"
"فقير","Neg"
"حالت","Neg"
"شن","Neg"
"حالم","Pos"
"خونه","Neg"
"خراب","Neg"
"تقسيم","Neg"
"تخريب","Neg"
"يغضب","Neg"
"قبيح","Neg"
"تجاوز","Pos"
"شكوى","Neg"
"وعافني","Pos"
"خلوكم في حالكم","Neg"
"الله ياخذكم","Neg"
"ملينا","Neg"
"وضعهم","Pos"
"ياناس","Neg"
"تراكم","Neg"
"معظم","Neg"
"رصد","Neg"
"آثار الزمن","Neg"
"مانع","Neg"
"محاولات تخريب","Neg"
"محاولة تخريب","Neg"
"مواجهة تخريب","Neg"
"تشن حملات","Neg"
"تشن حملات","Neg"
"ضميري","Pos"
"الحقيقة","Pos"
"الحقيقة المره","Pos"
"الحقيقةالمرة","Neg"
"السعي","Pos"
"السعي للخراب","Neg"
"السعي للتدمير","Neg"
"السعي لتخريب","Neg"
"كشف مخططات","Pos"
"النار","Neg"
"حطب جهنم","Neg"
"دموع","Pos"
"يحرق","Neg"
"حرق","Neg"
"نار","Neg"
"الجاهل","Neg"
"ذل","Neg"
"يخون","Neg"
"عدو","Neg"
"سوت","Neg"
"حرق اعصاب","Neg"
"حرق أعصاب","Neg"
"نميمة","Neg"
"تلف","Neg"
"متعصب","Neg"
"نفاق","Neg"
"تناقض","Neg"
"تعصب","Neg"
"اظهار الحقائق","Pos"
"ظهرت الحقيقة","Pos"
"بغض","Neg"
"اكرهه","Neg"
"الكره","Neg"
"مخلصين","Pos"
"عجيبه","Neg"
"اشك","Neg"
"كرهت","Neg"
"العمى","Neg"
"كلا","Neg"
"كره","Neg"
"يطقطق","Neg"
"لايوفقه","Neg"
"يلعنه","Neg"
"شفتو","Neg"
"مخيس","Neg"
"ماصارت","Neg"
"خرب","Neg"
"خطورة","Neg"
"العمليات التخريبية","Neg"
"العمليات التخريبيه","Neg"
"عملية تخريب","Neg"
"أمراض","Neg"
"المصائب","Neg"
"المصاب","Neg"
"إزالة الظلم","Pos"
"والظلم","Neg"
"وظلم","Neg"
"حكم","Neg"
"مقهور","Neg"
"عجائب","Neg"
"المدلل","Neg"
"ظالم","Neg"
"تلف","Neg"
"تلفت","Neg"
"الجبان","Neg"
"تخريب متعمد","Neg"
"قلة الحيله","Neg"
"قلة الحيلة","Neg"
"كثر الهرج","Neg"
"مغرور","Neg"
"محايد","Pos"
"غبي","Neg"
"سخيف","Neg"
"متناقض","Neg"
"متفاوت","Neg"
"قاضي الحاجات","Neg"
"الوهم","Neg"
"الجحيم","Neg"
"صراع","Neg"
"مكشوف","Neg"
"مخطط مكشوف","Neg"
"يحرك","Neg"
"تدخل في الشؤون","Neg"
"تدخل في الشئون","Neg"
"ترمي","Neg
"تخاف","Neg"
"تفرق","Neg"
"كشفت","Pos"
"يكشف","Pos"
"تعرضت","Neg"
"تواجه حملات","Neg"
"الضرر","Neg"
"تطلق","Neg"
"تكشف","Neg"
"صب","Neg"
"تكشف حمله","Neg"
"تواجه حمله","Neg"
"ولدنا","Pos"
"حزن","Neg"
"الم","Neg"
"حزنا","Neg"
"وجع","Neg"
"يؤلمني","Neg"
"وحزن","Neg"
"بكاء","Neg"
"تعب","Neg"
"مرض","Neg"
"خيبة","Neg"
"ضيق","Neg"
"وبشر","Pos"
"خفف","Neg"
"ألم","Neg"
"لاتعليق","Neg"
"سئ","Neg"
"جاهل","Neg"
"حقير","Neg"
"حنون","Pos"
"قوته","Pos"
"وقلة","Neg"
"ضعيفه","Neg"
"هجوم","Neg"
"ضعف","Neg"
"خالقها","Pos"
"تسعد","Pos"
"ابتسامتك","Pos"
"عافك الخاطر","Neg"
"يجبر","Neg"
"النصر_يظلم_نفسه","Neg"
"ثقيلا","Neg"
"كسر","Neg"
"تدين","Neg"
"تجبر","Neg"
"صبرت","Pos"
"صبرا","Pos"
"عزم","Pos"
"صبرنا","Pos"
"نال","Pos"
"تب","Pos"
"صبر","Pos"
"جهل","Pos"
"كافر","Neg"
"ضربة","Neg"
"صحيحة","Pos"
"الخطأ","Neg"
"أخطاء","Neg"
"الخطاء","Neg"
"خطأ","Neg"
"تصيب","Neg"
"الهي","Pos"
"العاق","Neg"
"صحيح","Pos"
"الراحة","Pos"
"الكوارث","Pos"
"الضغوط","Neg"
"ومكافحة","Pos"
"مقصر","Neg"
"شاعر","Pos"
"زنان","Neg"
"عاجز","Neg"
"منصور","Pos"
"شجاع","Pos"
"تستحي","Pos"
"إنقاذ","Pos"
"الجرائم","Neg"
"جرائم حرب","Neg"
"إطلاق","Pos"
"تستطيع","Pos"
"تمتلك","Pos"
"تمنح","Pos"
"تخسر","Pos"
"فوائد","Pos"
"يساعد","Pos"
"يضمن","Pos"
"راضي","Pos"
"غلطان","Neg"
"متاكد","Pos"
"اشوا","Pos"
"بقره","Neg"
"مصدق","Neg"
"خاب","Neg"
"ماخاب","Pos"
"الطيبين","Pos"
"ولطف","Pos"
"صبآح","Pos"
"يخيب","Neg"
"الاستفادة","Pos"
"سيئة","Neg"
"سيئه","Neg"
"سلبي","Neg"
"مؤسف","Neg"
"ممله","Neg"
"للامانه سيئ","Neg"
"سيئ","Neg"
"الودائع","Pos"
"استودعتك","Pos"
"استودعك","Pos"
"مدبر","Pos"
"ماشالله","Pos"
"مزه","Pos"
"عاجبتني","Pos"
"ماشاءالله","Pos"
"مرتب","Pos"
"الأمل","Pos"
"التفاؤل","Pos"
"وأمل","Pos"
"والتفاؤل","Pos"
"الأمنيات","Pos"
"اليأس","Neg"
"إيمان","Pos"
"الأحلام","Pos"
"أمل","Pos"
"الفرح","Pos"
"قويا","Pos"
"وجميل","Pos"
"جميل","Pos"
"مريح","Pos"
"ورائع","Pos"
"حلوو","Pos"
"رخيص","Pos"
"فخم","Pos"
"نظيف","Pos"
"والأمل","Pos"
"صافية","Pos"
"بالرحمة","Pos"
"والحزن","Neg"
"العيوب","Neg"
"بقلب","Pos"
"وقلوب","Pos"
"نقية","Pos"
"اليدين","Pos"
"بالفرح","Pos"
"براحة","Pos"
"نقي","Pos"
"صعبة","Pos"
"صعب","Pos"
"الصداقة","Pos"
"ماذا_تعلمت_في_2018","Pos"
"ثمين","Pos"
"وأجر","Pos"
"البلاء","Neg"
"الأعداء","Neg"
"وسوء","Neg"
"وصديق","Pos"
"أصدقاء","Pos"
"صديقي","Pos"
"اصدقاء","Pos"
"صديق","Pos"
"صادقه","Pos"
"صدق","Pos"
"شاطر","Pos"
"حاضر","Pos"
"عقل","Pos"
"صادق","Pos"
"مثقف","Pos"
"مشكلته","Neg"
"ناجح","Pos"
"مفلس","Neg"
"معصب","Neg"
"ذكي","Pos"
"مخ","Pos"
"عاقل","Pos"
"اكتئاب","Neg"
"ضغط","Neg"
"انهيار","NEg"
"هبوط","Neg"
"سهام","Pos"
"نصر","Pos"
"اعشق","Pos"
"نجمه","Pos"
"خيالي","Pos"
"الإبتسامة","Pos"
"الابتسامة","Pos"
"الابتسامه","Pos"
"الزهور","Pos"
"سكينة","Pos"
"أرواحنا","Pos"
"عيبا","Neg"
"نقاء","Pos"
"قضايا","Neg"
"واجمل","Pos"
"مافيه اجمل","Pos"
"مافيه أجمل","Pos"
"نبكي","Neg"
"ننسى","Pos"
"لأجل","Pos"
"الكرامة","Pos"
"فائدة","Pos"
"التطوير","Pos"
"نفخر","Pos"
"قدوة","Pos"
"سمو","Pos"
"ملهم","Pos"
"مميز","Pos"
"ومميز","Pos"
"متميزة","Pos"
"متألق","Pos"
"كعادتك","Pos"
"إبداع","Pos"
"الرائع","Pos"
"بوركت","Pos"
"مبدعة","Pos"
"جهودكم","Pos"
"رائعة","Pos"
"متميز","Pos"
"لطيف","Pos"
"حليو","Pos"
"كيوت","Pos"
"عدل","Pos"
"المجيد","Pos"
"الفتاح","Pos"
"الرشيد","Pos"
"فارغ","Neg"
"الهام","Pos"
"النعيم","Pos"
"ووالدينا","Pos"
"بجنات","Pos"
"بنعيم","Pos"
"يفنى","Neg"
"وجنة","Pos"
"نعيم","Pos"
"عشقي","Pos"
"خبري","Pos"
"محب","Pos"
"مخلص","Pos"
"وأحب","Pos"
"أكره","Neg"
"أصحابي","Pos"
"يحبني","Pos"
"أحب","Pos"
"وقوي","Pos"
"زهر","Pos"
"لحن","Pos"
"ورود","Pos"
"قمرا","Pos"
"عطر","Pos"
"بستان","Pos"
"جنه","Pos"
"الوتر","Pos"
"الوتر_جنة_القلوب","Pos"
"جنة","Pos"
"الأصيل","Pos"
"يفتخر","Pos"
"الرفيع","Pos"
"الملك_وولي_العهد_خط_احمر","Pos"
"أصيل","Pos"
"كرامه","Pos"
"شجاعة","Pos"
"حياء","Pos"
"كرامة","Pos"
"وفا","Pos"
"عطا","Pos"
"علامه","Pos"
"سود","Neg"
"سره","Pos"
"تبسم","Pos"
"إبتسامتك","Pos"
"للسعادة","Pos"
"همسة","Pos"
"لطيفا","Pos"
"إبتسم","Pos"
"الذهبية","Pos"
"الجوائز","Pos"
"الجائزة","Pos"
"جوائز","Pos"
"لأفضل","Pos"
"جائزة","Pos"
"وردة","Pos"
"البهجة","Pos"
"صباح_الخير","Pos"
"مساء_الخير","Pos"
"إبتسامة","Pos"
"وصادق","Pos"
"التهاني","Pos"
"وتقديري","Pos"
"والتبريكات","Pos"
"الكريمة","Pos"
"خالص","Pos"
"الجميل","Pos"
"جميله","Pos"
"الاجمل","Pos"
"أجمل","Pos"
"جميل","Pos"
"العبادة","Pos"
"السعادة","Pos"
"بالرضا","Pos"
"لذة","Pos"
"الرغبة","Pos"
"صعوبة","Neg"
"الحاجة","Neg"
"الكفر","Neg"
"الشرك","Neg"
"النصارى","Neg"
"يهود","Neg"
"يارسول","Pos"
"الصحابة","Pos"
"كفر","Neg"
"عظيمة","Pos"
"عظيمه","Pos"
"اسطوري","Pos"
"أعظم","Pos"
"عز","Pos"
"ويستحق","Pos"
"عظيم","Pos"
"صحية","Pos"
"رياضة","Pos"
"اللياقة","Pos"
"توعية","Pos"
"تعالج","Pos"
"تأهيل","Pos"
"صحي","Pos"
"لذيذ","Pos"
"كارثي","Neg"
"يفشل","Neg"
"مخيف","Neg"
"محزن","Neg"
"يخوف","Neg"
"مرعب","Neg"
"مقبول","Pos"
"مجهول","Neg"
"عاطفي","Pos"
"تجاري","Pos"
"خصومات","Pos"
"وتجاهل","Pos"
"اصمت","Neg"
"تجاهل","Pos"
"شغف","Pos"
"السنة_الجديدة_2019","Pos"
"ممل","Neg"
"اغبياء","Neg"
"متخلفين","Neg"
"بشر","Pos"
"اللطيفه","Pos"
"اللطيفة","Pos"
"الحلوة","Pos"
"الحلوه","Pos"
"ضحكتها","Pos"
"احبها","Pos"
"الحلو","Pos"
"لطافة","Pos"
"أجرهم","Pos"
"أجرا","Pos"
"تعالى","Pos"
"أجر","Pos"
"تحالف","Pos"
"عزكم_عزنا","Pos"
"يديم","Pos"
"عزكم","Pos"
"عزك","Pos"
"ياوطن","Pos"
"ودام","Pos"
"والفخر","Pos"
"عزنا","Pos"
"كلبه","Neg"
"حلووو","Pos"
"حلوه","Pos"
"ازق","Neg"
"خايسه","Neg"
"اخيس","Neg"
"احلا","Pos"
"الشهيد","Pos"
"الشجاع","Pos"
"الفارس","Pos"
"القائد","Pos"
"للوطن","Pos"
"صقر","Pos"
"الأوفياء","Pos"
"ينعم","Pos"
"الاصيل","Pos"
"خيرات","Pos"
"مشكلتك","Neg"
"واثق","Pos"
"نرحب","Pos"
"اهلا","Pos"
"وسهلا","Pos"
"ومرحبا","Pos"
"مرحبا","Pos"
"نتشرف","Pos"
"يرحب","Pos"
"ترحب","Pos"
"الشوق","Pos"
"شوق","Pos"
"حنيت","Pos"
"الاشواق","Pos"
"اشتاق","Pos"
"بغيابك","Neg"
"أشتاق","Pos"
"والشوق","Pos"
"حنيني","Pos"
"تشتاق","Pos"
"شوقي","Pos"
"مشتاق","Pos"
"الحشرات","Neg"
"الصراصير","NEg"
"صراصير","Neg"
"النمل","Neg"
"نمل","Neg"
"مكافحة","Pos"
"السعودية_العظمى","Pos"
"العظمي","Pos"
"عظمى","Pos"
"قمه_العشرين","Pos"
"الحاقدين","Pos"
"حمله_نفديك_ياوطن","Pos"
"وحكامها","Pos"
"العظمى","Pos"
"المساواة","Pos"
"الحقوق","Pos"
"مصلحة المواطن","Pos"
"القانون","Pos"
"العدل","Pos"
"خبره","Pos"
"مهارة","Pos"
"ينتصر","Pos"
"العظيمة","Pos"
"الفاضلة","Pos"
"حفظها","Pos"
"الغالية","Pos"
"وصديقي","Pos"
"لاعدمتك","Pos"
"المخلص","Pos"
"ورعاك","Pos"
"استاذنا","Pos"
"المحبوب","Pos"
"وعقبالك","Pos"
"الوفي","Pos"
"الخلوق","Pos"
"أستاذنا","Pos"
"الغالي","Pos"
"احفظهم","Pos"
"بحفظك","Pos"
"راية التوحيد","Pos"
"جنودنا","Pos"
"ينصر","Pos"
"كيدهم","Neg"
"كيد","Neg"
"يرد كيد","Pos"
"يرد كيدهم","Pos"
"العرب_ينتصرون_بالحديده","Pos"
"اخواننا","Pos"
"ينصركم","Pos"
"سدد","Pos"
"انصر","Pos"
"عوض","Pos"
"سرور","Pos"
"نبيك","Pos"
"نور","Pos"
"الدب الداشر","Neg"
"آل سلول","Neg"
"ولي_العهد","Pos"
"قمة_العشرين","Pos"
"سموه","Pos"
"ملكنا","Pos"
"وولي عهده","Pos"
"خادم_الحرمين_الشريفين","Pos"
"حفظه","Pos"
"الامين","Pos"
"حفظهم","Pos"
"بلاد الحرمين","Pos"
"والخير","Pos"
"والبركة","Pos"
"والسعاده","Pos"
"الخيرات","Pos"
"والطيبه","Pos"
"والسرور","Pos"
"بالنور","Pos"
"والنور","Pos"
"الخير","Pos"
"الشريفين","Pos"
"مبرووووووك","Pos"
"ومبروك","Pos"
"وبالتوفيق","Pos"
"بالتوفيق","Pos"
"ابارك","Pos"
"والف","Pos"
"والتأهل","Pos"
"يتمم","Pos"
"نبارك","Pos"
"مبروك","Pos"
"خادم الحرمين","Pos"
"السمو","Pos"
"بلدنا","Pos"
"للقلب","Pos"
"الروح","Pos"
"والقلب","Pos"
"بالقلب","Pos"
"والمشاعر","Pos"
"يطيب","Pos"
"الفؤاد","Pos"
"الغلا","Pos"
"القلب","Pos"
"وطننا","Pos"
"والوطن","Pos"
"وطني","Pos"
"فداء","Pos"
"قيادتنا","Pos"
"الوطن","Pos"
"ياصباح النور","Pos"
"النور","Pos"
"ملكنا","Pos"
"سيدي","Pos"
"بالشكر","Pos"
"شكري","Pos"
"موصول","Pos"
"الشكر","Pos"
"اهتمام","Pos"
"يحترم","Pos"
"تفاهم","Pos"
"احترام","Pos"
"الاعتذار","Pos"
"تعتذر","Pos"
"اعتذار","Pos"
"وفخر","Pos"
"الفخر","Pos"
"ذخر","Pos"
"محفل","Pos"
"فخرا","Pos"
"كفوووو","Pos"
"يحفظك","Pos"
"وعز","Pos"
"كفووووو","Pos"
"فخر","Pos"
"حفل","Pos"
"مناسبات","Pos"
"استاذي","Pos"
"أشكرك","Pos"
"مشكور","Pos"
"دكتورنا","Pos"
"وجزاك","Pos"
"دعمك","Pos"
"شكرآ","Pos"
"اشكرك","Pos"
"ممتنة","Pos"
"ممتنه","Pos"
"فخوره","Pos"
"اشكر","Pos"
"فخورة","Pos"
"استمتعت","Pos"
"محظوظه","Pos"
"فخور","Pos"
"اسفه","Neg"
"زعلان","Neg"
"غلطت","Neg"
"اطقطق","Neg"
"عصبت","Neg"
"اسف","Pos"
"اهنيك","Pos"
"خورافي","Pos"
"خرافي","Pos"
"جدااا","Pos"
"اسطورتي","Pos"
"مشاءالله","Pos"
"وحش","Pos"
"ابدعت","Pos"
"برافو","Pos"
"وحبي","Pos"
"وحبك","Pos"
"وحب","Pos"
"ضحكه","Pos"
"بحبك","Pos"
"حبه","Pos"
"مبسوطة","Pos"
"مروقه","Pos"
"انبسطت","Pos"
"صحباتي","Pos"
"ببكي","Neg"
"مبسوطه","Pos"
"فايز","Pos"
"فرحان","Pos"
"متحمس","Pos"
"مبسوط","Pos"
"وفرح","Pos"
"وسعاده","Pos"
"وفرحة","Pos"
"فرحه","Pos"
"ضيقه","Neg"
"والفرح","Pos"
"فرحة","Pos"
"ضحكة","Pos"
"فرح","Pos"
"اشجع","Pos"
"قلبيي","Pos"
"احبك","Pos"
"حبيتك","Pos"
"فرحتي","Pos"
"عمري","Pos"
"أشتقت","Pos"
"حبي","Pos"
"احلام","Pos"
"اماني","Pos"
"الاحلام","Pos"
"هنا_عبر_عن_حبك","Pos"
"اتمنى","Pos"
"امنيتي","Pos"
"فايده","Pos"
"ايمان","Pos"
"امل","Pos"
"بفضل","Pos"
"عزوجل","Pos"
"وجل","Pos"
"وتعالى","Pos"
"الرحمن","Pos"
"الفضل","Pos"
"وتوفيقه","Pos"
"وكرمه","Pos"
"ﷻ","Pos"
"فضل","Pos"
"نكبه","Neg"
"تفو","Neg"
"تلوم","Neg"
"تحترم","Pos"
"وجهة","Pos"
"عيب","Neg"
"إنجاز","Pos"
"انجاز","Pos"
"لاشريك","Pos"
"السميع","Pos"
"قدير","Pos"
"والمؤمنين","Pos"
"اصرف","Pos"
"اصلح","Pos"
"الاحتلال","Neg"
"تحرير","Pos"
"بالهدف","Pos"
"يحتفل","Pos"
"الفايز","Pos"
"خسرنا","Neg"
"احتفل","Pos"
"فاعف","Pos"
"العفو","Pos"
"عفوا","Pos"
"وفقنا","Pos"
"الحدووود_الشمالية_ترحب_بالملك","Pos"
"كريم","Pos"
"بيست","Pos"
"كيس","Neg"
"من كيسي","Neg"
"من كيسه","Neg"
"كيسيبيديا","Neg"
"اصلي","Pos"
"مبدع","Pos"
"اصيل","Pos"
"عقده","Neg"
"ورحم","Pos"
"رحمهم","Pos"
"رحمها","Pos"
"رحمه","Pos"
"رحم","Pos"
"الفاضل","Pos"
"واتمنى","Pos"
"تحيه","Pos"
"أستاذي","Pos"
"نبيا","Pos"
"مسلم","Pos"
"حسنة","Pos"
"مؤمن","Pos"
"ثق","Pos"
"تيأس","Neg"
"يأس","Neg"
"لاتيأس","Pos"
"تفاءل","Pos"
"تحزن","Neg"
"فالله","Pos"
"سبحانه","Pos"
"تقلق","Neg"
"لعل","Pos"
"وثق","Pos"
"يسرا","Pos"
"وتذكر","Pos"
"اطمئن","Pos"
"وحسن","Pos"
"حسن ظنكم","Pos"
"وحسن ظنكم","Pos"
"حسن الخاتمه","Pos"
"وحسن الخاتمه","Pos"
"حسن الخاتمة","Pos"
"وحسن الخاتمة","Pos"
"الحسن","Pos"
"الأخلاق","Pos"
"حسن","Pos"
"محترم","Pos"
"أتفق","Pos"
"صدقت","Pos"
"اتفق","Pos"
"وفقكم","Pos"
"يحفظكم","Pos"
"ويحفظكم","Pos"
"صبحكم","Pos"
"بحفظه","Pos"
"وجزاكم","Pos"
"يحفظ","Pos"
"حفظكم","Pos"
"ونفع","Pos"
"وبارك","Pos"
"وجمع","Pos"
"فخورين","Pos"
"ويبارك","Pos"
"وينفع","Pos"
"يحييك","Pos"
"بارك","Pos"
"يتقبل","Pos"
"عمرة","Pos"
"وتقبل","Pos"
"راض","Pos"
"أخلاقك","Pos"
"تقبل","Pos"
"ويحب","Pos"
"استحق","Pos"
"مهتم","Pos"
"معجب","Pos"
"تقدير","Pos"
"بحب","Pos"
"لعيب","Pos"
"اسمو","Pos"
"لايق","Pos"
"جامد","Pos"
"منظم","Pos"
"إعجاب","Pos"
"اعجبتني","Pos"
"الهديه","Pos"
"اعجاب","Pos"
"حلال","Pos"
"خايس","Neg"
"احلى","Pos"
"حلو","Pos"
"أعز","Pos"
"والمسلمين","Pos"
"اغلى","Pos"
"مكروه","Neg"
"لايحرمني","Pos"
"لايخليني","Pos"
"اميين","Pos"
"اعز","Pos"
"رهيبة","Pos"
"وجميلة","Pos"
"لطيفة","Pos"
"بسيطة","Pos"
"حلوة","Pos"
"ياسلام","Pos"
"سلام","Pos"
"غلط","Neg"
"تستهبل","Neg"
"اساطير","Pos"
"اغبى","Neg"
"اطلق","Pos"
"اسوء","Neg"
"اسطوره","Pos"
"اسوأ","Neg"
"اسلام","Pos"
"اعظم","Pos"
"بموت","Neg"
"الضحك","Pos"
"بموت من الضحك","Pos"
"اضحك","Pos"
"وناسه","Pos"
"يضحك","Pos"
"ضحك","Pos"
"الحر","Pos"
"هادي","Pos"
"حر","Pos"
"يوافق","Pos"
"وافق","Pos"
"ادام","Pos"
"وطاعة","Pos"
"مملكتنا","Neg"
"وأمن","Pos"
"حفظ","Pos"
"وخل","Neg"
"يفيدك","Pos"
"الفرصه","Pos"
"وسعادة","Pos"
"بالنجاح","Pos"
"أبارك","Pos"
"وغالي","Pos"
"غاليه","Pos"
"أغلى","Pos"
"يابعدي","Pos"
"الحبايب","Pos"
"ياغالي","Pos"
"وافي","Pos"
"غايب","Neg"
"غالي","Pos"
"أثق","Pos"
"يثق","Pos"
"اثق","Pos"
"الفنان","Pos"
"الفنانين","Pos"
"الفن","Pos"
"الاغنية","Pos"
"اللحن","Pos"
"اغنية","Pos"
"فنان","Pos"
"قويه","Pos"
"قوية","Pos"
"بقوة","Pos"
"قوي","Pos"
"الحلم","Pos"
"احلامي","Pos"
"أحلامك","Pos"
"احلم","Pos"
"كابوس","Neg"
"يتحقق","Pos"
"حلمه","Pos"
"حلما","Pos"
"عتمة","Neg"
"امنياتي","Pos"
"طموحي","Pos"
"حلم","Pos"
"اجرنا","Pos"
"الملتقى","Pos"
"الثقة","Pos"
"وسدد","Pos"
"قناعة","Pos"
"يقين","Pos"
"القوة","Pos"
"ثقة","Pos"
"الخالق","Pos"
"سبحوا_الله_كثيرا","Pos"
"يحفظهم","Pos"
"احفظ","Pos"
"الثقه","Pos"
"نثق","Pos"
"ثقه","Pos"
"سلمت","Pos"
"سلم","Pos"
"واحلى","Pos"
"أحلى","Pos"
"احلي","Pos"
"الامانة","Pos"
"الالتزام","Pos"
"وامان","Pos"
"الحبيبه","Pos"
"غصه","Neg"
"امان","Pos"
"دمتم","Pos"
"دوما","Pos"
"حفظك","Pos"
"دامت","Pos"
"وستبقى","Pos"
"ستبقى","Pos"
"شامخا","Pos"
"عنان","Pos"
"عمرا","Pos"
"دمت","Pos"
"مضمون","Pos"
"مناسب","Pos"
"الشرف","Pos"
"داعم","Pos"
"اعتز","Pos"
"المميزين","Pos"
"شرف","Pos"
"اخير","Pos"
"أمن","Pos"
"شركات","Pos"
"جرائم","Neg"
"الامن","Pos"
"امن","Pos"
"والتقدير","Pos"
"وشكر","Pos"
"فشكرا","Pos"
"والشكر","Pos"
"جزيل","Pos"
"موفقة","Pos"
"موفقه","Pos"
"موفقين","Pos"
"وفالنا","Pos"
"موفقیت","Pos"
"موفق","Pos"
"لخدمة","Pos"
"بتوفيق","Pos"
"يوفق","Pos"
"إنشاء","Pos"
"رؤية","Pos"
"وفقه","Pos"
"لتعزيز","Pos"
"والتقدم","Pos"
"وفق","Pos"
"لوطنه","Pos"
"مواطن","Pos"
"انساني","Pos"
"الشرفاء","Pos"
"شريف","Pos"
"الادب","Pos"
"أدب","Pos"
"اخلاق","Pos"
"استهبال","Neg"
"ادب","Pos"
"اعصب","Neg"
"واحس","Pos"
"اتحلطم","Neg"
"شسوي","Neg"
"انبسط","Pos"
"فاهمة","Pos"
"فاهمه","Pos"
"ماتعرف","Neg"
"فاهم","Pos"
"ممتع","Pos"
"وتنظيم","Pos"
"مذهل","Pos"
"رائع","Pos"
"واحب","Pos"
"احبه","Pos"
"ماحب","Neg"
"احبهم","Pos"
"واكره","Neg"
"اكره","Neg"
"اصحابي","Pos"
"احب","Pos"
"نورت","Pos"
"وغلا","Pos"
"منوره","Pos"
"فديتك","Pos"
"اهلين","Pos"
"ارحب","Pos"
"الراحمين","Pos"
"جناتك","Pos"
"واجمعنا","Pos"
"واغفر","Pos"
"المستبشرين","Pos"
"وارحم","Pos"
"واجمعني","Pos"
"جنتك","Pos"
"ارحمه","Pos"
"اجمعنا","Pos"
"ارحم","Pos"
"المكرمه","Pos"
"مساءكم سعيد","Pos"
"مساكم الله بالخير","Pos"
"أسعد","Pos"
"صباحكم","Pos"
"واسعد مسائكم","Pos"
"مسائكم","Pos"
"وأسعد","Pos"
"اسعد","Pos"
"قرة","Pos"
"وأجمل","Pos"
"اروع","Pos"
"وأحلى","Pos"
"روائع","Pos"
"أصدق","Pos"
"الوفاء","Pos"
"والأجمل","Pos"
"أروع","Pos"
"الفل","Pos"
"فل","Pos"
"تمنياتي","Pos"
"بدعوة","Pos"
"الأجر","Pos"
"التكريم","Pos"
"هنيئا","Pos"
"الرزق","Pos"
"رزقك","Pos"
"الخيرة","Pos"
"أنعم","Pos"
"رزقا","Pos"
"ويرزقكم","Pos"
"رزقه","Pos"
"وعافية","Pos"
"الأرزاق","Pos"
"الذاكرين","Pos"
"رزق","Pos"
"التأهل","Pos"
"فوز","Pos"
"جيد","Pos"
"متقدم","Pos"
"مثالي","Pos"
"وصفاء","Pos"
"قسوة","Neg"
"سعادته","Pos"
"الصحبة","Pos"
"صفاء","Pos"
"٩٢عام_من_المجد_ياعميد","Pos"
"المحافل","Pos"
"أسطورة","Pos"
"مجد","Pos"
"نحبهم","Pos"
"نضحك","Pos"
"نحب","Pos"
"القمر","Pos"
"الغيم","Pos"
"سماء","Pos"
"السما","Pos"
"قمر","Pos"
"باركت","Pos"
"صليت","Pos"
"مجيد","Pos"
"المواهب","Pos"
"واعد","Pos"
"النجس","Neg"
"وضيع","Neg"
"الفقراوي","Neg"
"الطواقي","Neg"
"طاقية","Neg"
"طاقيه","Neg"
"الوضيع","Neg"
"القمه","Pos"
"فقراوي","Neg"
"زعيم","Pos"
"الزعيم","Pos"
"العالمي","Pos"
"تأنيب","Neg"
"تأنيب الضمير","Pos"
"تبلد","Neg"
"طابور خامس","Neg"
"عقليه مريضه","Neg"
"عقلية مريضه","Neg"
"عقلية مريضة","Neg"
"عقلية مريضه","Neg"
"واعي","Pos"
"يسامح","Pos"
"وكرم","Pos"
"الضيافة","Pos"
"تكريم","Pos"
"ضيافة","Pos"
"كرم","Pos"
"العذب","Pos"
"غيم","Pos"
"نسيم","Pos"
"صمتك","Neg"
"عش","Pos"
"يجرح","Neg"
"تبالي","Pos"
"لامبالاه","Neg"
"لامبالاة","Neg"
"عيش","Pos"
"سامح","Pos"
"تطقطق","Neg"
"سريع","Pos"
"أعتذر","Pos"
"اعتذر","Pos"
"طهر","Pos"
"الطاهر","Pos"
"زهور","Pos"
"ينبت","Pos"
"ورد","Pos"
"لطيفه","Pos"
"حياه","Pos"
"يديمها","Pos"
"سعيده","Pos"
"كويسه","Pos"
"كويس","Pos"
"أحبه","Pos"
"زعل","Neg"
"صديقه","Pos"
"الأوطان","Pos"
"فدا","Pos"
"وطن","Pos"
"السنه_الجديده_2019","Pos"
"السعيدة","Pos"
"سعيدة","Pos"
"العميل الخائن","Neg"
"زوار السفارات","Neg"
"مصداقية","Pos"
"كفو","Pos"
"ونعم","Pos"
"صدقتي","Pos"
"انعم","Pos"
"والنعم","Pos"
"تنمر","Neg"
"وعي","Pos"
"السعيد","Pos"
"عيد","Pos"
"اللوبي","Neg"
"عدالة","Pos"
"تميز","Pos"
"ينفع","Pos"
"علم","Pos"
"سعى","Pos"
"نفع","Pos"
"نقدر","Pos"
"ياعيني","Pos"
"قووول","Pos"
"لوف","Pos"
"العسل","Pos"
"سكر","Pos"
"عروس","Pos"
"بخور","Pos"
"عسل","Pos"
"يسلط","Neg"
"ويرضى","Pos"
"يتوب","Pos"
"رضى","Pos"
"يقدر","Pos"
"يصلح","Pos"
"ويصلح","Pos"
"يخلف","Pos"
"يرضي","Pos"
"يرضى","Pos"
"ممتازه","Pos"
"ممتازة","Pos"
"جيده","Pos"
"متكامل","Pos"
"ممتاز","Pos
"ييسر امري","Pos"
"ييسر امورنا","Pos"
"عسر","Neg"
"وسهل","Pos"
"وسخر","Pos"
"توفيقا","Pos"
"يسرني","Pos"
"يسر","Pos"
"عقبالك","Pos"
"شاءالله","Pos"
"عقبال","Pos"
"الشهداء","Pos"
"شهيد","Pos"
"ظريف","Neg"
"ههههههههه","Pos"
"ابشرك","Pos"
"اخيرا","Pos"
"اسلم","Pos"
"ابشركم","Pos"
"وابشر","Pos"
"أبشر","Pos"
"لاهنت","Pos"
"ابشري","Pos"
"ابشر","Pos"
"الأماني","Pos"
"نصيب","Pos"
"تمنى","Pos"
"والمحبة","Pos"
"بالمحبة","Pos"
"الود","Pos"
"الأخوة","Pos"
"والوفاء","Pos"
"المحبه","Pos"
"والاحترام","Pos"
"والحب","Pos"
"بالطيب","Pos"
"الوفا","Pos"
"المغفرة","Pos"
"المحبة","Pos"
"نفوز","Pos"
"نفرح","Pos"
"بالأمان","Pos"
"الصادق","Pos"
"الرفيق","Pos"
"الأخ","Pos"
"الحقيقي","Pos"
"صديقا","Pos"
"المحب","Pos"
"الصديق","Pos"
"الاسف","Neg"
"تتفق","Pos"
"السب","Neg"
"واستمتع","Pos"
"المفضلة","Pos"
"احجز","Pos"
"ممتعة","Pos"
"تستمتع","Pos"
"فرصة","Pos"
"المفضل","Pos"
"المتعة","Pos"
"استمتع","Pos"
"تفتخر","Pos"
"افتخر","Pos"
"راقي","Pos"
"رقي","Pos"
"والاهتمام","Pos"
"والاخلاق","Pos"
"والأخلاق","Pos"
"الرقي","Pos"
"الطيبه","Pos"
"بطيب","Pos"
"والصدق","Pos"
"الحسنه","Pos"
"ثقافه","Pos"
"الاخلاق","Pos"
"الشين","Neg"
"عله","Neg"
"المجنون","Neg"
"البلا","Neg"
"حظه","Pos"
"ونعيم","Pos"
"حظوظ","Pos"
"حظي","Pos"
"تصعب","Neg"
"نخاف","Neg"
"حظ","Pos"
"نصيبك","Pos"
"دموعك","Neg"
"تعبك","Neg"
"حظك","Pos"
"الجيد","Pos"
"المفيد","Pos"
"العاطفي","Pos"
"العاطفة","Pos"
"السليم","Pos"
"الوعي","Pos"
"بالعلم","Pos"
"والعلم","Pos"
"العمل","Pos"
"للعلم","Pos"
"والعمل","Pos"
"المعرفة","Pos"
"العلم","Pos"
"تقدمها","Pos"
"الثقافة","Pos"
"والثقافة","Pos"
"ثقافة","Pos"
"الفائز","Pos"
"الأعلى","Pos"
"الاعلى","Pos"
"الجنان","Pos"
"بالفردوس","Pos"
"الجنة","Pos"
"تكفيرا","Neg"
"الفردوس","Pos"
"مهارات","Pos"
"الذكاء","Pos"
"العاقل","Pos"
"يتميز","Pos"
"يجيد","Pos"
"ينتج","Pos"
"الذكي","Pos"
"المتميزة","Pos"
"المميز","Pos"
"المشرف","Pos"
"المتميز","Pos"
"نعمه","Pos"
"السراء","Pos"
"والامان","Pos"
"النعمه","Pos"
"بنعمة","Pos"
"نعمة","Pos"
"الابداع","Pos"
"مبدعه","Pos"
"ابداع","Pos"
"فخامه","Pos"
"ملكة","Pos"
"سحابه","Pos"
"جوري","Pos"
"خيال","Pos"
"يجنن","Pos"
"تطوير","Pos"
"شوقك","Pos"
"غرامك","Pos"
"الفراق","Neg"
"أحبك","Pos"
"حبك","Pos"
"خرابيط","Neg"
"دلع","Pos"
"احتراما","Pos"
"حبايبي","Pos"
"حلوين","Pos"
"الحلوين","Pos"
"ياحلوين","Pos"
"بسمة","Pos"
"ابتسامة","Pos"
"العوض","Pos"
"الاماني","Pos"
"الامل","Pos"
"وابتسم","Pos"
"أبتسم","Pos"
"وانسى","Pos"
"أحببته","Pos"
"ابتسم","Pos"
"القلوب_الصادقه","Pos"
"طيبه","Pos"
"وراحة","Pos"
"وطمأنينة","Pos"
"عناء","Neg"
"والطمأنينة","Pos"
"والراحة","Pos"
"دائمة","Pos"
"شاكر","Pos"
"جزيلا","Pos"
"غثيث","Neg"
"مروق","Pos"
"مستانس","Pos"
"زعلانين","Neg"
"متحمسين","Pos"
"خايفين","Neg"
"مبسوطين","Pos"
"هديه","Pos"
"الهدية","Pos"
"إهداء","Pos"
"الهدايا","Pos"
"هدية","Pos"
"حفلات","Pos"
"حفله","Pos"
"هدايا","Pos"
"محظوظ","Pos"
"سيئين","Neg"
"كويسين","Pos"
"محظوظين","Pos"
"جلاد","Pos"
"اسطورة","Pos"
"الإبداع","Pos"
"المبادرات المجتمعية","Pos"
"الإنجاز","Pos"
"التميز","Pos"
"المدح","Pos"
"مدح","Pos"
"بيفوز","Pos"
"ينافس","Pos"
"يفوز","Pos"
"الطحالب","Neg"
"يفوزون","Pos"
"فرحانين","Pos"
"فايزين","Pos"
"مواهب","Pos"
"الموهبة","Pos"
"ثنائي","Pos"
"المهارات","Pos"
"موهبه","Pos"
"موهبة","Pos"
"الكرم","Pos"
"والكرم","Pos"
"الجود","Pos"
"ويجزاك","Pos"
"يالغلا","Pos"
"فديت","Pos"
"يابعد","Pos"
"لبى","Pos"
"يالبى","Pos"
"ياحبي","Pos"
"رحيم","Pos"
"الحكماء","Pos"
"غفور","Pos"
"عبادة","Pos"
"حكيم","Pos"
"وجدان","Pos"
"تسلمي","Pos"
"جذاب","Pos"
"يسعدلي","Pos"
"بوسه","Pos"
"تسلمين","Pos"
"احساس","Pos"
"ذوق","Pos"
"والعز","Pos"
"العز","Pos"
"الراس","Pos"
"دام","Pos"
"يعزك","Pos"
"يمناك","Pos"
"شامخ","Pos"
"صادقة","Pos"
"ومالك","Pos"
"أطيب","Pos"
"تبخل","Neg"
"طيبة","Pos"
"وصحه","Pos"
"طيبين","Pos"
"يقويك","Pos"
"يوفقك","Pos"
"وفالك","Pos"
"قدها","Pos"
"الاستقرار","Pos"
"وطنية","Pos"
"الوطنية","Pos"
"باختصار","Pos"
"الانتماء","Pos"
"يتجدد","Pos"
"ومستقبل","Pos"
"المستقبل","Pos"
"والعطاء","Pos"
"نتخطى الصعاب","Pos"
"الصعاب","Neg"
"مشرق","Pos"
"بعون","Neg"
"نفتخر","Pos"
"ابطال","Pos"
"الابطال","Pos"
"تستاهلون","Pos"
"يوفقنا","Pos"
"يجزاكم","Pos"
"يقويكم","Pos"
"المباركة","Pos"
"الفضيل","Pos"
"للشيخ","Pos"
"الصالح","Pos"
"الكريم","Pos"
"المبارك","Pos"
"الاحتفال","Pos"
"تهنئة","Pos"
"احتفال","Pos"
"السعاده","Pos"
"الغيره","Neg"
"الخيانه","Neg"
"اجمل_لحن_سمعته","Pos"
"الصداقه","Pos"
"اجر","Pos"
"والعافيه","Pos"
"الاجر","Pos"
"النفسية","Neg"
"الاستمتاع","Pos"
"الجميلة","Pos"
"الحماس","Pos"
"الإيجابية","Pos"
"متعة","Pos"
"التواضع","Pos"
"عطاء","Pos"
"قبح","Neg"
"تواضع","Pos"
"الأستاذ","Pos"
"أتشرف","Pos"
"خدمتكم","Pos"
"عشقت","Pos"
"جنون","Pos"
"العشق","Pos"
"عشقا","Pos"
"عشاق","Pos"
"عشق","Pos"
"العشاق","Pos"
"العاشق","Pos"
"حبنا","Pos"
"العاشقين","Pos"
"الجديدة","Pos"
"كنوز","Pos"
"السبع","Pos"
"رضي","Pos"
"فارغة","Neg"
"كنز","Pos"
"التوفيق","Pos"
"والنجاح","Pos"
"مبارك","Pos"
"الراقية","Pos"
"بشكرك","Pos"
"فخامة","Pos"
"ارقى","Pos"
"أرقى","Pos"
"راقية","Pos"
"هيبة","Pos"
"رفيع","Pos"
"يستاهلون","Pos"
"المشاركين","Pos"
"مميزين","Pos"
"مبدعين","Pos"
"مفيد","Pos"
"الفائدة","Pos"
"مفيدة","Pos"
"رهيبه","Pos"
"رهيب","Pos"
"فزت","Pos"
"تفوز","Pos"
"لحول","Neg"
"اذكروا_الله_تفرج_همومكم","Pos"
"قوة","Pos"
"التطور","Pos"
"مبروووك","Pos"
"مبروووووك","Pos"
"للاعلى","Pos"
"وعقبال","Pos"
"للأعلى","Pos"
"مبرووووك","Pos"
"مبرووك","Pos"
"نعمك","Pos"
"رزقنا","Pos"
"النعمة","Pos"
"بخت","Pos"
"محبوب","Pos"
"والتوفيق","Pos"
"والصحة","Pos"
"الصالحة","Pos"
"والعافية","Pos"
"والسعادة","Pos"
"تبكي","Neg"
"تضحك","Pos"
"للحزن","Neg"
"تبتسم","Pos"
"لتحسين","Pos"
"النمو","Pos"
"يعزز","Pos"
"كفاءة","Pos"
"تحفيز","Pos"
"تحسين","Pos"
"يضيء","Pos"
"تشرق","Pos"
"تزهر","Pos"
"فرحا","Pos"
"تضيء","Pos"
"أنر","Pos"
"بهجة","Pos"
"ياحياتي","Pos"
"اغني","Pos"
"مشتاقه","Pos"
"منور","Pos"
"اشتقنا","Pos"
"مشتاقين","Pos"
"الخلد","Pos"
"جنات","Pos"
"مساءك","Pos"
"بالخير","Pos"
"حياكم","Pos"
"حياك","Pos"
"اصلاح","Neg"
"الجميله","Pos"
"أحسنت","Pos"
"جزاك","Pos"
"احسنت","Pos"
"ونجاح","Pos"
"إنجازات","Pos"
"خيركم","Pos"
"الروقان","Pos"
"حلى","Pos"
"روقان","Pos"
"حلاوه","Pos"
"الورد","Pos"
"حلاوة","Pos"
"اطيب","Pos"
"انسانی","Pos"
"الخيره","Pos"
"خيرة","Pos"
"السلامه","Pos"
"والرزق","Pos"
"تبشر","Pos"
"خيره","Pos"
"يبارك","Pos"
"يشرفني","Pos"
"يشرفنا","Pos"
"اتشرف","Pos"
"تشرفت","Pos"
"والشهداء","Pos"
"وارزقهم","Pos"
"وأموات","Pos"
"الأبرار","Pos"
"السعداء","Pos"
"المتقين","Pos"
"الصالحين","Pos"
"بساطة","Pos"
"للأفضل","Pos"
"وتوفيق","Pos"
"تمم","Pos"
"للافضل","Pos"
"نستفيد","Pos"
"استفاد","Pos"
"يستفيد","Pos"
"الفايده","Pos"
"استفدنا","Pos"
"ندمت","Neg"
"استفدت","Pos"
"الامان","Pos"
"معني_الامان","Pos"
"أمان","Pos"
"الضياع","Neg"
"الخوف","Neg"
"السند","Pos"
"الطمأنينة","Pos"
"زحام","Neg"
"الأمان","Pos"
"كوارث","Neg"
"وطنهم","Pos"
"الباطل","Neg"
"والحق","Pos"
"الظالم","Neg"
"الحق","Pos"
"السلبي","Neg"
"ايجابي","Pos"
"إيجابي","Pos"
"طموح","Pos"
"خروف","Neg"
"الدين","Pos"
"غني","Pos"
"وتقدير","Pos"
"تعزيز","Pos"
"رائدة","Pos"
"روعه","Pos"
"تجنن","Pos"
"مسك","Pos"
"تسعدني","Pos"
"ممتن","Pos"
"مايستاهل","Neg"
"يوفقه","Pos"
"يستاهل","Pos"
"احبكم","Pos"
"تحبون","Pos"
"يخليكم","Pos"
"يسعدكم","Pos"
"ودعم","Pos""
"الداعم","Pos"
"المنافسة","Pos"
"الدعم","Pos"
"لدعم","Pos"
"تدعم","Pos"
"مكافأة","Pos"
"اليهودي","Neg"
"الخائن","Neg"
"أعداء","Neg"
"الخونة","Neg"
"الفرس","Neg"
"الخونه","Neg"
"وضد","Neg"
"متفقين","Pos"
"شبيحة","Neg"
"السجون","Neg"
"السجن","Neg"
"القصاص","Neg"
"سجن","Neg"
"وطرد","Neg"
"الطرد","Neg"
"طرد","Neg"
"الحوادث","Neg"
"حوادث","Neg"
"تتألم","Neg"
"تنكسر","Neg"
"تندم","Neg"
"تفقد","Neg"
"الحل","Pos"
"المشاكل","Neg"
"مشكلة","Neg"
"فوبيا","Neg"
"فرصه","Pos"
"مااحب","Neg"
"مشكله","Neg"
"والمشكله","Neg"
"وللاسف","Neg"
"المصيبه","Neg"
"المشكله","Neg"
"حماية","Neg"
"حقي","Pos"
"التدخل","Neg"
"الانسحاب","Neg"
"وللأسف","Neg"
"الإهمال","Neg"
"نطلب","Neg"
"للأسف","Neg"
"نعاني","Neg"
"المعاناة","Neg"
"بمرض","Neg"
"تعاني","Neg"
"يعالج","Pos"
"يعاني","Neg"
"غلاء","Neg"
"الذباب","Neg"
"ذباب","Neg"
"يخفي","Neg"
"يعجز","Neg"
"ضاق","Neg"
"عجز","Neg"
"تنظيم الحمدين","Neg"
"تخسي","Neg"
"خبل","Neg"
"الخبيث","Neg"
"خاين","Neg"
"خائن","Neg"
"جريمه","Neg"
"جريمة","Neg"
"الجريمة","Neg"
"العجم","Neg"
"الاخوان","Neg"
"العصملي","Neg"
"مظاهرات","Neg"
"إسقاط","Neg"
"تدمير","Neg"
"يضرب","Neg"
"يستغل","Neg"
"يسقط","Neg"
"يدمر","Neg"
"المرتزقه","Neg"
"السيئه","Neg"
"السلبية","Neg"
"السيئة","Pos"
"تافه","Neg"
"مقرف","Neg"
"خلايا عزمي","Neg"
"كلاب","Neg"
"تنبح","Neg"
"نباح","Neg"
"الحمير","Neg"
"النباح","Neg"
"ينبح","Neg"
"الكلاب","Neg"
"الفتنة","Neg"
"حثالة","Neg"
"القذرة","Neg"
"الخلافات","Neg"
"الخلاف","Neg"
"الأزمة","Neg"
"العاطلين","Neg"
"حرام","Neg"
"ابله","Neg"
"مسخره","Neg"
"زباله","Neg"
"زبال","Neg"
"اخس","Neg"
"واطي","Neg"
"خليهم","Neg"
"زبالة","Neg"
"واعفو","Pos"
"واعف","Pos"
"عفو","Pos"
"غش","Neg"
"مهزله","Neg"
"ظلم","Neg"
"الخراب","Neg"
"كارثة","Pos"
"اشباه","Neg"
"دمار","Neg"
"بقتل","Neg"
"مقتل","Neg"
"اليهود","Neg"
"المجوس","Neg"
"استغلال","Neg"
"للاسف","Neg"
"مبالغ","Neg"
"كافي","Neg"
"ذنوب","Neg"
"الحسنات","Pos"
"صلوا_على_النبي_لاجل_شفاعته","Pos"
"المعاصي","Neg"
"تشويه","Neg"
"عنصري","Neg"
"يمهل","Pos"
"يهمل","Neg"
"ينتقم","Neg"
"غلطه","Neg"
"خطاء","Neg"
"مخالفه","Neg"
"خطا","Neg"
"الخطر","Neg"
"الحرب","Neg"
"ضحية","Neg"
"خاطئ","Neg"
"خاطئة","Neg"
"الخنزيره","Neg"
"دويلة","Neg"
"الخنزيرة","Neg"
"المقاطعه","Neg"
"خيانه","Neg"
"كفروا","Neg"
"عذابا","Neg"
"جهنم","Neg"
"القم","Neg"
"جزمة","Neg"
"يلعنك","Neg"
"دعس","Neg"
"يلعنكم","Neg"
"الكلب","Neg"
"مرتزقة","Neg"
"الصهاينة","Neg"
"المرتزقة","Neg"
"مقاطعة","Neg"
"المقاطعة","Neg"
"الرفض","Neg"
"اللوم","Neg"
"فساد","Neg"
"المخدرات","Neg"
"الفساد","Neg"
"إنسانية","Pos"
"الإساءة","Neg"
"التعايش","Pos"
"الكراهية","Neg"
"تختفي","Neg"
"اسقاط","Neg"
"يخسي","Neg"
"اجلد","Neg"
"يجلد","Neg"
"مقبرة","Neg"
"ايقاف","Neg"
"هدر","Neg"
"خلايا","Neg"
"خبث","Neg"
"الفاسد","Neg"
"مزبلة","Neg"
"واحبك","Pos"
"تحبني","Pos"
"اغار","Neg"
"اتغير","Neg"
"اكرهك","Neg"
"جبان","Neg"
"حمار","Neg"
"قذر","Neg"
"داهيه","Neg"
"عاهه","Neg"
"فاشل","Neg"
"شعبية","Pos"
"ضحايا","Neg"
"هاردلك","Pos"
"هزيمه","Neg"
"صياحهم","Neg"
"الجن","Neg"
"الرجيم","Neg"
"والعياذ","Neg"
"الشياطين","Neg"
"وشر","Neg"
"البلية","Neg"
"حسد","Neg"
"ونعوذ","Neg"
"وأعوذ","Neg"
"شره","Neg"
"سوء","Neg"
"أعوذ","Neg"
"الشر","Neg"
"شر","Neg"
"يفيد","Neg"
"الفرص","Pos"
"ضاعت","Neg"
"ضيع","Neg"
"ضياع","Neg"
"الحروب","Neg"
"فوضى","Neg"
"الفوضى","Neg"
"نستطيع","Pos"
"طقطقة","Neg"
"هزلت","Neg"
"فضيحة","Neg"
"محاسبة","Neg"
"الزبالة","Neg"
"تطبيل","Neg"
"مهزلة","Neg"
"القرف","Neg"
"فضايح","Neg"
"قرف","Neg"
"ميته","Pos"
"القهر","Neg"
"اه","Neg"
"اااه","Neg"
"صداع","Neg"
"قهر","Neg"
"امحق","Neg"
"مشاكل","Neg"
"قانوني","Pos"
"مخالف","Neg"
"ذميم","Neg"
"مرتزقه","Neg"
"خونة","Neg"
"فاضيه","Neg"
"زفت","Neg"
"تأخير","Neg"
"تشجيع","Pos"
"حرمان","Neg"
"جثة","Neg"
"يعاقب","Neg"
"الأمانة","Pos"
"رمي","Neg"
"مضيع","Neg"
"تطيح","Neg"
"ضدي","Neg"
"ينقذ","Pos"
"قطعت","Neg"
"قصف","Neg"
"حرب","Neg"
"تخبط","Neg"
"يهدد","Neg"
"نصب","Neg"
"الظن","Neg"
"تثق","Pos"
"تظن","Neg"
"تخشى","Neg"
"تغضب","Neg"
"تتجاهل","Neg"
"تسيء","Neg"
"أساء","Neg"
"تتهم","Neg"
"يسيء","Neg"
"يحزنون","Neg"
"بالصحة","Pos"
"تحرم","Neg"
"التنمر","Neg"
"العنف","Neg"
"الكذب","Neg"
"بالكذب","Neg"
"يصدق","Pos"
"تكذب","Neg"
"كذبه","Neg"
"ينكر","Neg"
"مايدري","Neg"
"يكذبون","Neg"
"يكذب","Neg"
"المجرمين","Neg"
"قتله","Neg"
"هدم","Neg"
"القبض","Neg"
"الفتنه","Neg"
"اذناب","Neg"
"الصهيوني","Neg"
"قردوغان","Neg"
"احمق","Neg"
"تجرح","Pos"
"تعاتب","Neg"
"تؤذي","Neg"
"تبالغ","Neg"
"احتجاج","Neg"
"المرتزق","Neg"
"جني","Neg"
"مافيا","Neg"
"ياهلا","Pos"
"الكذاب","Neg"
"كذاب","Neg"
"الاعداء","Neg"
"اعداء","Neg"
"والمشكلة","Neg"
"المصيبة","Neg"
"المشكلة","Neg"
"لليهود","Neg"
"مرتزق","Neg"
"الصدمة","Neg"
"معاناة","Neg"
"ارتفاع_سعر_البنزين","Neg"
"الإرهاب","Neg"
"العدو","Neg"
"خيانة","Neg"
"مضحك","Pos"
"السيئ","Neg"
"رائعا","Pos"
"الأجمل","Pos"
"السيء","Neg"
"مرهق","Neg"
"سيء","Neg"
"احاول","Pos"
"تتدخل","Neg"
"تطالب","Neg"
"النفايات","Neg"
"الارهاب","Neg"
"الحمار","Neg"
"اهبل","Neg"
"كلب","Neg"
"الاخونج","Neg"
"الغبار","Neg"
"تغرق","Neg"
"ازمة","Neg"
"الحيل","Neg"
"الخلل","Neg"
"فاسد","Neg"
"اضرب","Neg"
"يغبن","Neg"
"كريه","Neg"
"مستفز","Neg"
"غبيه","Neg"
"طقطقه","Neg"
"تافهه","Neg"
"استفزاز","Neg"
"مشرد","Neg"
"عاطل","Neg"
"همش","Neg"
"ظلمات","Neg"
"الظلم","Neg"
"ترفض","Neg"
"يرفض","Neg"
"تسرق","Neg"
"تتعب","Neg"
"يظلم","Neg"
"تظلم","Neg"
"البطالة","Neg"
"يعانون","Neg"
"القيمة","Pos"
"تبا","Neg"
"الفقيد","Neg"
"وألهم","Pos"
"ومحبيه","Pos"
"لعن","Neg"
"اولى","Neg"
"اسرائيل","Neg"
"الاسرائيلي","Neg"
"مخالفات","Neg"
"عقوبات","Neg"
"عقوبه","Neg"
"العقاب","Neg"
"عقوبة","Neg"
"المخالفة","Neg"
"العقوبة","Neg"
"العقوبات","Neg"
"وكذب","Neg"
"الخبث","Neg"
"والكذب","Neg"
"كذب","Neg"
"شریف","Pos"
"خان","Neg"
"الشبك","Neg"
"الشواذ","Neg"
"يعقب","Neg"
"الحسرة","Neg"
"الذنب","Neg"
"ذنبي","Neg"
"خذلان","Neg"
"ذنب","Neg"
"يلعن","Neg"
"ملعون","Neg"
"خلل","Neg"
"عنف","Neg"
"قاتل","Neg"
"هربت","Neg"
"الهروب","Neg"
"تهرب","Neg"
"فتنه_تغلب","Neg"
"خمینی","Neg"
"فتنه","Neg"
"هياط","Neg"
"يهايط","Neg"
"تهايط","Neg"
"مهايطيه","Neg"
"مهايطية","Neg"
"مهايطي","Neg"
"انفصال","Neg"
"جبان","Pos"
"خائب","Neg"
"عاف","Pos"
"تقاعس","Neg"
"تسرع","Neg"
"دجى","Neg"
"تصدع","Neg"
"عار","Neg"
"إدانة","Neg"
"خطأ","Neg"
"إيقاف","Neg"
"بخيل","Neg"
"خسر","Neg"
"خسره","Neg"
"إضاعة","Pos"
"تخاذل","Neg"
"زنديق","Neg"
"كافر","Neg"
"تارك","Neg"
"حقير","Neg"
"إثبات","Pos"
"حساس","Neg"
"رؤوف","Neg"
"غشاش","Neg"
"بكاء","Neg"
"تراجع","Neg"
"شح","Neg"
"بخس","Neg"
"رخيص","Neg"
"ضعيف","Neg"
"تنافر","Neg"
"إدعاء","Neg"
"إنكار","Neg"
"إهانة","Pos"
"تخالف","Pos"
"ضر","Neg"
"بشع","Neg"
"حرم","Neg"
"انهزم","Neg"
"ملموس","Neg"
"واقعي","Neg"
"سخط","Neg"
"غيظ","Neg"
"تابع","Neg"
"خادم","Neg"
"أذل","Neg"
"أهان","Neg"
"خسة","Neg"
"خسيس","Neg"
"دنيء","Neg"
"سافل","Neg"
"منحط","Neg"
"توفي","Neg"
"زال","Neg"
"أحمق","Neg"
"جاهل","Neg"
"تأمين","Neg"
"تعيس","Neg"
"سفاسف","Neg"
"أرهب","Neg"
"عسير","Neg"
"مميت","Neg"
"أبله","Neg"
"أبغض","Pos"
"خسارة","Neg"
"أمية","Neg"
"شكرها","Neg"
"إخلاء","Neg"
"إقصاء","Neg"
"ترحيل","Neg"
"إحتياج","Neg"
"ذليل","Neg"
"نذل","Neg"
"استلام","Neg"
"منحوس","Neg"
"عارض","Neg"
"أنفق","Neg"
"مضر","Neg"
"ضعف","Neg"
"كاره","Neg"
"أسى","Neg"
"حنظل","Neg"
"تعصب","Neg"
"حموضة","Neg"
"إفلاس","Neg"
"تصنع","Neg"
"عظمة","Neg"
"إرهاق","Neg"
"سلبي","Neg"
"سلبية","Neg"
"حزين","Neg"
"أفقر","Neg"
"بشعة","Neg"
"تذليل","Neg"
"مسهل","Neg"
"جزاء","Pos"
"أخذ","Neg"
"إطفاء","Pos"
"إطلاق","Pos"
"تجنبها","Pos"
"ارتياح","Pos"
"سكوت","Pos"
"برودة","Pos"
"صادق","Pos"
"مخلص","Pos"
"مؤتمن","Pos"
"براءة","Pos"
"تأدب","Pos"
"طليق","Pos"
"محرر","Pos"
"غني","Pos"
"جميل","Pos"
"مجاز","Pos"
"تشتت","Pos"
"تناثر","Pos"
"استمرار","Pos"
"صاعد","Pos"
"استقامة","Pos"
"فاضلة","Pos"
"قبل","Pos"
"إلغاء","Pos"
"اهتدى","Pos"
"إلزام","Pos"
"جنة","Pos"
"فردوس","Pos"
"نعيم","Pos"
"ألفة","Pos"
"حب","Pos"
"صداقة","Pos"
"بارع","Pos"
"خير","Pos"
"مأساة","Pos"
"حلها","Pos"
"فكها","Pos"
"عادل","Pos"
"تأييد","Pos"
"خضوع","Pos"
"نزيه","Pos"
"استعادة","Pos"
"إطمئنان","Pos"
"إقامة","Pos"
"بناء","Pos"
"تمييز","Pos"
"تعارض","Pos"
"صاحي","Pos"
"اشتغل","Pos"
"بدد","Pos"
"بذل","Pos"
"صدوق","Pos"
"إخلاص","Pos"
"مألوف","Pos"
"جيد","Pos"
"بريء","Pos"
"تهوع","Pos"
"شغل","Pos"
"تأكيد","Pos"
"ثبوت","Pos"
"تقدمي","Pos"
"محترم","Pos"
"مقدس","Pos"
"ملاك","Pos"
"ملك","Pos"
