{
  "Table": {
    "TableName": "${self:provider.environment.DYNAMODB_TABLE}",
    "KeySchema": [
      {
        "AttributeName": "id",
        "KeyType": "HASH"
      }
    ],
    "AttributeDefinitions": [
      {
        "AttributeName": "id",
        "AttributeType": "S"
      }
    ],
    "ProvisionedThroughput": {
      "ReadCapacityUnits": 1,
      "WriteCapacityUnits": 1
    }
  }
}
