module gitlab.com/arbetsformedlingen/devops/aardvarkManager

go 1.18

require (
	github.com/argoproj/argo-cd/v2 v2.4.11
	github.com/gin-contrib/cors v1.4.0
	github.com/gin-gonic/gin v1.8.1
	github.com/go-git/go-billy/v5 v5.3.1
	github.com/go-git/go-git/v5 v5.4.2
	github.com/openshift/client-go v0.0.0-20220603133046-984ee5ebedcf
	github.com/spf13/viper v1.12.0
	github.com/stretchr/testify v1.8.0
	github.com/xanzy/go-gitlab v0.68.2
	gopkg.in/yaml.v3 v3.0.1
	k8s.io/apimachinery v0.24.4
	k8s.io/client-go v0.24.4
	sigs.k8s.io/kustomize/api v0.10.1
)

require (
	github.com/Azure/go-ansiterm v0.0.0-20210617225240-d185dfc1b5a1 // indirect
	github.com/MakeNowJust/heredoc v0.0.0-20170808103936-bb23615498cd // indirect
	github.com/Masterminds/semver/v3 v3.1.1 // indirect
	github.com/Microsoft/go-winio v0.4.17 // indirect
	github.com/ProtonMail/go-crypto v0.0.0-20210428141323-04723f9f07d7 // indirect
	github.com/PuerkitoBio/purell v1.1.1 // indirect
	github.com/PuerkitoBio/urlesc v0.0.0-20170810143723-de5bf2ad4578 // indirect
	github.com/acomagu/bufpipe v1.0.3 // indirect
	github.com/argoproj/gitops-engine v0.7.3 // indirect
	github.com/argoproj/pkg v0.11.1-0.20211203175135-36c59d8fafe0 // indirect
	github.com/bombsimon/logrusr/v2 v2.0.1 // indirect
	github.com/bradleyfalzon/ghinstallation/v2 v2.0.4 // indirect
	github.com/cespare/xxhash/v2 v2.1.2 // indirect
	github.com/chai2010/gettext-go v0.0.0-20170215093142-bf70f2a70fb1 // indirect
	github.com/davecgh/go-spew v1.1.1 // indirect
	github.com/dgryski/go-rendezvous v0.0.0-20200823014737-9f7001d12a5f // indirect
	github.com/docker/distribution v2.7.1+incompatible // indirect
	github.com/emicklei/go-restful v2.9.5+incompatible // indirect
	github.com/emirpasic/gods v1.12.0 // indirect
	github.com/evanphx/json-patch v4.12.0+incompatible // indirect
	github.com/exponent-io/jsonpath v0.0.0-20151013193312-d6023ce2651d // indirect
	github.com/fatih/camelcase v1.0.0 // indirect
	github.com/fsnotify/fsnotify v1.5.4 // indirect
	github.com/fvbommel/sortorder v1.0.1 // indirect
	github.com/ghodss/yaml v1.0.0 // indirect
	github.com/gin-contrib/sse v0.1.0 // indirect
	github.com/go-errors/errors v1.0.1 // indirect
	github.com/go-git/gcfg v1.5.0 // indirect
	github.com/go-logr/logr v1.2.3 // indirect
	github.com/go-openapi/jsonpointer v0.19.5 // indirect
	github.com/go-openapi/jsonreference v0.19.5 // indirect
	github.com/go-openapi/swag v0.19.14 // indirect
	github.com/go-playground/locales v0.14.0 // indirect
	github.com/go-playground/universal-translator v0.18.0 // indirect
	github.com/go-playground/validator/v10 v10.10.0 // indirect
	github.com/go-redis/cache/v8 v8.4.2 // indirect
	github.com/go-redis/redis/v8 v8.11.3 // indirect
	github.com/gobwas/glob v0.2.3 // indirect
	github.com/goccy/go-json v0.9.7 // indirect
	github.com/gogo/protobuf v1.3.2 // indirect
	github.com/golang-jwt/jwt/v4 v4.2.0 // indirect
	github.com/golang/protobuf v1.5.2 // indirect
	github.com/google/btree v1.0.1 // indirect
	github.com/google/go-cmp v0.5.8 // indirect
	github.com/google/go-github/v41 v41.0.0 // indirect
	github.com/google/go-querystring v1.1.0 // indirect
	github.com/google/gofuzz v1.1.0 // indirect
	github.com/google/shlex v0.0.0-20191202100458-e7afc7fbc510 // indirect
	github.com/google/uuid v1.1.2 // indirect
	github.com/googleapis/gnostic v0.5.5 // indirect
	github.com/gregjones/httpcache v0.0.0-20190611155906-901d90724c79 // indirect
	github.com/hashicorp/go-cleanhttp v0.5.2 // indirect
	github.com/hashicorp/go-retryablehttp v0.7.1 // indirect
	github.com/hashicorp/hcl v1.0.0 // indirect
	github.com/imdario/mergo v0.3.12 // indirect
	github.com/inconshreveable/mousetrap v1.0.0 // indirect
	github.com/jbenet/go-context v0.0.0-20150711004518-d14ea06fba99 // indirect
	github.com/jonboulle/clockwork v0.2.2 // indirect
	github.com/josharian/intern v1.0.0 // indirect
	github.com/json-iterator/go v1.1.12 // indirect
	github.com/kballard/go-shellquote v0.0.0-20180428030007-95032a82bc51 // indirect
	github.com/kevinburke/ssh_config v0.0.0-20201106050909-4977a11b4351 // indirect
	github.com/klauspost/compress v1.13.5 // indirect
	github.com/leodido/go-urn v1.2.1 // indirect
	github.com/liggitt/tabwriter v0.0.0-20181228230101-89fcab3d43de // indirect
	github.com/magiconair/properties v1.8.6 // indirect
	github.com/mailru/easyjson v0.7.6 // indirect
	github.com/mattn/go-isatty v0.0.14 // indirect
	github.com/mitchellh/go-homedir v1.1.0 // indirect
	github.com/mitchellh/go-wordwrap v1.0.0 // indirect
	github.com/mitchellh/mapstructure v1.5.0 // indirect
	github.com/moby/spdystream v0.2.0 // indirect
	github.com/moby/term v0.0.0-20210610120745-9d4ed1856297 // indirect
	github.com/modern-go/concurrent v0.0.0-20180306012644-bacd9c7ef1dd // indirect
	github.com/modern-go/reflect2 v1.0.2 // indirect
	github.com/monochromegane/go-gitignore v0.0.0-20200626010858-205db1a8cc00 // indirect
	github.com/opencontainers/go-digest v1.0.0 // indirect
	github.com/openshift/api v0.0.0-20220525145417-ee5b62754c68 // indirect
	github.com/patrickmn/go-cache v2.1.0+incompatible // indirect
	github.com/pelletier/go-toml v1.9.5 // indirect
	github.com/pelletier/go-toml/v2 v2.0.1 // indirect
	github.com/peterbourgon/diskv v2.0.1+incompatible // indirect
	github.com/pkg/errors v0.9.1 // indirect
	github.com/pmezard/go-difflib v1.0.0 // indirect
	github.com/robfig/cron v1.2.0 // indirect
	github.com/russross/blackfriday v1.5.2 // indirect
	github.com/sergi/go-diff v1.1.0 // indirect
	github.com/sirupsen/logrus v1.8.1 // indirect
	github.com/spf13/afero v1.8.2 // indirect
	github.com/spf13/cast v1.5.0 // indirect
	github.com/spf13/cobra v1.3.0 // indirect
	github.com/spf13/jwalterweatherman v1.1.0 // indirect
	github.com/spf13/pflag v1.0.5 // indirect
	github.com/stretchr/objx v0.4.0 // indirect
	github.com/subosito/gotenv v1.3.0 // indirect
	github.com/ugorji/go/codec v1.2.7 // indirect
	github.com/vmihailenco/go-tinylfu v0.2.1 // indirect
	github.com/vmihailenco/msgpack/v5 v5.3.4 // indirect
	github.com/vmihailenco/tagparser/v2 v2.0.0 // indirect
	github.com/xanzy/ssh-agent v0.3.0 // indirect
	github.com/xlab/treeprint v0.0.0-20181112141820-a009c3971eca // indirect
	go.starlark.net v0.0.0-20200306205701-8dd3e2ee1dd5 // indirect
	golang.org/x/crypto v0.0.0-20220525230936-793ad666bf5e // indirect
	golang.org/x/exp v0.0.0-20210901193431-a062eea981d2 // indirect
	golang.org/x/net v0.0.0-20220621193019-9d032be2e588 // indirect
	golang.org/x/oauth2 v0.0.0-20220608161450-d0670ef3b1eb // indirect
	golang.org/x/sync v0.0.0-20210220032951-036812b2e83c // indirect
	golang.org/x/sys v0.0.0-20220520151302-bc2c85ada10a // indirect
	golang.org/x/term v0.0.0-20210927222741-03fcf44c2211 // indirect
	golang.org/x/text v0.3.7 // indirect
	golang.org/x/time v0.0.0-20220411224347-583f2d630306 // indirect
	google.golang.org/appengine v1.6.7 // indirect
	google.golang.org/genproto v0.0.0-20220519153652-3a47de7e79bd // indirect
	google.golang.org/grpc v1.46.2 // indirect
	google.golang.org/protobuf v1.28.0 // indirect
	gopkg.in/inf.v0 v0.9.1 // indirect
	gopkg.in/ini.v1 v1.66.4 // indirect
	gopkg.in/warnings.v0 v0.1.2 // indirect
	gopkg.in/yaml.v2 v2.4.0 // indirect
	k8s.io/api v0.24.0 // indirect
	k8s.io/apiserver v0.23.1 // indirect
	k8s.io/cli-runtime v0.23.1 // indirect
	k8s.io/component-base v0.23.1 // indirect
	k8s.io/component-helpers v0.23.1 // indirect
	k8s.io/klog/v2 v2.60.1 // indirect
	k8s.io/kube-aggregator v0.23.1 // indirect
	k8s.io/kube-openapi v0.0.0-20211115234752-e816edb12b65 // indirect
	k8s.io/kubectl v0.23.1 // indirect
	k8s.io/kubernetes v1.23.1 // indirect
	k8s.io/utils v0.0.0-20210930125809-cb0fa318a74b // indirect
	sigs.k8s.io/json v0.0.0-20211020170558-c049b76a60c6 // indirect
	sigs.k8s.io/kustomize/api v0.10.1 // indirect
	sigs.k8s.io/kustomize/kyaml v0.13.0 // indirect
	sigs.k8s.io/structured-merge-diff/v4 v4.2.0 // indirect
	sigs.k8s.io/yaml v1.3.0 // indirect
)

replace (
	k8s.io/api => k8s.io/api v0.23.1
	k8s.io/apiextensions-apiserver => k8s.io/apiextensions-apiserver v0.23.1
	k8s.io/apimachinery => k8s.io/apimachinery v0.23.1
	k8s.io/apiserver => k8s.io/apiserver v0.23.1
	k8s.io/cli-runtime => k8s.io/cli-runtime v0.23.1
	k8s.io/client-go => k8s.io/client-go v0.23.1
	k8s.io/cloud-provider => k8s.io/cloud-provider v0.23.1
	k8s.io/cluster-bootstrap => k8s.io/cluster-bootstrap v0.23.1
	k8s.io/code-generator => k8s.io/code-generator v0.23.1
	k8s.io/component-base => k8s.io/component-base v0.23.1
	k8s.io/component-helpers => k8s.io/component-helpers v0.23.1
	k8s.io/controller-manager => k8s.io/controller-manager v0.23.1
	k8s.io/cri-api => k8s.io/cri-api v0.23.1
	k8s.io/csi-translation-lib => k8s.io/csi-translation-lib v0.23.1
	k8s.io/kube-aggregator => k8s.io/kube-aggregator v0.23.1
	k8s.io/kube-controller-manager => k8s.io/kube-controller-manager v0.23.1
	k8s.io/kube-proxy => k8s.io/kube-proxy v0.23.1
	k8s.io/kube-scheduler => k8s.io/kube-scheduler v0.23.1
	k8s.io/kubectl => k8s.io/kubectl v0.23.1
	k8s.io/kubelet => k8s.io/kubelet v0.23.1
	k8s.io/kubernetes => k8s.io/kubernetes v1.23.1
	k8s.io/legacy-cloud-providers => k8s.io/legacy-cloud-providers v0.23.1
	k8s.io/metrics => k8s.io/metrics v0.23.1
	k8s.io/mount-utils => k8s.io/mount-utils v0.23.1
	k8s.io/pod-security-admission => k8s.io/pod-security-admission v0.23.1
	k8s.io/sample-apiserver => k8s.io/sample-apiserver v0.23.1
)
