^C:\USERS\ADMIN\DESKTOP\RR_HERTZ\PLUGINFILES\CONTACTMODEL\EXAMPLE\RR_HERTZ.CPP
C:\WINDOWS\GLOBALIZATION\SORTING\SORTDEFAULT.NLS
C:\PROGRAM FILES (X86)\MICROSOFT VISUAL STUDIO\2019\COMMUNITY\VC\TOOLS\MSVC\14.29.30133\BIN\HOSTX86\X64\1033\CLUI.DLL
C:\WINDOWS\SYSTEM32\TZRES.DLL
C:\USERS\ADMIN\DESKTOP\RR_HERTZ\PLUGINFILES\CONTACTMODEL\EXAMPLE\RR_HERTZ.H
C:\USERS\ADMIN\DESKTOP\RR_HERTZ\PLUGINFILES\CONTACTMODEL\SRC\CONTACTMODELMECHANICAL.H
C:\USERS\ADMIN\DESKTOP\RR_HERTZ\PLUGINFILES\CONTACTMODEL\SRC\CONTACTMODEL.H
C:\USERS\ADMIN\DESKTOP\RR_HERTZ\PLUGINFILES\INTERFACE\CONTACTMODEL\INTERFACE\ICONTACTMODEL.H
C:\USERS\ADMIN\DESKTOP\RR_HERTZ\PLUGINFILES\INTERFACE\MODULE\INTERFACE\DIM.H
C:\USERS\ADMIN\DESKTOP\RR_HERTZ\PLUGINFILES\INTERFACE\BASE\SRC\BASE.H
C:\USERS\ADMIN\DESKTOP\RR_HERTZ\PLUGINFILES\INTERFACE\BASE\SRC\BASEDEF.H
C:\USERS\ADMIN\DESKTOP\RR_HERTZ\PLUGINFILES\INTERFACE\BASE\SRC\EXPORT.H
C:\PROGRAM FILES (X86)\WINDOWS KITS\10\INCLUDE\10.0.19041.0\UCRT\WCHAR.H
C:\PROGRAM FILES (X86)\WINDOWS KITS\10\INCLUDE\10.0.19041.0\UCRT\CORECRT.H
C:\PROGRAM FILES (X86)\MICROSOFT VISUAL STUDIO\2019\COMMUNITY\VC\TOOLS\MSVC\14.29.30133\INCLUDE\VCRUNTIME.H
C:\PROGRAM FILES (X86)\MICROSOFT VISUAL STUDIO\2019\COMMUNITY\VC\TOOLS\MSVC\14.29.30133\INCLUDE\SAL.H
C:\PROGRAM FILES (X86)\MICROSOFT VISUAL STUDIO\2019\COMMUNITY\VC\TOOLS\MSVC\14.29.30133\INCLUDE\CONCURRENCYSAL.H
C:\PROGRAM FILES (X86)\MICROSOFT VISUAL STUDIO\2019\COMMUNITY\VC\TOOLS\MSVC\14.29.30133\INCLUDE\VADEFS.H
C:\PROGRAM FILES (X86)\WINDOWS KITS\10\INCLUDE\10.0.19041.0\UCRT\CORECRT_MEMCPY_S.H
C:\PROGRAM FILES (X86)\WINDOWS KITS\10\INCLUDE\10.0.19041.0\UCRT\ERRNO.H
C:\PROGRAM FILES (X86)\MICROSOFT VISUAL STUDIO\2019\COMMUNITY\VC\TOOLS\MSVC\14.29.30133\INCLUDE\VCRUNTIME_STRING.H
C:\PROGRAM FILES (X86)\WINDOWS KITS\10\INCLUDE\10.0.19041.0\UCRT\CORECRT_WCONIO.H
C:\PROGRAM FILES (X86)\WINDOWS KITS\10\INCLUDE\10.0.19041.0\UCRT\CORECRT_STDIO_CONFIG.H
C:\PROGRAM FILES (X86)\WINDOWS KITS\10\INCLUDE\10.0.19041.0\UCRT\CORECRT_WCTYPE.H
C:\PROGRAM FILES (X86)\WINDOWS KITS\10\INCLUDE\10.0.19041.0\UCRT\CORECRT_WDIRECT.H
C:\PROGRAM FILES (X86)\WINDOWS KITS\10\INCLUDE\10.0.19041.0\UCRT\CORECRT_WIO.H
C:\PROGRAM FILES (X86)\WINDOWS KITS\10\INCLUDE\10.0.19041.0\UCRT\CORECRT_SHARE.H
C:\PROGRAM FILES (X86)\WINDOWS KITS\10\INCLUDE\10.0.19041.0\UCRT\CORECRT_WPROCESS.H
C:\PROGRAM FILES (X86)\WINDOWS KITS\10\INCLUDE\10.0.19041.0\UCRT\CORECRT_WSTDIO.H
C:\PROGRAM FILES (X86)\WINDOWS KITS\10\INCLUDE\10.0.19041.0\UCRT\CORECRT_WSTDLIB.H
C:\PROGRAM FILES (X86)\WINDOWS KITS\10\INCLUDE\10.0.19041.0\UCRT\CORECRT_WSTRING.H
C:\PROGRAM FILES (X86)\WINDOWS KITS\10\INCLUDE\10.0.19041.0\UCRT\CORECRT_WTIME.H
C:\PROGRAM FILES (X86)\WINDOWS KITS\10\INCLUDE\10.0.19041.0\UCRT\SYS\STAT.H
C:\PROGRAM FILES (X86)\WINDOWS KITS\10\INCLUDE\10.0.19041.0\UCRT\SYS\TYPES.H
C:\USERS\ADMIN\DESKTOP\RR_HERTZ\PLUGINFILES\INTERFACE\BASE\SRC\BASESTRING.H
C:\PROGRAM FILES (X86)\MICROSOFT VISUAL STUDIO\2019\COMMUNITY\VC\TOOLS\MSVC\14.29.30133\INCLUDE\STRING
C:\PROGRAM FILES (X86)\MICROSOFT VISUAL STUDIO\2019\COMMUNITY\VC\TOOLS\MSVC\14.29.30133\INCLUDE\YVALS_CORE.H
C:\PROGRAM FILES (X86)\MICROSOFT VISUAL STUDIO\2019\COMMUNITY\VC\TOOLS\MSVC\14.29.30133\INCLUDE\XKEYCHECK.H
C:\PROGRAM FILES (X86)\MICROSOFT VISUAL STUDIO\2019\COMMUNITY\VC\TOOLS\MSVC\14.29.30133\INCLUDE\XSTRING
C:\PROGRAM FILES (X86)\MICROSOFT VISUAL STUDIO\2019\COMMUNITY\VC\TOOLS\MSVC\14.29.30133\INCLUDE\IOSFWD
C:\PROGRAM FILES (X86)\MICROSOFT VISUAL STUDIO\2019\COMMUNITY\VC\TOOLS\MSVC\14.29.30133\INCLUDE\YVALS.H
C:\PROGRAM FILES (X86)\WINDOWS KITS\10\INCLUDE\10.0.19041.0\UCRT\CRTDBG.H
C:\PROGRAM FILES (X86)\MICROSOFT VISUAL STUDIO\2019\COMMUNITY\VC\TOOLS\MSVC\14.29.30133\INCLUDE\VCRUNTIME_NEW_DEBUG.H
C:\PROGRAM FILES (X86)\MICROSOFT VISUAL STUDIO\2019\COMMUNITY\VC\TOOLS\MSVC\14.29.30133\INCLUDE\VCRUNTIME_NEW.H
C:\PROGRAM FILES (X86)\MICROSOFT VISUAL STUDIO\2019\COMMUNITY\VC\TOOLS\MSVC\14.29.30133\INCLUDE\CRTDEFS.H
C:\PROGRAM FILES (X86)\MICROSOFT VISUAL STUDIO\2019\COMMUNITY\VC\TOOLS\MSVC\14.29.30133\INCLUDE\USE_ANSI.H
C:\PROGRAM FILES (X86)\MICROSOFT VISUAL STUDIO\2019\COMMUNITY\VC\TOOLS\MSVC\14.29.30133\INCLUDE\CSTDIO
C:\PROGRAM FILES (X86)\WINDOWS KITS\10\INCLUDE\10.0.19041.0\UCRT\STDIO.H
C:\PROGRAM FILES (X86)\MICROSOFT VISUAL STUDIO\2019\COMMUNITY\VC\TOOLS\MSVC\14.29.30133\INCLUDE\CSTRING
C:\PROGRAM FILES (X86)\WINDOWS KITS\10\INCLUDE\10.0.19041.0\UCRT\STRING.H
C:\PROGRAM FILES (X86)\WINDOWS KITS\10\INCLUDE\10.0.19041.0\UCRT\CORECRT_MEMORY.H
C:\PROGRAM FILES (X86)\MICROSOFT VISUAL STUDIO\2019\COMMUNITY\VC\TOOLS\MSVC\14.29.30133\INCLUDE\CWCHAR
C:\PROGRAM FILES (X86)\MICROSOFT VISUAL STUDIO\2019\COMMUNITY\VC\TOOLS\MSVC\14.29.30133\INCLUDE\XSTDDEF
C:\PROGRAM FILES (X86)\MICROSOFT VISUAL STUDIO\2019\COMMUNITY\VC\TOOLS\MSVC\14.29.30133\INCLUDE\CSTDDEF
C:\PROGRAM FILES (X86)\WINDOWS KITS\10\INCLUDE\10.0.19041.0\UCRT\STDDEF.H
C:\PROGRAM FILES (X86)\MICROSOFT VISUAL STUDIO\2019\COMMUNITY\VC\TOOLS\MSVC\14.29.30133\INCLUDE\XTR1COMMON
C:\PROGRAM FILES (X86)\MICROSOFT VISUAL STUDIO\2019\COMMUNITY\VC\TOOLS\MSVC\14.29.30133\INCLUDE\CSTDLIB
C:\PROGRAM FILES (X86)\WINDOWS KITS\10\INCLUDE\10.0.19041.0\UCRT\MATH.H
C:\PROGRAM FILES (X86)\WINDOWS KITS\10\INCLUDE\10.0.19041.0\UCRT\CORECRT_MATH.H
C:\PROGRAM FILES (X86)\WINDOWS KITS\10\INCLUDE\10.0.19041.0\UCRT\STDLIB.H
C:\PROGRAM FILES (X86)\WINDOWS KITS\10\INCLUDE\10.0.19041.0\UCRT\CORECRT_MALLOC.H
C:\PROGRAM FILES (X86)\WINDOWS KITS\10\INCLUDE\10.0.19041.0\UCRT\CORECRT_SEARCH.H
C:\PROGRAM FILES (X86)\MICROSOFT VISUAL STUDIO\2019\COMMUNITY\VC\TOOLS\MSVC\14.29.30133\INCLUDE\LIMITS.H
C:\PROGRAM FILES (X86)\MICROSOFT VISUAL STUDIO\2019\COMMUNITY\VC\TOOLS\MSVC\14.29.30133\INCLUDE\INITIALIZER_LIST
C:\PROGRAM FILES (X86)\MICROSOFT VISUAL STUDIO\2019\COMMUNITY\VC\TOOLS\MSVC\14.29.30133\INCLUDE\XMEMORY
C:\PROGRAM FILES (X86)\MICROSOFT VISUAL STUDIO\2019\COMMUNITY\VC\TOOLS\MSVC\14.29.30133\INCLUDE\CSTDINT
C:\PROGRAM FILES (X86)\MICROSOFT VISUAL STUDIO\2019\COMMUNITY\VC\TOOLS\MSVC\14.29.30133\INCLUDE\STDINT.H
C:\PROGRAM FILES (X86)\MICROSOFT VISUAL STUDIO\2019\COMMUNITY\VC\TOOLS\MSVC\14.29.30133\INCLUDE\LIMITS
C:\PROGRAM FILES (X86)\MICROSOFT VISUAL STUDIO\2019\COMMUNITY\VC\TOOLS\MSVC\14.29.30133\INCLUDE\CFLOAT
C:\PROGRAM FILES (X86)\WINDOWS KITS\10\INCLUDE\10.0.19041.0\UCRT\FLOAT.H
C:\PROGRAM FILES (X86)\MICROSOFT VISUAL STUDIO\2019\COMMUNITY\VC\TOOLS\MSVC\14.29.30133\INCLUDE\CLIMITS
C:\PROGRAM FILES (X86)\MICROSOFT VISUAL STUDIO\2019\COMMUNITY\VC\TOOLS\MSVC\14.29.30133\INCLUDE\INTRIN0.H
C:\PROGRAM FILES (X86)\MICROSOFT VISUAL STUDIO\2019\COMMUNITY\VC\TOOLS\MSVC\14.29.30133\INCLUDE\INTRIN0.INL.H
C:\PROGRAM FILES (X86)\MICROSOFT VISUAL STUDIO\2019\COMMUNITY\VC\TOOLS\MSVC\14.29.30133\INCLUDE\ISA_AVAILABILITY.H
C:\PROGRAM FILES (X86)\MICROSOFT VISUAL STUDIO\2019\COMMUNITY\VC\TOOLS\MSVC\14.29.30133\INCLUDE\NEW
C:\PROGRAM FILES (X86)\MICROSOFT VISUAL STUDIO\2019\COMMUNITY\VC\TOOLS\MSVC\14.29.30133\INCLUDE\EXCEPTION
C:\PROGRAM FILES (X86)\MICROSOFT VISUAL STUDIO\2019\COMMUNITY\VC\TOOLS\MSVC\14.29.30133\INCLUDE\TYPE_TRAITS
C:\PROGRAM FILES (X86)\WINDOWS KITS\10\INCLUDE\10.0.19041.0\UCRT\MALLOC.H
C:\PROGRAM FILES (X86)\MICROSOFT VISUAL STUDIO\2019\COMMUNITY\VC\TOOLS\MSVC\14.29.30133\INCLUDE\VCRUNTIME_EXCEPTION.H
C:\PROGRAM FILES (X86)\MICROSOFT VISUAL STUDIO\2019\COMMUNITY\VC\TOOLS\MSVC\14.29.30133\INCLUDE\EH.H
C:\PROGRAM FILES (X86)\WINDOWS KITS\10\INCLUDE\10.0.19041.0\UCRT\CORECRT_TERMINATE.H
C:\PROGRAM FILES (X86)\MICROSOFT VISUAL STUDIO\2019\COMMUNITY\VC\TOOLS\MSVC\14.29.30133\INCLUDE\XATOMIC.H
C:\PROGRAM FILES (X86)\MICROSOFT VISUAL STUDIO\2019\COMMUNITY\VC\TOOLS\MSVC\14.29.30133\INCLUDE\XUTILITY
C:\PROGRAM FILES (X86)\MICROSOFT VISUAL STUDIO\2019\COMMUNITY\VC\TOOLS\MSVC\14.29.30133\INCLUDE\UTILITY
C:\PROGRAM FILES (X86)\MICROSOFT VISUAL STUDIO\2019\COMMUNITY\VC\TOOLS\MSVC\14.29.30133\INCLUDE\XPOLYMORPHIC_ALLOCATOR.H
C:\PROGRAM FILES (X86)\MICROSOFT VISUAL STUDIO\2019\COMMUNITY\VC\TOOLS\MSVC\14.29.30133\INCLUDE\TUPLE
C:\PROGRAM FILES (X86)\MICROSOFT VISUAL STUDIO\2019\COMMUNITY\VC\TOOLS\MSVC\14.29.30133\INCLUDE\CCTYPE
C:\PROGRAM FILES (X86)\WINDOWS KITS\10\INCLUDE\10.0.19041.0\UCRT\CTYPE.H
C:\PROGRAM FILES (X86)\MICROSOFT VISUAL STUDIO\2019\COMMUNITY\VC\TOOLS\MSVC\14.29.30133\INCLUDE\CODEANALYSIS\WARNINGS.H
C:\USERS\ADMIN\DESKTOP\RR_HERTZ\PLUGINFILES\INTERFACE\BASE\FMT\FORMAT.H
C:\PROGRAM FILES (X86)\MICROSOFT VISUAL STUDIO\2019\COMMUNITY\VC\TOOLS\MSVC\14.29.30133\INCLUDE\ALGORITHM
C:\PROGRAM FILES (X86)\MICROSOFT VISUAL STUDIO\2019\COMMUNITY\VC\TOOLS\MSVC\14.29.30133\INCLUDE\CERRNO
C:\PROGRAM FILES (X86)\MICROSOFT VISUAL STUDIO\2019\COMMUNITY\VC\TOOLS\MSVC\14.29.30133\INCLUDE\CMATH
C:\PROGRAM FILES (X86)\MICROSOFT VISUAL STUDIO\2019\COMMUNITY\VC\TOOLS\MSVC\14.29.30133\INCLUDE\MEMORY
C:\PROGRAM FILES (X86)\MICROSOFT VISUAL STUDIO\2019\COMMUNITY\VC\TOOLS\MSVC\14.29.30133\INCLUDE\TYPEINFO
C:\PROGRAM FILES (X86)\MICROSOFT VISUAL STUDIO\2019\COMMUNITY\VC\TOOLS\MSVC\14.29.30133\INCLUDE\VCRUNTIME_TYPEINFO.H
C:\PROGRAM FILES (X86)\MICROSOFT VISUAL STUDIO\2019\COMMUNITY\VC\TOOLS\MSVC\14.29.30133\INCLUDE\STDEXCEPT
C:\USERS\ADMIN\DESKTOP\RR_HERTZ\PLUGINFILES\INTERFACE\BASE\FMT\CORE.H
C:\PROGRAM FILES (X86)\MICROSOFT VISUAL STUDIO\2019\COMMUNITY\VC\TOOLS\MSVC\14.29.30133\INCLUDE\FUNCTIONAL
C:\PROGRAM FILES (X86)\MICROSOFT VISUAL STUDIO\2019\COMMUNITY\VC\TOOLS\MSVC\14.29.30133\INCLUDE\UNORDERED_MAP
C:\PROGRAM FILES (X86)\MICROSOFT VISUAL STUDIO\2019\COMMUNITY\VC\TOOLS\MSVC\14.29.30133\INCLUDE\XHASH
C:\PROGRAM FILES (X86)\MICROSOFT VISUAL STUDIO\2019\COMMUNITY\VC\TOOLS\MSVC\14.29.30133\INCLUDE\LIST
C:\PROGRAM FILES (X86)\MICROSOFT VISUAL STUDIO\2019\COMMUNITY\VC\TOOLS\MSVC\14.29.30133\INCLUDE\VECTOR
C:\PROGRAM FILES (X86)\MICROSOFT VISUAL STUDIO\2019\COMMUNITY\VC\TOOLS\MSVC\14.29.30133\INCLUDE\XBIT_OPS.H
C:\PROGRAM FILES (X86)\MICROSOFT VISUAL STUDIO\2019\COMMUNITY\VC\TOOLS\MSVC\14.29.30133\INCLUDE\XNODE_HANDLE.H
C:\PROGRAM FILES (X86)\MICROSOFT VISUAL STUDIO\2019\COMMUNITY\VC\TOOLS\MSVC\14.29.30133\INCLUDE\ITERATOR
C:\PROGRAM FILES (X86)\MICROSOFT VISUAL STUDIO\2019\COMMUNITY\VC\TOOLS\MSVC\14.29.30133\INCLUDE\STRING_VIEW
C:\PROGRAM FILES (X86)\MICROSOFT VISUAL STUDIO\2019\COMMUNITY\VC\TOOLS\MSVC\14.29.30133\INCLUDE\INTRIN.H
C:\PROGRAM FILES (X86)\MICROSOFT VISUAL STUDIO\2019\COMMUNITY\VC\TOOLS\MSVC\14.29.30133\INCLUDE\SETJMP.H
C:\PROGRAM FILES (X86)\MICROSOFT VISUAL STUDIO\2019\COMMUNITY\VC\TOOLS\MSVC\14.29.30133\INCLUDE\IMMINTRIN.H
C:\PROGRAM FILES (X86)\MICROSOFT VISUAL STUDIO\2019\COMMUNITY\VC\TOOLS\MSVC\14.29.30133\INCLUDE\WMMINTRIN.H
C:\PROGRAM FILES (X86)\MICROSOFT VISUAL STUDIO\2019\COMMUNITY\VC\TOOLS\MSVC\14.29.30133\INCLUDE\NMMINTRIN.H
C:\PROGRAM FILES (X86)\MICROSOFT VISUAL STUDIO\2019\COMMUNITY\VC\TOOLS\MSVC\14.29.30133\INCLUDE\SMMINTRIN.H
C:\PROGRAM FILES (X86)\MICROSOFT VISUAL STUDIO\2019\COMMUNITY\VC\TOOLS\MSVC\14.29.30133\INCLUDE\TMMINTRIN.H
C:\PROGRAM FILES (X86)\MICROSOFT VISUAL STUDIO\2019\COMMUNITY\VC\TOOLS\MSVC\14.29.30133\INCLUDE\PMMINTRIN.H
C:\PROGRAM FILES (X86)\MICROSOFT VISUAL STUDIO\2019\COMMUNITY\VC\TOOLS\MSVC\14.29.30133\INCLUDE\EMMINTRIN.H
C:\PROGRAM FILES (X86)\MICROSOFT VISUAL STUDIO\2019\COMMUNITY\VC\TOOLS\MSVC\14.29.30133\INCLUDE\XMMINTRIN.H
C:\PROGRAM FILES (X86)\MICROSOFT VISUAL STUDIO\2019\COMMUNITY\VC\TOOLS\MSVC\14.29.30133\INCLUDE\MMINTRIN.H
C:\PROGRAM FILES (X86)\MICROSOFT VISUAL STUDIO\2019\COMMUNITY\VC\TOOLS\MSVC\14.29.30133\INCLUDE\ZMMINTRIN.H
C:\PROGRAM FILES (X86)\MICROSOFT VISUAL STUDIO\2019\COMMUNITY\VC\TOOLS\MSVC\14.29.30133\INCLUDE\AMMINTRIN.H
C:\PROGRAM FILES (X86)\MICROSOFT VISUAL STUDIO\2019\COMMUNITY\VC\TOOLS\MSVC\14.29.30133\INCLUDE\MAP
C:\PROGRAM FILES (X86)\MICROSOFT VISUAL STUDIO\2019\COMMUNITY\VC\TOOLS\MSVC\14.29.30133\INCLUDE\XTREE
C:\PROGRAM FILES (X86)\MICROSOFT VISUAL STUDIO\2019\COMMUNITY\VC\TOOLS\MSVC\14.29.30133\INCLUDE\SET
C:\PROGRAM FILES (X86)\MICROSOFT VISUAL STUDIO\2019\COMMUNITY\VC\TOOLS\MSVC\14.29.30133\INCLUDE\UNORDERED_SET
C:\USERS\ADMIN\DESKTOP\RR_HERTZ\PLUGINFILES\INTERFACE\BASE\SRC\TO.H
C:\USERS\ADMIN\DESKTOP\RR_HERTZ\PLUGINFILES\INTERFACE\BASE\SRC\LIMIT.H
C:\PROGRAM FILES (X86)\MICROSOFT VISUAL STUDIO\2019\COMMUNITY\VC\TOOLS\MSVC\14.29.30133\INCLUDE\CASSERT
C:\PROGRAM FILES (X86)\WINDOWS KITS\10\INCLUDE\10.0.19041.0\UCRT\ASSERT.H
C:\USERS\ADMIN\DESKTOP\RR_HERTZ\PLUGINFILES\INTERFACE\BASE\SRC\EXTENT3.H
C:\USERS\ADMIN\DESKTOP\RR_HERTZ\PLUGINFILES\INTERFACE\BASE\SRC\EXTENT2.H
C:\USERS\ADMIN\DESKTOP\RR_HERTZ\PLUGINFILES\INTERFACE\BASE\SRC\VECT.H
C:\PROGRAM FILES (X86)\MICROSOFT VISUAL STUDIO\2019\COMMUNITY\VC\TOOLS\MSVC\14.29.30133\INCLUDE\ARRAY
C:\USERS\ADMIN\DESKTOP\RR_HERTZ\PLUGINFILES\INTERFACE\BASE\SRC\AVECT.H
C:\USERS\ADMIN\DESKTOP\RR_HERTZ\PLUGINFILES\INTERFACE\BASE\SRC\BASEMEMORY.H
C:\USERS\ADMIN\DESKTOP\RR_HERTZ\PLUGINFILES\INTERFACE\BASE\SRC\VARIANT.H
C:\USERS\ADMIN\DESKTOP\RR_HERTZ\PLUGINFILES\INTERFACE\BASE\SRC\TYPE_SELECTOR.H
C:\USERS\ADMIN\DESKTOP\RR_HERTZ\PLUGINFILES\INTERFACE\BASE\SRC\SYMTENSOR.H
C:\USERS\ADMIN\DESKTOP\RR_HERTZ\PLUGINFILES\INTERFACE\BASE\SRC\AXES.H
C:\USERS\ADMIN\DESKTOP\RR_HERTZ\PLUGINFILES\INTERFACE\BASE\SRC\ORIENTATION.H
C:\USERS\ADMIN\DESKTOP\RR_HERTZ\PLUGINFILES\INTERFACE\BASE\SRC\QUAT.H
C:\USERS\ADMIN\DESKTOP\RR_HERTZ\PLUGINFILES\INTERFACE\BASE\SRC\MATRIX.H
C:\USERS\ADMIN\DESKTOP\RR_HERTZ\PLUGINFILES\INTERFACE\BASE\SRC\CAXES.H
C:\USERS\ADMIN\DESKTOP\RR_HERTZ\PLUGINFILES\INTERFACE\BASE\SRC\BASEQT.H
C:\USERS\ADMIN\DESKTOP\RR_HERTZ\PLUGINFILES\INTERFACE\BASE\SRC\BASETOQT.H
C:\QT\5.14.2\MSVC2017_64\INCLUDE\QTCORE\QTCORE
C:\QT\5.14.2\MSVC2017_64\INCLUDE\QTCORE\QTCOREDEPENDS
C:\QT\5.14.2\MSVC2017_64\INCLUDE\QTCORE\QGLOBAL.H
C:\QT\5.14.2\MSVC2017_64\INCLUDE\QTCORE\QCONFIG.H
C:\QT\5.14.2\MSVC2017_64\INCLUDE\QTCORE\QTCORE-CONFIG.H
C:\QT\5.14.2\MSVC2017_64\INCLUDE\QTCORE\QSYSTEMDETECTION.H
C:\QT\5.14.2\MSVC2017_64\INCLUDE\QTCORE\QPROCESSORDETECTION.H
C:\QT\5.14.2\MSVC2017_64\INCLUDE\QTCORE\QCOMPILERDETECTION.H
C:\QT\5.14.2\MSVC2017_64\INCLUDE\QTCORE\QTYPEINFO.H
C:\QT\5.14.2\MSVC2017_64\INCLUDE\QTCORE\QSYSINFO.H
C:\QT\5.14.2\MSVC2017_64\INCLUDE\QTCORE\QLOGGING.H
C:\QT\5.14.2\MSVC2017_64\INCLUDE\QTCORE\QFLAGS.H
C:\QT\5.14.2\MSVC2017_64\INCLUDE\QTCORE\QATOMIC.H
C:\QT\5.14.2\MSVC2017_64\INCLUDE\QTCORE\QBASICATOMIC.H
C:\QT\5.14.2\MSVC2017_64\INCLUDE\QTCORE\QATOMIC_CXX11.H
C:\QT\5.14.2\MSVC2017_64\INCLUDE\QTCORE\QGENERICATOMIC.H
C:\PROGRAM FILES (X86)\MICROSOFT VISUAL STUDIO\2019\COMMUNITY\VC\TOOLS\MSVC\14.29.30133\INCLUDE\ATOMIC
C:\PROGRAM FILES (X86)\MICROSOFT VISUAL STUDIO\2019\COMMUNITY\VC\TOOLS\MSVC\14.29.30133\INCLUDE\XTHREADS.H
C:\PROGRAM FILES (X86)\MICROSOFT VISUAL STUDIO\2019\COMMUNITY\VC\TOOLS\MSVC\14.29.30133\INCLUDE\XTIMEC.H
C:\PROGRAM FILES (X86)\MICROSOFT VISUAL STUDIO\2019\COMMUNITY\VC\TOOLS\MSVC\14.29.30133\INCLUDE\CTIME
C:\PROGRAM FILES (X86)\WINDOWS KITS\10\INCLUDE\10.0.19041.0\UCRT\TIME.H
C:\QT\5.14.2\MSVC2017_64\INCLUDE\QTCORE\QGLOBALSTATIC.H
C:\QT\5.14.2\MSVC2017_64\INCLUDE\QTCORE\QNUMERIC.H
C:\QT\5.14.2\MSVC2017_64\INCLUDE\QTCORE\QVERSIONTAGGING.H
C:\QT\5.14.2\MSVC2017_64\INCLUDE\QTCORE\QABSTRACTANIMATION.H
C:\QT\5.14.2\MSVC2017_64\INCLUDE\QTCORE\QOBJECT.H
C:\QT\5.14.2\MSVC2017_64\INCLUDE\QTCORE\QOBJECTDEFS.H
C:\QT\5.14.2\MSVC2017_64\INCLUDE\QTCORE\QNAMESPACE.H
C:\QT\5.14.2\MSVC2017_64\INCLUDE\QTCORE\QOBJECTDEFS_IMPL.H
C:\QT\5.14.2\MSVC2017_64\INCLUDE\QTCORE\QSTRING.H
C:\QT\5.14.2\MSVC2017_64\INCLUDE\QTCORE\QCHAR.H
C:\QT\5.14.2\MSVC2017_64\INCLUDE\QTCORE\QBYTEARRAY.H
C:\QT\5.14.2\MSVC2017_64\INCLUDE\QTCORE\QREFCOUNT.H
C:\QT\5.14.2\MSVC2017_64\INCLUDE\QTCORE\QARRAYDATA.H
C:\PROGRAM FILES (X86)\MICROSOFT VISUAL STUDIO\2019\COMMUNITY\VC\TOOLS\MSVC\14.29.30133\INCLUDE\STDARG.H
C:\QT\5.14.2\MSVC2017_64\INCLUDE\QTCORE\QSTRINGLITERAL.H
C:\QT\5.14.2\MSVC2017_64\INCLUDE\QTCORE\QSTRINGALGORITHMS.H
C:\QT\5.14.2\MSVC2017_64\INCLUDE\QTCORE\QSTRINGVIEW.H
C:\QT\5.14.2\MSVC2017_64\INCLUDE\QTCORE\QLIST.H
C:\QT\5.14.2\MSVC2017_64\INCLUDE\QTCORE\QALGORITHMS.H
C:\QT\5.14.2\MSVC2017_64\INCLUDE\QTCORE\QITERATOR.H
C:\QT\5.14.2\MSVC2017_64\INCLUDE\QTCORE\QHASHFUNCTIONS.H
C:\QT\5.14.2\MSVC2017_64\INCLUDE\QTCORE\QPAIR.H
C:\PROGRAM FILES (X86)\MICROSOFT VISUAL STUDIO\2019\COMMUNITY\VC\TOOLS\MSVC\14.29.30133\INCLUDE\NUMERIC
C:\QT\5.14.2\MSVC2017_64\INCLUDE\QTCORE\QVECTOR.H
C:\QT\5.14.2\MSVC2017_64\INCLUDE\QTCORE\QCONTAINERTOOLS_IMPL.H
C:\QT\5.14.2\MSVC2017_64\INCLUDE\QTCORE\QPOINT.H
C:\QT\5.14.2\MSVC2017_64\INCLUDE\QTCORE\QBYTEARRAYLIST.H
C:\QT\5.14.2\MSVC2017_64\INCLUDE\QTCORE\QSTRINGLIST.H
C:\QT\5.14.2\MSVC2017_64\INCLUDE\QTCORE\QREGEXP.H
C:\QT\5.14.2\MSVC2017_64\INCLUDE\QTCORE\QSTRINGMATCHER.H
C:\QT\5.14.2\MSVC2017_64\INCLUDE\QTCORE\QSCOPEDPOINTER.H
C:\QT\5.14.2\MSVC2017_64\INCLUDE\QTCORE\QMETATYPE.H
C:\QT\5.14.2\MSVC2017_64\INCLUDE\QTCORE\QVARLENGTHARRAY.H
C:\QT\5.14.2\MSVC2017_64\INCLUDE\QTCORE\QCONTAINERFWD.H
C:\QT\5.14.2\MSVC2017_64\INCLUDE\QTCORE\QOBJECT_IMPL.H
C:\PROGRAM FILES (X86)\MICROSOFT VISUAL STUDIO\2019\COMMUNITY\VC\TOOLS\MSVC\14.29.30133\INCLUDE\CHRONO
C:\PROGRAM FILES (X86)\MICROSOFT VISUAL STUDIO\2019\COMMUNITY\VC\TOOLS\MSVC\14.29.30133\INCLUDE\RATIO
C:\QT\5.14.2\MSVC2017_64\INCLUDE\QTCORE\QABSTRACTEVENTDISPATCHER.H
C:\QT\5.14.2\MSVC2017_64\INCLUDE\QTCORE\QEVENTLOOP.H
C:\QT\5.14.2\MSVC2017_64\INCLUDE\QTCORE\QABSTRACTITEMMODEL.H
C:\QT\5.14.2\MSVC2017_64\INCLUDE\QTCORE\QVARIANT.H
C:\QT\5.14.2\MSVC2017_64\INCLUDE\QTCORE\QMAP.H
C:\QT\5.14.2\MSVC2017_64\INCLUDE\QTCORE\QHASH.H
C:\QT\5.14.2\MSVC2017_64\INCLUDE\QTCORE\QABSTRACTNATIVEEVENTFILTER.H
C:\QT\5.14.2\MSVC2017_64\INCLUDE\QTCORE\QABSTRACTPROXYMODEL.H
C:\QT\5.14.2\MSVC2017_64\INCLUDE\QTCORE\QABSTRACTSTATE.H
C:\QT\5.14.2\MSVC2017_64\INCLUDE\QTCORE\QABSTRACTTRANSITION.H
C:\QT\5.14.2\MSVC2017_64\INCLUDE\QTCORE\QANIMATIONGROUP.H
C:\QT\5.14.2\MSVC2017_64\INCLUDE\QTCORE\QARRAYDATAOPS.H
C:\QT\5.14.2\MSVC2017_64\INCLUDE\QTCORE\QARRAYDATAPOINTER.H
C:\QT\5.14.2\MSVC2017_64\INCLUDE\QTCORE\QBASICTIMER.H
C:\QT\5.14.2\MSVC2017_64\INCLUDE\QTCORE\QBITARRAY.H
C:\QT\5.14.2\MSVC2017_64\INCLUDE\QTCORE\QBUFFER.H
C:\QT\5.14.2\MSVC2017_64\INCLUDE\QTCORE\QIODEVICE.H
C:\QT\5.14.2\MSVC2017_64\INCLUDE\QTCORE\QBYTEARRAYMATCHER.H
C:\QT\5.14.2\MSVC2017_64\INCLUDE\QTCORE\QCACHE.H
C:\QT\5.14.2\MSVC2017_64\INCLUDE\QTCORE\QCALENDAR.H
C:\QT\5.14.2\MSVC2017_64\INCLUDE\QTCORE\QLOCALE.H
C:\QT\5.14.2\MSVC2017_64\INCLUDE\QTCORE\QSHAREDDATA.H
C:\QT\5.14.2\MSVC2017_64\INCLUDE\QTCORE\QCBORARRAY.H
C:\QT\5.14.2\MSVC2017_64\INCLUDE\QTCORE\QCBORVALUE.H
C:\QT\5.14.2\MSVC2017_64\INCLUDE\QTCORE\QDATETIME.H
C:\QT\5.14.2\MSVC2017_64\INCLUDE\QTCORE\QCBORCOMMON.H
C:\QT\5.14.2\MSVC2017_64\INCLUDE\QTCORE\QDEBUG.H
C:\QT\5.14.2\MSVC2017_64\INCLUDE\QTCORE\QTEXTSTREAM.H
C:\QT\5.14.2\MSVC2017_64\INCLUDE\QTCORE\QSET.H
C:\QT\5.14.2\MSVC2017_64\INCLUDE\QTCORE\QCONTIGUOUSCACHE.H
C:\QT\5.14.2\MSVC2017_64\INCLUDE\QTCORE\QSHAREDPOINTER.H
C:\QT\5.14.2\MSVC2017_64\INCLUDE\QTCORE\QSHAREDPOINTER_IMPL.H
C:\QT\5.14.2\MSVC2017_64\INCLUDE\QTCORE\QREGULAREXPRESSION.H
C:\QT\5.14.2\MSVC2017_64\INCLUDE\QTCORE\QURL.H
C:\QT\5.14.2\MSVC2017_64\INCLUDE\QTCORE\QUUID.H
C:\QT\5.14.2\MSVC2017_64\INCLUDE\QTCORE\QCBORMAP.H
C:\QT\5.14.2\MSVC2017_64\INCLUDE\QTCORE\QCBORSTREAM.H
C:\QT\5.14.2\MSVC2017_64\INCLUDE\QTCORE\QFLOAT16.H
C:\QT\5.14.2\MSVC2017_64\INCLUDE\QTCORE\QCOLLATOR.H
C:\QT\5.14.2\MSVC2017_64\INCLUDE\QTCORE\QCOMMANDLINEOPTION.H
C:\QT\5.14.2\MSVC2017_64\INCLUDE\QTCORE\QCOMMANDLINEPARSER.H
C:\QT\5.14.2\MSVC2017_64\INCLUDE\QTCORE\QCOREAPPLICATION.H
C:\QT\5.14.2\MSVC2017_64\INCLUDE\QTCORE\QCOREEVENT.H
C:\QT\5.14.2\MSVC2017_64\INCLUDE\QTCORE\QCONCATENATETABLESPROXYMODEL.H
C:\QT\5.14.2\MSVC2017_64\INCLUDE\QTCORE\QCRYPTOGRAPHICHASH.H
C:\QT\5.14.2\MSVC2017_64\INCLUDE\QTCORE\QDATASTREAM.H
C:\QT\5.14.2\MSVC2017_64\INCLUDE\QTCORE\QDEADLINETIMER.H
C:\QT\5.14.2\MSVC2017_64\INCLUDE\QTCORE\QELAPSEDTIMER.H
C:\QT\5.14.2\MSVC2017_64\INCLUDE\QTCORE\QDIR.H
C:\QT\5.14.2\MSVC2017_64\INCLUDE\QTCORE\QFILEINFO.H
C:\QT\5.14.2\MSVC2017_64\INCLUDE\QTCORE\QFILE.H
C:\QT\5.14.2\MSVC2017_64\INCLUDE\QTCORE\QFILEDEVICE.H
C:\QT\5.14.2\MSVC2017_64\INCLUDE\QTCORE\QDIRITERATOR.H
C:\QT\5.14.2\MSVC2017_64\INCLUDE\QTCORE\QEASINGCURVE.H
C:\QT\5.14.2\MSVC2017_64\INCLUDE\QTCORE\QENDIAN.H
C:\QT\5.14.2\MSVC2017_64\INCLUDE\QTCORE\QEVENTTRANSITION.H
C:\QT\5.14.2\MSVC2017_64\INCLUDE\QTCORE\QEXCEPTION.H
C:\QT\5.14.2\MSVC2017_64\INCLUDE\QTCORE\QFACTORYINTERFACE.H
C:\QT\5.14.2\MSVC2017_64\INCLUDE\QTCORE\QFILESELECTOR.H
C:\QT\5.14.2\MSVC2017_64\INCLUDE\QTCORE\QOBJECT
C:\QT\5.14.2\MSVC2017_64\INCLUDE\QTCORE\QSTRINGLIST
C:\QT\5.14.2\MSVC2017_64\INCLUDE\QTCORE\QFILESYSTEMWATCHER.H
C:\QT\5.14.2\MSVC2017_64\INCLUDE\QTCORE\QFINALSTATE.H
C:\QT\5.14.2\MSVC2017_64\INCLUDE\QTCORE\QFUTURE.H
C:\QT\5.14.2\MSVC2017_64\INCLUDE\QTCORE\QFUTUREINTERFACE.H
C:\QT\5.14.2\MSVC2017_64\INCLUDE\QTCORE\QRUNNABLE.H
C:\QT\5.14.2\MSVC2017_64\INCLUDE\QTCORE\QMUTEX.H
C:\QT\5.14.2\MSVC2017_64\INCLUDE\QTCORE\QRESULTSTORE.H
C:\PROGRAM FILES (X86)\MICROSOFT VISUAL STUDIO\2019\COMMUNITY\VC\TOOLS\MSVC\14.29.30133\INCLUDE\MUTEX
C:\PROGRAM FILES (X86)\MICROSOFT VISUAL STUDIO\2019\COMMUNITY\VC\TOOLS\MSVC\14.29.30133\INCLUDE\SYSTEM_ERROR
C:\PROGRAM FILES (X86)\MICROSOFT VISUAL STUDIO\2019\COMMUNITY\VC\TOOLS\MSVC\14.29.30133\INCLUDE\__MSVC_SYSTEM_ERROR_ABI.HPP
C:\PROGRAM FILES (X86)\MICROSOFT VISUAL STUDIO\2019\COMMUNITY\VC\TOOLS\MSVC\14.29.30133\INCLUDE\XCALL_ONCE.H
C:\PROGRAM FILES (X86)\MICROSOFT VISUAL STUDIO\2019\COMMUNITY\VC\TOOLS\MSVC\14.29.30133\INCLUDE\XERRC.H
C:\PROGRAM FILES (X86)\MICROSOFT VISUAL STUDIO\2019\COMMUNITY\VC\TOOLS\MSVC\14.29.30133\INCLUDE\THREAD
C:\PROGRAM FILES (X86)\WINDOWS KITS\10\INCLUDE\10.0.19041.0\UCRT\PROCESS.H
C:\PROGRAM FILES (X86)\WINDOWS KITS\10\INCLUDE\10.0.19041.0\UCRT\CORECRT_STARTUP.H
C:\PROGRAM FILES (X86)\MICROSOFT VISUAL STUDIO\2019\COMMUNITY\VC\TOOLS\MSVC\14.29.30133\INCLUDE\VCRUNTIME_STARTUP.H
C:\QT\5.14.2\MSVC2017_64\INCLUDE\QTCORE\QFUTURESYNCHRONIZER.H
C:\QT\5.14.2\MSVC2017_64\INCLUDE\QTCORE\QFUTUREWATCHER.H
C:\QT\5.14.2\MSVC2017_64\INCLUDE\QTCORE\QHISTORYSTATE.H
C:\QT\5.14.2\MSVC2017_64\INCLUDE\QTCORE\QIDENTITYPROXYMODEL.H
C:\QT\5.14.2\MSVC2017_64\INCLUDE\QTCORE\QISENUM.H
C:\QT\5.14.2\MSVC2017_64\INCLUDE\QTCORE\QITEMSELECTIONMODEL.H
C:\QT\5.14.2\MSVC2017_64\INCLUDE\QTCORE\QJSONARRAY.H
C:\QT\5.14.2\MSVC2017_64\INCLUDE\QTCORE\QJSONVALUE.H
C:\QT\5.14.2\MSVC2017_64\INCLUDE\QTCORE\QJSONDOCUMENT.H
C:\QT\5.14.2\MSVC2017_64\INCLUDE\QTCORE\QJSONOBJECT.H
C:\QT\5.14.2\MSVC2017_64\INCLUDE\QTCORE\QLIBRARY.H
C:\QT\5.14.2\MSVC2017_64\INCLUDE\QTCORE\QLIBRARYINFO.H
C:\QT\5.14.2\MSVC2017_64\INCLUDE\QTCORE\QVERSIONNUMBER.H
C:\QT\5.14.2\MSVC2017_64\INCLUDE\QTCORE\QLINE.H
C:\QT\5.14.2\MSVC2017_64\INCLUDE\QTCORE\QLINKEDLIST.H
C:\QT\5.14.2\MSVC2017_64\INCLUDE\QTCORE\QLOCKFILE.H
C:\QT\5.14.2\MSVC2017_64\INCLUDE\QTCORE\QLOGGINGCATEGORY.H
C:\QT\5.14.2\MSVC2017_64\INCLUDE\QTCORE\QMARGINS.H
C:\QT\5.14.2\MSVC2017_64\INCLUDE\QTCORE\QMATH.H
C:\QT\5.14.2\MSVC2017_64\INCLUDE\QTCORE\QMESSAGEAUTHENTICATIONCODE.H
C:\QT\5.14.2\MSVC2017_64\INCLUDE\QTCORE\QMETAOBJECT.H
C:\QT\5.14.2\MSVC2017_64\INCLUDE\QTCORE\QMIMEDATA.H
C:\QT\5.14.2\MSVC2017_64\INCLUDE\QTCORE\QMIMEDATABASE.H
C:\QT\5.14.2\MSVC2017_64\INCLUDE\QTCORE\QMIMETYPE.H
C:\QT\5.14.2\MSVC2017_64\INCLUDE\QTCORE\QOBJECTCLEANUPHANDLER.H
C:\QT\5.14.2\MSVC2017_64\INCLUDE\QTCORE\QOPERATINGSYSTEMVERSION.H
C:\QT\5.14.2\MSVC2017_64\INCLUDE\QTCORE\QPARALLELANIMATIONGROUP.H
C:\QT\5.14.2\MSVC2017_64\INCLUDE\QTCORE\QPAUSEANIMATION.H
C:\QT\5.14.2\MSVC2017_64\INCLUDE\QTCORE\QPLUGIN.H
C:\QT\5.14.2\MSVC2017_64\INCLUDE\QTCORE\QPOINTER.H
C:\QT\5.14.2\MSVC2017_64\INCLUDE\QTCORE\QPLUGINLOADER.H
C:\QT\5.14.2\MSVC2017_64\INCLUDE\QTCORE\QPROCESS.H
C:\QT\5.14.2\MSVC2017_64\INCLUDE\QTCORE\QPROPERTYANIMATION.H
C:\QT\5.14.2\MSVC2017_64\INCLUDE\QTCORE\QVARIANTANIMATION.H
C:\QT\5.14.2\MSVC2017_64\INCLUDE\QTCORE\QQUEUE.H
C:\QT\5.14.2\MSVC2017_64\INCLUDE\QTCORE\QRANDOM.H
C:\PROGRAM FILES (X86)\MICROSOFT VISUAL STUDIO\2019\COMMUNITY\VC\TOOLS\MSVC\14.29.30133\INCLUDE\RANDOM
C:\QT\5.14.2\MSVC2017_64\INCLUDE\QTCORE\QREADWRITELOCK.H
C:\QT\5.14.2\MSVC2017_64\INCLUDE\QTCORE\QRECT.H
C:\QT\5.14.2\MSVC2017_64\INCLUDE\QTCORE\QSIZE.H
C:\QT\5.14.2\MSVC2017_64\INCLUDE\QTCORE\QRESOURCE.H
C:\QT\5.14.2\MSVC2017_64\INCLUDE\QTCORE\QSAVEFILE.H
C:\QT\5.14.2\MSVC2017_64\INCLUDE\QTCORE\QSCOPEDVALUEROLLBACK.H
C:\QT\5.14.2\MSVC2017_64\INCLUDE\QTCORE\QSCOPEGUARD.H
C:\QT\5.14.2\MSVC2017_64\INCLUDE\QTCORE\QSEMAPHORE.H
C:\QT\5.14.2\MSVC2017_64\INCLUDE\QTCORE\QSEQUENTIALANIMATIONGROUP.H
C:\QT\5.14.2\MSVC2017_64\INCLUDE\QTCORE\QSETTINGS.H
C:\QT\5.14.2\MSVC2017_64\INCLUDE\QTCORE\QSHAREDMEMORY.H
C:\QT\5.14.2\MSVC2017_64\INCLUDE\QTCORE\QSIGNALMAPPER.H
C:\QT\5.14.2\MSVC2017_64\INCLUDE\QTCORE\QSIGNALTRANSITION.H
C:\QT\5.14.2\MSVC2017_64\INCLUDE\QTCORE\QSOCKETNOTIFIER.H
C:\QT\5.14.2\MSVC2017_64\INCLUDE\QTCORE\QSORTFILTERPROXYMODEL.H
C:\QT\5.14.2\MSVC2017_64\INCLUDE\QTCORE\QSTACK.H
C:\QT\5.14.2\MSVC2017_64\INCLUDE\QTCORE\QSTANDARDPATHS.H
C:\QT\5.14.2\MSVC2017_64\INCLUDE\QTCORE\QSTATE.H
C:\QT\5.14.2\MSVC2017_64\INCLUDE\QTCORE\QSTATEMACHINE.H
C:\QT\5.14.2\MSVC2017_64\INCLUDE\QTCORE\QSTORAGEINFO.H
C:\QT\5.14.2\MSVC2017_64\INCLUDE\QTCORE\QSTRINGBUILDER.H
C:\QT\5.14.2\MSVC2017_64\INCLUDE\QTCORE\QSTRINGLISTMODEL.H
C:\QT\5.14.2\MSVC2017_64\INCLUDE\QTCORE\QSYSTEMSEMAPHORE.H
C:\QT\5.14.2\MSVC2017_64\INCLUDE\QTCORE\QTEMPORARYDIR.H
C:\QT\5.14.2\MSVC2017_64\INCLUDE\QTCORE\QTEMPORARYFILE.H
C:\QT\5.14.2\MSVC2017_64\INCLUDE\QTCORE\QTEXTBOUNDARYFINDER.H
C:\QT\5.14.2\MSVC2017_64\INCLUDE\QTCORE\QTEXTCODEC.H
C:\QT\5.14.2\MSVC2017_64\INCLUDE\QTCORE\QTHREAD.H
C:\PROGRAM FILES (X86)\MICROSOFT VISUAL STUDIO\2019\COMMUNITY\VC\TOOLS\MSVC\14.29.30133\INCLUDE\FUTURE
C:\PROGRAM FILES (X86)\MICROSOFT VISUAL STUDIO\2019\COMMUNITY\VC\TOOLS\MSVC\14.29.30133\INCLUDE\CONDITION_VARIABLE
C:\PROGRAM FILES (X86)\MICROSOFT VISUAL STUDIO\2019\COMMUNITY\VC\TOOLS\MSVC\14.29.30133\INCLUDE\PPLTASKS.H
C:\PROGRAM FILES (X86)\MICROSOFT VISUAL STUDIO\2019\COMMUNITY\VC\TOOLS\MSVC\14.29.30133\INCLUDE\PPLWIN.H
C:\PROGRAM FILES (X86)\MICROSOFT VISUAL STUDIO\2019\COMMUNITY\VC\TOOLS\MSVC\14.29.30133\INCLUDE\PPLINTERFACE.H
C:\PROGRAM FILES (X86)\MICROSOFT VISUAL STUDIO\2019\COMMUNITY\VC\TOOLS\MSVC\14.29.30133\INCLUDE\PPLTASKSCHEDULER.H
C:\PROGRAM FILES (X86)\MICROSOFT VISUAL STUDIO\2019\COMMUNITY\VC\TOOLS\MSVC\14.29.30133\INCLUDE\PPLCANCELLATION_TOKEN.H
C:\QT\5.14.2\MSVC2017_64\INCLUDE\QTCORE\QTHREADPOOL.H
C:\QT\5.14.2\MSVC2017_64\INCLUDE\QTCORE\QTHREADSTORAGE.H
C:\QT\5.14.2\MSVC2017_64\INCLUDE\QTCORE\QTIMELINE.H
C:\QT\5.14.2\MSVC2017_64\INCLUDE\QTCORE\QTIMER.H
C:\QT\5.14.2\MSVC2017_64\INCLUDE\QTCORE\QTIMEZONE.H
C:\QT\5.14.2\MSVC2017_64\INCLUDE\QTCORE\QTRANSLATOR.H
C:\QT\5.14.2\MSVC2017_64\INCLUDE\QTCORE\QTRANSPOSEPROXYMODEL.H
C:\QT\5.14.2\MSVC2017_64\INCLUDE\QTCORE\QTYPETRAITS.H
C:\QT\5.14.2\MSVC2017_64\INCLUDE\QTCORE\QURLQUERY.H
C:\QT\5.14.2\MSVC2017_64\INCLUDE\QTCORE\QWAITCONDITION.H
C:\QT\5.14.2\MSVC2017_64\INCLUDE\QTCORE\QWINEVENTNOTIFIER.H
C:\QT\5.14.2\MSVC2017_64\INCLUDE\QTCORE\QXMLSTREAM.H
C:\QT\5.14.2\MSVC2017_64\INCLUDE\QTCORE\QTCOREVERSION.H
C:\USERS\ADMIN\DESKTOP\RR_HERTZ\PLUGINFILES\INTERFACE\BASE\SRC\BASEQSTRING.H
C:\USERS\ADMIN\DESKTOP\RR_HERTZ\PLUGINFILES\INTERFACE\BASE\SRC\BASEQEXCEPTION.H
C:\USERS\ADMIN\DESKTOP\RR_HERTZ\PLUGINFILES\INTERFACE\BASE\SRC\BASEMUTEX.H
C:\USERS\ADMIN\DESKTOP\RR_HERTZ\PLUGINFILES\INTERFACE\BASE\SRC\BASEEXCEPTION.H
C:\USERS\ADMIN\DESKTOP\RR_HERTZ\PLUGINFILES\CONTACTMODEL\SRC\CONTACTMODEL_GLOBAL.H
C:\USERS\ADMIN\DESKTOP\RR_HERTZ\PLUGINFILES\INTERFACE\BASE\SRC\FARRAY.H
C:\USERS\ADMIN\DESKTOP\RR_HERTZ\PLUGINFILES\INTERFACE\SHARED\SRC\ARCHIVESTREAM.H
C:\USERS\ADMIN\DESKTOP\RR_HERTZ\PLUGINFILES\INTERFACE\SHARED\SRC\EXPORTSHARED.H
C:\PROGRAM FILES (X86)\MICROSOFT VISUAL STUDIO\2019\COMMUNITY\VC\TOOLS\MSVC\14.29.30133\INCLUDE\IOSTREAM
C:\PROGRAM FILES (X86)\MICROSOFT VISUAL STUDIO\2019\COMMUNITY\VC\TOOLS\MSVC\14.29.30133\INCLUDE\ISTREAM
C:\PROGRAM FILES (X86)\MICROSOFT VISUAL STUDIO\2019\COMMUNITY\VC\TOOLS\MSVC\14.29.30133\INCLUDE\OSTREAM
C:\PROGRAM FILES (X86)\MICROSOFT VISUAL STUDIO\2019\COMMUNITY\VC\TOOLS\MSVC\14.29.30133\INCLUDE\IOS
C:\PROGRAM FILES (X86)\MICROSOFT VISUAL STUDIO\2019\COMMUNITY\VC\TOOLS\MSVC\14.29.30133\INCLUDE\XLOCNUM
C:\PROGRAM FILES (X86)\MICROSOFT VISUAL STUDIO\2019\COMMUNITY\VC\TOOLS\MSVC\14.29.30133\INCLUDE\STREAMBUF
C:\PROGRAM FILES (X86)\MICROSOFT VISUAL STUDIO\2019\COMMUNITY\VC\TOOLS\MSVC\14.29.30133\INCLUDE\XIOSBASE
C:\PROGRAM FILES (X86)\WINDOWS KITS\10\INCLUDE\10.0.19041.0\UCRT\SHARE.H
C:\PROGRAM FILES (X86)\MICROSOFT VISUAL STUDIO\2019\COMMUNITY\VC\TOOLS\MSVC\14.29.30133\INCLUDE\XLOCALE
C:\PROGRAM FILES (X86)\MICROSOFT VISUAL STUDIO\2019\COMMUNITY\VC\TOOLS\MSVC\14.29.30133\INCLUDE\XFACET
C:\PROGRAM FILES (X86)\MICROSOFT VISUAL STUDIO\2019\COMMUNITY\VC\TOOLS\MSVC\14.29.30133\INCLUDE\XLOCINFO
C:\PROGRAM FILES (X86)\MICROSOFT VISUAL STUDIO\2019\COMMUNITY\VC\TOOLS\MSVC\14.29.30133\INCLUDE\XLOCINFO.H
C:\PROGRAM FILES (X86)\MICROSOFT VISUAL STUDIO\2019\COMMUNITY\VC\TOOLS\MSVC\14.29.30133\INCLUDE\CLOCALE
C:\PROGRAM FILES (X86)\WINDOWS KITS\10\INCLUDE\10.0.19041.0\UCRT\LOCALE.H
C:\USERS\ADMIN\DESKTOP\RR_HERTZ\PLUGINFILES\INTERFACE\CONTACTMODEL\INTERFACE\ICONTACTMODELMECHANICAL.H
C:\USERS\ADMIN\DESKTOP\RR_HERTZ\PLUGINFILES\CONTACTMODEL\EXAMPLE\VERSION.TXT
C:\USERS\ADMIN\DESKTOP\RR_HERTZ\PLUGINFILES\CONTACTMODEL\SRC\CONTACTMODELTHERMAL.H
C:\USERS\ADMIN\DESKTOP\RR_HERTZ\PLUGINFILES\INTERFACE\CONTACTMODEL\INTERFACE\ICONTACTMODELTHERMAL.H
C:\USERS\ADMIN\DESKTOP\RR_HERTZ\PLUGINFILES\INTERFACE\FISH\SRC\PARAMETER.H
C:\USERS\ADMIN\DESKTOP\RR_HERTZ\PLUGINFILES\INTERFACE\FISH\SRC\INDEX.H
C:\USERS\ADMIN\DESKTOP\RR_HERTZ\PLUGINFILES\INTERFACE\FISH\SRC\EXPORTFISH.H
C:\USERS\ADMIN\DESKTOP\RR_HERTZ\PLUGINFILES\INTERFACE\SHARED\SRC\CHEAPSPINLOCK.H
C:\USERS\ADMIN\DESKTOP\RR_HERTZ\PLUGINFILES\INTERFACE\BASE\SRC\SPINLOCK.H
C:\USERS\ADMIN\DESKTOP\RR_HERTZ\PLUGINFILES\INTERFACE\FISH\SRC\MATRIX.H
C:\USERS\ADMIN\DESKTOP\RR_HERTZ\PLUGINFILES\INTERFACE\FISH\SRC\SHAREDDATA.H
C:\USERS\ADMIN\DESKTOP\RR_HERTZ\PLUGINFILES\INTERFACE\FISH\SRC\SAVEDEPTH.H
C:\USERS\ADMIN\DESKTOP\RR_HERTZ\PLUGINFILES\INTERFACE\FISH\SRC\UTILITYTHREAD.H
C:\PROGRAM FILES (X86)\MICROSOFT VISUAL STUDIO\2019\COMMUNITY\VC\TOOLS\MSVC\14.29.30133\INCLUDE\DEQUE
C:\USERS\ADMIN\DESKTOP\RR_HERTZ\PLUGINFILES\INTERFACE\SHARED\SRC\ARCHIVE2.H
C:\USERS\ADMIN\DESKTOP\RR_HERTZ\PLUGINFILES\INTERFACE\BASE\SRC\MAT.H
C:\USERS\ADMIN\DESKTOP\RR_HERTZ\PLUGINFILES\INTERFACE\FISH\SRC\POINTER.H
C:\USERS\ADMIN\DESKTOP\RR_HERTZ\PLUGINFILES\INTERFACE\UTILITY\SRC\THING.H
C:\USERS\ADMIN\DESKTOP\RR_HERTZ\PLUGINFILES\INTERFACE\UTILITY\SRC\LOWEST.H
C:\USERS\ADMIN\DESKTOP\RR_HERTZ\PLUGINFILES\INTERFACE\UTILITY\INTERFACE\ITHING.H
C:\USERS\ADMIN\DESKTOP\RR_HERTZ\PLUGINFILES\INTERFACE\UTILITY\INTERFACE\IDELETENOTICE.H
C:\USERS\ADMIN\DESKTOP\RR_HERTZ\PLUGINFILES\INTERFACE\UTILITY\INTERFACE\IGROUP.H
C:\USERS\ADMIN\DESKTOP\RR_HERTZ\PLUGINFILES\INTERFACE\UTILITY\SRC\TPTR.H
C:\USERS\ADMIN\DESKTOP\RR_HERTZ\PLUGINFILES\INTERFACE\FISH\SRC\REFERENCE.H
C:\USERS\ADMIN\DESKTOP\RR_HERTZ\PLUGINFILES\INTERFACE\UTILITY\SRC\ACCUMULATOR.H
C:\USERS\ADMIN\DESKTOP\RR_HERTZ\PLUGINFILES\INTERFACE\UTILITY\SRC\EXTENDEDPRECISION.H
C:\USERS\ADMIN\DESKTOP\RR_HERTZ\PLUGINFILES\INTERFACE\FISH\INTERFACE\IPARAMETER.H
C:\USERS\ADMIN\DESKTOP\RR_HERTZ\PLUGINFILES\INTERFACE\SHARED\INTERFACE\ITENSORDATA.H
C:\USERS\ADMIN\DESKTOP\RR_HERTZ\PLUGINFILES\INTERFACE\SHARED\SRC\MATHUTIL.H
C:\USERS\ADMIN\DESKTOP\RR_HERTZ\PLUGINFILES\INTERFACE\KERNEL\INTERFACE\IPROGRAM.H
C:\USERS\ADMIN\DESKTOP\RR_HERTZ\PLUGINFILES\INTERFACE\MODULE\INTERFACE\ICONTACT.H
C:\USERS\ADMIN\DESKTOP\RR_HERTZ\PLUGINFILES\INTERFACE\UTILITY\INTERFACE\ISIGNALBASE.H
C:\USERS\ADMIN\DESKTOP\RR_HERTZ\PLUGINFILES\INTERFACE\MODULE\INTERFACE\ICONTACTMECHANICAL.H
C:\USERS\ADMIN\DESKTOP\RR_HERTZ\PLUGINFILES\INTERFACE\MODULE\INTERFACE\ICONTACTTHERMAL.H
C:\USERS\ADMIN\DESKTOP\RR_HERTZ\PLUGINFILES\INTERFACE\MODULE\INTERFACE\IFISHCALLLIST.H
C:\USERS\ADMIN\DESKTOP\RR_HERTZ\PLUGINFILES\INTERFACE\MODULE\INTERFACE\IPIECE.H
C:\USERS\ADMIN\DESKTOP\RR_HERTZ\PLUGINFILES\INTERFACE\MODULE\INTERFACE\IPIECEMECHANICAL.H
