^C:\Users\Admin\Desktop\RR_HERTZ\PluginFiles\contactmodel\example\example.vcxproj
C:\Users\Admin\Desktop\RR_HERTZ\PluginFiles\contactmodel\example\x64\Release\contactmodelmechanical3drrhertz007.lib
C:\Users\Admin\Desktop\RR_HERTZ\PluginFiles\contactmodel\example\x64\Release\contactmodelmechanical3drrhertz007.exp
^C:\Users\Admin\Desktop\RR_HERTZ\PluginFiles\contactmodel\example\example.vcxproj
C:\Users\Admin\Desktop\RR_HERTZ\PluginFiles\contactmodel\example\x64\Release\contactmodelmechanical3drrhertz007.lib
C:\Users\Admin\Desktop\RR_HERTZ\PluginFiles\contactmodel\example\x64\Release\contactmodelmechanical3drrhertz007.exp
^C:\Users\Admin\Desktop\RR_HERTZ\PluginFiles\contactmodel\example\example.vcxproj
C:\Users\Admin\Desktop\RR_HERTZ\PluginFiles\contactmodel\example\x64\Release\contactmodelmechanical3drrhertz007.lib
C:\Users\Admin\Desktop\RR_HERTZ\PluginFiles\contactmodel\example\x64\Release\contactmodelmechanical3drrhertz007.exp
