#Command: "C:\Program Files (x86)\Microsoft Visual Studio\2019\Community\VC\Tools\MSVC\14.29.30133\bin\HostX86\x64\link.exe" /ERRORREPORT:PROMPT @C:\Users\Admin\AppData\Local\Temp\tmpf0269672c57b4482a639083bb89a4919.rsp /nologo /incremental /fullbuild
^C:\USERS\ADMIN\DESKTOP\RR_HERTZ\PLUGINFILES\CONTACTMODEL\EXAMPLE\X64\RELEASE\RR_HERTZ.OBJ|C:\USERS\ADMIN\DESKTOP\RR_HERTZ\PLUGINFILES\CONTACTMODEL\EXAMPLE\X64\RELEASE\VERSION.RES
C:\USERS\ADMIN\APPDATA\LOCAL\TEMP\LNK{D0EFB7B0-4B47-4E84-8D6A-84EB4BE065EA}.TMP
