Nov 08 15:16:07 330cf82 openvpn[849]: Fri Nov  8 15:16:07 2019 RESOLVE: Cannot resolve host address: vpn.nerds4life.org:443 (Temporary failure in name resolution)
Nov 08 15:16:07 330cf82 openvpn[849]: Fri Nov  8 15:16:07 2019 Could not determine IPv4/IPv6 protocol
Nov 08 15:16:07 330cf82 openvpn[849]: Fri Nov  8 15:16:07 2019 SIGUSR1[soft,init_instance] received, process restarting
Nov 08 15:16:07 330cf82 openvpn[849]: Fri Nov  8 15:16:07 2019 Restart pause, 40 second(s)

Nov 08 15:16:32 330cf82 balenad[857]: time="2019-11-08T15:16:32.784258578Z" level=info msg="shim reaped" id=2731ac6f4f28fc78795d068b126226b4915c375839034277f74bf7a516ade589
Nov 08 15:16:32 330cf82 balenad[857]: time="2019-11-08T15:16:32.791473326Z" level=info msg="ignoring event" module=libcontainerd namespace=moby topic=/tasks/delete type="*events.TaskDelete"
Nov 08 15:16:36 330cf82 resin-supervisor[1487]: [error]   Failed to get target state for device: Error: getaddrinfo EAI_AGAIN api.nerds4life.org api.nerds4life.org:443
Nov 08 15:16:36 330cf82 d93313190b7a[857]: [error]   Failed to get target state for device: Error: getaddrinfo EAI_AGAIN api.nerds4life.org api.nerds4life.org:443
Nov 08 15:16:36 330cf82 d93313190b7a[857]: [error]   LogBackend: unexpected error: Error: getaddrinfo EAI_AGAIN api.nerds4life.org api.nerds4life.org:443
Nov 08 15:16:36 330cf82 resin-supervisor[1487]: [error]   LogBackend: unexpected error: Error: getaddrinfo EAI_AGAIN api.nerds4life.org api.nerds4life.org:443
Nov 08 15:16:36 330cf82 resin-supervisor[1487]: [error]         at GetAddrInfoReqWrap.onlookup [as oncomplete] (dns.js:56:26)
Nov 08 15:16:36 330cf82 d93313190b7a[857]: [error]         at GetAddrInfoReqWrap.onlookup [as oncomplete] (dns.js:56:26)
