﻿"end","rand","ucount"
1574635500000,0,3
1574635500000,1,0
1574636400000,0,8
1574636400000,1,4
1574637300000,0,4
1574637300000,1,3
1574639100000,0,3
1574639100000,1,1
1574640000000,0,1
1574640000000,1,1
1574640900000,0,2
1574640900000,1,0
1574641800000,1,1
1574642700000,0,3
1574642700000,1,0
1574643600000,0,1
1574643600000,1,0
1574644500000,0,4
1574644500000,1,0
1574645400000,0,1
1574645400000,1,0
1574646300000,1,1
1574647200000,0,1
1574647200000,1,0
1574648100000,0,1
1574648100000,1,1
1574649000000,1,1
1574649900000,1,1
1574650800000,0,1
1574650800000,1,0
1574651700000,0,1
1574651700000,1,0
1574652600000,0,1
1574652600000,1,1
1574654400000,0,2
1574654400000,1,0
1574656200000,1,1
1574657100000,0,1
1574657100000,1,0
1574658000000,0,3
1574658000000,1,0
1574658900000,0,1
1574659800000,0,1
1574660700000,0,1
1574661600000,0,4
1574662500000,1,1
1574663400000,0,5
1574664300000,0,7
1574664300000,1,1
1574665200000,0,5
1574665200000,1,2
1574666100000,0,4
1574666100000,1,4
1574667000000,0,7
1574667900000,0,11
1574667900000,1,6
1574668800000,0,16
1574668800000,1,2
1574669700000,0,18
1574669700000,1,3
1574670600000,0,27
1574670600000,1,6
1574671500000,0,35
1574671500000,1,6
1574672400000,0,48
1574672400000,1,15
1574673300000,0,58
1574673300000,1,23
1574674200000,0,68
1574674200000,1,17
1574675100000,0,84
1574675100000,1,14
1574676000000,0,80
1574676000000,1,20
1574676900000,0,82
1574676900000,1,16
1574677800000,0,98
1574677800000,1,18
1574678700000,0,93
1574678700000,1,10
1574679600000,0,74
1574679600000,1,23
1574680500000,0,90
1574680500000,1,23
1574681400000,0,79
1574681400000,1,29
1574682300000,0,66
1574682300000,1,26
1574683200000,0,92
1574683200000,1,23
1574684100000,0,85
1574684100000,1,22
1574685000000,0,80
1574685000000,1,32
1574685900000,0,75
1574685900000,1,24
1574686800000,0,77
1574686800000,1,22
1574687700000,0,64
1574687700000,1,18
1574688600000,0,72
1574688600000,1,23
1574689500000,0,95
1574689500000,1,17
1574690400000,0,94
1574690400000,1,20
1574691300000,0,83
1574691300000,1,16
1574692200000,0,108
1574692200000,1,26
1574693100000,0,79
1574693100000,1,39
1574694000000,0,104
1574694000000,1,12
1574694900000,0,142
1574694900000,1,23
1574695800000,0,99
1574695800000,1,22
1574696700000,0,89
1574696700000,1,26
1574697600000,0,114
1574697600000,1,18
1574698500000,0,111
1574698500000,1,21
1574699400000,0,85
1574699400000,1,18
1574700300000,0,86
1574700300000,1,17
1574701200000,0,97
1574701200000,1,21
1574702100000,0,94
1574702100000,1,21
1574703000000,0,86
1574703000000,1,21
1574703900000,0,71
1574703900000,1,23
1574704800000,0,68
1574704800000,1,27
1574705700000,0,66
1574705700000,1,18
1574706600000,0,57
1574706600000,1,20
1574707500000,0,48
1574707500000,1,16
1574708400000,0,53
1574708400000,1,31
1574709300000,0,38
1574709300000,1,19
1574710200000,0,49
1574710200000,1,15
1574711100000,0,52
1574711100000,1,21
1574712000000,0,39
1574712000000,1,12
1574712900000,0,21
1574712900000,1,11
1574713800000,0,36
1574713800000,1,14
1574714700000,0,21
1574714700000,1,3
1574715600000,0,14
1574715600000,1,6
1574716500000,0,10
1574716500000,1,3
1574717400000,0,7
1574717400000,1,3
1574718300000,0,6
1574718300000,1,3
1574719200000,1,6
1574719200000,0,5
1574720100000,0,9
1574720100000,1,1
1574721000000,0,3
1574721000000,1,2
1574721900000,0,2
1574721900000,1,2
