﻿"end","rand","rawDataCount"
1574462700000,0,119
1574462700000,1,8
1574463600000,0,309
1574463600000,1,60
1574464500000,0,53
1574464500000,1,43
1574465400000,0,35
1574465400000,1,28
1574466300000,0,88
1574466300000,1,11
1574467200000,1,31
1574467200000,0,18
1574468100000,0,52
1574468100000,1,21
1574469000000,0,53
1574469000000,1,4
1574469900000,1,29
1574469900000,0,27
1574470800000,0,13
1574470800000,1,10
1574471700000,0,27
1574471700000,1,15
1574472600000,1,3
1574473500000,0,8
1574473500000,1,3
1574474400000,0,65
1574474400000,1,0
1574475300000,1,18
1574475300000,0,7
1574477100000,0,3
1574477100000,1,2
1574478000000,0,29
1574478000000,1,0
1574478900000,1,5
1574478900000,0,3
1574479800000,0,3
1574479800000,1,0
1574480700000,0,85
1574480700000,1,3
1574481600000,0,27
1574481600000,1,0
1574482500000,0,47
1574482500000,1,0
1574483400000,0,176
1574483400000,1,6
1574484300000,0,97
1574485200000,0,34
1574485200000,1,0
1574486100000,0,11
1574486100000,1,3
1574487000000,0,80
1574487000000,1,2
1574487900000,0,134
1574487900000,1,0
1574488800000,0,27
1574488800000,1,0
1574489700000,0,51
1574489700000,1,0
1574490600000,0,97
1574490600000,1,0
1574491500000,0,235
1574491500000,1,8
1574492400000,0,108
1574492400000,1,2
1574493300000,0,208
1574493300000,1,11
1574494200000,0,331
1574494200000,1,21
1574495100000,0,894
1574495100000,1,133
1574496000000,0,416
1574496000000,1,105
1574496900000,0,1351
1574496900000,1,102
1574497800000,0,1224
1574497800000,1,373
1574498700000,0,1156
1574498700000,1,225
1574499600000,0,2162
1574499600000,1,89
1574500500000,0,1577
1574500500000,1,315
1574501400000,0,2149
1574501400000,1,367
1574502300000,0,1465
1574502300000,1,339
1574503200000,0,1772
1574503200000,1,327
1574504100000,0,1761
1574504100000,1,486
1574505000000,0,1792
1574505000000,1,452
1574505900000,0,1959
1574505900000,1,513
1574506800000,0,1618
1574506800000,1,329
1574507700000,0,1901
1574507700000,1,393
1574508600000,0,2126
1574508600000,1,463
1574509500000,0,1842
1574509500000,1,568
1574510400000,0,2716
1574510400000,1,326
1574511300000,0,2792
1574511300000,1,443
1574512200000,0,2314
1574512200000,1,495
1574513100000,0,2433
1574513100000,1,649
1574514000000,0,3119
1574514000000,1,523
1574514900000,0,2703
1574514900000,1,516
1574515800000,0,2635
1574515800000,1,732
1574516700000,0,5473
1574516700000,1,601
1574517600000,0,2251
1574517600000,1,532
1574518500000,0,2442
1574518500000,1,602
1574519400000,0,2968
1574519400000,1,698
1574520300000,0,2718
1574520300000,1,800
1574521200000,0,2349
1574521200000,1,726
1574522100000,0,2501
1574522100000,1,799
1574523000000,0,2822
1574523000000,1,635
1574523900000,0,2322
1574523900000,1,766
1574524800000,0,2626
1574524800000,1,728
1574525700000,0,2596
1574525700000,1,614
1574526600000,0,2438
1574526600000,1,1046
1574527500000,0,2920
1574527500000,1,515
1574528400000,0,2313
1574528400000,1,403
1574529300000,0,1722
1574529300000,1,297
1574530200000,0,2276
1574530200000,1,672
1574531100000,0,2208
1574531100000,1,719
1574532000000,0,1680
1574532000000,1,634
1574532900000,0,1469
1574532900000,1,666
1574533800000,0,1115
1574533800000,1,317
1574534700000,0,1160
1574534700000,1,375
1574535600000,0,1034
1574535600000,1,384
1574536500000,0,1002
1574536500000,1,232
1574537400000,0,530
1574537400000,1,199
1574538300000,0,648
1574538300000,1,351
1574539200000,0,575
1574539200000,1,313
1574540100000,0,549
1574540100000,1,148
1574541000000,0,769
1574541000000,1,195
1574541900000,0,726
1574541900000,1,252
1574542800000,0,559
1574542800000,1,269
1574543700000,0,626
1574543700000,1,210
1574544600000,0,386
1574544600000,1,190
1574545500000,0,468
1574545500000,1,127
1574546400000,0,212
1574546400000,1,111
1574547300000,1,134
1574547300000,0,128
1574548200000,0,74
1574548200000,1,27
1574549100000,0,35
1574549100000,1,23
