"end","rand","ucount"
1574553600000,0,281
1574553600000,1,173
1574557200000,0,133
1574557200000,1,85
1574560800000,0,106
1574560800000,1,50
1574564400000,0,96
1574564400000,1,75
1574568000000,0,118
1574568000000,1,81
1574571600000,0,89
1574571600000,1,67
1574575200000,0,115
1574575200000,1,71
1574578800000,0,290
1574578800000,1,133
1574582400000,0,1102
1574582400000,1,511
1574586000000,0,2325
1574586000000,1,954
1574589600000,0,3443
1574589600000,1,1449
1574593200000,0,3760
1574593200000,1,1676
1574596800000,0,3529
1574596800000,1,1657
1574600400000,0,3345
1574600400000,1,1453
1574604000000,0,3791
1574604000000,1,1671
1574607600000,0,3981
1574607600000,1,1807
1574611200000,0,4374
1574611200000,1,2151
1574614800000,0,3640
1574614800000,1,1899
1574618400000,0,2685
1574618400000,1,1312
1574622000000,0,1788
1574622000000,1,910
1574625600000,0,976
1574625600000,1,492
1574629200000,0,459
1574629200000,1,196
1574632800000,0,239
1574632800000,1,130
1574636400000,0,195
1574636400000,1,95
1574640000000,0,83
1574640000000,1,50
1574643600000,0,73
1574643600000,1,58
1574647200000,0,71
1574647200000,1,49
1574650800000,0,62
1574650800000,1,55
1574654400000,0,84
1574654400000,1,51
1574658000000,0,109
1574658000000,1,63
1574661600000,0,189
1574661600000,1,105
1574665200000,0,376
1574665200000,1,237
1574668800000,0,707
1574668800000,1,383
1574672400000,0,1503
1574672400000,1,788
1574676000000,0,2295
1574676000000,1,1063
1574679600000,0,2437
1574679600000,1,1278
1574683200000,0,2510
1574683200000,1,1349
1574686800000,0,2376
1574686800000,1,1181
1574690400000,0,2476
1574690400000,1,1210
1574694000000,0,2698
1574694000000,1,1307
1574697600000,0,2617
1574697600000,1,1328
1574701200000,0,2367
1574701200000,1,1192
1574704800000,0,2104
1574704800000,1,1107
1574708400000,0,1618
1574708400000,1,889
1574712000000,0,1099
1574712000000,1,613
1574715600000,0,402
1574715600000,1,199
1574719200000,0,249
1574719200000,1,130
1574722800000,0,153
1574722800000,1,85
1574726400000,0,116
1574726400000,1,61
1574730000000,0,81
1574730000000,1,47
1574733600000,0,66
1574733600000,1,54
1574737200000,0,75
1574737200000,1,64
1574740800000,0,75
1574740800000,1,50
1574744400000,0,137
1574744400000,1,50
1574748000000,0,250
1574748000000,1,113
1574751600000,0,344
1574751600000,1,170
1574755200000,0,539
1574755200000,1,244
1574758800000,0,1073
1574758800000,1,518
1574762400000,0,1356
1574762400000,1,669
1574766000000,0,1431
1574766000000,1,734
1574769600000,0,1521
1574769600000,1,833
1574773200000,0,1369
1574773200000,1,709
1574776800000,0,1364
1574776800000,1,650
1574780400000,0,1335
1574780400000,1,633
1574784000000,0,1358
1574784000000,1,705
1574787600000,0,1356
1574787600000,1,744
1574791200000,0,1003
1574791200000,1,540
1574794800000,0,931
1574794800000,1,541
1574798400000,0,541
1574798400000,1,291
1574802000000,0,206
1574802000000,1,94
1574805600000,0,136
1574805600000,1,55
1574809200000,0,84
1574809200000,1,45
1574812800000,0,23
1574812800000,1,14
1574816400000,0,19
1574816400000,1,8
1574820000000,0,55
1574820000000,1,11
1574845200000,0,1086
1574845200000,1,629
1574848800000,0,2429
1574848800000,1,1293
1574852400000,0,2401
1574852400000,1,1164
1574856000000,0,2585
1574856000000,1,1360
1574859600000,0,2738
1574859600000,1,1467
1574863200000,0,2789
1574863200000,1,1320
1574866800000,0,2697
1574866800000,1,1364
1574870400000,0,2947
1574870400000,1,1589
1574874000000,0,2857
1574874000000,1,1628
1574877600000,0,2469
1574877600000,1,1321
1574881200000,0,2344
1574881200000,1,1398
1574884800000,0,1747
1574884800000,1,1000
1574888400000,0,549
1574888400000,1,331
1574892000000,0,324
1574892000000,1,214
1574895600000,0,221
1574895600000,1,169
1574899200000,0,114
1574899200000,1,104
1574902800000,0,107
1574902800000,1,84
1574906400000,0,94
1574906400000,1,87
1574910000000,0,112
1574910000000,1,93
1574913600000,0,119
1574913600000,1,96
1574917200000,0,161
1574917200000,1,113
1574920800000,0,275
1574920800000,1,172
1574924400000,0,593
1574924400000,1,382
1574928000000,0,1438
1574928000000,1,777
1574931600000,0,2459
1574931600000,1,1248
1574935200000,0,3113
1574935200000,1,1641
1574938800000,0,3171
1574938800000,1,1702
1574942400000,0,3255
1574942400000,1,1801
1574946000000,0,3214
1574946000000,1,1688
1574949600000,0,3639
1574949600000,1,1888
1574953200000,0,3987
1574953200000,1,2273
1574956800000,0,4381
1574956800000,1,2533
1574960400000,0,4069
1574960400000,1,2378
1574964000000,0,3840
1574964000000,1,2296
1574967600000,0,3182
1574967600000,1,1907
1574971200000,0,2512
1574971200000,1,1480
1574974800000,0,700
1574974800000,1,390
1574978400000,0,387
1574978400000,1,217
1574982000000,0,230
1574982000000,1,152
1574985600000,0,155
1574985600000,1,102
1574989200000,0,92
1574989200000,1,87
1574992800000,0,117
1574992800000,1,88
1574996400000,0,109
1574996400000,1,85
1575000000000,0,132
1575000000000,1,101
1575003600000,0,150
1575003600000,1,121
1575007200000,0,266
1575007200000,1,135
1575010800000,0,827
1575010800000,1,485
1575014400000,0,2161
1575014400000,1,1228
1575018000000,0,3571
1575018000000,1,1782
1575021600000,0,4109
1575021600000,1,2072
1575025200000,0,4438
1575025200000,1,2330
1575028800000,0,4595
1575028800000,1,2497
1575032400000,0,4954
1575032400000,1,2660
1575036000000,0,4954
1575036000000,1,2477
1575039600000,0,5363
1575039600000,1,2708
1575043200000,0,5368
1575043200000,1,2757
1575046800000,0,5489
1575046800000,1,3085
1575050400000,0,5043
1575050400000,1,2786
1575054000000,0,4653
1575054000000,1,2758
1575057600000,0,4479
1575057600000,1,2798
1575061200000,0,3395
1575061200000,1,2280
1575064800000,0,1643
1575064800000,1,1174
1575068400000,0,502
1575068400000,1,342
1575072000000,0,324
1575072000000,1,217
1575075600000,0,131
1575075600000,1,112
1575079200000,0,104
1575079200000,1,89
1575082800000,0,109
1575082800000,1,88
1575086400000,0,124
1575086400000,1,97
1575090000000,0,138
1575090000000,1,100
1575093600000,0,219
1575093600000,1,137
1575097200000,0,732
1575097200000,1,393
1575100800000,0,2052
1575100800000,1,1053
1575104400000,0,4032
1575104400000,1,2027
1575108000000,0,5183
1575108000000,1,2507
1575111600000,0,5064
1575111600000,1,2550
1575115200000,0,4492
1575115200000,1,2114
1575118800000,0,3404
1575118800000,1,1464
1575122400000,0,3838
1575122400000,1,1860
1575126000000,0,6004
1575126000000,1,2769
1575129600000,0,5965
1575129600000,1,2937
1575133200000,0,5774
1575133200000,1,2944
1575136800000,0,4940
1575136800000,1,2667
1575140400000,0,3674
1575140400000,1,2003
1575144000000,0,3418
1575144000000,1,2068
1575147600000,0,3289
1575147600000,1,2035
1575151200000,0,2422
1575151200000,1,1572
1575154800000,0,1082
1575154800000,1,753
1575158400000,0,500
1575158400000,1,331
1575162000000,0,218
1575162000000,1,135
1575165600000,0,152
1575165600000,1,98
1575169200000,0,146
1575169200000,1,87
1575172800000,0,146
1575172800000,1,89
1575176400000,0,168
1575176400000,1,91
1575180000000,0,204
1575180000000,1,109
1575183600000,0,652
1575183600000,1,340
1575187200000,0,2152
1575187200000,1,971
1575190800000,0,4697
1575190800000,1,2153
1575194400000,0,6310
1575194400000,1,2781
1575198000000,0,6148
1575198000000,1,2746
1575201600000,0,5701
1575201600000,1,2548
1575205200000,0,5838
1575205200000,1,2685
1575208800000,0,6254
1575208800000,1,2624
1575212400000,0,6275
1575212400000,1,2531
1575216000000,0,5784
1575216000000,1,2610
1575219600000,0,4292
1575219600000,1,1863
1575223200000,0,2132
1575223200000,1,1009
1575226800000,0,1369
1575226800000,1,664
1575230400000,0,886
1575230400000,1,368
1575234000000,0,298
1575234000000,1,83
1575237600000,0,137
1575237600000,1,43
1575241200000,0,94
1575241200000,1,20
1575244800000,0,71
1575244800000,1,18
1575248400000,0,72
1575248400000,1,24
1575252000000,0,66
1575252000000,1,12
1575255600000,0,66
1575255600000,1,10
1575259200000,0,51
1575259200000,1,8
1575262800000,0,61
1575262800000,1,2
1575266400000,0,78
1575266400000,1,2
1575270000000,0,73
1575270000000,1,12
1575273600000,0,72
1575273600000,1,15
1575277200000,0,3
