﻿"end","rand","ucount"
1574721900000,0,7
1574721900000,1,1
1574722800000,0,25
1574722800000,1,18
1574723700000,1,26
1574723700000,0,25
1574724600000,1,22
1574724600000,0,20
1574725500000,0,23
1574725500000,1,14
1574726400000,0,23
1574726400000,1,22
1574727300000,0,26
1574727300000,1,15
1574728200000,0,17
1574728200000,1,12
1574729100000,0,11
1574729100000,1,11
1574730000000,0,19
1574730000000,1,11
1574730900000,0,21
1574730900000,1,10
1574731800000,0,17
1574731800000,1,12
1574732700000,1,11
1574732700000,0,9
1574733600000,0,15
1574733600000,1,13
1574734500000,0,14
1574734500000,1,12
1574735400000,1,13
1574735400000,0,12
1574736300000,1,16
1574736300000,0,15
1574737200000,0,17
1574737200000,1,11
1574738100000,1,16
1574738100000,0,10
1574739000000,1,18
1574739000000,0,13
1574739900000,0,14
1574739900000,1,13
1574740800000,0,12
1574740800000,1,11
1574741700000,0,16
1574741700000,1,10
1574742600000,1,17
1574742600000,0,14
1574743500000,0,15
1574743500000,1,9
1574744400000,0,16
1574744400000,1,15
1574745300000,0,27
1574745300000,1,8
1574746200000,0,25
1574746200000,1,12
1574747100000,0,32
1574747100000,1,11
1574748000000,0,22
1574748000000,1,19
1574748900000,0,51
1574748900000,1,31
1574749800000,0,50
1574749800000,1,28
1574750700000,0,58
1574750700000,1,33
1574751600000,0,55
1574751600000,1,37
1574752500000,0,55
1574752500000,1,41
1574753400000,0,77
1574753400000,1,44
1574754300000,0,81
1574754300000,1,35
1574755200000,0,88
1574755200000,1,51
1574756100000,0,77
1574756100000,1,44
1574757000000,0,91
1574757000000,1,52
1574757900000,0,139
1574757900000,1,86
1574758800000,0,167
1574758800000,1,90
1574759700000,0,170
1574759700000,1,117
1574760600000,0,176
1574760600000,1,124
1574761500000,0,222
1574761500000,1,164
1574762400000,0,216
1574762400000,1,139
1574763300000,0,207
1574763300000,1,165
1574764200000,0,219
1574764200000,1,168
1574765100000,0,222
1574765100000,1,153
1574766000000,0,270
1574766000000,1,180
1574766900000,0,266
1574766900000,1,167
1574767800000,0,215
1574767800000,1,160
1574768700000,0,262
1574768700000,1,190
1574769600000,0,241
1574769600000,1,185
1574770500000,0,288
1574770500000,1,198
1574771400000,0,262
1574771400000,1,221
1574772300000,0,251
1574772300000,1,166
1574773200000,0,234
1574773200000,1,186
1574774100000,0,259
1574774100000,1,152
1574775000000,0,232
1574775000000,1,165
1574775900000,0,212
1574775900000,1,157
1574776800000,0,214
1574776800000,1,168
1574777700000,0,264
1574777700000,1,166
1574778600000,0,189
1574778600000,1,117
1574779500000,0,220
1574779500000,1,155
1574780400000,0,214
1574780400000,1,153
1574781300000,0,225
1574781300000,1,150
1574782200000,0,218
1574782200000,1,123
1574783100000,0,225
1574783100000,1,153
1574784000000,0,212
1574784000000,1,156
1574784900000,0,220
1574784900000,1,170
1574785800000,0,255
1574785800000,1,189
1574786700000,0,241
1574786700000,1,154
1574787600000,0,248
1574787600000,1,173
1574788500000,0,236
1574788500000,1,171
1574789400000,0,243
1574789400000,1,177
1574790300000,0,200
1574790300000,1,158
1574791200000,0,193
1574791200000,1,108
1574792100000,0,132
1574792100000,1,123
1574793000000,0,176
1574793000000,1,137
1574793900000,0,186
1574793900000,1,134
1574794800000,0,182
1574794800000,1,129
1574795700000,0,160
1574795700000,1,123
1574796600000,0,146
1574796600000,1,134
1574797500000,0,155
1574797500000,1,107
1574798400000,0,106
1574798400000,1,90
1574799300000,0,85
1574799300000,1,68
1574800200000,0,93
1574800200000,1,65
1574801100000,0,48
1574801100000,1,40
1574802000000,0,52
1574802000000,1,28
1574802900000,0,28
1574802900000,1,23
1574803800000,0,30
1574803800000,1,14
1574804700000,1,23
1574804700000,0,18
1574805600000,0,23
1574805600000,1,15
1574806500000,0,22
1574806500000,1,12
1574807400000,0,19
1574807400000,1,12
1574808300000,0,11
1574808300000,1,7
