﻿"end","rand","rawDataCount"
1574808300000,0,21
1574808300000,1,12
1574809200000,0,92
1574809200000,1,81
1574810100000,1,96
1574810100000,0,47
1574811000000,1,52
1574811000000,0,49
1574811900000,1,41
1574811900000,0,31
1574812800000,1,26
1574812800000,0,9
1574813700000,0,53
1574813700000,1,23
1574814600000,1,21
1574814600000,0,10
1574815500000,0,24
1574815500000,1,0
1574816400000,1,37
1574816400000,0,12
1574817300000,0,43
1574817300000,1,0
1574818200000,0,18
1574818200000,1,12
1574819100000,0,22
1574819100000,1,13
1574820000000,0,21
1574820000000,1,10
1574820900000,0,60
1574820900000,1,13
1574821800000,0,32
1574821800000,1,22
1574845200000,0,3
1574845200000,1,0
1574846100000,0,114
1574846100000,1,43
1574847000000,0,2377
1574847000000,1,1271
1574847900000,0,2356
1574847900000,1,1188
1574848800000,0,1938
1574848800000,1,1323
1574849700000,0,1734
1574849700000,1,1121
1574850600000,0,1855
1574850600000,1,1146
1574851500000,0,2153
1574851500000,1,1484
1574852400000,0,2333
1574852400000,1,973
1574853300000,0,1744
1574853300000,1,985
1574854200000,0,2082
1574854200000,1,1205
1574855100000,0,2222
1574855100000,1,1133
1574856000000,0,2026
1574856000000,1,1121
1574856900000,0,1963
1574856900000,1,1249
1574857800000,0,2302
1574857800000,1,1730
1574858700000,0,2191
1574858700000,1,1460
1574859600000,0,2283
1574859600000,1,1417
1574860500000,0,2293
1574860500000,1,1583
1574861400000,0,2291
1574861400000,1,1624
1574862300000,0,2402
1574862300000,1,1550
1574863200000,0,2210
1574863200000,1,1465
1574864100000,0,2478
1574864100000,1,1335
1574865000000,0,2143
1574865000000,1,1255
1574865900000,0,2464
1574865900000,1,1457
1574866800000,0,2089
1574866800000,1,1562
1574867700000,0,2139
1574867700000,1,1535
1574868600000,0,2466
1574868600000,1,1578
1574869500000,0,2147
1574869500000,1,1379
1574870400000,0,2372
1574870400000,1,1665
1574871300000,0,2272
1574871300000,1,1604
1574872200000,0,2590
1574872200000,1,1788
1574873100000,0,2633
1574873100000,1,1966
1574874000000,0,2812
1574874000000,1,2010
1574874900000,0,2684
1574874900000,1,1805
1574875800000,0,2231
1574875800000,1,1792
1574876700000,0,2812
1574876700000,1,1821
1574877600000,0,2526
1574877600000,1,1503
1574878500000,0,2248
1574878500000,1,1460
1574879400000,0,2267
1574879400000,1,1532
1574880300000,0,1834
1574880300000,1,1471
1574881200000,0,2240
1574881200000,1,1376
1574882100000,0,1914
1574882100000,1,1442
1574883000000,0,2091
1574883000000,1,1616
1574883900000,0,2160
1574883900000,1,1248
1574884800000,0,1838
1574884800000,1,1441
1574885700000,0,1479
1574885700000,1,1111
1574886600000,0,1164
1574886600000,1,793
1574887500000,0,1026
1574887500000,1,705
1574888400000,0,682
1574888400000,1,552
1574889300000,0,511
1574889300000,1,385
1574890200000,0,475
1574890200000,1,443
1574891100000,0,495
1574891100000,1,443
1574892000000,0,651
1574892000000,1,415
1574892900000,0,406
1574892900000,1,389
1574893800000,1,281
1574893800000,0,263
1574894700000,0,277
1574894700000,1,215
