﻿"end","rand","rawDataCount"
1574549100000,1,76
1574549100000,0,74
1574550000000,0,566
1574550000000,1,347
1574550900000,0,435
1574550900000,1,315
1574551800000,0,463
1574551800000,1,292
1574552700000,0,472
1574552700000,1,375
1574553600000,0,432
1574553600000,1,250
1574554500000,0,349
1574554500000,1,210
1574555400000,0,361
1574555400000,1,256
1574556300000,0,181
1574556300000,1,177
1574557200000,0,268
1574557200000,1,176
1574558100000,0,134
1574558100000,1,102
1574559000000,1,141
1574559000000,0,103
1574559900000,1,225
1574559900000,0,159
1574560800000,0,167
1574560800000,1,80
1574561700000,0,265
1574561700000,1,85
1574562600000,0,182
1574562600000,1,126
1574563500000,0,204
1574563500000,1,69
1574564400000,1,187
1574564400000,0,177
1574565300000,0,171
1574565300000,1,153
1574566200000,1,201
1574566200000,0,159
1574567100000,0,237
1574567100000,1,160
1574568000000,0,159
1574568000000,1,110
1574568900000,0,153
1574568900000,1,86
1574569800000,0,228
1574569800000,1,205
1574570700000,0,253
1574570700000,1,122
1574571600000,0,217
1574571600000,1,160
1574572500000,0,156
1574572500000,1,101
1574573400000,1,210
1574573400000,0,110
1574574300000,0,243
1574574300000,1,136
1574575200000,0,177
1574575200000,1,126
1574576100000,0,234
1574576100000,1,122
1574577000000,0,159
1574577000000,1,104
1574577900000,0,281
1574577900000,1,84
1574578800000,0,427
1574578800000,1,266
1574579700000,0,296
1574579700000,1,234
1574580600000,0,670
1574580600000,1,225
1574581500000,0,492
1574581500000,1,396
1574582400000,0,754
1574582400000,1,546
1574583300000,0,1204
1574583300000,1,434
1574584200000,0,1423
1574584200000,1,632
1574585100000,0,1742
1574585100000,1,1144
1574586000000,0,1875
1574586000000,1,1124
1574586900000,0,1788
1574586900000,1,1080
1574587800000,0,2441
1574587800000,1,1317
1574588700000,0,2360
1574588700000,1,1257
1574589600000,0,2367
1574589600000,1,1416
1574590500000,0,2780
1574590500000,1,1741
1574591400000,0,2997
1574591400000,1,1813
1574592300000,0,3111
1574592300000,1,1914
1574593200000,0,3160
1574593200000,1,1787
1574594100000,0,2996
1574594100000,1,2045
1574595000000,0,3108
1574595000000,1,1749
1574595900000,0,3013
1574595900000,1,1816
1574596800000,0,3099
1574596800000,1,1825
1574597700000,0,2950
1574597700000,1,1729
1574598600000,0,2803
1574598600000,1,2074
1574599500000,0,2836
1574599500000,1,1903
1574600400000,0,2558
1574600400000,1,1920
1574601300000,0,2535
1574601300000,1,1885
1574602200000,0,2640
1574602200000,1,1365
1574603100000,0,2586
1574603100000,1,2216
1574604000000,0,2762
1574604000000,1,1777
1574604900000,0,3061
1574604900000,1,2002
1574605800000,0,3654
1574605800000,1,1969
1574606700000,0,3233
1574606700000,1,2049
1574607600000,0,3395
1574607600000,1,2295
1574608500000,0,3385
1574608500000,1,2274
1574609400000,0,3653
1574609400000,1,2186
1574610300000,0,3566
1574610300000,1,2661
1574611200000,0,3760
1574611200000,1,2709
1574612100000,0,3870
1574612100000,1,2436
1574613000000,0,4035
1574613000000,1,2860
1574613900000,0,4092
1574613900000,1,2858
1574614800000,0,3264
1574614800000,1,2386
1574615700000,0,3014
1574615700000,1,2417
1574616600000,0,3069
1574616600000,1,2094
1574617500000,0,2823
1574617500000,1,2087
1574618400000,0,2459
1574618400000,1,1686
1574619300000,0,2287
1574619300000,1,1493
1574620200000,0,2121
1574620200000,1,1311
1574621100000,0,1875
1574621100000,1,1361
1574622000000,0,1617
1574622000000,1,1077
1574622900000,0,1356
1574622900000,1,1171
1574623800000,0,1685
1574623800000,1,995
1574624700000,0,1019
1574624700000,1,706
1574625600000,0,903
1574625600000,1,561
1574626500000,0,1041
1574626500000,1,609
1574627400000,0,681
1574627400000,1,619
1574628300000,0,468
1574628300000,1,395
1574629200000,0,493
1574629200000,1,320
1574630100000,0,476
1574630100000,1,194
1574631000000,0,303
1574631000000,1,249
1574631900000,1,470
1574631900000,0,269
1574632800000,0,287
1574632800000,1,160
1574633700000,0,238
1574633700000,1,226
1574634600000,0,344
1574634600000,1,148
1574635500000,0,232
1574635500000,1,130
