﻿"end","rand","rawDataCount"
1574462700000,1,137
1574462700000,0,65
1574463600000,0,678
1574463600000,1,504
1574464500000,0,499
1574464500000,1,445
1574465400000,0,481
1574465400000,1,443
1574466300000,0,469
1574466300000,1,341
1574467200000,0,421
1574467200000,1,313
1574468100000,0,334
1574468100000,1,288
1574469000000,1,333
1574469000000,0,280
1574469900000,0,333
1574469900000,1,296
1574470800000,1,302
1574470800000,0,298
1574471700000,1,360
1574471700000,0,176
1574472600000,0,379
1574472600000,1,171
1574473500000,1,277
1574473500000,0,190
1574474400000,1,292
1574474400000,0,197
1574475300000,1,259
1574475300000,0,253
1574476200000,0,313
1574476200000,1,225
1574477100000,0,287
1574477100000,1,205
1574478000000,0,297
1574478000000,1,212
1574478900000,1,323
1574478900000,0,291
1574479800000,0,254
1574479800000,1,228
1574480700000,0,228
1574480700000,1,186
1574481600000,0,287
1574481600000,1,260
1574482500000,0,526
1574482500000,1,237
1574483400000,0,249
1574483400000,1,245
1574484300000,1,239
1574484300000,0,212
1574485200000,0,231
1574485200000,1,185
1574486100000,0,391
1574486100000,1,260
1574487000000,1,335
1574487000000,0,203
1574487900000,1,299
1574487900000,0,294
1574488800000,0,382
1574488800000,1,198
1574489700000,0,454
1574489700000,1,105
1574490600000,1,403
1574490600000,0,338
1574491500000,0,465
1574491500000,1,351
1574492400000,1,413
1574492400000,0,355
1574493300000,0,496
1574493300000,1,360
1574494200000,0,1024
1574494200000,1,561
1574495100000,0,1249
1574495100000,1,879
1574496000000,0,901
1574496000000,1,676
1574496900000,0,1463
1574496900000,1,1066
1574497800000,0,2074
1574497800000,1,1288
1574498700000,0,2057
1574498700000,1,1517
1574499600000,0,2266
1574499600000,1,1536
1574500500000,0,2860
1574500500000,1,1828
1574501400000,0,3212
1574501400000,1,2121
1574502300000,0,3626
1574502300000,1,2482
1574503200000,0,3650
1574503200000,1,2535
1574504100000,0,3888
1574504100000,1,2910
1574505000000,0,4382
1574505000000,1,2996
1574505900000,0,4788
1574505900000,1,3115
1574506800000,0,4248
1574506800000,1,3029
1574507700000,0,4740
1574507700000,1,3136
1574508600000,0,4907
1574508600000,1,2947
1574509500000,0,4660
1574509500000,1,2454
1574510400000,0,5135
1574510400000,1,2515
1574511300000,0,5875
1574511300000,1,3368
1574512200000,0,5170
1574512200000,1,2732
1574513100000,0,5667
1574513100000,1,2975
1574514000000,0,5930
1574514000000,1,3522
1574514900000,0,5780
1574514900000,1,3489
1574515800000,0,5180
1574515800000,1,3355
1574516700000,0,6028
1574516700000,1,3743
1574517600000,0,5130
1574517600000,1,3311
1574518500000,0,6644
1574518500000,1,4136
1574519400000,0,5893
1574519400000,1,5011
1574520300000,0,6834
1574520300000,1,4419
1574521200000,0,7775
1574521200000,1,5414
1574522100000,0,6443
1574522100000,1,4978
1574523000000,0,7196
1574523000000,1,5065
1574523900000,0,7062
1574523900000,1,5136
1574524800000,0,6702
1574524800000,1,5498
1574525700000,0,7576
1574525700000,1,4637
1574526600000,0,6313
1574526600000,1,4829
1574527500000,0,6172
1574527500000,1,4310
1574528400000,0,5418
1574528400000,1,3459
1574529300000,0,4728
1574529300000,1,3327
1574530200000,0,5780
1574530200000,1,3833
1574531100000,0,5455
1574531100000,1,4002
1574532000000,0,3713
1574532000000,1,2765
1574532900000,0,3861
1574532900000,1,2509
1574533800000,0,2877
1574533800000,1,2130
1574534700000,0,2793
1574534700000,1,1905
1574535600000,0,2419
1574535600000,1,1786
1574536500000,0,2345
1574536500000,1,1604
1574537400000,0,1727
1574537400000,1,1247
1574538300000,0,1509
1574538300000,1,1278
1574539200000,0,1745
1574539200000,1,1247
1574540100000,0,1623
1574540100000,1,1050
1574541000000,0,1600
1574541000000,1,1023
1574541900000,0,1713
1574541900000,1,1095
1574542800000,0,1500
1574542800000,1,1008
1574543700000,0,1402
1574543700000,1,1089
1574544600000,0,1150
1574544600000,1,1136
1574545500000,0,1154
1574545500000,1,864
1574546400000,0,1397
1574546400000,1,611
1574547300000,1,657
1574547300000,0,482
1574548200000,0,599
1574548200000,1,339
1574549100000,0,383
1574549100000,1,325
