"end","rand","ucount"
1574722800000,0,88
1574722800000,1,43
1574724600000,0,65
1574724600000,1,42
1574726400000,0,73
1574726400000,1,39
1574728200000,0,43
1574728200000,1,22
1574730000000,0,41
1574730000000,1,25
1574731800000,0,40
1574731800000,1,22
1574733600000,0,35
1574733600000,1,28
1574735400000,0,31
1574735400000,1,26
1574737200000,0,40
1574737200000,1,30
1574739000000,0,35
1574739000000,1,34
1574740800000,0,35
1574740800000,1,22
1574742600000,0,40
1574742600000,1,28
1574744400000,0,51
1574744400000,1,26
1574746200000,0,86
1574746200000,1,24
1574748000000,0,99
1574748000000,1,47
1574749800000,0,153
1574749800000,1,66
1574751600000,0,143
1574751600000,1,84
1574753400000,0,202
1574753400000,1,86
1574755200000,0,223
1574755200000,1,91
1574757000000,0,321
1574757000000,1,153
1574758800000,0,480
1574758800000,1,222
1574760600000,0,611
1574760600000,1,297
1574762400000,0,685
1574762400000,1,323
1574764200000,0,695
1574764200000,1,346
1574766000000,0,738
1574766000000,1,363
1574767800000,0,703
1574767800000,1,371
1574769600000,0,782
1574769600000,1,407
1574771400000,0,753
1574771400000,1,426
1574773200000,0,685
1574773200000,1,367
1574775000000,0,696
1574775000000,1,343
1574776800000,0,737
1574776800000,1,353
1574778600000,0,646
1574778600000,1,297
1574780400000,0,695
1574780400000,1,333
1574782200000,0,663
1574782200000,1,302
1574784000000,0,656
1574784000000,1,339
1574785800000,0,719
1574785800000,1,366
1574787600000,0,697
1574787600000,1,372
1574789400000,0,671
1574789400000,1,372
1574791200000,0,493
1574791200000,1,243
1574793000000,0,518
1574793000000,1,298
1574794800000,0,508
1574794800000,1,275
1574796600000,0,432
1574796600000,1,266
1574798400000,0,305
1574798400000,1,172
1574800200000,0,239
1574800200000,1,119
1574802000000,0,128
1574802000000,1,52
1574803800000,0,78
1574803800000,1,42
1574805600000,0,78
1574805600000,1,29
1574807400000,0,58
1574807400000,1,26
