"rand","end","rawDataCount"
0,1574204400000,4269
0,1574208000000,9382
0,1574211600000,9722
0,1574215200000,9632
0,1574218800000,6404
0,1574222400000,62850
0,1574226000000,51872
0,1574229600000,73909
0,1574233200000,77631
0,1574236800000,78431
0,1574240400000,63558
0,1574244000000,65477
0,1574247600000,69519
0,1574251200000,104103
0,1574254800000,65314
0,1574258400000,63277
0,1574262000000,71722
0,1574265600000,81140
0,1574269200000,68227
0,1574272800000,66737
0,1574276400000,58211
0,1574280000000,49515
0,1574283600000,12771
0,1574287200000,6565
0,1574290800000,3645
0,1574294400000,11693
0,1574298000000,2217
0,1574301600000,2784
0,1574305200000,16097
0,1574308800000,4148
0,1574312400000,102865
0,1574316000000,65266
0,1574319600000,72910
0,1574323200000,62315
0,1574326800000,74065
0,1574330400000,48810
0,1574334000000,47182
0,1574337600000,54721
0,1574341200000,86306
0,1574344800000,62831
0,1574348400000,97475
0,1574352000000,110282
0,1574355600000,73943
0,1574359200000,54210
0,1574362800000,67726
0,1574366400000,33424
0,1574370000000,13571
0,1574373600000,8330
0,1574377200000,18978
0,1574380800000,50545
0,1574384400000,6512
0,1574388000000,2482
0,1574391600000,13381
0,1574395200000,63243
0,1574398800000,56401
0,1574402400000,21980
0,1574406000000,63289
0,1574409600000,62543
0,1574413200000,82604
0,1574416800000,72854
0,1574420400000,64556
0,1574424000000,62887
0,1574427600000,76074
0,1574434800000,127752
0,1574438400000,88786
0,1574442000000,91328
0,1574445600000,69505
0,1574449200000,77169
0,1574452800000,103781
0,1574456400000,173907
0,1574460000000,23839
0,1574463600000,8013
0,1574467200000,17272
0,1574470800000,7327
0,1574474400000,2100
0,1574478000000,21014
0,1574481600000,26423
0,1574485200000,64239
0,1574488800000,28685
0,1574492400000,57022
0,1574496000000,79869
0,1574499600000,88720
0,1574503200000,99041
0,1574506800000,108209
0,1574510400000,122659
0,1574514000000,151281
0,1574517600000,170062
0,1574521200000,188628
0,1574524800000,159550
0,1574528400000,123246
0,1574532000000,83134
0,1574535600000,72855
0,1574539200000,45117
0,1574542800000,23390
0,1574546400000,11900
0,1574550000000,9045
0,1574553600000,7820
0,1574557200000,1831
0,1574560800000,8699
0,1574564400000,13042
0,1574568000000,47616
0,1574571600000,10885
0,1574575200000,13506
0,1574578800000,76700
0,1574582400000,42826
0,1574586000000,48669
0,1574589600000,61250
0,1574593200000,69206
0,1574596800000,63471
0,1574600400000,56665
0,1574604000000,82213
0,1574607600000,71918
0,1574611200000,74619
0,1574614800000,68515
0,1574618400000,41940
0,1574622000000,25924
0,1574625600000,30799
0,1574629200000,8619
0,1574632800000,7810
0,1574636400000,6546
0,1574640000000,1416
0,1574643600000,34452
0,1574647200000,1535
0,1574650800000,2380
0,1574654400000,44006
0,1574658000000,39171
0,1574661600000,19987
0,1574665200000,18274
0,1574668800000,16404
0,1574672400000,65085
0,1574676000000,38237
0,1574679600000,39246
0,1574683200000,41053
0,1574686800000,32842
0,1574690400000,32948
0,1574694000000,34530
0,1574697600000,47600
0,1574701200000,33080
0,1574704800000,30572
0,1574708400000,26374
0,1574712000000,25496
0,1574715600000,13726
0,1574719200000,4355
0,1574722800000,3622
0,1574726400000,4996
0,1574730000000,1848
0,1574733600000,2277
0,1574737200000,6632
0,1574740800000,20838
0,1574744400000,24199
0,1574748000000,5477
0,1574751600000,13533
0,1574755200000,11349
0,1574758800000,17638
0,1574762400000,24156
0,1574766000000,33032
0,1574769600000,21825
0,1574773200000,20988
0,1574776800000,21468
0,1574780400000,18277
0,1574784000000,19031
0,1574787600000,18272
0,1574791200000,15282
0,1574794800000,11757
0,1574798400000,5028
0,1574802000000,2097
0,1574805600000,1019
1,1574204400000,1617
1,1574208000000,1436
1,1574211600000,1384
1,1574215200000,1383
1,1574218800000,1169
1,1574222400000,1494
1,1574226000000,1519
1,1574229600000,1977
1,1574233200000,15938
1,1574236800000,12549
1,1574240400000,17831
1,1574244000000,23324
1,1574247600000,28280
1,1574251200000,29026
1,1574254800000,28409
1,1574258400000,28149
1,1574262000000,33539
1,1574265600000,32018
1,1574269200000,35204
1,1574272800000,34924
1,1574276400000,32957
1,1574280000000,18982
1,1574283600000,6152
1,1574287200000,2716
1,1574290800000,1882
1,1574294400000,1559
1,1574298000000,1018
1,1574301600000,1208
1,1574305200000,1030
1,1574308800000,866
1,1574312400000,1311
1,1574316000000,1665
1,1574323200000,7867
1,1574326800000,14619
1,1574330400000,15757
1,1574334000000,15690
1,1574337600000,20481
1,1574341200000,22831
1,1574344800000,20365
1,1574348400000,27494
1,1574352000000,26418
1,1574355600000,26685
1,1574359200000,26998
1,1574362800000,22030
1,1574366400000,11870
1,1574370000000,4188
1,1574373600000,2953
1,1574377200000,2183
1,1574380800000,93434
1,1574384400000,1518
1,1574388000000,1728
1,1574391600000,1172
1,1574395200000,1294
1,1574398800000,1349
1,1574402400000,1511
1,1574406000000,15734
1,1574409600000,11599
1,1574413200000,19245
1,1574416800000,23110
1,1574420400000,25242
1,1574424000000,21769
1,1574427600000,16940
1,1574431200000,80547
1,1574434800000,24103
1,1574438400000,30310
1,1574442000000,44428
1,1574445600000,36279
1,1574449200000,34770
1,1574452800000,35663
1,1574456400000,31474
1,1574460000000,9664
1,1574463600000,3716
1,1574467200000,2348
1,1574470800000,1636
1,1574474400000,1613
1,1574478000000,1327
1,1574481600000,1354
1,1574485200000,1334
1,1574488800000,1491
1,1574492400000,13684
1,1574496000000,10943
1,1574499600000,24686
1,1574503200000,40473
1,1574506800000,46655
1,1574510400000,47276
1,1574514000000,69352
1,1574517600000,87511
1,1574521200000,101438
1,1574524800000,96594
1,1574528400000,65406
1,1574532000000,41469
1,1574535600000,22487
1,1574539200000,15828
1,1574542800000,12421
1,1574546400000,5521
1,1574550000000,3225
1,1574553600000,2150
1,1574557200000,923
1,1574560800000,463
1,1574564400000,867
1,1574568000000,710
1,1574571600000,858
1,1574575200000,735
1,1574578800000,11506
1,1574582400000,6313
1,1574586000000,12077
1,1574589600000,14706
1,1574593200000,16174
1,1574596800000,15022
1,1574600400000,14346
1,1574604000000,19638
1,1574607600000,28578
1,1574611200000,35711
1,1574614800000,29783
1,1574618400000,22759
1,1574622000000,14772
1,1574625600000,6658
1,1574629200000,3963
1,1574632800000,1346
1,1574636400000,1198
1,1574640000000,819
1,1574643600000,642
1,1574647200000,566
1,1574650800000,525
1,1574654400000,564
1,1574658000000,696
1,1574661600000,13197
1,1574665200000,2677
1,1574668800000,4058
1,1574672400000,118202
1,1574676000000,15751
1,1574679600000,16019
1,1574683200000,15309
1,1574686800000,14579
1,1574690400000,14696
1,1574694000000,15878
1,1574697600000,17709
1,1574701200000,14976
1,1574704800000,16612
1,1574708400000,13965
1,1574712000000,7758
1,1574715600000,4535
1,1574719200000,1389
1,1574722800000,1139
1,1574726400000,705
1,1574730000000,504
1,1574733600000,533
1,1574737200000,615
1,1574740800000,615
1,1574744400000,649
1,1574748000000,1534
1,1574751600000,12205
1,1574755200000,3441
1,1574758800000,6848
1,1574762400000,9324
1,1574766000000,11401
1,1574769600000,12481
1,1574773200000,10429
1,1574776800000,10009
1,1574780400000,9968
1,1574784000000,10381
1,1574787600000,10539
1,1574791200000,7076
1,1574794800000,6988
1,1574798400000,3282
1,1574802000000,1151
1,1574805600000,539
