a => 26
action => 4
aggravation => 4
aint => 4
all => 4
along => 1
and => 21
around => 2
articulate => 2
at => 1
baby => 10
bark => 4
bite => 4
breeze => 1
can => 1
close => 5
coat => 2
come => 27
conversation => 4
dont => 4
drifting => 1
ease => 1
eyes => 1
fight => 4
gettin => 2
getting => 2
girl => 2
grab => 2
groovy => 1
heart => 4
how => 1
i => 1
im => 2
it => 1
its => 3
late => 2
less => 12
lets => 2
listen => 1
little => 24
me => 19
mind => 1
more => 12
mouth => 4
music => 1
night => 1
of => 2
on => 26
open => 4
please => 4
procrastinate => 2
put => 1
satisfactioning => 4
satisfy => 14
show => 1
spark => 4
start => 2
summer => 1
talking => 2
the => 1
this => 4
through => 1
tired => 2
to => 2
up => 4
upset => 2
use => 1
waitin => 2
walking => 2
with => 1
you => 1
your => 12
