EESchema Schematic File Version 2
LIBS:power
LIBS:device
LIBS:transistors
LIBS:conn
LIBS:linear
LIBS:regul
LIBS:74xx
LIBS:cmos4000
LIBS:adc-dac
LIBS:memory
LIBS:xilinx
LIBS:microcontrollers
LIBS:dsp
LIBS:microchip
LIBS:analog_switches
LIBS:motorola
LIBS:texas
LIBS:intel
LIBS:audio
LIBS:interface
LIBS:digital-audio
LIBS:philips
LIBS:display
LIBS:cypress
LIBS:siliconi
LIBS:opto
LIBS:atmel
LIBS:contrib
LIBS:valves
LIBS:chordata
LIBS:k_ceptor-cache
EELAYER 25 0
EELAYER END
$Descr A4 11693 8268
encoding utf-8
Sheet 1 1
Title "Chordata K-CEPTOR Schematic"
Date "2019-11-07"
Rev "2.3b"
Comp "Chordata"
Comment1 "Design by: Bruno Laurencich"
Comment2 "http://chordata.cc"
Comment3 ""
Comment4 ""
$EndDescr
$Comp
L LTC4316 U2
U 1 1 5974A90C
P 3900 3700
F 0 "U2" H 3650 3300 60  0000 C CNN
F 1 "LTC4316" H 3800 4100 60  0000 C CNN
F 2 "Housings_SSOP:MSOP-10_3x3mm_Pitch0.5mm" H 3900 3700 60  0001 C CNN
F 3 "" H 3900 3700 60  0001 C CNN
	1    3900 3700
	1    0    0    -1  
$EndComp
$Comp
L GND #PWR01
U 1 1 5974C342
P 5900 3550
F 0 "#PWR01" H 5900 3300 50  0001 C CNN
F 1 "GND" H 5900 3400 50  0000 C CNN
F 2 "" H 5900 3550 50  0001 C CNN
F 3 "" H 5900 3550 50  0001 C CNN
	1    5900 3550
	1    0    0    -1  
$EndComp
Text GLabel 6450 3150 2    55   Input ~ 0
GND
$Comp
L PWR_FLAG #FLG02
U 1 1 5974C50B
P 2650 2850
F 0 "#FLG02" H 2650 2925 50  0001 C CNN
F 1 "PWR_FLAG" H 2650 3000 50  0000 C CNN
F 2 "" H 2650 2850 50  0001 C CNN
F 3 "" H 2650 2850 50  0001 C CNN
	1    2650 2850
	1    0    0    -1  
$EndComp
$Comp
L PWR_FLAG #FLG03
U 1 1 5974C706
P 5900 2800
F 0 "#FLG03" H 5900 2875 50  0001 C CNN
F 1 "PWR_FLAG" H 5900 2950 50  0000 C CNN
F 2 "" H 5900 2800 50  0001 C CNN
F 3 "" H 5900 2800 50  0001 C CNN
	1    5900 2800
	1    0    0    -1  
$EndComp
$Comp
L VCC #PWR04
U 1 1 5974CBC4
P 2200 2850
F 0 "#PWR04" H 2200 2700 50  0001 C CNN
F 1 "VCC" H 2200 3000 50  0000 C CNN
F 2 "" H 2200 2850 50  0001 C CNN
F 3 "" H 2200 2850 50  0001 C CNN
	1    2200 2850
	1    0    0    -1  
$EndComp
Text GLabel 3100 3150 2    55   Input ~ 0
3.3v
$Comp
L C C1
U 1 1 5974FCFB
P 6500 4350
F 0 "C1" H 6525 4450 50  0000 L CNN
F 1 "100nF" H 6525 4250 50  0000 L CNN
F 2 "Capacitors_SMD:C_1206" H 6538 4200 50  0001 C CNN
F 3 "" H 6500 4350 50  0001 C CNN
	1    6500 4350
	1    0    0    -1  
$EndComp
$Comp
L C C5
U 1 1 5974FDE3
P 6850 4350
F 0 "C5" H 6875 4450 50  0000 L CNN
F 1 "10nF" H 6875 4250 50  0000 L CNN
F 2 "Capacitors_SMD:C_1206" H 6888 4200 50  0001 C CNN
F 3 "" H 6850 4350 50  0001 C CNN
	1    6850 4350
	1    0    0    -1  
$EndComp
$Comp
L GND #PWR05
U 1 1 5974FFE4
P 6850 4900
F 0 "#PWR05" H 6850 4650 50  0001 C CNN
F 1 "GND" H 6850 4750 50  0000 C CNN
F 2 "" H 6850 4900 50  0001 C CNN
F 3 "" H 6850 4900 50  0001 C CNN
	1    6850 4900
	1    0    0    -1  
$EndComp
$Comp
L GND #PWR06
U 1 1 59751AC9
P 9400 5200
F 0 "#PWR06" H 9400 4950 50  0001 C CNN
F 1 "GND" H 9400 5050 50  0000 C CNN
F 2 "" H 9400 5200 50  0001 C CNN
F 3 "" H 9400 5200 50  0001 C CNN
	1    9400 5200
	1    0    0    -1  
$EndComp
$Comp
L GND #PWR07
U 1 1 59751AFB
P 4750 4550
F 0 "#PWR07" H 4750 4300 50  0001 C CNN
F 1 "GND" H 4750 4400 50  0000 C CNN
F 2 "" H 4750 4550 50  0001 C CNN
F 3 "" H 4750 4550 50  0001 C CNN
	1    4750 4550
	1    0    0    -1  
$EndComp
Text GLabel 10350 1950 2    55   Input ~ 0
PULL_UP1
Text GLabel 7500 2700 0    55   Input ~ 0
SDA_T
Text GLabel 7500 2100 0    55   Input ~ 0
SCL_T
Text GLabel 4600 3700 2    55   Input ~ 0
SDA_T
Text GLabel 4600 3800 2    55   Input ~ 0
SCL_T
Text GLabel 8200 5900 2    55   Input ~ 0
SDA_T
Text GLabel 8200 6000 2    55   Input ~ 0
SCL_T
Text GLabel 8200 6100 2    55   Input ~ 0
PULL_UP1
$Comp
L R R1
U 1 1 5975514D
P 7850 5900
F 0 "R1" V 7900 6100 50  0000 C CNN
F 1 "R" V 7850 5900 50  0000 C CNN
F 2 "Resistors_SMD:R_0805" V 7780 5900 50  0001 C CNN
F 3 "" H 7850 5900 50  0001 C CNN
	1    7850 5900
	0    1    1    0   
$EndComp
$Comp
L R R2
U 1 1 597551DB
P 7500 6000
F 0 "R2" V 7550 6200 50  0000 C CNN
F 1 "R" V 7500 6000 50  0000 C CNN
F 2 "Resistors_SMD:R_0805" V 7430 6000 50  0001 C CNN
F 3 "" H 7500 6000 50  0001 C CNN
	1    7500 6000
	0    1    1    0   
$EndComp
$Comp
L R R3
U 1 1 59755213
P 7100 6100
F 0 "R3" V 7150 6300 50  0000 C CNN
F 1 "R" V 7100 6100 50  0000 C CNN
F 2 "Resistors_SMD:R_0805" V 7030 6100 50  0001 C CNN
F 3 "" H 7100 6100 50  0001 C CNN
	1    7100 6100
	0    1    1    0   
$EndComp
$Comp
L VCC #PWR08
U 1 1 59755CEF
P 6750 5750
F 0 "#PWR08" H 6750 5600 50  0001 C CNN
F 1 "VCC" H 6750 5900 50  0000 C CNN
F 2 "" H 6750 5750 50  0001 C CNN
F 3 "" H 6750 5750 50  0001 C CNN
	1    6750 5750
	1    0    0    -1  
$EndComp
$Comp
L C C4
U 1 1 59756655
P 7650 4350
F 0 "C4" H 7675 4450 50  0000 L CNN
F 1 "10uF" H 7675 4250 50  0000 L CNN
F 2 "Capacitors_SMD:C_1206" H 7688 4200 50  0001 C CNN
F 3 "" H 7650 4350 50  0001 C CNN
	1    7650 4350
	1    0    0    -1  
$EndComp
$Comp
L GND #PWR09
U 1 1 59756C6E
P 7650 4900
F 0 "#PWR09" H 7650 4650 50  0001 C CNN
F 1 "GND" H 7650 4750 50  0000 C CNN
F 2 "" H 7650 4900 50  0001 C CNN
F 3 "" H 7650 4900 50  0001 C CNN
	1    7650 4900
	1    0    0    -1  
$EndComp
$Comp
L VCC #PWR010
U 1 1 59756E3A
P 7250 3900
F 0 "#PWR010" H 7250 3750 50  0001 C CNN
F 1 "VCC" H 7250 4050 50  0000 C CNN
F 2 "" H 7250 3900 50  0001 C CNN
F 3 "" H 7250 3900 50  0001 C CNN
	1    7250 3900
	1    0    0    -1  
$EndComp
Text GLabel 2650 3700 0    55   Input ~ 0
SDA
Text GLabel 2650 3800 0    55   Input ~ 0
SCL
$Comp
L C C2
U 1 1 59758A0F
P 8150 4350
F 0 "C2" H 8175 4450 50  0000 L CNN
F 1 "100nF" H 8175 4250 50  0000 L CNN
F 2 "Capacitors_SMD:C_1206" H 8188 4200 50  0001 C CNN
F 3 "" H 8150 4350 50  0001 C CNN
	1    8150 4350
	1    0    0    -1  
$EndComp
$Comp
L GND #PWR011
U 1 1 59758C50
P 8150 4900
F 0 "#PWR011" H 8150 4650 50  0001 C CNN
F 1 "GND" H 8150 4750 50  0000 C CNN
F 2 "" H 8150 4900 50  0001 C CNN
F 3 "" H 8150 4900 50  0001 C CNN
	1    8150 4900
	1    0    0    -1  
$EndComp
$Comp
L LED D1
U 1 1 5975AFF3
P 5750 6100
F 0 "D1" H 5750 6200 50  0000 C CNN
F 1 "LED" H 5750 6000 50  0000 C CNN
F 2 "LEDs:LED_1206" H 5750 6100 50  0001 C CNN
F 3 "" H 5750 6100 50  0001 C CNN
	1    5750 6100
	0    -1   -1   0   
$EndComp
$Comp
L R R4
U 1 1 5975B5A7
P 5750 5550
F 0 "R4" V 5830 5550 50  0000 C CNN
F 1 "R" V 5750 5550 50  0000 C CNN
F 2 "Resistors_SMD:R_0805" V 5680 5550 50  0001 C CNN
F 3 "" H 5750 5550 50  0001 C CNN
	1    5750 5550
	1    0    0    -1  
$EndComp
$Comp
L GND #PWR012
U 1 1 5975B887
P 5750 6800
F 0 "#PWR012" H 5750 6550 50  0001 C CNN
F 1 "GND" H 5750 6650 50  0000 C CNN
F 2 "" H 5750 6800 50  0001 C CNN
F 3 "" H 5750 6800 50  0001 C CNN
	1    5750 6800
	1    0    0    -1  
$EndComp
$Comp
L VCC #PWR013
U 1 1 5975B937
P 5750 4900
F 0 "#PWR013" H 5750 4750 50  0001 C CNN
F 1 "VCC" H 5750 5050 50  0000 C CNN
F 2 "" H 5750 4900 50  0001 C CNN
F 3 "" H 5750 4900 50  0001 C CNN
	1    5750 4900
	1    0    0    -1  
$EndComp
Text GLabel 4600 3500 2    55   Input ~ 0
XORL
Text GLabel 4300 1950 0    55   Input ~ 0
XORL
Text GLabel 1950 1100 1    55   Input ~ 0
3.3v
Text GLabel 2350 1100 1    55   Input ~ 0
GND
$Comp
L Jumper_NO_Small JP1
U 1 1 5976571D
P 4300 2500
F 0 "JP1" H 4300 2580 50  0000 C CNN
F 1 "Jumper_SDA" H 4310 2440 50  0000 C CNN
F 2 "Chordata:jumper_open_THT_big" H 4300 2500 50  0001 C CNN
F 3 "" H 4300 2500 50  0001 C CNN
	1    4300 2500
	1    0    0    -1  
$EndComp
$Comp
L Jumper_NO_Small JP2
U 1 1 597657FD
P 4300 2800
F 0 "JP2" H 4300 2880 50  0000 C CNN
F 1 "Jumper_SCL" H 4310 2740 50  0000 C CNN
F 2 "Chordata:jumper_open_THT_big" H 4300 2800 50  0001 C CNN
F 3 "" H 4300 2800 50  0001 C CNN
	1    4300 2800
	1    0    0    -1  
$EndComp
Text GLabel 3900 2500 0    55   Input ~ 0
SDA
Text GLabel 4650 2500 2    55   Input ~ 0
SDA_T
Text GLabel 3900 2800 0    55   Input ~ 0
SCL
Text GLabel 4650 2800 2    55   Input ~ 0
SCL_T
NoConn ~ 3400 3950
$Comp
L Conn_01x06 J1
U 1 1 5B3F52AD
P 1600 5550
F 0 "J1" H 1600 5850 50  0000 C CNN
F 1 "IN" H 1600 5150 50  0000 C CNN
F 2 "Chordata:RJ12_6P_MOLEX" H 1600 5550 50  0001 C CNN
F 3 "" H 1600 5550 50  0001 C CNN
	1    1600 5550
	1    0    0    -1  
$EndComp
Text GLabel 1400 5650 0    55   Input ~ 0
IN_3.3v
Text GLabel 1400 5750 0    55   Input ~ 0
GND
Text GLabel 1400 5450 0    55   Input ~ 0
GND
Text GLabel 1400 5850 0    55   Input ~ 0
IN_SDA
Text GLabel 1400 5350 0    55   Input ~ 0
IN_SCL
Text GLabel 1400 5550 0    55   Input ~ 0
ENABLE
$Comp
L Conn_01x06 J2
U 1 1 5B3F5753
P 4700 5700
F 0 "J2" H 4700 6000 50  0000 C CNN
F 1 "OUT" H 4700 5300 50  0000 C CNN
F 2 "Chordata:RJ12_6P_MOLEX" H 4700 5700 50  0001 C CNN
F 3 "" H 4700 5700 50  0001 C CNN
	1    4700 5700
	-1   0    0    1   
$EndComp
Text GLabel 4900 5500 2    55   Input ~ 0
GND
Text GLabel 4900 5800 2    55   Input ~ 0
GND
Text GLabel 4900 5400 2    55   Input ~ 0
SDA
Text GLabel 4900 5900 2    55   Input ~ 0
SCL
Text GLabel 4900 5700 2    55   Input ~ 0
ENABLE
Text GLabel 1800 4400 0    55   Input ~ 0
ENABLE
$Comp
L C C3
U 1 1 5B3F6DCC
P 7250 4350
F 0 "C3" H 7275 4450 50  0000 L CNN
F 1 "100nF" H 7275 4250 50  0000 L CNN
F 2 "Capacitors_SMD:C_1206" H 7288 4200 50  0001 C CNN
F 3 "" H 7250 4350 50  0001 C CNN
	1    7250 4350
	1    0    0    -1  
$EndComp
Wire Wire Line
	5900 2800 5900 3550
Wire Wire Line
	5900 3150 6450 3150
Connection ~ 5900 3150
Wire Wire Line
	2200 3150 3100 3150
Connection ~ 2650 3150
Wire Wire Line
	2200 3150 2200 2850
Wire Wire Line
	8800 4500 8800 4600
Wire Wire Line
	8800 4600 9400 4600
Connection ~ 9400 4600
Wire Wire Line
	8900 4500 8900 4600
Connection ~ 8900 4600
Wire Wire Line
	9000 4500 9000 4600
Connection ~ 9000 4600
Wire Wire Line
	9100 4500 9100 4600
Connection ~ 9100 4600
Wire Wire Line
	9200 4500 9200 4600
Connection ~ 9200 4600
Wire Wire Line
	9300 4500 9300 4600
Connection ~ 9300 4600
Wire Wire Line
	7250 3900 8300 3900
Wire Wire Line
	6850 3650 8300 3650
Wire Wire Line
	6500 3550 8300 3550
Wire Wire Line
	9400 4500 9400 5200
Wire Wire Line
	4600 4000 4750 4000
Wire Wire Line
	4750 4000 4750 4550
Wire Wire Line
	2650 3400 3400 3400
Wire Wire Line
	2650 3500 3400 3500
Wire Wire Line
	8200 5900 8000 5900
Wire Wire Line
	7700 5900 6750 5900
Wire Wire Line
	6750 5750 6750 6100
Wire Wire Line
	8200 6000 7650 6000
Wire Wire Line
	6750 6000 7350 6000
Connection ~ 6750 5900
Wire Wire Line
	8200 6100 7250 6100
Wire Wire Line
	6750 6100 6950 6100
Connection ~ 6750 6000
Wire Wire Line
	7250 4500 7250 4750
Wire Wire Line
	7250 4750 7650 4750
Connection ~ 7650 4750
Wire Wire Line
	3400 3700 2650 3700
Wire Wire Line
	3400 3800 2650 3800
Wire Wire Line
	8150 4500 8150 4900
Wire Wire Line
	5750 5950 5750 5700
Wire Wire Line
	5750 5400 5750 4900
Wire Wire Line
	5750 6250 5750 6800
Wire Wire Line
	7650 4500 7650 4900
Wire Wire Line
	4650 2500 4400 2500
Wire Wire Line
	4200 2500 3900 2500
Wire Wire Line
	3900 2800 4200 2800
Wire Wire Line
	4400 2800 4650 2800
Wire Wire Line
	2650 2850 2650 3400
Wire Wire Line
	8150 4200 8150 4100
Wire Wire Line
	7650 3800 7650 4200
Connection ~ 7650 3900
Wire Wire Line
	8300 3800 7650 3800
Wire Wire Line
	7250 3900 7250 4200
Wire Wire Line
	8150 4100 8300 4100
Wire Wire Line
	8300 4200 8150 4200
Wire Wire Line
	6850 3650 6850 4200
Wire Wire Line
	6500 3550 6500 4200
$Comp
L VCC #PWR014
U 1 1 5B3F8B55
P 8150 4100
F 0 "#PWR014" H 8150 3950 50  0001 C CNN
F 1 "VCC" V 8200 4150 50  0000 C CNN
F 2 "" H 8150 4100 50  0001 C CNN
F 3 "" H 8150 4100 50  0001 C CNN
	1    8150 4100
	0    -1   -1   0   
$EndComp
Wire Wire Line
	6850 4500 6850 4900
Wire Wire Line
	6500 4500 6500 4750
Wire Wire Line
	6500 4750 6850 4750
Connection ~ 6850 4750
$Comp
L 24LC02 U3
U 1 1 5B3FA71B
P 5900 1450
F 0 "U3" H 5650 1700 50  0000 C CNN
F 1 "M24C02" H 5950 1700 50  0000 L CNN
F 2 "Housings_SOIC:SOIC-8_3.9x4.9mm_Pitch1.27mm" H 5950 1200 50  0001 L CNN
F 3 "" H 5900 1350 50  0001 C CNN
	1    5900 1450
	1    0    0    -1  
$EndComp
Text GLabel 6300 1450 2    55   Input ~ 0
SCL_T
Text GLabel 6300 1350 2    55   Input ~ 0
SDA_T
Wire Wire Line
	6300 1550 6450 1550
Wire Wire Line
	6450 1550 6450 1950
Wire Wire Line
	6450 1950 5350 1950
Wire Wire Line
	5900 1750 5900 2200
Connection ~ 5900 1950
$Comp
L GND #PWR015
U 1 1 5B3FAA30
P 5900 2200
F 0 "#PWR015" H 5900 1950 50  0001 C CNN
F 1 "GND" H 5900 2050 50  0000 C CNN
F 2 "" H 5900 2200 50  0001 C CNN
F 3 "" H 5900 2200 50  0001 C CNN
	1    5900 2200
	1    0    0    -1  
$EndComp
Wire Wire Line
	5500 1450 5350 1450
Wire Wire Line
	5350 1450 5350 1950
Wire Wire Line
	5500 1550 5350 1550
Connection ~ 5350 1550
Wire Wire Line
	5900 900  5900 1150
Wire Wire Line
	5500 1350 5350 1350
Wire Wire Line
	5350 1350 5350 1050
Wire Wire Line
	5350 1050 5900 1050
Connection ~ 5900 1050
$Comp
L VCC #PWR016
U 1 1 5B3FAC5E
P 5900 900
F 0 "#PWR016" H 5900 750 50  0001 C CNN
F 1 "VCC" H 5900 1050 50  0000 C CNN
F 2 "" H 5900 900 50  0001 C CNN
F 3 "" H 5900 900 50  0001 C CNN
	1    5900 900 
	1    0    0    -1  
$EndComp
$Comp
L GND #PWR017
U 1 1 5C2E1F45
P 5200 4550
F 0 "#PWR017" H 5200 4300 50  0001 C CNN
F 1 "GND" H 5200 4400 50  0000 C CNN
F 2 "" H 5200 4550 50  0001 C CNN
F 3 "" H 5200 4550 50  0001 C CNN
	1    5200 4550
	1    0    0    -1  
$EndComp
Wire Wire Line
	5200 4550 5200 3400
$Comp
L R R5
U 1 1 5C2E2AEF
P 1950 1400
F 0 "R5" V 2030 1400 50  0000 C CNN
F 1 "RLT 976K" V 1850 1400 50  0000 C CNN
F 2 "Resistors_SMD:R_0805" V 1880 1400 50  0001 C CNN
F 3 "" H 1950 1400 50  0001 C CNN
	1    1950 1400
	1    0    0    -1  
$EndComp
$Comp
L R R6
U 1 1 5C2E2FC5
P 2350 1400
F 0 "R6" V 2430 1400 50  0000 C CNN
F 1 "RLB 102K" V 2250 1400 50  0000 C CNN
F 2 "Resistors_SMD:R_0805" V 2280 1400 50  0001 C CNN
F 3 "" H 2350 1400 50  0001 C CNN
	1    2350 1400
	1    0    0    -1  
$EndComp
Wire Wire Line
	1950 1100 1950 1250
Wire Wire Line
	1950 1550 1950 1650
Wire Wire Line
	1950 1650 2350 1650
Wire Wire Line
	2350 1650 2350 1550
Wire Wire Line
	2350 1250 2350 1100
Wire Wire Line
	4300 1950 4650 1950
Wire Wire Line
	2150 1850 2150 1650
Connection ~ 2150 1650
Wire Wire Line
	5200 3400 4600 3400
$Comp
L Conn_01x06 J4
U 1 1 5D94B71C
P 10550 5050
F 0 "J4" H 10550 5350 50  0000 C CNN
F 1 "SPI" H 10550 4650 50  0000 C CNN
F 2 "Pin_Headers:Pin_Header_Straight_1x06_Pitch2.54mm" H 10550 5050 50  0001 C CNN
F 3 "" H 10550 5050 50  0001 C CNN
	1    10550 5050
	1    0    0    -1  
$EndComp
$Comp
L Conn_01x05 J3
U 1 1 5D94B97B
P 10550 3850
F 0 "J3" H 10550 4150 50  0000 C CNN
F 1 "Sigs" H 10550 3550 50  0000 C CNN
F 2 "Pin_Headers:Pin_Header_Straight_1x05_Pitch2.54mm" H 10550 3850 50  0001 C CNN
F 3 "" H 10550 3850 50  0001 C CNN
	1    10550 3850
	1    0    0    -1  
$EndComp
$Comp
L LSM9DS1 U1
U 1 1 5974B175
P 9200 3900
F 0 "U1" V 9750 4650 60  0000 C CNN
F 1 "LSM9DS1" V 9750 3500 60  0000 C CNN
F 2 "Chordata:LGA-24L_3x3.5mm_Pitch0.43mm_external_pads_0.5mm" H 9200 3900 60  0001 C CNN
F 3 "" H 9200 3900 60  0001 C CNN
	1    9200 3900
	0    -1   -1   0   
$EndComp
Wire Wire Line
	9950 3600 10350 3600
Wire Wire Line
	10350 3600 10350 3650
Wire Wire Line
	9950 3750 10350 3750
Wire Wire Line
	9950 3900 10200 3900
Wire Wire Line
	10200 3900 10200 3850
Wire Wire Line
	10200 3850 10350 3850
Wire Wire Line
	7800 2100 7500 2100
Wire Wire Line
	8700 2850 8700 3250
Wire Wire Line
	8700 2850 8100 2850
Wire Wire Line
	8100 2850 8100 2800
Wire Wire Line
	7850 2700 7500 2700
Text GLabel 8350 2700 2    60   Input ~ 0
SDI_H
Text GLabel 8300 2100 2    60   Input ~ 0
SPC_H
Wire Wire Line
	9000 3250 9000 2300
Wire Wire Line
	9200 3250 9200 2800
Wire Wire Line
	9200 2800 10100 2800
Wire Wire Line
	9500 2050 9500 1950
Wire Wire Line
	10200 2550 10200 1950
Connection ~ 10200 1950
Wire Wire Line
	8050 2200 8050 2400
Wire Wire Line
	8050 2400 8800 2400
Wire Wire Line
	8800 2400 8800 3250
Wire Wire Line
	9500 1950 10350 1950
Wire Wire Line
	9000 2300 9400 2300
Text GLabel 9100 3250 1    60   Input ~ 0
CS_AG
Text GLabel 9300 3250 1    60   Input ~ 0
CS_M
Text GLabel 9500 2700 2    60   Input ~ 0
SDO_AG_H
Text GLabel 10200 3200 2    60   Input ~ 0
SDA_O_H
Wire Wire Line
	10200 3050 10200 3200
Wire Wire Line
	9500 2550 9500 2700
Text GLabel 8300 1050 0    55   Input ~ 0
PULL_UP1
Wire Wire Line
	8400 1400 8300 1400
Wire Wire Line
	8900 1050 8300 1050
Connection ~ 8300 1050
Wire Wire Line
	8300 1050 8300 1400
Text GLabel 9550 1400 2    60   Input ~ 0
CS_AG_H
Text GLabel 9550 1050 2    60   Input ~ 0
CS_M_H
Wire Wire Line
	9400 1050 9550 1050
Wire Wire Line
	8900 1400 9550 1400
Text GLabel 9150 1550 3    60   Input ~ 0
CS_M
Text GLabel 8300 1700 0    60   Input ~ 0
CS_AG
Wire Wire Line
	8300 1700 8650 1700
Wire Wire Line
	8650 1700 8650 1500
Wire Wire Line
	9150 1550 9150 1150
$Comp
L Jumper_NC/NO JP4
U 1 1 5D94ADFB
P 9150 1050
F 0 "JP4" H 9200 950 50  0000 L CNN
F 1 "Jumper_NC/NO" H 9150 1150 50  0000 C BNN
F 2 "Chordata:jumper_open_close" H 9150 1050 50  0001 C CNN
F 3 "" H 9150 1050 50  0001 C CNN
	1    9150 1050
	1    0    0    -1  
$EndComp
$Comp
L Jumper_NC/NO JP3
U 1 1 5D94AEB6
P 8650 1400
F 0 "JP3" H 8700 1300 50  0000 L CNN
F 1 "Jumper_NC/NO" H 8650 1500 50  0000 C BNN
F 2 "Chordata:jumper_open_close" H 8650 1400 50  0001 C CNN
F 3 "" H 8650 1400 50  0001 C CNN
	1    8650 1400
	1    0    0    -1  
$EndComp
$Comp
L Jumper_NC/NO JP5
U 1 1 5D94B614
P 8050 2100
F 0 "JP5" H 8100 2000 50  0000 L CNN
F 1 "Jumper_NC/NO" H 8050 2200 50  0000 C BNN
F 2 "Chordata:jumper_open_close" H 8050 2100 50  0001 C CNN
F 3 "" H 8050 2100 50  0001 C CNN
	1    8050 2100
	1    0    0    -1  
$EndComp
$Comp
L Jumper_NC/NO JP6
U 1 1 5D94B982
P 8100 2700
F 0 "JP6" H 8150 2600 50  0000 L CNN
F 1 "Jumper_NC/NO" H 8100 2800 50  0000 C BNN
F 2 "Chordata:jumper_open_close" H 8100 2700 50  0001 C CNN
F 3 "" H 8100 2700 50  0001 C CNN
	1    8100 2700
	1    0    0    -1  
$EndComp
$Comp
L Jumper_NC/NO JP7
U 1 1 5D94C18A
P 9500 2300
F 0 "JP7" H 9550 2200 50  0000 L CNN
F 1 "Jumper_NC/NO" H 9500 2400 50  0000 C BNN
F 2 "Chordata:jumper_open_close" H 9500 2300 50  0001 C CNN
F 3 "" H 9500 2300 50  0001 C CNN
	1    9500 2300
	0    1    1    0   
$EndComp
$Comp
L Jumper_NC/NO JP8
U 1 1 5D94C460
P 10200 2800
F 0 "JP8" H 10250 2700 50  0000 L CNN
F 1 "Jumper_NC/NO" H 10200 2900 50  0000 C BNN
F 2 "Chordata:jumper_open_close" H 10200 2800 50  0001 C CNN
F 3 "" H 10200 2800 50  0001 C CNN
	1    10200 2800
	0    1    1    0   
$EndComp
Text GLabel 10350 4850 0    60   Input ~ 0
SPC_H
Text GLabel 10350 4950 0    60   Input ~ 0
SDI_H
Text GLabel 10350 5050 0    60   Input ~ 0
CS_AG_H
Text GLabel 10350 5150 0    60   Input ~ 0
CS_M_H
Text GLabel 10350 5250 0    60   Input ~ 0
SDO_AG_H
Text GLabel 10350 5350 0    60   Input ~ 0
SDA_O_H
Text GLabel 2800 1100 1    55   Input ~ 0
3.3v
Text GLabel 3200 1100 1    55   Input ~ 0
GND
$Comp
L R R7
U 1 1 5D95AE6B
P 2800 1400
F 0 "R7" V 2880 1400 50  0000 C CNN
F 1 "RLT 976K" V 2700 1400 50  0000 C CNN
F 2 "Resistors_SMD:R_0805" V 2730 1400 50  0001 C CNN
F 3 "" H 2800 1400 50  0001 C CNN
	1    2800 1400
	1    0    0    -1  
$EndComp
$Comp
L R R8
U 1 1 5D95AE71
P 3200 1400
F 0 "R8" V 3280 1400 50  0000 C CNN
F 1 "RLB 182K" V 3100 1400 50  0000 C CNN
F 2 "Resistors_SMD:R_0805" V 3130 1400 50  0001 C CNN
F 3 "" H 3200 1400 50  0001 C CNN
	1    3200 1400
	1    0    0    -1  
$EndComp
Wire Wire Line
	2800 1100 2800 1250
Wire Wire Line
	2800 1550 2800 1650
Wire Wire Line
	2800 1650 3200 1650
Wire Wire Line
	3200 1650 3200 1550
Wire Wire Line
	3200 1250 3200 1100
Wire Wire Line
	3000 1850 3000 1650
Connection ~ 3000 1650
Text GLabel 1450 1100 1    55   Input ~ 0
GND
Wire Wire Line
	1250 1850 1250 1650
Wire Wire Line
	1250 1650 1450 1650
Wire Wire Line
	1450 1650 1450 1100
Text GLabel 1250 1850 3    60   Input ~ 0
ID_0
Text GLabel 2150 1850 3    60   Input ~ 0
ID_1
Text GLabel 3000 1850 3    60   Input ~ 0
ID_2
Wire Wire Line
	4500 1350 4650 1350
Wire Wire Line
	4650 1350 4650 1950
Wire Wire Line
	4500 1450 4650 1450
Connection ~ 4650 1450
Wire Wire Line
	4500 1550 4650 1550
Connection ~ 4650 1550
Text GLabel 4000 1350 0    60   Input ~ 0
ID_0
Text GLabel 4000 1450 0    60   Input ~ 0
ID_1
Text GLabel 4000 1550 0    60   Input ~ 0
ID_2
$Comp
L Conn_02x03_Odd_Even J5
U 1 1 5D961056
P 4200 1450
F 0 "J5" H 4250 1650 50  0000 C CNN
F 1 "ID_Switch" H 4250 1250 50  0000 C CNN
F 2 "Pin_Headers:Pin_Header_Straight_2x03_Pitch2.54mm_SMD" H 4200 1450 50  0001 C CNN
F 3 "" H 4200 1450 50  0001 C CNN
	1    4200 1450
	1    0    0    -1  
$EndComp
Wire Wire Line
	9950 4050 10350 4050
Wire Wire Line
	9950 4200 10300 4200
Wire Wire Line
	10300 4200 10300 3950
Wire Wire Line
	10300 3950 10350 3950
$Comp
L Jumper_NC/NO JP9
U 1 1 5D970535
P 2050 4400
F 0 "JP9" H 2100 4300 50  0000 L CNN
F 1 "Jumper_NC/NO" H 2050 4500 50  0000 C BNN
F 2 "Chordata:jumper_open_close" H 2050 4400 50  0001 C CNN
F 3 "" H 2050 4400 50  0001 C CNN
	1    2050 4400
	1    0    0    -1  
$EndComp
Text GLabel 1850 4750 0    60   Input ~ 0
SEL_ENABLE
Text GLabel 2650 3500 0    60   Input ~ 0
SEL_ENABLE
$Comp
L GND #PWR018
U 1 1 5D9729E8
P 2650 4600
F 0 "#PWR018" H 2650 4350 50  0001 C CNN
F 1 "GND" H 2650 4450 50  0000 C CNN
F 2 "" H 2650 4600 50  0001 C CNN
F 3 "" H 2650 4600 50  0001 C CNN
	1    2650 4600
	1    0    0    -1  
$EndComp
Wire Wire Line
	2300 4400 2650 4400
Wire Wire Line
	2650 4400 2650 4600
Wire Wire Line
	2050 4500 2050 4750
Wire Wire Line
	2050 4750 1850 4750
Text GLabel 1200 2800 1    55   Input ~ 0
3.3v
Text GLabel 1600 2800 1    55   Input ~ 0
GND
$Comp
L R R9
U 1 1 5D9789E4
P 1200 3100
F 0 "R9" V 1280 3100 50  0000 C CNN
F 1 "RLT CUSTOM" V 1100 3100 50  0000 C CNN
F 2 "Resistors_SMD:R_1206_HandSoldering" V 1130 3100 50  0001 C CNN
F 3 "" H 1200 3100 50  0001 C CNN
	1    1200 3100
	1    0    0    -1  
$EndComp
$Comp
L R R10
U 1 1 5D9789EA
P 1600 3100
F 0 "R10" V 1680 3100 50  0000 C CNN
F 1 "RLB CUSTOM" V 1500 3100 50  0000 C CNN
F 2 "Resistors_SMD:R_1206_HandSoldering" V 1530 3100 50  0001 C CNN
F 3 "" H 1600 3100 50  0001 C CNN
	1    1600 3100
	1    0    0    -1  
$EndComp
Wire Wire Line
	1200 2800 1200 2950
Wire Wire Line
	1200 3250 1200 3350
Wire Wire Line
	1200 3350 1600 3350
Wire Wire Line
	1600 3350 1600 3250
Wire Wire Line
	1600 2950 1600 2800
Wire Wire Line
	1400 3350 1400 3750
Connection ~ 1400 3350
Text GLabel 1300 3750 0    55   Input ~ 0
XORL
Wire Wire Line
	1400 3750 1300 3750
Text GLabel 2600 5700 0    55   Input ~ 0
3.3v
Text GLabel 2600 5500 0    55   Input ~ 0
IN_3.3v
Text GLabel 4900 5600 2    55   Input ~ 0
OUT_3.3v
Text GLabel 3500 5500 2    55   Input ~ 0
OUT_3.3v
Text GLabel 2150 6400 0    55   Input ~ 0
3.3v
$Comp
L TCA9509 U4
U 1 1 5DC32DEE
P 2650 6650
F 0 "U4" H 2741 6222 60  0000 C CNN
F 1 "TCA9517" H 2612 7062 60  0000 C CNN
F 2 "Housings_SSOP:VSSOP-8_3.0x3.0mm_Pitch0.65mm" H 2597 6456 60  0001 C CNN
F 3 "" H 2597 6456 60  0001 C CNN
	1    2650 6650
	1    0    0    -1  
$EndComp
Text GLabel 4150 6400 2    55   Input ~ 0
3.3v
Text GLabel 2150 6650 0    55   Input ~ 0
IN_SCL
Text GLabel 2150 6550 0    55   Input ~ 0
IN_SDA
Text GLabel 2150 6850 0    55   Input ~ 0
3.3v
$Comp
L R R11
U 1 1 5DC36108
P 3700 6550
F 0 "R11" V 3750 6750 50  0000 C CNN
F 1 "R" V 3700 6550 50  0000 C CNN
F 2 "Resistors_SMD:R_0805" V 3630 6550 50  0001 C CNN
F 3 "" H 3700 6550 50  0001 C CNN
	1    3700 6550
	0    1    1    0   
$EndComp
$Comp
L R R12
U 1 1 5DC361B8
P 3700 6650
F 0 "R12" V 3750 6850 50  0000 C CNN
F 1 "R" V 3700 6650 50  0000 C CNN
F 2 "Resistors_SMD:R_0805" V 3630 6650 50  0001 C CNN
F 3 "" H 3700 6650 50  0001 C CNN
	1    3700 6650
	0    1    1    0   
$EndComp
$Comp
L GND #PWR019
U 1 1 5DC36285
P 3100 7050
F 0 "#PWR019" H 3100 6800 50  0001 C CNN
F 1 "GND" H 3100 6900 50  0000 C CNN
F 2 "" H 3100 7050 50  0001 C CNN
F 3 "" H 3100 7050 50  0001 C CNN
	1    3100 7050
	1    0    0    -1  
$EndComp
Wire Wire Line
	4150 6400 3100 6400
Wire Wire Line
	3850 6550 4050 6550
Wire Wire Line
	4050 6400 4050 6650
Connection ~ 4050 6400
Wire Wire Line
	4050 6650 3850 6650
Connection ~ 4050 6550
Wire Wire Line
	3550 6550 3100 6550
Wire Wire Line
	3550 6650 3100 6650
Wire Wire Line
	3100 6850 3100 7050
Text GLabel 4100 6900 2    55   Input ~ 0
SDA
Text GLabel 4100 7050 2    55   Input ~ 0
SCL
Wire Wire Line
	3400 6550 3400 6900
Wire Wire Line
	3400 6900 4100 6900
Connection ~ 3400 6550
Wire Wire Line
	3300 6650 3300 7050
Wire Wire Line
	3300 7050 4100 7050
Connection ~ 3300 6650
Wire Wire Line
	2600 5500 3500 5500
Wire Wire Line
	2600 5700 3050 5700
Wire Wire Line
	3050 5700 3050 5500
Connection ~ 3050 5500
$EndSCHEMATC
