{
  "formatVersion": 1,
  "database": {
    "version": 1,
    "identityHash": "af4ade25251908e33320af1403c914fe",
    "entities": [
      {
        "tableName": "cars",
        "createSql": "CREATE TABLE IF NOT EXISTS `${TABLE_NAME}` (`carId` INTEGER PRIMARY KEY AUTOINCREMENT NOT NULL, `name` TEXT NOT NULL, `image` TEXT NOT NULL, `price` INTEGER NOT NULL, `category` TEXT NOT NULL)",
        "fields": [
          {
            "fieldPath": "carId",
            "columnName": "carId",
            "affinity": "INTEGER",
            "notNull": true
          },
          {
            "fieldPath": "name",
            "columnName": "name",
            "affinity": "TEXT",
            "notNull": true
          },
          {
            "fieldPath": "image",
            "columnName": "image",
            "affinity": "TEXT",
            "notNull": true
          },
          {
            "fieldPath": "price",
            "columnName": "price",
            "affinity": "INTEGER",
            "notNull": true
          },
          {
            "fieldPath": "category",
            "columnName": "category",
            "affinity": "TEXT",
            "notNull": true
          }
        ],
        "primaryKey": {
          "columnNames": [
            "carId"
          ],
          "autoGenerate": true
        },
        "indices": [],
        "foreignKeys": []
      }
    ],
    "views": [],
    "setupQueries": [
      "CREATE TABLE IF NOT EXISTS room_master_table (id INTEGER PRIMARY KEY,identity_hash TEXT)",
      "INSERT OR REPLACE INTO room_master_table (id,identity_hash) VALUES(42, 'af4ade25251908e33320af1403c914fe')"
    ]
  }
}