^C:\USERS\D!V4R\DESKTOP\EX_6 PRIME\EX_6 PRIME\SOURCE.CPP
/c /ZI /nologo /W3 /WX- /Od /Oy- /D WIN32 /D _DEBUG /D _CONSOLE /D _UNICODE /D UNICODE /Gm /EHsc /RTC1 /MDd /GS /fp:precise /Zc:wchar_t /Zc:forScope /Zc:inline /Fo"DEBUG\\" /Fd"DEBUG\VC140.PDB" /Gd /TP /analyze- C:\USERS\D!V4R\DESKTOP\EX_6 PRIME\EX_6 PRIME\SOURCE.CPP
^C:\USERS\D!V4R\DESKTOP\PROGRAMMING\HOMEWORK\EXAM 1\EX_6 PRIME\EX_6 PRIME\SOURCE.CPP
/c /ZI /nologo /W3 /WX- /Od /Oy- /D WIN32 /D _DEBUG /D _CONSOLE /D _UNICODE /D UNICODE /Gm /EHsc /RTC1 /MDd /GS /fp:precise /Zc:wchar_t /Zc:forScope /Zc:inline /Fo"DEBUG\\" /Fd"DEBUG\VC140.PDB" /Gd /TP /analyze- C:\USERS\D!V4R\DESKTOP\PROGRAMMING\HOMEWORK\EXAM 1\EX_6 PRIME\EX_6 PRIME\SOURCE.CPP
^C:\USERS\D!V4R\DESKTOP\PROGRAMMING\CODES\3 EXAM1\EX_6 PRIME\EX_6 PRIME\SOURCE.CPP
/c /ZI /nologo /W3 /WX- /Od /Oy- /D WIN32 /D _DEBUG /D _CONSOLE /D _UNICODE /D UNICODE /Gm /EHsc /RTC1 /MDd /GS /fp:precise /Zc:wchar_t /Zc:forScope /Zc:inline /Fo"DEBUG\\" /Fd"DEBUG\VC140.PDB" /Gd /TP /analyze- C:\USERS\D!V4R\DESKTOP\PROGRAMMING\CODES\3 EXAM1\EX_6 PRIME\EX_6 PRIME\SOURCE.CPP
