^C:\USERS\D!V4R\DOCUMENTS\VISUAL STUDIO 2015\PROJECTS\HW2_3\HW2_3\SOURCE.CPP
/c /ZI /nologo /W3 /WX- /sdl /Od /Oy- /D WIN32 /D _DEBUG /D _CONSOLE /D _UNICODE /D UNICODE /Gm /EHsc /RTC1 /MDd /GS /fp:precise /Zc:wchar_t /Zc:forScope /Zc:inline /Fo"DEBUG\\" /Fd"DEBUG\VC140.PDB" /Gd /TP /analyze- C:\USERS\D!V4R\DOCUMENTS\VISUAL STUDIO 2015\PROJECTS\HW2_3\HW2_3\SOURCE.CPP
^C:\USERS\D!V4R\DESKTOP\PROGRAMMING\CODES\4 HW2\HW2_EX3\HW2_3\SOURCE.CPP
/c /ZI /nologo /W3 /WX- /sdl /Od /Oy- /D WIN32 /D _DEBUG /D _CONSOLE /D _UNICODE /D UNICODE /Gm /EHsc /RTC1 /MDd /GS /fp:precise /Zc:wchar_t /Zc:forScope /Zc:inline /Fo"DEBUG\\" /Fd"DEBUG\VC140.PDB" /Gd /TP /analyze- C:\USERS\D!V4R\DESKTOP\PROGRAMMING\CODES\4 HW2\HW2_EX3\HW2_3\SOURCE.CPP
