^C:\USERS\D!V4R\DESKTOP\PROGRAMMING\CODES\HW\HW3\HW3_EX5\HW3_EX5\DEBUG\HW3_EX5.OBJ
C:\USERS\D!V4R\DESKTOP\PROGRAMMING\CODES\HW\HW3\HW3_EX5\DEBUG\HW3_EX5.ILK
C:\USERS\D!V4R\DESKTOP\PROGRAMMING\CODES\HW\HW3\HW3_EX5\DEBUG\HW3_EX5.EXE
C:\USERS\D!V4R\DESKTOP\PROGRAMMING\CODES\HW\HW3\HW3_EX5\DEBUG\HW3_EX5.PDB
