^C:\USERS\D!V4R\DESKTOP\QUESTION-3\QUESTION-3\SOURCE.CPP
C:\USERS\D!V4R\DESKTOP\QUESTION-3\QUESTION-3\DEBUG\VC140.PDB
C:\USERS\D!V4R\DESKTOP\QUESTION-3\QUESTION-3\DEBUG\VC140.IDB
C:\USERS\D!V4R\DESKTOP\QUESTION-3\QUESTION-3\DEBUG\SOURCE.OBJ
