^C:\USERS\D!V4R\DESKTOP\PROGRAMMING\CODES\HW\HW3\HW3_EX1\HW3_EX1\DEBUG\HW3_EX1.OBJ
C:\USERS\D!V4R\DESKTOP\PROGRAMMING\CODES\HW\HW3\HW3_EX1\DEBUG\HW3_EX1.ILK
C:\USERS\D!V4R\DESKTOP\PROGRAMMING\CODES\HW\HW3\HW3_EX1\DEBUG\HW3_EX1.EXE
C:\USERS\D!V4R\DESKTOP\PROGRAMMING\CODES\HW\HW3\HW3_EX1\DEBUG\HW3_EX1.PDB
