^C:\USERS\D!V4R\DOCUMENTS\VISUAL STUDIO 2015\PROJECTS\HW1_EX1\HW1_EX1\DEBUG\SOURCE.OBJ
C:\USERS\D!V4R\DOCUMENTS\VISUAL STUDIO 2015\PROJECTS\HW1_EX1\DEBUG\HW1_EX1.ILK
C:\USERS\D!V4R\DOCUMENTS\VISUAL STUDIO 2015\PROJECTS\HW1_EX1\DEBUG\HW1_EX1.EXE
C:\USERS\D!V4R\DOCUMENTS\VISUAL STUDIO 2015\PROJECTS\HW1_EX1\DEBUG\HW1_EX1.PDB
^C:\USERS\D!V4R\DESKTOP\PROGRAMMING\HOMEWORK\HM1\SAMPLE-9423115\1\HW1_EX1\HW1_EX1\DEBUG\SOURCE.OBJ
C:\USERS\D!V4R\DESKTOP\PROGRAMMING\HOMEWORK\HM1\SAMPLE-9423115\1\HW1_EX1\DEBUG\HW1_EX1.ILK
C:\USERS\D!V4R\DESKTOP\PROGRAMMING\HOMEWORK\HM1\SAMPLE-9423115\1\HW1_EX1\DEBUG\HW1_EX1.EXE
C:\USERS\D!V4R\DESKTOP\PROGRAMMING\HOMEWORK\HM1\SAMPLE-9423115\1\HW1_EX1\DEBUG\HW1_EX1.PDB
