^C:\USERS\D!V4R\DESKTOP\PROGRAMMING\CODES\HW\HW3\HW3_EX3\HW3_EX3\DEBUG\HW3_EX3.OBJ
C:\USERS\D!V4R\DESKTOP\PROGRAMMING\CODES\HW\HW3\HW3_EX3\DEBUG\HW3_EX3.ILK
C:\USERS\D!V4R\DESKTOP\PROGRAMMING\CODES\HW\HW3\HW3_EX3\DEBUG\HW3_EX3.EXE
C:\USERS\D!V4R\DESKTOP\PROGRAMMING\CODES\HW\HW3\HW3_EX3\DEBUG\HW3_EX3.PDB
