^C:\USERS\D!V4R\DESKTOP\PROGRAMMING\CODES\HW\HW4\HWEXPRIME\HWEXPRIME\SOURCE.CPP
C:\USERS\D!V4R\DESKTOP\PROGRAMMING\CODES\HW\HW4\HWEXPRIME\HWEXPRIME\DEBUG\VC140.PDB
C:\USERS\D!V4R\DESKTOP\PROGRAMMING\CODES\HW\HW4\HWEXPRIME\HWEXPRIME\DEBUG\VC140.IDB
C:\USERS\D!V4R\DESKTOP\PROGRAMMING\CODES\HW\HW4\HWEXPRIME\HWEXPRIME\DEBUG\SOURCE.OBJ
