^C:\USERS\D!V4R\DESKTOP\PROGRAMMING\CODES\HW\HW4\QUIZ_Q2\QUIZ_Q2\MAIN.CPP
C:\USERS\D!V4R\DESKTOP\PROGRAMMING\CODES\HW\HW4\QUIZ_Q2\QUIZ_Q2\DEBUG\VC140.PDB
C:\USERS\D!V4R\DESKTOP\PROGRAMMING\CODES\HW\HW4\QUIZ_Q2\QUIZ_Q2\DEBUG\VC140.IDB
C:\USERS\D!V4R\DESKTOP\PROGRAMMING\CODES\HW\HW4\QUIZ_Q2\QUIZ_Q2\DEBUG\MAIN.OBJ
