^C:\USERS\D!V4R\DESKTOP\QUESTION-2\QUESTION-2\DEBUG\SOURCE.OBJ
C:\USERS\D!V4R\DESKTOP\QUESTION-2\DEBUG\QUESTION-2.ILK
C:\USERS\D!V4R\DESKTOP\QUESTION-2\DEBUG\QUESTION-2.EXE
C:\USERS\D!V4R\DESKTOP\QUESTION-2\DEBUG\QUESTION-2.PDB
