﻿Build started 2015-10-17 9:54:07 PM.
     1>Project "C:\Users\D!V4R\Desktop\Programming\Codes\5 Exam2\Ex9\Ex9\Ex9.vcxproj" on node 2 (Build target(s)).
     1>ClCompile:
         C:\Program Files (x86)\Microsoft Visual Studio 14.0\VC\bin\CL.exe /c /ZI /nologo /W3 /WX- /sdl /Od /Oy- /D WIN32 /D _DEBUG /D _CONSOLE /D _UNICODE /D UNICODE /Gm /EHsc /RTC1 /MDd /GS /fp:precise /Zc:wchar_t /Zc:forScope /Zc:inline /Fo"Debug\\" /Fd"Debug\vc140.pdb" /Gd /TP /analyze- /errorReport:prompt Source.cpp
         Source.cpp
       Link:
         C:\Program Files (x86)\Microsoft Visual Studio 14.0\VC\bin\link.exe /ERRORREPORT:PROMPT /OUT:"C:\Users\D!V4R\Desktop\Programming\Codes\5 Exam2\Ex9\Debug\Ex9.exe" /INCREMENTAL /NOLOGO kernel32.lib user32.lib gdi32.lib winspool.lib comdlg32.lib advapi32.lib shell32.lib ole32.lib oleaut32.lib uuid.lib odbc32.lib odbccp32.lib /MANIFEST /MANIFESTUAC:"level='asInvoker' uiAccess='false'" /manifest:embed /Debug /PDB:"C:\Users\D!V4R\Desktop\Programming\Codes\5 Exam2\Ex9\Debug\Ex9.pdb" /SUBSYSTEM:CONSOLE /TLBID:1 /DYNAMICBASE /NXCOMPAT /IMPLIB:"C:\Users\D!V4R\Desktop\Programming\Codes\5 Exam2\Ex9\Debug\Ex9.lib" /MACHINE:X86 Debug\Source.obj
         Ex9.vcxproj -> C:\Users\D!V4R\Desktop\Programming\Codes\5 Exam2\Ex9\Debug\Ex9.exe
     1>Done Building Project "C:\Users\D!V4R\Desktop\Programming\Codes\5 Exam2\Ex9\Ex9\Ex9.vcxproj" (Build target(s)).

Build succeeded.

Time Elapsed 00:00:00.70
