^C:\USERS\D!V4R\DESKTOP\PROGRAMMING\CODES\5 EXAM2\EX9\EX9\SOURCE.CPP
C:\USERS\D!V4R\DESKTOP\PROGRAMMING\CODES\5 EXAM2\EX9\EX9\DEBUG\VC140.PDB
C:\USERS\D!V4R\DESKTOP\PROGRAMMING\CODES\5 EXAM2\EX9\EX9\DEBUG\VC140.IDB
C:\USERS\D!V4R\DESKTOP\PROGRAMMING\CODES\5 EXAM2\EX9\EX9\DEBUG\SOURCE.OBJ
