^C:\USERS\D!V4R\DESKTOP\PROGRAMMING\CODES\HW\HW4\HW4_EX2\HW4_EX2\HW4_EX2.CPP
C:\USERS\D!V4R\DESKTOP\PROGRAMMING\CODES\HW\HW4\HW4_EX2\HW4_EX2\DEBUG\VC140.PDB
C:\USERS\D!V4R\DESKTOP\PROGRAMMING\CODES\HW\HW4\HW4_EX2\HW4_EX2\DEBUG\VC140.IDB
C:\USERS\D!V4R\DESKTOP\PROGRAMMING\CODES\HW\HW4\HW4_EX2\HW4_EX2\DEBUG\HW4_EX2.OBJ
