(module Pin_Header_Straight_1x31_Pitch1.27mm_SMD_Pin1Right (layer F.Cu) (tedit 588DAF36)
  (descr "surface-mounted straight pin header, 1x31, 1.27mm pitch, single row, style 2 (pin 1 right)")
  (tags "Surface mounted pin header SMD 1x31 1.27mm single row style2 pin1 right")
  (attr smd)
  (fp_text reference REF** (at 0 -20.745) (layer F.SilkS)
    (effects (font (size 1 1) (thickness 0.15)))
  )
  (fp_text value Pin_Header_Straight_1x31_Pitch1.27mm_SMD_Pin1Right (at 0 20.745) (layer F.Fab)
    (effects (font (size 1 1) (thickness 0.15)))
  )
  (fp_line (start -0.635 -19.685) (end -0.635 19.685) (layer F.Fab) (width 0.1))
  (fp_line (start -0.635 19.685) (end 0.635 19.685) (layer F.Fab) (width 0.1))
  (fp_line (start 0.635 19.685) (end 0.635 -19.685) (layer F.Fab) (width 0.1))
  (fp_line (start 0.635 -19.685) (end -0.635 -19.685) (layer F.Fab) (width 0.1))
  (fp_line (start -0.635 -17.98) (end -0.635 -17.58) (layer F.Fab) (width 0.1))
  (fp_line (start -0.635 -17.58) (end -1.92 -17.58) (layer F.Fab) (width 0.1))
  (fp_line (start -1.92 -17.58) (end -1.92 -17.98) (layer F.Fab) (width 0.1))
  (fp_line (start -1.92 -17.98) (end -0.635 -17.98) (layer F.Fab) (width 0.1))
  (fp_line (start -0.635 -15.44) (end -0.635 -15.04) (layer F.Fab) (width 0.1))
  (fp_line (start -0.635 -15.04) (end -1.92 -15.04) (layer F.Fab) (width 0.1))
  (fp_line (start -1.92 -15.04) (end -1.92 -15.44) (layer F.Fab) (width 0.1))
  (fp_line (start -1.92 -15.44) (end -0.635 -15.44) (layer F.Fab) (width 0.1))
  (fp_line (start -0.635 -12.9) (end -0.635 -12.5) (layer F.Fab) (width 0.1))
  (fp_line (start -0.635 -12.5) (end -1.92 -12.5) (layer F.Fab) (width 0.1))
  (fp_line (start -1.92 -12.5) (end -1.92 -12.9) (layer F.Fab) (width 0.1))
  (fp_line (start -1.92 -12.9) (end -0.635 -12.9) (layer F.Fab) (width 0.1))
  (fp_line (start -0.635 -10.36) (end -0.635 -9.96) (layer F.Fab) (width 0.1))
  (fp_line (start -0.635 -9.96) (end -1.92 -9.96) (layer F.Fab) (width 0.1))
  (fp_line (start -1.92 -9.96) (end -1.92 -10.36) (layer F.Fab) (width 0.1))
  (fp_line (start -1.92 -10.36) (end -0.635 -10.36) (layer F.Fab) (width 0.1))
  (fp_line (start -0.635 -7.82) (end -0.635 -7.42) (layer F.Fab) (width 0.1))
  (fp_line (start -0.635 -7.42) (end -1.92 -7.42) (layer F.Fab) (width 0.1))
  (fp_line (start -1.92 -7.42) (end -1.92 -7.82) (layer F.Fab) (width 0.1))
  (fp_line (start -1.92 -7.82) (end -0.635 -7.82) (layer F.Fab) (width 0.1))
  (fp_line (start -0.635 -5.28) (end -0.635 -4.88) (layer F.Fab) (width 0.1))
  (fp_line (start -0.635 -4.88) (end -1.92 -4.88) (layer F.Fab) (width 0.1))
  (fp_line (start -1.92 -4.88) (end -1.92 -5.28) (layer F.Fab) (width 0.1))
  (fp_line (start -1.92 -5.28) (end -0.635 -5.28) (layer F.Fab) (width 0.1))
  (fp_line (start -0.635 -2.74) (end -0.635 -2.34) (layer F.Fab) (width 0.1))
  (fp_line (start -0.635 -2.34) (end -1.92 -2.34) (layer F.Fab) (width 0.1))
  (fp_line (start -1.92 -2.34) (end -1.92 -2.74) (layer F.Fab) (width 0.1))
  (fp_line (start -1.92 -2.74) (end -0.635 -2.74) (layer F.Fab) (width 0.1))
  (fp_line (start -0.635 -0.2) (end -0.635 0.2) (layer F.Fab) (width 0.1))
  (fp_line (start -0.635 0.2) (end -1.92 0.2) (layer F.Fab) (width 0.1))
  (fp_line (start -1.92 0.2) (end -1.92 -0.2) (layer F.Fab) (width 0.1))
  (fp_line (start -1.92 -0.2) (end -0.635 -0.2) (layer F.Fab) (width 0.1))
  (fp_line (start -0.635 2.34) (end -0.635 2.74) (layer F.Fab) (width 0.1))
  (fp_line (start -0.635 2.74) (end -1.92 2.74) (layer F.Fab) (width 0.1))
  (fp_line (start -1.92 2.74) (end -1.92 2.34) (layer F.Fab) (width 0.1))
  (fp_line (start -1.92 2.34) (end -0.635 2.34) (layer F.Fab) (width 0.1))
  (fp_line (start -0.635 4.88) (end -0.635 5.28) (layer F.Fab) (width 0.1))
  (fp_line (start -0.635 5.28) (end -1.92 5.28) (layer F.Fab) (width 0.1))
  (fp_line (start -1.92 5.28) (end -1.92 4.88) (layer F.Fab) (width 0.1))
  (fp_line (start -1.92 4.88) (end -0.635 4.88) (layer F.Fab) (width 0.1))
  (fp_line (start -0.635 7.42) (end -0.635 7.82) (layer F.Fab) (width 0.1))
  (fp_line (start -0.635 7.82) (end -1.92 7.82) (layer F.Fab) (width 0.1))
  (fp_line (start -1.92 7.82) (end -1.92 7.42) (layer F.Fab) (width 0.1))
  (fp_line (start -1.92 7.42) (end -0.635 7.42) (layer F.Fab) (width 0.1))
  (fp_line (start -0.635 9.96) (end -0.635 10.36) (layer F.Fab) (width 0.1))
  (fp_line (start -0.635 10.36) (end -1.92 10.36) (layer F.Fab) (width 0.1))
  (fp_line (start -1.92 10.36) (end -1.92 9.96) (layer F.Fab) (width 0.1))
  (fp_line (start -1.92 9.96) (end -0.635 9.96) (layer F.Fab) (width 0.1))
  (fp_line (start -0.635 12.5) (end -0.635 12.9) (layer F.Fab) (width 0.1))
  (fp_line (start -0.635 12.9) (end -1.92 12.9) (layer F.Fab) (width 0.1))
  (fp_line (start -1.92 12.9) (end -1.92 12.5) (layer F.Fab) (width 0.1))
  (fp_line (start -1.92 12.5) (end -0.635 12.5) (layer F.Fab) (width 0.1))
  (fp_line (start -0.635 15.04) (end -0.635 15.44) (layer F.Fab) (width 0.1))
  (fp_line (start -0.635 15.44) (end -1.92 15.44) (layer F.Fab) (width 0.1))
  (fp_line (start -1.92 15.44) (end -1.92 15.04) (layer F.Fab) (width 0.1))
  (fp_line (start -1.92 15.04) (end -0.635 15.04) (layer F.Fab) (width 0.1))
  (fp_line (start -0.635 17.58) (end -0.635 17.98) (layer F.Fab) (width 0.1))
  (fp_line (start -0.635 17.98) (end -1.92 17.98) (layer F.Fab) (width 0.1))
  (fp_line (start -1.92 17.98) (end -1.92 17.58) (layer F.Fab) (width 0.1))
  (fp_line (start -1.92 17.58) (end -0.635 17.58) (layer F.Fab) (width 0.1))
  (fp_line (start 0.635 -19.25) (end 0.635 -18.85) (layer F.Fab) (width 0.1))
  (fp_line (start 0.635 -18.85) (end 1.92 -18.85) (layer F.Fab) (width 0.1))
  (fp_line (start 1.92 -18.85) (end 1.92 -19.25) (layer F.Fab) (width 0.1))
  (fp_line (start 1.92 -19.25) (end 0.635 -19.25) (layer F.Fab) (width 0.1))
  (fp_line (start 0.635 -16.71) (end 0.635 -16.31) (layer F.Fab) (width 0.1))
  (fp_line (start 0.635 -16.31) (end 1.92 -16.31) (layer F.Fab) (width 0.1))
  (fp_line (start 1.92 -16.31) (end 1.92 -16.71) (layer F.Fab) (width 0.1))
  (fp_line (start 1.92 -16.71) (end 0.635 -16.71) (layer F.Fab) (width 0.1))
  (fp_line (start 0.635 -14.17) (end 0.635 -13.77) (layer F.Fab) (width 0.1))
  (fp_line (start 0.635 -13.77) (end 1.92 -13.77) (layer F.Fab) (width 0.1))
  (fp_line (start 1.92 -13.77) (end 1.92 -14.17) (layer F.Fab) (width 0.1))
  (fp_line (start 1.92 -14.17) (end 0.635 -14.17) (layer F.Fab) (width 0.1))
  (fp_line (start 0.635 -11.63) (end 0.635 -11.23) (layer F.Fab) (width 0.1))
  (fp_line (start 0.635 -11.23) (end 1.92 -11.23) (layer F.Fab) (width 0.1))
  (fp_line (start 1.92 -11.23) (end 1.92 -11.63) (layer F.Fab) (width 0.1))
  (fp_line (start 1.92 -11.63) (end 0.635 -11.63) (layer F.Fab) (width 0.1))
  (fp_line (start 0.635 -9.09) (end 0.635 -8.69) (layer F.Fab) (width 0.1))
  (fp_line (start 0.635 -8.69) (end 1.92 -8.69) (layer F.Fab) (width 0.1))
  (fp_line (start 1.92 -8.69) (end 1.92 -9.09) (layer F.Fab) (width 0.1))
  (fp_line (start 1.92 -9.09) (end 0.635 -9.09) (layer F.Fab) (width 0.1))
  (fp_line (start 0.635 -6.55) (end 0.635 -6.15) (layer F.Fab) (width 0.1))
  (fp_line (start 0.635 -6.15) (end 1.92 -6.15) (layer F.Fab) (width 0.1))
  (fp_line (start 1.92 -6.15) (end 1.92 -6.55) (layer F.Fab) (width 0.1))
  (fp_line (start 1.92 -6.55) (end 0.635 -6.55) (layer F.Fab) (width 0.1))
  (fp_line (start 0.635 -4.01) (end 0.635 -3.61) (layer F.Fab) (width 0.1))
  (fp_line (start 0.635 -3.61) (end 1.92 -3.61) (layer F.Fab) (width 0.1))
  (fp_line (start 1.92 -3.61) (end 1.92 -4.01) (layer F.Fab) (width 0.1))
  (fp_line (start 1.92 -4.01) (end 0.635 -4.01) (layer F.Fab) (width 0.1))
  (fp_line (start 0.635 -1.47) (end 0.635 -1.07) (layer F.Fab) (width 0.1))
  (fp_line (start 0.635 -1.07) (end 1.92 -1.07) (layer F.Fab) (width 0.1))
  (fp_line (start 1.92 -1.07) (end 1.92 -1.47) (layer F.Fab) (width 0.1))
  (fp_line (start 1.92 -1.47) (end 0.635 -1.47) (layer F.Fab) (width 0.1))
  (fp_line (start 0.635 1.07) (end 0.635 1.47) (layer F.Fab) (width 0.1))
  (fp_line (start 0.635 1.47) (end 1.92 1.47) (layer F.Fab) (width 0.1))
  (fp_line (start 1.92 1.47) (end 1.92 1.07) (layer F.Fab) (width 0.1))
  (fp_line (start 1.92 1.07) (end 0.635 1.07) (layer F.Fab) (width 0.1))
  (fp_line (start 0.635 3.61) (end 0.635 4.01) (layer F.Fab) (width 0.1))
  (fp_line (start 0.635 4.01) (end 1.92 4.01) (layer F.Fab) (width 0.1))
  (fp_line (start 1.92 4.01) (end 1.92 3.61) (layer F.Fab) (width 0.1))
  (fp_line (start 1.92 3.61) (end 0.635 3.61) (layer F.Fab) (width 0.1))
  (fp_line (start 0.635 6.15) (end 0.635 6.55) (layer F.Fab) (width 0.1))
  (fp_line (start 0.635 6.55) (end 1.92 6.55) (layer F.Fab) (width 0.1))
  (fp_line (start 1.92 6.55) (end 1.92 6.15) (layer F.Fab) (width 0.1))
  (fp_line (start 1.92 6.15) (end 0.635 6.15) (layer F.Fab) (width 0.1))
  (fp_line (start 0.635 8.69) (end 0.635 9.09) (layer F.Fab) (width 0.1))
  (fp_line (start 0.635 9.09) (end 1.92 9.09) (layer F.Fab) (width 0.1))
  (fp_line (start 1.92 9.09) (end 1.92 8.69) (layer F.Fab) (width 0.1))
  (fp_line (start 1.92 8.69) (end 0.635 8.69) (layer F.Fab) (width 0.1))
  (fp_line (start 0.635 11.23) (end 0.635 11.63) (layer F.Fab) (width 0.1))
  (fp_line (start 0.635 11.63) (end 1.92 11.63) (layer F.Fab) (width 0.1))
  (fp_line (start 1.92 11.63) (end 1.92 11.23) (layer F.Fab) (width 0.1))
  (fp_line (start 1.92 11.23) (end 0.635 11.23) (layer F.Fab) (width 0.1))
  (fp_line (start 0.635 13.77) (end 0.635 14.17) (layer F.Fab) (width 0.1))
  (fp_line (start 0.635 14.17) (end 1.92 14.17) (layer F.Fab) (width 0.1))
  (fp_line (start 1.92 14.17) (end 1.92 13.77) (layer F.Fab) (width 0.1))
  (fp_line (start 1.92 13.77) (end 0.635 13.77) (layer F.Fab) (width 0.1))
  (fp_line (start 0.635 16.31) (end 0.635 16.71) (layer F.Fab) (width 0.1))
  (fp_line (start 0.635 16.71) (end 1.92 16.71) (layer F.Fab) (width 0.1))
  (fp_line (start 1.92 16.71) (end 1.92 16.31) (layer F.Fab) (width 0.1))
  (fp_line (start 1.92 16.31) (end 0.635 16.31) (layer F.Fab) (width 0.1))
  (fp_line (start 0.635 18.85) (end 0.635 19.25) (layer F.Fab) (width 0.1))
  (fp_line (start 0.635 19.25) (end 1.92 19.25) (layer F.Fab) (width 0.1))
  (fp_line (start 1.92 19.25) (end 1.92 18.85) (layer F.Fab) (width 0.1))
  (fp_line (start 1.92 18.85) (end 0.635 18.85) (layer F.Fab) (width 0.1))
  (fp_line (start -0.695 -19.725) (end -0.695 -19.745) (layer F.SilkS) (width 0.12))
  (fp_line (start -0.695 -19.745) (end 0.695 -19.745) (layer F.SilkS) (width 0.12))
  (fp_line (start 0.695 -19.745) (end 0.695 -19.725) (layer F.SilkS) (width 0.12))
  (fp_line (start -0.695 19.725) (end -0.695 19.745) (layer F.SilkS) (width 0.12))
  (fp_line (start -0.695 19.745) (end 0.695 19.745) (layer F.SilkS) (width 0.12))
  (fp_line (start 0.695 19.745) (end 0.695 19.725) (layer F.SilkS) (width 0.12))
  (fp_line (start 0.695 -18.495) (end 0.695 -17.065) (layer F.SilkS) (width 0.12))
  (fp_line (start 0.695 -15.955) (end 0.695 -14.525) (layer F.SilkS) (width 0.12))
  (fp_line (start 0.695 -13.415) (end 0.695 -11.985) (layer F.SilkS) (width 0.12))
  (fp_line (start 0.695 -10.875) (end 0.695 -9.445) (layer F.SilkS) (width 0.12))
  (fp_line (start 0.695 -8.335) (end 0.695 -6.905) (layer F.SilkS) (width 0.12))
  (fp_line (start 0.695 -5.795) (end 0.695 -4.365) (layer F.SilkS) (width 0.12))
  (fp_line (start 0.695 -3.255) (end 0.695 -1.825) (layer F.SilkS) (width 0.12))
  (fp_line (start 0.695 -0.715) (end 0.695 0.715) (layer F.SilkS) (width 0.12))
  (fp_line (start 0.695 1.825) (end 0.695 3.255) (layer F.SilkS) (width 0.12))
  (fp_line (start 0.695 4.365) (end 0.695 5.795) (layer F.SilkS) (width 0.12))
  (fp_line (start 0.695 6.905) (end 0.695 8.335) (layer F.SilkS) (width 0.12))
  (fp_line (start 0.695 9.445) (end 0.695 10.875) (layer F.SilkS) (width 0.12))
  (fp_line (start 0.695 11.985) (end 0.695 13.415) (layer F.SilkS) (width 0.12))
  (fp_line (start 0.695 14.525) (end 0.695 15.955) (layer F.SilkS) (width 0.12))
  (fp_line (start 0.695 17.065) (end 0.695 18.495) (layer F.SilkS) (width 0.12))
  (fp_line (start -0.695 -19.745) (end -0.695 -18.335) (layer F.SilkS) (width 0.12))
  (fp_line (start 0.695 -19.725) (end 3 -19.725) (layer F.SilkS) (width 0.12))
  (fp_line (start -0.695 -17.225) (end -0.695 -15.795) (layer F.SilkS) (width 0.12))
  (fp_line (start -0.695 -14.685) (end -0.695 -13.255) (layer F.SilkS) (width 0.12))
  (fp_line (start -0.695 -12.145) (end -0.695 -10.715) (layer F.SilkS) (width 0.12))
  (fp_line (start -0.695 -9.605) (end -0.695 -8.175) (layer F.SilkS) (width 0.12))
  (fp_line (start -0.695 -7.065) (end -0.695 -5.635) (layer F.SilkS) (width 0.12))
  (fp_line (start -0.695 -4.525) (end -0.695 -3.095) (layer F.SilkS) (width 0.12))
  (fp_line (start -0.695 -1.985) (end -0.695 -0.555) (layer F.SilkS) (width 0.12))
  (fp_line (start -0.695 0.555) (end -0.695 1.985) (layer F.SilkS) (width 0.12))
  (fp_line (start -0.695 3.095) (end -0.695 4.525) (layer F.SilkS) (width 0.12))
  (fp_line (start -0.695 5.635) (end -0.695 7.065) (layer F.SilkS) (width 0.12))
  (fp_line (start -0.695 8.175) (end -0.695 9.605) (layer F.SilkS) (width 0.12))
  (fp_line (start -0.695 10.715) (end -0.695 12.145) (layer F.SilkS) (width 0.12))
  (fp_line (start -0.695 13.255) (end -0.695 14.685) (layer F.SilkS) (width 0.12))
  (fp_line (start -0.695 15.795) (end -0.695 17.225) (layer F.SilkS) (width 0.12))
  (fp_line (start -0.695 18.335) (end -0.695 19.745) (layer F.SilkS) (width 0.12))
  (fp_line (start -3.25 -19.95) (end -3.25 19.95) (layer F.CrtYd) (width 0.05))
  (fp_line (start -3.25 19.95) (end 3.25 19.95) (layer F.CrtYd) (width 0.05))
  (fp_line (start 3.25 19.95) (end 3.25 -19.95) (layer F.CrtYd) (width 0.05))
  (fp_line (start 3.25 -19.95) (end -3.25 -19.95) (layer F.CrtYd) (width 0.05))
  (pad 2 smd rect (at -1.95 -17.78) (size 2.1 0.75) (layers F.Cu F.Mask))
  (pad 4 smd rect (at -1.95 -15.24) (size 2.1 0.75) (layers F.Cu F.Mask))
  (pad 6 smd rect (at -1.95 -12.7) (size 2.1 0.75) (layers F.Cu F.Mask))
  (pad 8 smd rect (at -1.95 -10.16) (size 2.1 0.75) (layers F.Cu F.Mask))
  (pad 10 smd rect (at -1.95 -7.62) (size 2.1 0.75) (layers F.Cu F.Mask))
  (pad 12 smd rect (at -1.95 -5.08) (size 2.1 0.75) (layers F.Cu F.Mask))
  (pad 14 smd rect (at -1.95 -2.54) (size 2.1 0.75) (layers F.Cu F.Mask))
  (pad 16 smd rect (at -1.95 0) (size 2.1 0.75) (layers F.Cu F.Mask))
  (pad 18 smd rect (at -1.95 2.54) (size 2.1 0.75) (layers F.Cu F.Mask))
  (pad 20 smd rect (at -1.95 5.08) (size 2.1 0.75) (layers F.Cu F.Mask))
  (pad 22 smd rect (at -1.95 7.62) (size 2.1 0.75) (layers F.Cu F.Mask))
  (pad 24 smd rect (at -1.95 10.16) (size 2.1 0.75) (layers F.Cu F.Mask))
  (pad 26 smd rect (at -1.95 12.7) (size 2.1 0.75) (layers F.Cu F.Mask))
  (pad 28 smd rect (at -1.95 15.24) (size 2.1 0.75) (layers F.Cu F.Mask))
  (pad 30 smd rect (at -1.95 17.78) (size 2.1 0.75) (layers F.Cu F.Mask))
  (pad 1 smd rect (at 1.95 -19.05) (size 2.1 0.75) (layers F.Cu F.Mask))
  (pad 3 smd rect (at 1.95 -16.51) (size 2.1 0.75) (layers F.Cu F.Mask))
  (pad 5 smd rect (at 1.95 -13.97) (size 2.1 0.75) (layers F.Cu F.Mask))
  (pad 7 smd rect (at 1.95 -11.43) (size 2.1 0.75) (layers F.Cu F.Mask))
  (pad 9 smd rect (at 1.95 -8.89) (size 2.1 0.75) (layers F.Cu F.Mask))
  (pad 11 smd rect (at 1.95 -6.35) (size 2.1 0.75) (layers F.Cu F.Mask))
  (pad 13 smd rect (at 1.95 -3.81) (size 2.1 0.75) (layers F.Cu F.Mask))
  (pad 15 smd rect (at 1.95 -1.27) (size 2.1 0.75) (layers F.Cu F.Mask))
  (pad 17 smd rect (at 1.95 1.27) (size 2.1 0.75) (layers F.Cu F.Mask))
  (pad 19 smd rect (at 1.95 3.81) (size 2.1 0.75) (layers F.Cu F.Mask))
  (pad 21 smd rect (at 1.95 6.35) (size 2.1 0.75) (layers F.Cu F.Mask))
  (pad 23 smd rect (at 1.95 8.89) (size 2.1 0.75) (layers F.Cu F.Mask))
  (pad 25 smd rect (at 1.95 11.43) (size 2.1 0.75) (layers F.Cu F.Mask))
  (pad 27 smd rect (at 1.95 13.97) (size 2.1 0.75) (layers F.Cu F.Mask))
  (pad 29 smd rect (at 1.95 16.51) (size 2.1 0.75) (layers F.Cu F.Mask))
  (pad 31 smd rect (at 1.95 19.05) (size 2.1 0.75) (layers F.Cu F.Mask))
  (model Pin_Headers.3dshapes/Pin_Header_Straight_1x31_Pitch1.27mm_SMD_Pin1Right.wrl
    (at (xyz 0 0 0))
    (scale (xyz 1 1 1))
    (rotate (xyz 0 0 0))
  )
)