(module Pin_Header_Straight_2x06_Pitch2.54mm_SMD (layer F.Cu) (tedit 588DAF2A)
  (descr "surface-mounted straight pin header, 2x06, 2.54mm pitch, double rows")
  (tags "Surface mounted pin header SMD 2x06 2.54mm double row")
  (attr smd)
  (fp_text reference REF** (at 0 -8.68) (layer F.SilkS)
    (effects (font (size 1 1) (thickness 0.15)))
  )
  (fp_text value Pin_Header_Straight_2x06_Pitch2.54mm_SMD (at 0 8.68) (layer F.Fab)
    (effects (font (size 1 1) (thickness 0.15)))
  )
  (fp_line (start -2.54 -7.62) (end -2.54 7.62) (layer F.Fab) (width 0.1))
  (fp_line (start -2.54 7.62) (end 2.54 7.62) (layer F.Fab) (width 0.1))
  (fp_line (start 2.54 7.62) (end 2.54 -7.62) (layer F.Fab) (width 0.1))
  (fp_line (start 2.54 -7.62) (end -2.54 -7.62) (layer F.Fab) (width 0.1))
  (fp_line (start -2.54 -6.67) (end -2.54 -6.03) (layer F.Fab) (width 0.1))
  (fp_line (start -2.54 -6.03) (end -3.92 -6.03) (layer F.Fab) (width 0.1))
  (fp_line (start -3.92 -6.03) (end -3.92 -6.67) (layer F.Fab) (width 0.1))
  (fp_line (start -3.92 -6.67) (end -2.54 -6.67) (layer F.Fab) (width 0.1))
  (fp_line (start 2.54 -6.67) (end 2.54 -6.03) (layer F.Fab) (width 0.1))
  (fp_line (start 2.54 -6.03) (end 3.92 -6.03) (layer F.Fab) (width 0.1))
  (fp_line (start 3.92 -6.03) (end 3.92 -6.67) (layer F.Fab) (width 0.1))
  (fp_line (start 3.92 -6.67) (end 2.54 -6.67) (layer F.Fab) (width 0.1))
  (fp_line (start -2.54 -4.13) (end -2.54 -3.49) (layer F.Fab) (width 0.1))
  (fp_line (start -2.54 -3.49) (end -3.92 -3.49) (layer F.Fab) (width 0.1))
  (fp_line (start -3.92 -3.49) (end -3.92 -4.13) (layer F.Fab) (width 0.1))
  (fp_line (start -3.92 -4.13) (end -2.54 -4.13) (layer F.Fab) (width 0.1))
  (fp_line (start 2.54 -4.13) (end 2.54 -3.49) (layer F.Fab) (width 0.1))
  (fp_line (start 2.54 -3.49) (end 3.92 -3.49) (layer F.Fab) (width 0.1))
  (fp_line (start 3.92 -3.49) (end 3.92 -4.13) (layer F.Fab) (width 0.1))
  (fp_line (start 3.92 -4.13) (end 2.54 -4.13) (layer F.Fab) (width 0.1))
  (fp_line (start -2.54 -1.59) (end -2.54 -0.95) (layer F.Fab) (width 0.1))
  (fp_line (start -2.54 -0.95) (end -3.92 -0.95) (layer F.Fab) (width 0.1))
  (fp_line (start -3.92 -0.95) (end -3.92 -1.59) (layer F.Fab) (width 0.1))
  (fp_line (start -3.92 -1.59) (end -2.54 -1.59) (layer F.Fab) (width 0.1))
  (fp_line (start 2.54 -1.59) (end 2.54 -0.95) (layer F.Fab) (width 0.1))
  (fp_line (start 2.54 -0.95) (end 3.92 -0.95) (layer F.Fab) (width 0.1))
  (fp_line (start 3.92 -0.95) (end 3.92 -1.59) (layer F.Fab) (width 0.1))
  (fp_line (start 3.92 -1.59) (end 2.54 -1.59) (layer F.Fab) (width 0.1))
  (fp_line (start -2.54 0.95) (end -2.54 1.59) (layer F.Fab) (width 0.1))
  (fp_line (start -2.54 1.59) (end -3.92 1.59) (layer F.Fab) (width 0.1))
  (fp_line (start -3.92 1.59) (end -3.92 0.95) (layer F.Fab) (width 0.1))
  (fp_line (start -3.92 0.95) (end -2.54 0.95) (layer F.Fab) (width 0.1))
  (fp_line (start 2.54 0.95) (end 2.54 1.59) (layer F.Fab) (width 0.1))
  (fp_line (start 2.54 1.59) (end 3.92 1.59) (layer F.Fab) (width 0.1))
  (fp_line (start 3.92 1.59) (end 3.92 0.95) (layer F.Fab) (width 0.1))
  (fp_line (start 3.92 0.95) (end 2.54 0.95) (layer F.Fab) (width 0.1))
  (fp_line (start -2.54 3.49) (end -2.54 4.13) (layer F.Fab) (width 0.1))
  (fp_line (start -2.54 4.13) (end -3.92 4.13) (layer F.Fab) (width 0.1))
  (fp_line (start -3.92 4.13) (end -3.92 3.49) (layer F.Fab) (width 0.1))
  (fp_line (start -3.92 3.49) (end -2.54 3.49) (layer F.Fab) (width 0.1))
  (fp_line (start 2.54 3.49) (end 2.54 4.13) (layer F.Fab) (width 0.1))
  (fp_line (start 2.54 4.13) (end 3.92 4.13) (layer F.Fab) (width 0.1))
  (fp_line (start 3.92 4.13) (end 3.92 3.49) (layer F.Fab) (width 0.1))
  (fp_line (start 3.92 3.49) (end 2.54 3.49) (layer F.Fab) (width 0.1))
  (fp_line (start -2.54 6.03) (end -2.54 6.67) (layer F.Fab) (width 0.1))
  (fp_line (start -2.54 6.67) (end -3.92 6.67) (layer F.Fab) (width 0.1))
  (fp_line (start -3.92 6.67) (end -3.92 6.03) (layer F.Fab) (width 0.1))
  (fp_line (start -3.92 6.03) (end -2.54 6.03) (layer F.Fab) (width 0.1))
  (fp_line (start 2.54 6.03) (end 2.54 6.67) (layer F.Fab) (width 0.1))
  (fp_line (start 2.54 6.67) (end 3.92 6.67) (layer F.Fab) (width 0.1))
  (fp_line (start 3.92 6.67) (end 3.92 6.03) (layer F.Fab) (width 0.1))
  (fp_line (start 3.92 6.03) (end 2.54 6.03) (layer F.Fab) (width 0.1))
  (fp_line (start -2.6 -7.15) (end -2.6 -7.68) (layer F.SilkS) (width 0.12))
  (fp_line (start -2.6 -7.68) (end 2.6 -7.68) (layer F.SilkS) (width 0.12))
  (fp_line (start 2.6 -7.68) (end 2.6 -7.15) (layer F.SilkS) (width 0.12))
  (fp_line (start -2.6 7.15) (end -2.6 7.68) (layer F.SilkS) (width 0.12))
  (fp_line (start -2.6 7.68) (end 2.6 7.68) (layer F.SilkS) (width 0.12))
  (fp_line (start 2.6 7.68) (end 2.6 7.15) (layer F.SilkS) (width 0.12))
  (fp_line (start -4.27 -7.15) (end -2.6 -7.15) (layer F.SilkS) (width 0.12))
  (fp_line (start -4.55 -7.9) (end -4.55 7.9) (layer F.CrtYd) (width 0.05))
  (fp_line (start -4.55 7.9) (end 4.55 7.9) (layer F.CrtYd) (width 0.05))
  (fp_line (start 4.55 7.9) (end 4.55 -7.9) (layer F.CrtYd) (width 0.05))
  (fp_line (start 4.55 -7.9) (end -4.55 -7.9) (layer F.CrtYd) (width 0.05))
  (pad 1 smd rect (at -2.77 -6.35) (size 3 1) (layers F.Cu F.Mask))
  (pad 2 smd rect (at 2.77 -6.35) (size 3 1) (layers F.Cu F.Mask))
  (pad 3 smd rect (at -2.77 -3.81) (size 3 1) (layers F.Cu F.Mask))
  (pad 4 smd rect (at 2.77 -3.81) (size 3 1) (layers F.Cu F.Mask))
  (pad 5 smd rect (at -2.77 -1.27) (size 3 1) (layers F.Cu F.Mask))
  (pad 6 smd rect (at 2.77 -1.27) (size 3 1) (layers F.Cu F.Mask))
  (pad 7 smd rect (at -2.77 1.27) (size 3 1) (layers F.Cu F.Mask))
  (pad 8 smd rect (at 2.77 1.27) (size 3 1) (layers F.Cu F.Mask))
  (pad 9 smd rect (at -2.77 3.81) (size 3 1) (layers F.Cu F.Mask))
  (pad 10 smd rect (at 2.77 3.81) (size 3 1) (layers F.Cu F.Mask))
  (pad 11 smd rect (at -2.77 6.35) (size 3 1) (layers F.Cu F.Mask))
  (pad 12 smd rect (at 2.77 6.35) (size 3 1) (layers F.Cu F.Mask))
  (model Pin_Headers.3dshapes/Pin_Header_Straight_2x06_Pitch2.54mm_SMD.wrl
    (at (xyz 0 0 0))
    (scale (xyz 1 1 1))
    (rotate (xyz 0 0 0))
  )
)