(module stm32_module (layer F.Cu) (tedit 5DF491A0)
  (descr "surface-mounted straight pin header, 1x20, 2.54mm pitch, single row, style 2 (pin 1 right)")
  (tags "Surface mounted pin header SMD 1x20 2.54mm single row style2 pin1 right")
  (attr smd)
  (fp_text reference REF** (at 7.57 -26.46) (layer F.SilkS)
    (effects (font (size 1 1) (thickness 0.15)))
  )
  (fp_text value stm32_module (at -0.13 -0.22 90) (layer F.Fab)
    (effects (font (size 1 1) (thickness 0.15)))
  )
  (fp_line (start 8.84 25.4) (end 6.3 25.4) (layer F.Fab) (width 0.1))
  (fp_line (start 6.3 -25.4) (end 7.89 -25.4) (layer F.Fab) (width 0.1))
  (fp_line (start 8.84 25.4) (end 8.84 -24.45) (layer F.Fab) (width 0.1))
  (fp_line (start 8.84 -24.45) (end 7.89 -25.4) (layer F.Fab) (width 0.1))
  (fp_line (start 6.3 -25.4) (end 6.3 25.4) (layer F.Fab) (width 0.1))
  (fp_line (start 6.3 -21.91) (end 5.03 -21.91) (layer F.Fab) (width 0.1))
  (fp_line (start 5.03 -21.91) (end 5.03 -21.27) (layer F.Fab) (width 0.1))
  (fp_line (start 5.03 -21.27) (end 6.3 -21.27) (layer F.Fab) (width 0.1))
  (fp_line (start 6.3 -16.83) (end 5.03 -16.83) (layer F.Fab) (width 0.1))
  (fp_line (start 5.03 -16.83) (end 5.03 -16.19) (layer F.Fab) (width 0.1))
  (fp_line (start 5.03 -16.19) (end 6.3 -16.19) (layer F.Fab) (width 0.1))
  (fp_line (start 6.3 -11.75) (end 5.03 -11.75) (layer F.Fab) (width 0.1))
  (fp_line (start 5.03 -11.75) (end 5.03 -11.11) (layer F.Fab) (width 0.1))
  (fp_line (start 5.03 -11.11) (end 6.3 -11.11) (layer F.Fab) (width 0.1))
  (fp_line (start 6.3 -6.67) (end 5.03 -6.67) (layer F.Fab) (width 0.1))
  (fp_line (start 5.03 -6.67) (end 5.03 -6.03) (layer F.Fab) (width 0.1))
  (fp_line (start 5.03 -6.03) (end 6.3 -6.03) (layer F.Fab) (width 0.1))
  (fp_line (start 6.3 -1.59) (end 5.03 -1.59) (layer F.Fab) (width 0.1))
  (fp_line (start 5.03 -1.59) (end 5.03 -0.95) (layer F.Fab) (width 0.1))
  (fp_line (start 5.03 -0.95) (end 6.3 -0.95) (layer F.Fab) (width 0.1))
  (fp_line (start 6.3 3.49) (end 5.03 3.49) (layer F.Fab) (width 0.1))
  (fp_line (start 5.03 3.49) (end 5.03 4.13) (layer F.Fab) (width 0.1))
  (fp_line (start 5.03 4.13) (end 6.3 4.13) (layer F.Fab) (width 0.1))
  (fp_line (start 6.3 8.57) (end 5.03 8.57) (layer F.Fab) (width 0.1))
  (fp_line (start 5.03 8.57) (end 5.03 9.21) (layer F.Fab) (width 0.1))
  (fp_line (start 5.03 9.21) (end 6.3 9.21) (layer F.Fab) (width 0.1))
  (fp_line (start 6.3 13.65) (end 5.03 13.65) (layer F.Fab) (width 0.1))
  (fp_line (start 5.03 13.65) (end 5.03 14.29) (layer F.Fab) (width 0.1))
  (fp_line (start 5.03 14.29) (end 6.3 14.29) (layer F.Fab) (width 0.1))
  (fp_line (start 6.3 18.73) (end 5.03 18.73) (layer F.Fab) (width 0.1))
  (fp_line (start 5.03 18.73) (end 5.03 19.37) (layer F.Fab) (width 0.1))
  (fp_line (start 5.03 19.37) (end 6.3 19.37) (layer F.Fab) (width 0.1))
  (fp_line (start 6.3 23.81) (end 5.03 23.81) (layer F.Fab) (width 0.1))
  (fp_line (start 5.03 23.81) (end 5.03 24.45) (layer F.Fab) (width 0.1))
  (fp_line (start 5.03 24.45) (end 6.3 24.45) (layer F.Fab) (width 0.1))
  (fp_line (start 8.84 -24.45) (end 10.11 -24.45) (layer F.Fab) (width 0.1))
  (fp_line (start 10.11 -24.45) (end 10.11 -23.81) (layer F.Fab) (width 0.1))
  (fp_line (start 10.11 -23.81) (end 8.84 -23.81) (layer F.Fab) (width 0.1))
  (fp_line (start 8.84 -19.37) (end 10.11 -19.37) (layer F.Fab) (width 0.1))
  (fp_line (start 10.11 -19.37) (end 10.11 -18.73) (layer F.Fab) (width 0.1))
  (fp_line (start 10.11 -18.73) (end 8.84 -18.73) (layer F.Fab) (width 0.1))
  (fp_line (start 8.84 -14.29) (end 10.11 -14.29) (layer F.Fab) (width 0.1))
  (fp_line (start 10.11 -14.29) (end 10.11 -13.65) (layer F.Fab) (width 0.1))
  (fp_line (start 10.11 -13.65) (end 8.84 -13.65) (layer F.Fab) (width 0.1))
  (fp_line (start 8.84 -9.21) (end 10.11 -9.21) (layer F.Fab) (width 0.1))
  (fp_line (start 10.11 -9.21) (end 10.11 -8.57) (layer F.Fab) (width 0.1))
  (fp_line (start 10.11 -8.57) (end 8.84 -8.57) (layer F.Fab) (width 0.1))
  (fp_line (start 8.84 -4.13) (end 10.11 -4.13) (layer F.Fab) (width 0.1))
  (fp_line (start 10.11 -4.13) (end 10.11 -3.49) (layer F.Fab) (width 0.1))
  (fp_line (start 10.11 -3.49) (end 8.84 -3.49) (layer F.Fab) (width 0.1))
  (fp_line (start 8.84 0.95) (end 10.11 0.95) (layer F.Fab) (width 0.1))
  (fp_line (start 10.11 0.95) (end 10.11 1.59) (layer F.Fab) (width 0.1))
  (fp_line (start 10.11 1.59) (end 8.84 1.59) (layer F.Fab) (width 0.1))
  (fp_line (start 8.84 6.03) (end 10.11 6.03) (layer F.Fab) (width 0.1))
  (fp_line (start 10.11 6.03) (end 10.11 6.67) (layer F.Fab) (width 0.1))
  (fp_line (start 10.11 6.67) (end 8.84 6.67) (layer F.Fab) (width 0.1))
  (fp_line (start 8.84 11.11) (end 10.11 11.11) (layer F.Fab) (width 0.1))
  (fp_line (start 10.11 11.11) (end 10.11 11.75) (layer F.Fab) (width 0.1))
  (fp_line (start 10.11 11.75) (end 8.84 11.75) (layer F.Fab) (width 0.1))
  (fp_line (start 8.84 16.19) (end 10.11 16.19) (layer F.Fab) (width 0.1))
  (fp_line (start 10.11 16.19) (end 10.11 16.83) (layer F.Fab) (width 0.1))
  (fp_line (start 10.11 16.83) (end 8.84 16.83) (layer F.Fab) (width 0.1))
  (fp_line (start 8.84 21.27) (end 10.11 21.27) (layer F.Fab) (width 0.1))
  (fp_line (start 10.11 21.27) (end 10.11 21.91) (layer F.Fab) (width 0.1))
  (fp_line (start 10.11 21.91) (end 8.84 21.91) (layer F.Fab) (width 0.1))
  (fp_line (start 6.24 -25.46) (end 8.9 -25.46) (layer F.SilkS) (width 0.12))
  (fp_line (start 6.24 25.46) (end 8.9 25.46) (layer F.SilkS) (width 0.12))
  (fp_line (start 8.9 -23.37) (end 8.9 -19.81) (layer F.SilkS) (width 0.12))
  (fp_line (start 8.9 -18.29) (end 8.9 -14.73) (layer F.SilkS) (width 0.12))
  (fp_line (start 8.9 -13.21) (end 8.9 -9.65) (layer F.SilkS) (width 0.12))
  (fp_line (start 8.9 -8.13) (end 8.9 -4.57) (layer F.SilkS) (width 0.12))
  (fp_line (start 8.9 -3.05) (end 8.9 0.51) (layer F.SilkS) (width 0.12))
  (fp_line (start 8.9 2.03) (end 8.9 5.59) (layer F.SilkS) (width 0.12))
  (fp_line (start 8.9 7.11) (end 8.9 10.67) (layer F.SilkS) (width 0.12))
  (fp_line (start 8.9 12.19) (end 8.9 15.75) (layer F.SilkS) (width 0.12))
  (fp_line (start 8.9 17.27) (end 8.9 20.83) (layer F.SilkS) (width 0.12))
  (fp_line (start 8.9 22.35) (end 8.9 25.46) (layer F.SilkS) (width 0.12))
  (fp_line (start 6.24 -25.46) (end 6.24 -22.35) (layer F.SilkS) (width 0.12))
  (fp_line (start 8.9 -24.89) (end 10.42 -24.89) (layer F.SilkS) (width 0.12))
  (fp_line (start 8.9 -25.46) (end 8.9 -24.89) (layer F.SilkS) (width 0.12))
  (fp_line (start 6.24 24.89) (end 6.24 25.46) (layer F.SilkS) (width 0.12))
  (fp_line (start 6.24 -20.83) (end 6.24 -17.27) (layer F.SilkS) (width 0.12))
  (fp_line (start 6.24 -15.75) (end 6.24 -12.19) (layer F.SilkS) (width 0.12))
  (fp_line (start 6.24 -10.67) (end 6.24 -7.11) (layer F.SilkS) (width 0.12))
  (fp_line (start 6.24 -5.59) (end 6.24 -2.03) (layer F.SilkS) (width 0.12))
  (fp_line (start 6.24 -0.51) (end 6.24 3.05) (layer F.SilkS) (width 0.12))
  (fp_line (start 6.24 4.57) (end 6.24 8.13) (layer F.SilkS) (width 0.12))
  (fp_line (start 6.24 9.65) (end 6.24 13.21) (layer F.SilkS) (width 0.12))
  (fp_line (start 6.24 14.73) (end 6.24 18.29) (layer F.SilkS) (width 0.12))
  (fp_line (start 6.24 19.81) (end 6.24 23.37) (layer F.SilkS) (width 0.12))
  (fp_line (start 4.12 -25.9) (end 4.12 25.9) (layer F.CrtYd) (width 0.05))
  (fp_line (start 4.12 25.9) (end 11.02 25.9) (layer F.CrtYd) (width 0.05))
  (fp_line (start 11.02 25.9) (end 11.02 -25.9) (layer F.CrtYd) (width 0.05))
  (fp_line (start 11.02 -25.9) (end 4.12 -25.9) (layer F.CrtYd) (width 0.05))
  (fp_text user %R (at 7.57 0 90) (layer F.Fab)
    (effects (font (size 1 1) (thickness 0.15)))
  )
  (fp_line (start -8.755566 -5.59) (end -8.755566 -2.03) (layer F.SilkS) (width 0.12))
  (fp_line (start -8.755566 -10.67) (end -8.755566 -7.11) (layer F.SilkS) (width 0.12))
  (fp_line (start -8.755566 -15.75) (end -8.755566 -12.19) (layer F.SilkS) (width 0.12))
  (fp_line (start -8.755566 -20.83) (end -8.755566 -17.27) (layer F.SilkS) (width 0.12))
  (fp_line (start -8.755566 24.89) (end -8.755566 25.46) (layer F.SilkS) (width 0.12))
  (fp_line (start -6.095566 -25.46) (end -6.095566 -24.89) (layer F.SilkS) (width 0.12))
  (fp_line (start -6.095566 -24.89) (end -4.575566 -24.89) (layer F.SilkS) (width 0.12))
  (fp_line (start -8.755566 -25.46) (end -8.755566 -22.35) (layer F.SilkS) (width 0.12))
  (fp_line (start -6.095566 22.35) (end -6.095566 25.46) (layer F.SilkS) (width 0.12))
  (fp_line (start -6.095566 17.27) (end -6.095566 20.83) (layer F.SilkS) (width 0.12))
  (fp_line (start -6.095566 12.19) (end -6.095566 15.75) (layer F.SilkS) (width 0.12))
  (fp_line (start -6.095566 7.11) (end -6.095566 10.67) (layer F.SilkS) (width 0.12))
  (fp_line (start -6.095566 2.03) (end -6.095566 5.59) (layer F.SilkS) (width 0.12))
  (fp_line (start -6.095566 -3.05) (end -6.095566 0.51) (layer F.SilkS) (width 0.12))
  (fp_line (start -6.095566 -8.13) (end -6.095566 -4.57) (layer F.SilkS) (width 0.12))
  (fp_line (start -6.095566 -13.21) (end -6.095566 -9.65) (layer F.SilkS) (width 0.12))
  (fp_line (start -6.095566 -18.29) (end -6.095566 -14.73) (layer F.SilkS) (width 0.12))
  (fp_line (start -6.095566 -23.37) (end -6.095566 -19.81) (layer F.SilkS) (width 0.12))
  (fp_line (start -8.755566 25.46) (end -6.095566 25.46) (layer F.SilkS) (width 0.12))
  (fp_line (start -8.755566 -25.46) (end -6.095566 -25.46) (layer F.SilkS) (width 0.12))
  (fp_line (start -4.885566 21.91) (end -6.155566 21.91) (layer F.Fab) (width 0.1))
  (fp_line (start -4.885566 21.27) (end -4.885566 21.91) (layer F.Fab) (width 0.1))
  (fp_line (start -6.155566 21.27) (end -4.885566 21.27) (layer F.Fab) (width 0.1))
  (fp_line (start -4.885566 16.83) (end -6.155566 16.83) (layer F.Fab) (width 0.1))
  (fp_line (start -4.885566 16.19) (end -4.885566 16.83) (layer F.Fab) (width 0.1))
  (fp_line (start -6.155566 16.19) (end -4.885566 16.19) (layer F.Fab) (width 0.1))
  (fp_line (start -4.885566 11.75) (end -6.155566 11.75) (layer F.Fab) (width 0.1))
  (fp_line (start -4.885566 11.11) (end -4.885566 11.75) (layer F.Fab) (width 0.1))
  (fp_line (start -6.155566 11.11) (end -4.885566 11.11) (layer F.Fab) (width 0.1))
  (fp_line (start -4.885566 6.67) (end -6.155566 6.67) (layer F.Fab) (width 0.1))
  (fp_line (start -4.885566 6.03) (end -4.885566 6.67) (layer F.Fab) (width 0.1))
  (fp_line (start -6.155566 6.03) (end -4.885566 6.03) (layer F.Fab) (width 0.1))
  (fp_line (start -4.885566 1.59) (end -6.155566 1.59) (layer F.Fab) (width 0.1))
  (fp_line (start -6.155566 25.4) (end -8.695566 25.4) (layer F.Fab) (width 0.1))
  (fp_text user %R (at -7.425566 0 90) (layer F.Fab)
    (effects (font (size 1 1) (thickness 0.15)))
  )
  (fp_line (start -8.695566 18.73) (end -9.965566 18.73) (layer F.Fab) (width 0.1))
  (fp_line (start -9.965566 14.29) (end -8.695566 14.29) (layer F.Fab) (width 0.1))
  (fp_line (start -9.965566 13.65) (end -9.965566 14.29) (layer F.Fab) (width 0.1))
  (fp_line (start -8.695566 13.65) (end -9.965566 13.65) (layer F.Fab) (width 0.1))
  (fp_line (start -9.965566 9.21) (end -8.695566 9.21) (layer F.Fab) (width 0.1))
  (fp_line (start -9.965566 8.57) (end -9.965566 9.21) (layer F.Fab) (width 0.1))
  (fp_line (start -8.695566 8.57) (end -9.965566 8.57) (layer F.Fab) (width 0.1))
  (fp_line (start -9.965566 4.13) (end -8.695566 4.13) (layer F.Fab) (width 0.1))
  (fp_line (start -9.965566 3.49) (end -9.965566 4.13) (layer F.Fab) (width 0.1))
  (fp_line (start -8.695566 3.49) (end -9.965566 3.49) (layer F.Fab) (width 0.1))
  (fp_line (start -9.965566 -0.95) (end -8.695566 -0.95) (layer F.Fab) (width 0.1))
  (fp_line (start -9.965566 -1.59) (end -9.965566 -0.95) (layer F.Fab) (width 0.1))
  (fp_line (start -8.695566 -1.59) (end -9.965566 -1.59) (layer F.Fab) (width 0.1))
  (fp_line (start -9.965566 -6.03) (end -8.695566 -6.03) (layer F.Fab) (width 0.1))
  (fp_line (start -9.965566 -6.67) (end -9.965566 -6.03) (layer F.Fab) (width 0.1))
  (fp_line (start -8.695566 -6.67) (end -9.965566 -6.67) (layer F.Fab) (width 0.1))
  (fp_line (start -8.695566 -11.75) (end -9.965566 -11.75) (layer F.Fab) (width 0.1))
  (fp_line (start -9.965566 -16.19) (end -8.695566 -16.19) (layer F.Fab) (width 0.1))
  (fp_line (start -9.965566 -16.83) (end -9.965566 -16.19) (layer F.Fab) (width 0.1))
  (fp_line (start -8.695566 -16.83) (end -9.965566 -16.83) (layer F.Fab) (width 0.1))
  (fp_line (start -9.965566 -21.27) (end -8.695566 -21.27) (layer F.Fab) (width 0.1))
  (fp_line (start -9.965566 -21.91) (end -9.965566 -21.27) (layer F.Fab) (width 0.1))
  (fp_line (start -8.695566 -21.91) (end -9.965566 -21.91) (layer F.Fab) (width 0.1))
  (fp_line (start -8.695566 -25.4) (end -8.695566 25.4) (layer F.Fab) (width 0.1))
  (fp_line (start -6.155566 -24.45) (end -7.105566 -25.4) (layer F.Fab) (width 0.1))
  (fp_line (start -6.155566 25.4) (end -6.155566 -24.45) (layer F.Fab) (width 0.1))
  (fp_line (start -9.965566 -11.75) (end -9.965566 -11.11) (layer F.Fab) (width 0.1))
  (fp_line (start -8.695566 -25.4) (end -7.105566 -25.4) (layer F.Fab) (width 0.1))
  (fp_line (start -3.975566 -25.9) (end -10.875566 -25.9) (layer F.CrtYd) (width 0.05))
  (fp_line (start -3.975566 25.9) (end -3.975566 -25.9) (layer F.CrtYd) (width 0.05))
  (fp_line (start -10.875566 25.9) (end -3.975566 25.9) (layer F.CrtYd) (width 0.05))
  (fp_line (start -10.875566 -25.9) (end -10.875566 25.9) (layer F.CrtYd) (width 0.05))
  (fp_line (start -8.755566 19.81) (end -8.755566 23.37) (layer F.SilkS) (width 0.12))
  (fp_line (start -8.755566 14.73) (end -8.755566 18.29) (layer F.SilkS) (width 0.12))
  (fp_line (start -8.755566 9.65) (end -8.755566 13.21) (layer F.SilkS) (width 0.12))
  (fp_line (start -8.755566 4.57) (end -8.755566 8.13) (layer F.SilkS) (width 0.12))
  (fp_line (start -8.755566 -0.51) (end -8.755566 3.05) (layer F.SilkS) (width 0.12))
  (fp_line (start -4.885566 0.95) (end -4.885566 1.59) (layer F.Fab) (width 0.1))
  (fp_line (start -6.155566 0.95) (end -4.885566 0.95) (layer F.Fab) (width 0.1))
  (fp_line (start -4.885566 -3.49) (end -6.155566 -3.49) (layer F.Fab) (width 0.1))
  (fp_line (start -4.885566 -4.13) (end -4.885566 -3.49) (layer F.Fab) (width 0.1))
  (fp_line (start -6.155566 -4.13) (end -4.885566 -4.13) (layer F.Fab) (width 0.1))
  (fp_line (start -4.885566 -8.57) (end -6.155566 -8.57) (layer F.Fab) (width 0.1))
  (fp_line (start -4.885566 -9.21) (end -4.885566 -8.57) (layer F.Fab) (width 0.1))
  (fp_line (start -6.155566 -9.21) (end -4.885566 -9.21) (layer F.Fab) (width 0.1))
  (fp_line (start -4.885566 -13.65) (end -6.155566 -13.65) (layer F.Fab) (width 0.1))
  (fp_line (start -4.885566 -14.29) (end -4.885566 -13.65) (layer F.Fab) (width 0.1))
  (fp_line (start -6.155566 -14.29) (end -4.885566 -14.29) (layer F.Fab) (width 0.1))
  (fp_line (start -4.885566 -18.73) (end -6.155566 -18.73) (layer F.Fab) (width 0.1))
  (fp_line (start -4.885566 -19.37) (end -4.885566 -18.73) (layer F.Fab) (width 0.1))
  (fp_line (start -6.155566 -19.37) (end -4.885566 -19.37) (layer F.Fab) (width 0.1))
  (fp_line (start -4.885566 -23.81) (end -6.155566 -23.81) (layer F.Fab) (width 0.1))
  (fp_line (start -4.885566 -24.45) (end -4.885566 -23.81) (layer F.Fab) (width 0.1))
  (fp_line (start -6.155566 -24.45) (end -4.885566 -24.45) (layer F.Fab) (width 0.1))
  (fp_line (start -9.965566 24.45) (end -8.695566 24.45) (layer F.Fab) (width 0.1))
  (fp_line (start -9.965566 23.81) (end -9.965566 24.45) (layer F.Fab) (width 0.1))
  (fp_line (start -8.695566 23.81) (end -9.965566 23.81) (layer F.Fab) (width 0.1))
  (fp_line (start -9.965566 19.37) (end -8.695566 19.37) (layer F.Fab) (width 0.1))
  (fp_line (start -9.965566 18.73) (end -9.965566 19.37) (layer F.Fab) (width 0.1))
  (fp_line (start -9.965566 -11.11) (end -8.695566 -11.11) (layer F.Fab) (width 0.1))
  (pad 39 smd rect (at 5.915 -21.59) (size 3.45 1) (layers F.Cu F.Paste F.Mask))
  (pad 37 smd rect (at 5.915 -16.51) (size 3.45 1) (layers F.Cu F.Paste F.Mask))
  (pad 35 smd rect (at 5.915 -11.43) (size 3.45 1) (layers F.Cu F.Paste F.Mask))
  (pad 33 smd rect (at 5.915 -6.35) (size 3.45 1) (layers F.Cu F.Paste F.Mask))
  (pad 31 smd rect (at 5.915 -1.27) (size 3.45 1) (layers F.Cu F.Paste F.Mask))
  (pad 29 smd rect (at 5.915 3.81) (size 3.45 1) (layers F.Cu F.Paste F.Mask))
  (pad 27 smd rect (at 5.915 8.89) (size 3.45 1) (layers F.Cu F.Paste F.Mask))
  (pad 25 smd rect (at 5.915 13.97) (size 3.45 1) (layers F.Cu F.Paste F.Mask))
  (pad 23 smd rect (at 5.915 19.05) (size 3.45 1) (layers F.Cu F.Paste F.Mask))
  (pad 21 smd rect (at 5.915 24.13) (size 3.45 1) (layers F.Cu F.Paste F.Mask))
  (pad 40 smd rect (at 9.225 -24.13) (size 3.45 1) (layers F.Cu F.Paste F.Mask))
  (pad 38 smd rect (at 9.225 -19.05) (size 3.45 1) (layers F.Cu F.Paste F.Mask))
  (pad 36 smd rect (at 9.225 -13.97) (size 3.45 1) (layers F.Cu F.Paste F.Mask))
  (pad 34 smd rect (at 9.225 -8.89) (size 3.45 1) (layers F.Cu F.Paste F.Mask))
  (pad 32 smd rect (at 9.225 -3.81) (size 3.45 1) (layers F.Cu F.Paste F.Mask))
  (pad 30 smd rect (at 9.225 1.27) (size 3.45 1) (layers F.Cu F.Paste F.Mask))
  (pad 28 smd rect (at 9.225 6.35) (size 3.45 1) (layers F.Cu F.Paste F.Mask))
  (pad 26 smd rect (at 9.225 11.43) (size 3.45 1) (layers F.Cu F.Paste F.Mask))
  (pad 24 smd rect (at 9.225 16.51) (size 3.45 1) (layers F.Cu F.Paste F.Mask))
  (pad 22 smd rect (at 9.225 21.59) (size 3.45 1) (layers F.Cu F.Paste F.Mask))
  (pad 19 smd rect (at -5.770566 21.59) (size 3.45 1) (layers F.Cu F.Paste F.Mask))
  (pad 17 smd rect (at -5.770566 16.51) (size 3.45 1) (layers F.Cu F.Paste F.Mask))
  (pad 15 smd rect (at -5.770566 11.43) (size 3.45 1) (layers F.Cu F.Paste F.Mask))
  (pad 6 smd rect (at -9.080566 -11.43) (size 3.45 1) (layers F.Cu F.Paste F.Mask))
  (pad 8 smd rect (at -9.080566 -6.35) (size 3.45 1) (layers F.Cu F.Paste F.Mask))
  (pad 4 smd rect (at -9.080566 -16.51) (size 3.45 1) (layers F.Cu F.Paste F.Mask))
  (pad 18 smd rect (at -9.080566 19.05) (size 3.45 1) (layers F.Cu F.Paste F.Mask))
  (pad 16 smd rect (at -9.080566 13.97) (size 3.45 1) (layers F.Cu F.Paste F.Mask))
  (pad 14 smd rect (at -9.080566 8.89) (size 3.45 1) (layers F.Cu F.Paste F.Mask))
  (pad 12 smd rect (at -9.080566 3.81) (size 3.45 1) (layers F.Cu F.Paste F.Mask))
  (pad 2 smd rect (at -9.080566 -21.59) (size 3.45 1) (layers F.Cu F.Paste F.Mask))
  (pad 13 smd rect (at -5.770566 6.35) (size 3.45 1) (layers F.Cu F.Paste F.Mask))
  (pad 11 smd rect (at -5.770566 1.27) (size 3.45 1) (layers F.Cu F.Paste F.Mask))
  (pad 9 smd rect (at -5.770566 -3.81) (size 3.45 1) (layers F.Cu F.Paste F.Mask))
  (pad 7 smd rect (at -5.770566 -8.89) (size 3.45 1) (layers F.Cu F.Paste F.Mask))
  (pad 5 smd rect (at -5.770566 -13.97) (size 3.45 1) (layers F.Cu F.Paste F.Mask))
  (pad 3 smd rect (at -5.770566 -19.05) (size 3.45 1) (layers F.Cu F.Paste F.Mask))
  (pad 1 smd rect (at -5.770566 -24.13) (size 3.45 1) (layers F.Cu F.Paste F.Mask))
  (pad 20 smd rect (at -9.080566 24.13) (size 3.45 1) (layers F.Cu F.Paste F.Mask))
  (pad 10 smd rect (at -9.080566 -1.27) (size 3.45 1) (layers F.Cu F.Paste F.Mask))
  (model ${KISYS3DMOD}/Connector_PinHeader_2.54mm.3dshapes/PinHeader_1x20_P2.54mm_Vertical_SMD_Pin1Right.wrl
    (at (xyz 0 0 0))
    (scale (xyz 1 1 1))
    (rotate (xyz 0 0 0))
  )
)
