(module Pin_Header_Straight_2x19_Pitch2.54mm_SMD (layer F.Cu) (tedit 588DAF2B)
  (descr "surface-mounted straight pin header, 2x19, 2.54mm pitch, double rows")
  (tags "Surface mounted pin header SMD 2x19 2.54mm double row")
  (attr smd)
  (fp_text reference REF** (at 0 -25.19) (layer F.SilkS)
    (effects (font (size 1 1) (thickness 0.15)))
  )
  (fp_text value Pin_Header_Straight_2x19_Pitch2.54mm_SMD (at 0 25.19) (layer F.Fab)
    (effects (font (size 1 1) (thickness 0.15)))
  )
  (fp_line (start -2.54 -24.13) (end -2.54 24.13) (layer F.Fab) (width 0.1))
  (fp_line (start -2.54 24.13) (end 2.54 24.13) (layer F.Fab) (width 0.1))
  (fp_line (start 2.54 24.13) (end 2.54 -24.13) (layer F.Fab) (width 0.1))
  (fp_line (start 2.54 -24.13) (end -2.54 -24.13) (layer F.Fab) (width 0.1))
  (fp_line (start -2.54 -23.18) (end -2.54 -22.54) (layer F.Fab) (width 0.1))
  (fp_line (start -2.54 -22.54) (end -3.92 -22.54) (layer F.Fab) (width 0.1))
  (fp_line (start -3.92 -22.54) (end -3.92 -23.18) (layer F.Fab) (width 0.1))
  (fp_line (start -3.92 -23.18) (end -2.54 -23.18) (layer F.Fab) (width 0.1))
  (fp_line (start 2.54 -23.18) (end 2.54 -22.54) (layer F.Fab) (width 0.1))
  (fp_line (start 2.54 -22.54) (end 3.92 -22.54) (layer F.Fab) (width 0.1))
  (fp_line (start 3.92 -22.54) (end 3.92 -23.18) (layer F.Fab) (width 0.1))
  (fp_line (start 3.92 -23.18) (end 2.54 -23.18) (layer F.Fab) (width 0.1))
  (fp_line (start -2.54 -20.64) (end -2.54 -20) (layer F.Fab) (width 0.1))
  (fp_line (start -2.54 -20) (end -3.92 -20) (layer F.Fab) (width 0.1))
  (fp_line (start -3.92 -20) (end -3.92 -20.64) (layer F.Fab) (width 0.1))
  (fp_line (start -3.92 -20.64) (end -2.54 -20.64) (layer F.Fab) (width 0.1))
  (fp_line (start 2.54 -20.64) (end 2.54 -20) (layer F.Fab) (width 0.1))
  (fp_line (start 2.54 -20) (end 3.92 -20) (layer F.Fab) (width 0.1))
  (fp_line (start 3.92 -20) (end 3.92 -20.64) (layer F.Fab) (width 0.1))
  (fp_line (start 3.92 -20.64) (end 2.54 -20.64) (layer F.Fab) (width 0.1))
  (fp_line (start -2.54 -18.1) (end -2.54 -17.46) (layer F.Fab) (width 0.1))
  (fp_line (start -2.54 -17.46) (end -3.92 -17.46) (layer F.Fab) (width 0.1))
  (fp_line (start -3.92 -17.46) (end -3.92 -18.1) (layer F.Fab) (width 0.1))
  (fp_line (start -3.92 -18.1) (end -2.54 -18.1) (layer F.Fab) (width 0.1))
  (fp_line (start 2.54 -18.1) (end 2.54 -17.46) (layer F.Fab) (width 0.1))
  (fp_line (start 2.54 -17.46) (end 3.92 -17.46) (layer F.Fab) (width 0.1))
  (fp_line (start 3.92 -17.46) (end 3.92 -18.1) (layer F.Fab) (width 0.1))
  (fp_line (start 3.92 -18.1) (end 2.54 -18.1) (layer F.Fab) (width 0.1))
  (fp_line (start -2.54 -15.56) (end -2.54 -14.92) (layer F.Fab) (width 0.1))
  (fp_line (start -2.54 -14.92) (end -3.92 -14.92) (layer F.Fab) (width 0.1))
  (fp_line (start -3.92 -14.92) (end -3.92 -15.56) (layer F.Fab) (width 0.1))
  (fp_line (start -3.92 -15.56) (end -2.54 -15.56) (layer F.Fab) (width 0.1))
  (fp_line (start 2.54 -15.56) (end 2.54 -14.92) (layer F.Fab) (width 0.1))
  (fp_line (start 2.54 -14.92) (end 3.92 -14.92) (layer F.Fab) (width 0.1))
  (fp_line (start 3.92 -14.92) (end 3.92 -15.56) (layer F.Fab) (width 0.1))
  (fp_line (start 3.92 -15.56) (end 2.54 -15.56) (layer F.Fab) (width 0.1))
  (fp_line (start -2.54 -13.02) (end -2.54 -12.38) (layer F.Fab) (width 0.1))
  (fp_line (start -2.54 -12.38) (end -3.92 -12.38) (layer F.Fab) (width 0.1))
  (fp_line (start -3.92 -12.38) (end -3.92 -13.02) (layer F.Fab) (width 0.1))
  (fp_line (start -3.92 -13.02) (end -2.54 -13.02) (layer F.Fab) (width 0.1))
  (fp_line (start 2.54 -13.02) (end 2.54 -12.38) (layer F.Fab) (width 0.1))
  (fp_line (start 2.54 -12.38) (end 3.92 -12.38) (layer F.Fab) (width 0.1))
  (fp_line (start 3.92 -12.38) (end 3.92 -13.02) (layer F.Fab) (width 0.1))
  (fp_line (start 3.92 -13.02) (end 2.54 -13.02) (layer F.Fab) (width 0.1))
  (fp_line (start -2.54 -10.48) (end -2.54 -9.84) (layer F.Fab) (width 0.1))
  (fp_line (start -2.54 -9.84) (end -3.92 -9.84) (layer F.Fab) (width 0.1))
  (fp_line (start -3.92 -9.84) (end -3.92 -10.48) (layer F.Fab) (width 0.1))
  (fp_line (start -3.92 -10.48) (end -2.54 -10.48) (layer F.Fab) (width 0.1))
  (fp_line (start 2.54 -10.48) (end 2.54 -9.84) (layer F.Fab) (width 0.1))
  (fp_line (start 2.54 -9.84) (end 3.92 -9.84) (layer F.Fab) (width 0.1))
  (fp_line (start 3.92 -9.84) (end 3.92 -10.48) (layer F.Fab) (width 0.1))
  (fp_line (start 3.92 -10.48) (end 2.54 -10.48) (layer F.Fab) (width 0.1))
  (fp_line (start -2.54 -7.94) (end -2.54 -7.3) (layer F.Fab) (width 0.1))
  (fp_line (start -2.54 -7.3) (end -3.92 -7.3) (layer F.Fab) (width 0.1))
  (fp_line (start -3.92 -7.3) (end -3.92 -7.94) (layer F.Fab) (width 0.1))
  (fp_line (start -3.92 -7.94) (end -2.54 -7.94) (layer F.Fab) (width 0.1))
  (fp_line (start 2.54 -7.94) (end 2.54 -7.3) (layer F.Fab) (width 0.1))
  (fp_line (start 2.54 -7.3) (end 3.92 -7.3) (layer F.Fab) (width 0.1))
  (fp_line (start 3.92 -7.3) (end 3.92 -7.94) (layer F.Fab) (width 0.1))
  (fp_line (start 3.92 -7.94) (end 2.54 -7.94) (layer F.Fab) (width 0.1))
  (fp_line (start -2.54 -5.4) (end -2.54 -4.76) (layer F.Fab) (width 0.1))
  (fp_line (start -2.54 -4.76) (end -3.92 -4.76) (layer F.Fab) (width 0.1))
  (fp_line (start -3.92 -4.76) (end -3.92 -5.4) (layer F.Fab) (width 0.1))
  (fp_line (start -3.92 -5.4) (end -2.54 -5.4) (layer F.Fab) (width 0.1))
  (fp_line (start 2.54 -5.4) (end 2.54 -4.76) (layer F.Fab) (width 0.1))
  (fp_line (start 2.54 -4.76) (end 3.92 -4.76) (layer F.Fab) (width 0.1))
  (fp_line (start 3.92 -4.76) (end 3.92 -5.4) (layer F.Fab) (width 0.1))
  (fp_line (start 3.92 -5.4) (end 2.54 -5.4) (layer F.Fab) (width 0.1))
  (fp_line (start -2.54 -2.86) (end -2.54 -2.22) (layer F.Fab) (width 0.1))
  (fp_line (start -2.54 -2.22) (end -3.92 -2.22) (layer F.Fab) (width 0.1))
  (fp_line (start -3.92 -2.22) (end -3.92 -2.86) (layer F.Fab) (width 0.1))
  (fp_line (start -3.92 -2.86) (end -2.54 -2.86) (layer F.Fab) (width 0.1))
  (fp_line (start 2.54 -2.86) (end 2.54 -2.22) (layer F.Fab) (width 0.1))
  (fp_line (start 2.54 -2.22) (end 3.92 -2.22) (layer F.Fab) (width 0.1))
  (fp_line (start 3.92 -2.22) (end 3.92 -2.86) (layer F.Fab) (width 0.1))
  (fp_line (start 3.92 -2.86) (end 2.54 -2.86) (layer F.Fab) (width 0.1))
  (fp_line (start -2.54 -0.32) (end -2.54 0.32) (layer F.Fab) (width 0.1))
  (fp_line (start -2.54 0.32) (end -3.92 0.32) (layer F.Fab) (width 0.1))
  (fp_line (start -3.92 0.32) (end -3.92 -0.32) (layer F.Fab) (width 0.1))
  (fp_line (start -3.92 -0.32) (end -2.54 -0.32) (layer F.Fab) (width 0.1))
  (fp_line (start 2.54 -0.32) (end 2.54 0.32) (layer F.Fab) (width 0.1))
  (fp_line (start 2.54 0.32) (end 3.92 0.32) (layer F.Fab) (width 0.1))
  (fp_line (start 3.92 0.32) (end 3.92 -0.32) (layer F.Fab) (width 0.1))
  (fp_line (start 3.92 -0.32) (end 2.54 -0.32) (layer F.Fab) (width 0.1))
  (fp_line (start -2.54 2.22) (end -2.54 2.86) (layer F.Fab) (width 0.1))
  (fp_line (start -2.54 2.86) (end -3.92 2.86) (layer F.Fab) (width 0.1))
  (fp_line (start -3.92 2.86) (end -3.92 2.22) (layer F.Fab) (width 0.1))
  (fp_line (start -3.92 2.22) (end -2.54 2.22) (layer F.Fab) (width 0.1))
  (fp_line (start 2.54 2.22) (end 2.54 2.86) (layer F.Fab) (width 0.1))
  (fp_line (start 2.54 2.86) (end 3.92 2.86) (layer F.Fab) (width 0.1))
  (fp_line (start 3.92 2.86) (end 3.92 2.22) (layer F.Fab) (width 0.1))
  (fp_line (start 3.92 2.22) (end 2.54 2.22) (layer F.Fab) (width 0.1))
  (fp_line (start -2.54 4.76) (end -2.54 5.4) (layer F.Fab) (width 0.1))
  (fp_line (start -2.54 5.4) (end -3.92 5.4) (layer F.Fab) (width 0.1))
  (fp_line (start -3.92 5.4) (end -3.92 4.76) (layer F.Fab) (width 0.1))
  (fp_line (start -3.92 4.76) (end -2.54 4.76) (layer F.Fab) (width 0.1))
  (fp_line (start 2.54 4.76) (end 2.54 5.4) (layer F.Fab) (width 0.1))
  (fp_line (start 2.54 5.4) (end 3.92 5.4) (layer F.Fab) (width 0.1))
  (fp_line (start 3.92 5.4) (end 3.92 4.76) (layer F.Fab) (width 0.1))
  (fp_line (start 3.92 4.76) (end 2.54 4.76) (layer F.Fab) (width 0.1))
  (fp_line (start -2.54 7.3) (end -2.54 7.94) (layer F.Fab) (width 0.1))
  (fp_line (start -2.54 7.94) (end -3.92 7.94) (layer F.Fab) (width 0.1))
  (fp_line (start -3.92 7.94) (end -3.92 7.3) (layer F.Fab) (width 0.1))
  (fp_line (start -3.92 7.3) (end -2.54 7.3) (layer F.Fab) (width 0.1))
  (fp_line (start 2.54 7.3) (end 2.54 7.94) (layer F.Fab) (width 0.1))
  (fp_line (start 2.54 7.94) (end 3.92 7.94) (layer F.Fab) (width 0.1))
  (fp_line (start 3.92 7.94) (end 3.92 7.3) (layer F.Fab) (width 0.1))
  (fp_line (start 3.92 7.3) (end 2.54 7.3) (layer F.Fab) (width 0.1))
  (fp_line (start -2.54 9.84) (end -2.54 10.48) (layer F.Fab) (width 0.1))
  (fp_line (start -2.54 10.48) (end -3.92 10.48) (layer F.Fab) (width 0.1))
  (fp_line (start -3.92 10.48) (end -3.92 9.84) (layer F.Fab) (width 0.1))
  (fp_line (start -3.92 9.84) (end -2.54 9.84) (layer F.Fab) (width 0.1))
  (fp_line (start 2.54 9.84) (end 2.54 10.48) (layer F.Fab) (width 0.1))
  (fp_line (start 2.54 10.48) (end 3.92 10.48) (layer F.Fab) (width 0.1))
  (fp_line (start 3.92 10.48) (end 3.92 9.84) (layer F.Fab) (width 0.1))
  (fp_line (start 3.92 9.84) (end 2.54 9.84) (layer F.Fab) (width 0.1))
  (fp_line (start -2.54 12.38) (end -2.54 13.02) (layer F.Fab) (width 0.1))
  (fp_line (start -2.54 13.02) (end -3.92 13.02) (layer F.Fab) (width 0.1))
  (fp_line (start -3.92 13.02) (end -3.92 12.38) (layer F.Fab) (width 0.1))
  (fp_line (start -3.92 12.38) (end -2.54 12.38) (layer F.Fab) (width 0.1))
  (fp_line (start 2.54 12.38) (end 2.54 13.02) (layer F.Fab) (width 0.1))
  (fp_line (start 2.54 13.02) (end 3.92 13.02) (layer F.Fab) (width 0.1))
  (fp_line (start 3.92 13.02) (end 3.92 12.38) (layer F.Fab) (width 0.1))
  (fp_line (start 3.92 12.38) (end 2.54 12.38) (layer F.Fab) (width 0.1))
  (fp_line (start -2.54 14.92) (end -2.54 15.56) (layer F.Fab) (width 0.1))
  (fp_line (start -2.54 15.56) (end -3.92 15.56) (layer F.Fab) (width 0.1))
  (fp_line (start -3.92 15.56) (end -3.92 14.92) (layer F.Fab) (width 0.1))
  (fp_line (start -3.92 14.92) (end -2.54 14.92) (layer F.Fab) (width 0.1))
  (fp_line (start 2.54 14.92) (end 2.54 15.56) (layer F.Fab) (width 0.1))
  (fp_line (start 2.54 15.56) (end 3.92 15.56) (layer F.Fab) (width 0.1))
  (fp_line (start 3.92 15.56) (end 3.92 14.92) (layer F.Fab) (width 0.1))
  (fp_line (start 3.92 14.92) (end 2.54 14.92) (layer F.Fab) (width 0.1))
  (fp_line (start -2.54 17.46) (end -2.54 18.1) (layer F.Fab) (width 0.1))
  (fp_line (start -2.54 18.1) (end -3.92 18.1) (layer F.Fab) (width 0.1))
  (fp_line (start -3.92 18.1) (end -3.92 17.46) (layer F.Fab) (width 0.1))
  (fp_line (start -3.92 17.46) (end -2.54 17.46) (layer F.Fab) (width 0.1))
  (fp_line (start 2.54 17.46) (end 2.54 18.1) (layer F.Fab) (width 0.1))
  (fp_line (start 2.54 18.1) (end 3.92 18.1) (layer F.Fab) (width 0.1))
  (fp_line (start 3.92 18.1) (end 3.92 17.46) (layer F.Fab) (width 0.1))
  (fp_line (start 3.92 17.46) (end 2.54 17.46) (layer F.Fab) (width 0.1))
  (fp_line (start -2.54 20) (end -2.54 20.64) (layer F.Fab) (width 0.1))
  (fp_line (start -2.54 20.64) (end -3.92 20.64) (layer F.Fab) (width 0.1))
  (fp_line (start -3.92 20.64) (end -3.92 20) (layer F.Fab) (width 0.1))
  (fp_line (start -3.92 20) (end -2.54 20) (layer F.Fab) (width 0.1))
  (fp_line (start 2.54 20) (end 2.54 20.64) (layer F.Fab) (width 0.1))
  (fp_line (start 2.54 20.64) (end 3.92 20.64) (layer F.Fab) (width 0.1))
  (fp_line (start 3.92 20.64) (end 3.92 20) (layer F.Fab) (width 0.1))
  (fp_line (start 3.92 20) (end 2.54 20) (layer F.Fab) (width 0.1))
  (fp_line (start -2.54 22.54) (end -2.54 23.18) (layer F.Fab) (width 0.1))
  (fp_line (start -2.54 23.18) (end -3.92 23.18) (layer F.Fab) (width 0.1))
  (fp_line (start -3.92 23.18) (end -3.92 22.54) (layer F.Fab) (width 0.1))
  (fp_line (start -3.92 22.54) (end -2.54 22.54) (layer F.Fab) (width 0.1))
  (fp_line (start 2.54 22.54) (end 2.54 23.18) (layer F.Fab) (width 0.1))
  (fp_line (start 2.54 23.18) (end 3.92 23.18) (layer F.Fab) (width 0.1))
  (fp_line (start 3.92 23.18) (end 3.92 22.54) (layer F.Fab) (width 0.1))
  (fp_line (start 3.92 22.54) (end 2.54 22.54) (layer F.Fab) (width 0.1))
  (fp_line (start -2.6 -23.66) (end -2.6 -24.19) (layer F.SilkS) (width 0.12))
  (fp_line (start -2.6 -24.19) (end 2.6 -24.19) (layer F.SilkS) (width 0.12))
  (fp_line (start 2.6 -24.19) (end 2.6 -23.66) (layer F.SilkS) (width 0.12))
  (fp_line (start -2.6 23.66) (end -2.6 24.19) (layer F.SilkS) (width 0.12))
  (fp_line (start -2.6 24.19) (end 2.6 24.19) (layer F.SilkS) (width 0.12))
  (fp_line (start 2.6 24.19) (end 2.6 23.66) (layer F.SilkS) (width 0.12))
  (fp_line (start -4.27 -23.66) (end -2.6 -23.66) (layer F.SilkS) (width 0.12))
  (fp_line (start -4.55 -24.4) (end -4.55 24.4) (layer F.CrtYd) (width 0.05))
  (fp_line (start -4.55 24.4) (end 4.55 24.4) (layer F.CrtYd) (width 0.05))
  (fp_line (start 4.55 24.4) (end 4.55 -24.4) (layer F.CrtYd) (width 0.05))
  (fp_line (start 4.55 -24.4) (end -4.55 -24.4) (layer F.CrtYd) (width 0.05))
  (pad 1 smd rect (at -2.77 -22.86) (size 3 1) (layers F.Cu F.Mask))
  (pad 2 smd rect (at 2.77 -22.86) (size 3 1) (layers F.Cu F.Mask))
  (pad 3 smd rect (at -2.77 -20.32) (size 3 1) (layers F.Cu F.Mask))
  (pad 4 smd rect (at 2.77 -20.32) (size 3 1) (layers F.Cu F.Mask))
  (pad 5 smd rect (at -2.77 -17.78) (size 3 1) (layers F.Cu F.Mask))
  (pad 6 smd rect (at 2.77 -17.78) (size 3 1) (layers F.Cu F.Mask))
  (pad 7 smd rect (at -2.77 -15.24) (size 3 1) (layers F.Cu F.Mask))
  (pad 8 smd rect (at 2.77 -15.24) (size 3 1) (layers F.Cu F.Mask))
  (pad 9 smd rect (at -2.77 -12.7) (size 3 1) (layers F.Cu F.Mask))
  (pad 10 smd rect (at 2.77 -12.7) (size 3 1) (layers F.Cu F.Mask))
  (pad 11 smd rect (at -2.77 -10.16) (size 3 1) (layers F.Cu F.Mask))
  (pad 12 smd rect (at 2.77 -10.16) (size 3 1) (layers F.Cu F.Mask))
  (pad 13 smd rect (at -2.77 -7.62) (size 3 1) (layers F.Cu F.Mask))
  (pad 14 smd rect (at 2.77 -7.62) (size 3 1) (layers F.Cu F.Mask))
  (pad 15 smd rect (at -2.77 -5.08) (size 3 1) (layers F.Cu F.Mask))
  (pad 16 smd rect (at 2.77 -5.08) (size 3 1) (layers F.Cu F.Mask))
  (pad 17 smd rect (at -2.77 -2.54) (size 3 1) (layers F.Cu F.Mask))
  (pad 18 smd rect (at 2.77 -2.54) (size 3 1) (layers F.Cu F.Mask))
  (pad 19 smd rect (at -2.77 0) (size 3 1) (layers F.Cu F.Mask))
  (pad 20 smd rect (at 2.77 0) (size 3 1) (layers F.Cu F.Mask))
  (pad 21 smd rect (at -2.77 2.54) (size 3 1) (layers F.Cu F.Mask))
  (pad 22 smd rect (at 2.77 2.54) (size 3 1) (layers F.Cu F.Mask))
  (pad 23 smd rect (at -2.77 5.08) (size 3 1) (layers F.Cu F.Mask))
  (pad 24 smd rect (at 2.77 5.08) (size 3 1) (layers F.Cu F.Mask))
  (pad 25 smd rect (at -2.77 7.62) (size 3 1) (layers F.Cu F.Mask))
  (pad 26 smd rect (at 2.77 7.62) (size 3 1) (layers F.Cu F.Mask))
  (pad 27 smd rect (at -2.77 10.16) (size 3 1) (layers F.Cu F.Mask))
  (pad 28 smd rect (at 2.77 10.16) (size 3 1) (layers F.Cu F.Mask))
  (pad 29 smd rect (at -2.77 12.7) (size 3 1) (layers F.Cu F.Mask))
  (pad 30 smd rect (at 2.77 12.7) (size 3 1) (layers F.Cu F.Mask))
  (pad 31 smd rect (at -2.77 15.24) (size 3 1) (layers F.Cu F.Mask))
  (pad 32 smd rect (at 2.77 15.24) (size 3 1) (layers F.Cu F.Mask))
  (pad 33 smd rect (at -2.77 17.78) (size 3 1) (layers F.Cu F.Mask))
  (pad 34 smd rect (at 2.77 17.78) (size 3 1) (layers F.Cu F.Mask))
  (pad 35 smd rect (at -2.77 20.32) (size 3 1) (layers F.Cu F.Mask))
  (pad 36 smd rect (at 2.77 20.32) (size 3 1) (layers F.Cu F.Mask))
  (pad 37 smd rect (at -2.77 22.86) (size 3 1) (layers F.Cu F.Mask))
  (pad 38 smd rect (at 2.77 22.86) (size 3 1) (layers F.Cu F.Mask))
  (model Pin_Headers.3dshapes/Pin_Header_Straight_2x19_Pitch2.54mm_SMD.wrl
    (at (xyz 0 0 0))
    (scale (xyz 1 1 1))
    (rotate (xyz 0 0 0))
  )
)