(module Pin_Header_Straight_2x10_Pitch2.54mm_SMD (layer F.Cu) (tedit 588DAF2B)
  (descr "surface-mounted straight pin header, 2x10, 2.54mm pitch, double rows")
  (tags "Surface mounted pin header SMD 2x10 2.54mm double row")
  (attr smd)
  (fp_text reference REF** (at 0 -13.76) (layer F.SilkS)
    (effects (font (size 1 1) (thickness 0.15)))
  )
  (fp_text value Pin_Header_Straight_2x10_Pitch2.54mm_SMD (at 0 13.76) (layer F.Fab)
    (effects (font (size 1 1) (thickness 0.15)))
  )
  (fp_line (start -2.54 -12.7) (end -2.54 12.7) (layer F.Fab) (width 0.1))
  (fp_line (start -2.54 12.7) (end 2.54 12.7) (layer F.Fab) (width 0.1))
  (fp_line (start 2.54 12.7) (end 2.54 -12.7) (layer F.Fab) (width 0.1))
  (fp_line (start 2.54 -12.7) (end -2.54 -12.7) (layer F.Fab) (width 0.1))
  (fp_line (start -2.54 -11.75) (end -2.54 -11.11) (layer F.Fab) (width 0.1))
  (fp_line (start -2.54 -11.11) (end -3.92 -11.11) (layer F.Fab) (width 0.1))
  (fp_line (start -3.92 -11.11) (end -3.92 -11.75) (layer F.Fab) (width 0.1))
  (fp_line (start -3.92 -11.75) (end -2.54 -11.75) (layer F.Fab) (width 0.1))
  (fp_line (start 2.54 -11.75) (end 2.54 -11.11) (layer F.Fab) (width 0.1))
  (fp_line (start 2.54 -11.11) (end 3.92 -11.11) (layer F.Fab) (width 0.1))
  (fp_line (start 3.92 -11.11) (end 3.92 -11.75) (layer F.Fab) (width 0.1))
  (fp_line (start 3.92 -11.75) (end 2.54 -11.75) (layer F.Fab) (width 0.1))
  (fp_line (start -2.54 -9.21) (end -2.54 -8.57) (layer F.Fab) (width 0.1))
  (fp_line (start -2.54 -8.57) (end -3.92 -8.57) (layer F.Fab) (width 0.1))
  (fp_line (start -3.92 -8.57) (end -3.92 -9.21) (layer F.Fab) (width 0.1))
  (fp_line (start -3.92 -9.21) (end -2.54 -9.21) (layer F.Fab) (width 0.1))
  (fp_line (start 2.54 -9.21) (end 2.54 -8.57) (layer F.Fab) (width 0.1))
  (fp_line (start 2.54 -8.57) (end 3.92 -8.57) (layer F.Fab) (width 0.1))
  (fp_line (start 3.92 -8.57) (end 3.92 -9.21) (layer F.Fab) (width 0.1))
  (fp_line (start 3.92 -9.21) (end 2.54 -9.21) (layer F.Fab) (width 0.1))
  (fp_line (start -2.54 -6.67) (end -2.54 -6.03) (layer F.Fab) (width 0.1))
  (fp_line (start -2.54 -6.03) (end -3.92 -6.03) (layer F.Fab) (width 0.1))
  (fp_line (start -3.92 -6.03) (end -3.92 -6.67) (layer F.Fab) (width 0.1))
  (fp_line (start -3.92 -6.67) (end -2.54 -6.67) (layer F.Fab) (width 0.1))
  (fp_line (start 2.54 -6.67) (end 2.54 -6.03) (layer F.Fab) (width 0.1))
  (fp_line (start 2.54 -6.03) (end 3.92 -6.03) (layer F.Fab) (width 0.1))
  (fp_line (start 3.92 -6.03) (end 3.92 -6.67) (layer F.Fab) (width 0.1))
  (fp_line (start 3.92 -6.67) (end 2.54 -6.67) (layer F.Fab) (width 0.1))
  (fp_line (start -2.54 -4.13) (end -2.54 -3.49) (layer F.Fab) (width 0.1))
  (fp_line (start -2.54 -3.49) (end -3.92 -3.49) (layer F.Fab) (width 0.1))
  (fp_line (start -3.92 -3.49) (end -3.92 -4.13) (layer F.Fab) (width 0.1))
  (fp_line (start -3.92 -4.13) (end -2.54 -4.13) (layer F.Fab) (width 0.1))
  (fp_line (start 2.54 -4.13) (end 2.54 -3.49) (layer F.Fab) (width 0.1))
  (fp_line (start 2.54 -3.49) (end 3.92 -3.49) (layer F.Fab) (width 0.1))
  (fp_line (start 3.92 -3.49) (end 3.92 -4.13) (layer F.Fab) (width 0.1))
  (fp_line (start 3.92 -4.13) (end 2.54 -4.13) (layer F.Fab) (width 0.1))
  (fp_line (start -2.54 -1.59) (end -2.54 -0.95) (layer F.Fab) (width 0.1))
  (fp_line (start -2.54 -0.95) (end -3.92 -0.95) (layer F.Fab) (width 0.1))
  (fp_line (start -3.92 -0.95) (end -3.92 -1.59) (layer F.Fab) (width 0.1))
  (fp_line (start -3.92 -1.59) (end -2.54 -1.59) (layer F.Fab) (width 0.1))
  (fp_line (start 2.54 -1.59) (end 2.54 -0.95) (layer F.Fab) (width 0.1))
  (fp_line (start 2.54 -0.95) (end 3.92 -0.95) (layer F.Fab) (width 0.1))
  (fp_line (start 3.92 -0.95) (end 3.92 -1.59) (layer F.Fab) (width 0.1))
  (fp_line (start 3.92 -1.59) (end 2.54 -1.59) (layer F.Fab) (width 0.1))
  (fp_line (start -2.54 0.95) (end -2.54 1.59) (layer F.Fab) (width 0.1))
  (fp_line (start -2.54 1.59) (end -3.92 1.59) (layer F.Fab) (width 0.1))
  (fp_line (start -3.92 1.59) (end -3.92 0.95) (layer F.Fab) (width 0.1))
  (fp_line (start -3.92 0.95) (end -2.54 0.95) (layer F.Fab) (width 0.1))
  (fp_line (start 2.54 0.95) (end 2.54 1.59) (layer F.Fab) (width 0.1))
  (fp_line (start 2.54 1.59) (end 3.92 1.59) (layer F.Fab) (width 0.1))
  (fp_line (start 3.92 1.59) (end 3.92 0.95) (layer F.Fab) (width 0.1))
  (fp_line (start 3.92 0.95) (end 2.54 0.95) (layer F.Fab) (width 0.1))
  (fp_line (start -2.54 3.49) (end -2.54 4.13) (layer F.Fab) (width 0.1))
  (fp_line (start -2.54 4.13) (end -3.92 4.13) (layer F.Fab) (width 0.1))
  (fp_line (start -3.92 4.13) (end -3.92 3.49) (layer F.Fab) (width 0.1))
  (fp_line (start -3.92 3.49) (end -2.54 3.49) (layer F.Fab) (width 0.1))
  (fp_line (start 2.54 3.49) (end 2.54 4.13) (layer F.Fab) (width 0.1))
  (fp_line (start 2.54 4.13) (end 3.92 4.13) (layer F.Fab) (width 0.1))
  (fp_line (start 3.92 4.13) (end 3.92 3.49) (layer F.Fab) (width 0.1))
  (fp_line (start 3.92 3.49) (end 2.54 3.49) (layer F.Fab) (width 0.1))
  (fp_line (start -2.54 6.03) (end -2.54 6.67) (layer F.Fab) (width 0.1))
  (fp_line (start -2.54 6.67) (end -3.92 6.67) (layer F.Fab) (width 0.1))
  (fp_line (start -3.92 6.67) (end -3.92 6.03) (layer F.Fab) (width 0.1))
  (fp_line (start -3.92 6.03) (end -2.54 6.03) (layer F.Fab) (width 0.1))
  (fp_line (start 2.54 6.03) (end 2.54 6.67) (layer F.Fab) (width 0.1))
  (fp_line (start 2.54 6.67) (end 3.92 6.67) (layer F.Fab) (width 0.1))
  (fp_line (start 3.92 6.67) (end 3.92 6.03) (layer F.Fab) (width 0.1))
  (fp_line (start 3.92 6.03) (end 2.54 6.03) (layer F.Fab) (width 0.1))
  (fp_line (start -2.54 8.57) (end -2.54 9.21) (layer F.Fab) (width 0.1))
  (fp_line (start -2.54 9.21) (end -3.92 9.21) (layer F.Fab) (width 0.1))
  (fp_line (start -3.92 9.21) (end -3.92 8.57) (layer F.Fab) (width 0.1))
  (fp_line (start -3.92 8.57) (end -2.54 8.57) (layer F.Fab) (width 0.1))
  (fp_line (start 2.54 8.57) (end 2.54 9.21) (layer F.Fab) (width 0.1))
  (fp_line (start 2.54 9.21) (end 3.92 9.21) (layer F.Fab) (width 0.1))
  (fp_line (start 3.92 9.21) (end 3.92 8.57) (layer F.Fab) (width 0.1))
  (fp_line (start 3.92 8.57) (end 2.54 8.57) (layer F.Fab) (width 0.1))
  (fp_line (start -2.54 11.11) (end -2.54 11.75) (layer F.Fab) (width 0.1))
  (fp_line (start -2.54 11.75) (end -3.92 11.75) (layer F.Fab) (width 0.1))
  (fp_line (start -3.92 11.75) (end -3.92 11.11) (layer F.Fab) (width 0.1))
  (fp_line (start -3.92 11.11) (end -2.54 11.11) (layer F.Fab) (width 0.1))
  (fp_line (start 2.54 11.11) (end 2.54 11.75) (layer F.Fab) (width 0.1))
  (fp_line (start 2.54 11.75) (end 3.92 11.75) (layer F.Fab) (width 0.1))
  (fp_line (start 3.92 11.75) (end 3.92 11.11) (layer F.Fab) (width 0.1))
  (fp_line (start 3.92 11.11) (end 2.54 11.11) (layer F.Fab) (width 0.1))
  (fp_line (start -2.6 -12.23) (end -2.6 -12.76) (layer F.SilkS) (width 0.12))
  (fp_line (start -2.6 -12.76) (end 2.6 -12.76) (layer F.SilkS) (width 0.12))
  (fp_line (start 2.6 -12.76) (end 2.6 -12.23) (layer F.SilkS) (width 0.12))
  (fp_line (start -2.6 12.23) (end -2.6 12.76) (layer F.SilkS) (width 0.12))
  (fp_line (start -2.6 12.76) (end 2.6 12.76) (layer F.SilkS) (width 0.12))
  (fp_line (start 2.6 12.76) (end 2.6 12.23) (layer F.SilkS) (width 0.12))
  (fp_line (start -4.27 -12.23) (end -2.6 -12.23) (layer F.SilkS) (width 0.12))
  (fp_line (start -4.55 -12.95) (end -4.55 12.95) (layer F.CrtYd) (width 0.05))
  (fp_line (start -4.55 12.95) (end 4.55 12.95) (layer F.CrtYd) (width 0.05))
  (fp_line (start 4.55 12.95) (end 4.55 -12.95) (layer F.CrtYd) (width 0.05))
  (fp_line (start 4.55 -12.95) (end -4.55 -12.95) (layer F.CrtYd) (width 0.05))
  (pad 1 smd rect (at -2.77 -11.43) (size 3 1) (layers F.Cu F.Mask))
  (pad 2 smd rect (at 2.77 -11.43) (size 3 1) (layers F.Cu F.Mask))
  (pad 3 smd rect (at -2.77 -8.89) (size 3 1) (layers F.Cu F.Mask))
  (pad 4 smd rect (at 2.77 -8.89) (size 3 1) (layers F.Cu F.Mask))
  (pad 5 smd rect (at -2.77 -6.35) (size 3 1) (layers F.Cu F.Mask))
  (pad 6 smd rect (at 2.77 -6.35) (size 3 1) (layers F.Cu F.Mask))
  (pad 7 smd rect (at -2.77 -3.81) (size 3 1) (layers F.Cu F.Mask))
  (pad 8 smd rect (at 2.77 -3.81) (size 3 1) (layers F.Cu F.Mask))
  (pad 9 smd rect (at -2.77 -1.27) (size 3 1) (layers F.Cu F.Mask))
  (pad 10 smd rect (at 2.77 -1.27) (size 3 1) (layers F.Cu F.Mask))
  (pad 11 smd rect (at -2.77 1.27) (size 3 1) (layers F.Cu F.Mask))
  (pad 12 smd rect (at 2.77 1.27) (size 3 1) (layers F.Cu F.Mask))
  (pad 13 smd rect (at -2.77 3.81) (size 3 1) (layers F.Cu F.Mask))
  (pad 14 smd rect (at 2.77 3.81) (size 3 1) (layers F.Cu F.Mask))
  (pad 15 smd rect (at -2.77 6.35) (size 3 1) (layers F.Cu F.Mask))
  (pad 16 smd rect (at 2.77 6.35) (size 3 1) (layers F.Cu F.Mask))
  (pad 17 smd rect (at -2.77 8.89) (size 3 1) (layers F.Cu F.Mask))
  (pad 18 smd rect (at 2.77 8.89) (size 3 1) (layers F.Cu F.Mask))
  (pad 19 smd rect (at -2.77 11.43) (size 3 1) (layers F.Cu F.Mask))
  (pad 20 smd rect (at 2.77 11.43) (size 3 1) (layers F.Cu F.Mask))
  (model Pin_Headers.3dshapes/Pin_Header_Straight_2x10_Pitch2.54mm_SMD.wrl
    (at (xyz 0 0 0))
    (scale (xyz 1 1 1))
    (rotate (xyz 0 0 0))
  )
)