(module Pin_Header_Straight_1x08_Pitch2.54mm_SMD_Pin1Left (layer F.Cu) (tedit 588DAF27)
  (descr "surface-mounted straight pin header, 1x08, 2.54mm pitch, single row, style 1 (pin 1 left)")
  (tags "Surface mounted pin header SMD 1x08 2.54mm single row style1 pin1 left")
  (attr smd)
  (fp_text reference REF** (at 0 -11.22) (layer F.SilkS)
    (effects (font (size 1 1) (thickness 0.15)))
  )
  (fp_text value Pin_Header_Straight_1x08_Pitch2.54mm_SMD_Pin1Left (at 0 11.22) (layer F.Fab)
    (effects (font (size 1 1) (thickness 0.15)))
  )
  (fp_line (start -1.27 -10.16) (end -1.27 10.16) (layer F.Fab) (width 0.1))
  (fp_line (start -1.27 10.16) (end 1.27 10.16) (layer F.Fab) (width 0.1))
  (fp_line (start 1.27 10.16) (end 1.27 -10.16) (layer F.Fab) (width 0.1))
  (fp_line (start 1.27 -10.16) (end -1.27 -10.16) (layer F.Fab) (width 0.1))
  (fp_line (start -1.27 -9.21) (end -1.27 -8.57) (layer F.Fab) (width 0.1))
  (fp_line (start -1.27 -8.57) (end -2.65 -8.57) (layer F.Fab) (width 0.1))
  (fp_line (start -2.65 -8.57) (end -2.65 -9.21) (layer F.Fab) (width 0.1))
  (fp_line (start -2.65 -9.21) (end -1.27 -9.21) (layer F.Fab) (width 0.1))
  (fp_line (start -1.27 -4.13) (end -1.27 -3.49) (layer F.Fab) (width 0.1))
  (fp_line (start -1.27 -3.49) (end -2.65 -3.49) (layer F.Fab) (width 0.1))
  (fp_line (start -2.65 -3.49) (end -2.65 -4.13) (layer F.Fab) (width 0.1))
  (fp_line (start -2.65 -4.13) (end -1.27 -4.13) (layer F.Fab) (width 0.1))
  (fp_line (start -1.27 0.95) (end -1.27 1.59) (layer F.Fab) (width 0.1))
  (fp_line (start -1.27 1.59) (end -2.65 1.59) (layer F.Fab) (width 0.1))
  (fp_line (start -2.65 1.59) (end -2.65 0.95) (layer F.Fab) (width 0.1))
  (fp_line (start -2.65 0.95) (end -1.27 0.95) (layer F.Fab) (width 0.1))
  (fp_line (start -1.27 6.03) (end -1.27 6.67) (layer F.Fab) (width 0.1))
  (fp_line (start -1.27 6.67) (end -2.65 6.67) (layer F.Fab) (width 0.1))
  (fp_line (start -2.65 6.67) (end -2.65 6.03) (layer F.Fab) (width 0.1))
  (fp_line (start -2.65 6.03) (end -1.27 6.03) (layer F.Fab) (width 0.1))
  (fp_line (start 1.27 -6.67) (end 1.27 -6.03) (layer F.Fab) (width 0.1))
  (fp_line (start 1.27 -6.03) (end 2.65 -6.03) (layer F.Fab) (width 0.1))
  (fp_line (start 2.65 -6.03) (end 2.65 -6.67) (layer F.Fab) (width 0.1))
  (fp_line (start 2.65 -6.67) (end 1.27 -6.67) (layer F.Fab) (width 0.1))
  (fp_line (start 1.27 -1.59) (end 1.27 -0.95) (layer F.Fab) (width 0.1))
  (fp_line (start 1.27 -0.95) (end 2.65 -0.95) (layer F.Fab) (width 0.1))
  (fp_line (start 2.65 -0.95) (end 2.65 -1.59) (layer F.Fab) (width 0.1))
  (fp_line (start 2.65 -1.59) (end 1.27 -1.59) (layer F.Fab) (width 0.1))
  (fp_line (start 1.27 3.49) (end 1.27 4.13) (layer F.Fab) (width 0.1))
  (fp_line (start 1.27 4.13) (end 2.65 4.13) (layer F.Fab) (width 0.1))
  (fp_line (start 2.65 4.13) (end 2.65 3.49) (layer F.Fab) (width 0.1))
  (fp_line (start 2.65 3.49) (end 1.27 3.49) (layer F.Fab) (width 0.1))
  (fp_line (start 1.27 8.57) (end 1.27 9.21) (layer F.Fab) (width 0.1))
  (fp_line (start 1.27 9.21) (end 2.65 9.21) (layer F.Fab) (width 0.1))
  (fp_line (start 2.65 9.21) (end 2.65 8.57) (layer F.Fab) (width 0.1))
  (fp_line (start 2.65 8.57) (end 1.27 8.57) (layer F.Fab) (width 0.1))
  (fp_line (start -1.33 -9.69) (end -1.33 -10.22) (layer F.SilkS) (width 0.12))
  (fp_line (start -1.33 -10.22) (end 1.33 -10.22) (layer F.SilkS) (width 0.12))
  (fp_line (start 1.33 -10.22) (end 1.33 -9.69) (layer F.SilkS) (width 0.12))
  (fp_line (start -1.33 9.69) (end -1.33 10.22) (layer F.SilkS) (width 0.12))
  (fp_line (start -1.33 10.22) (end 1.33 10.22) (layer F.SilkS) (width 0.12))
  (fp_line (start 1.33 10.22) (end 1.33 9.69) (layer F.SilkS) (width 0.12))
  (fp_line (start 1.33 -10.22) (end 1.33 -7.03) (layer F.SilkS) (width 0.12))
  (fp_line (start -1.33 -9.69) (end -3 -9.69) (layer F.SilkS) (width 0.12))
  (fp_line (start 1.33 -5.67) (end 1.33 -1.95) (layer F.SilkS) (width 0.12))
  (fp_line (start 1.33 -0.59) (end 1.33 3.13) (layer F.SilkS) (width 0.12))
  (fp_line (start 1.33 4.49) (end 1.33 8.21) (layer F.SilkS) (width 0.12))
  (fp_line (start -1.33 -8.21) (end -1.33 -4.49) (layer F.SilkS) (width 0.12))
  (fp_line (start -1.33 -3.13) (end -1.33 0.59) (layer F.SilkS) (width 0.12))
  (fp_line (start -1.33 1.95) (end -1.33 5.67) (layer F.SilkS) (width 0.12))
  (fp_line (start -1.33 7.03) (end -1.33 10.22) (layer F.SilkS) (width 0.12))
  (fp_line (start -3.25 -10.45) (end -3.25 10.45) (layer F.CrtYd) (width 0.05))
  (fp_line (start -3.25 10.45) (end 3.25 10.45) (layer F.CrtYd) (width 0.05))
  (fp_line (start 3.25 10.45) (end 3.25 -10.45) (layer F.CrtYd) (width 0.05))
  (fp_line (start 3.25 -10.45) (end -3.25 -10.45) (layer F.CrtYd) (width 0.05))
  (pad 1 smd rect (at -1.5 -8.89) (size 3 1) (layers F.Cu F.Mask))
  (pad 3 smd rect (at -1.5 -3.81) (size 3 1) (layers F.Cu F.Mask))
  (pad 5 smd rect (at -1.5 1.27) (size 3 1) (layers F.Cu F.Mask))
  (pad 7 smd rect (at -1.5 6.35) (size 3 1) (layers F.Cu F.Mask))
  (pad 2 smd rect (at 1.5 -6.35) (size 3 1) (layers F.Cu F.Mask))
  (pad 4 smd rect (at 1.5 -1.27) (size 3 1) (layers F.Cu F.Mask))
  (pad 6 smd rect (at 1.5 3.81) (size 3 1) (layers F.Cu F.Mask))
  (pad 8 smd rect (at 1.5 8.89) (size 3 1) (layers F.Cu F.Mask))
  (model Pin_Headers.3dshapes/Pin_Header_Straight_1x08_Pitch2.54mm_SMD_Pin1Left.wrl
    (at (xyz 0 0 0))
    (scale (xyz 1 1 1))
    (rotate (xyz 0 0 0))
  )
)