(module Pin_Header_Straight_1x23_Pitch2.54mm_SMD_Pin1Left (layer F.Cu) (tedit 588DAF28)
  (descr "surface-mounted straight pin header, 1x23, 2.54mm pitch, single row, style 1 (pin 1 left)")
  (tags "Surface mounted pin header SMD 1x23 2.54mm single row style1 pin1 left")
  (attr smd)
  (fp_text reference REF** (at 0 -30.27) (layer F.SilkS)
    (effects (font (size 1 1) (thickness 0.15)))
  )
  (fp_text value Pin_Header_Straight_1x23_Pitch2.54mm_SMD_Pin1Left (at 0 30.27) (layer F.Fab)
    (effects (font (size 1 1) (thickness 0.15)))
  )
  (fp_line (start -1.27 -29.21) (end -1.27 29.21) (layer F.Fab) (width 0.1))
  (fp_line (start -1.27 29.21) (end 1.27 29.21) (layer F.Fab) (width 0.1))
  (fp_line (start 1.27 29.21) (end 1.27 -29.21) (layer F.Fab) (width 0.1))
  (fp_line (start 1.27 -29.21) (end -1.27 -29.21) (layer F.Fab) (width 0.1))
  (fp_line (start -1.27 -28.26) (end -1.27 -27.62) (layer F.Fab) (width 0.1))
  (fp_line (start -1.27 -27.62) (end -2.65 -27.62) (layer F.Fab) (width 0.1))
  (fp_line (start -2.65 -27.62) (end -2.65 -28.26) (layer F.Fab) (width 0.1))
  (fp_line (start -2.65 -28.26) (end -1.27 -28.26) (layer F.Fab) (width 0.1))
  (fp_line (start -1.27 -23.18) (end -1.27 -22.54) (layer F.Fab) (width 0.1))
  (fp_line (start -1.27 -22.54) (end -2.65 -22.54) (layer F.Fab) (width 0.1))
  (fp_line (start -2.65 -22.54) (end -2.65 -23.18) (layer F.Fab) (width 0.1))
  (fp_line (start -2.65 -23.18) (end -1.27 -23.18) (layer F.Fab) (width 0.1))
  (fp_line (start -1.27 -18.1) (end -1.27 -17.46) (layer F.Fab) (width 0.1))
  (fp_line (start -1.27 -17.46) (end -2.65 -17.46) (layer F.Fab) (width 0.1))
  (fp_line (start -2.65 -17.46) (end -2.65 -18.1) (layer F.Fab) (width 0.1))
  (fp_line (start -2.65 -18.1) (end -1.27 -18.1) (layer F.Fab) (width 0.1))
  (fp_line (start -1.27 -13.02) (end -1.27 -12.38) (layer F.Fab) (width 0.1))
  (fp_line (start -1.27 -12.38) (end -2.65 -12.38) (layer F.Fab) (width 0.1))
  (fp_line (start -2.65 -12.38) (end -2.65 -13.02) (layer F.Fab) (width 0.1))
  (fp_line (start -2.65 -13.02) (end -1.27 -13.02) (layer F.Fab) (width 0.1))
  (fp_line (start -1.27 -7.94) (end -1.27 -7.3) (layer F.Fab) (width 0.1))
  (fp_line (start -1.27 -7.3) (end -2.65 -7.3) (layer F.Fab) (width 0.1))
  (fp_line (start -2.65 -7.3) (end -2.65 -7.94) (layer F.Fab) (width 0.1))
  (fp_line (start -2.65 -7.94) (end -1.27 -7.94) (layer F.Fab) (width 0.1))
  (fp_line (start -1.27 -2.86) (end -1.27 -2.22) (layer F.Fab) (width 0.1))
  (fp_line (start -1.27 -2.22) (end -2.65 -2.22) (layer F.Fab) (width 0.1))
  (fp_line (start -2.65 -2.22) (end -2.65 -2.86) (layer F.Fab) (width 0.1))
  (fp_line (start -2.65 -2.86) (end -1.27 -2.86) (layer F.Fab) (width 0.1))
  (fp_line (start -1.27 2.22) (end -1.27 2.86) (layer F.Fab) (width 0.1))
  (fp_line (start -1.27 2.86) (end -2.65 2.86) (layer F.Fab) (width 0.1))
  (fp_line (start -2.65 2.86) (end -2.65 2.22) (layer F.Fab) (width 0.1))
  (fp_line (start -2.65 2.22) (end -1.27 2.22) (layer F.Fab) (width 0.1))
  (fp_line (start -1.27 7.3) (end -1.27 7.94) (layer F.Fab) (width 0.1))
  (fp_line (start -1.27 7.94) (end -2.65 7.94) (layer F.Fab) (width 0.1))
  (fp_line (start -2.65 7.94) (end -2.65 7.3) (layer F.Fab) (width 0.1))
  (fp_line (start -2.65 7.3) (end -1.27 7.3) (layer F.Fab) (width 0.1))
  (fp_line (start -1.27 12.38) (end -1.27 13.02) (layer F.Fab) (width 0.1))
  (fp_line (start -1.27 13.02) (end -2.65 13.02) (layer F.Fab) (width 0.1))
  (fp_line (start -2.65 13.02) (end -2.65 12.38) (layer F.Fab) (width 0.1))
  (fp_line (start -2.65 12.38) (end -1.27 12.38) (layer F.Fab) (width 0.1))
  (fp_line (start -1.27 17.46) (end -1.27 18.1) (layer F.Fab) (width 0.1))
  (fp_line (start -1.27 18.1) (end -2.65 18.1) (layer F.Fab) (width 0.1))
  (fp_line (start -2.65 18.1) (end -2.65 17.46) (layer F.Fab) (width 0.1))
  (fp_line (start -2.65 17.46) (end -1.27 17.46) (layer F.Fab) (width 0.1))
  (fp_line (start -1.27 22.54) (end -1.27 23.18) (layer F.Fab) (width 0.1))
  (fp_line (start -1.27 23.18) (end -2.65 23.18) (layer F.Fab) (width 0.1))
  (fp_line (start -2.65 23.18) (end -2.65 22.54) (layer F.Fab) (width 0.1))
  (fp_line (start -2.65 22.54) (end -1.27 22.54) (layer F.Fab) (width 0.1))
  (fp_line (start -1.27 27.62) (end -1.27 28.26) (layer F.Fab) (width 0.1))
  (fp_line (start -1.27 28.26) (end -2.65 28.26) (layer F.Fab) (width 0.1))
  (fp_line (start -2.65 28.26) (end -2.65 27.62) (layer F.Fab) (width 0.1))
  (fp_line (start -2.65 27.62) (end -1.27 27.62) (layer F.Fab) (width 0.1))
  (fp_line (start 1.27 -25.72) (end 1.27 -25.08) (layer F.Fab) (width 0.1))
  (fp_line (start 1.27 -25.08) (end 2.65 -25.08) (layer F.Fab) (width 0.1))
  (fp_line (start 2.65 -25.08) (end 2.65 -25.72) (layer F.Fab) (width 0.1))
  (fp_line (start 2.65 -25.72) (end 1.27 -25.72) (layer F.Fab) (width 0.1))
  (fp_line (start 1.27 -20.64) (end 1.27 -20) (layer F.Fab) (width 0.1))
  (fp_line (start 1.27 -20) (end 2.65 -20) (layer F.Fab) (width 0.1))
  (fp_line (start 2.65 -20) (end 2.65 -20.64) (layer F.Fab) (width 0.1))
  (fp_line (start 2.65 -20.64) (end 1.27 -20.64) (layer F.Fab) (width 0.1))
  (fp_line (start 1.27 -15.56) (end 1.27 -14.92) (layer F.Fab) (width 0.1))
  (fp_line (start 1.27 -14.92) (end 2.65 -14.92) (layer F.Fab) (width 0.1))
  (fp_line (start 2.65 -14.92) (end 2.65 -15.56) (layer F.Fab) (width 0.1))
  (fp_line (start 2.65 -15.56) (end 1.27 -15.56) (layer F.Fab) (width 0.1))
  (fp_line (start 1.27 -10.48) (end 1.27 -9.84) (layer F.Fab) (width 0.1))
  (fp_line (start 1.27 -9.84) (end 2.65 -9.84) (layer F.Fab) (width 0.1))
  (fp_line (start 2.65 -9.84) (end 2.65 -10.48) (layer F.Fab) (width 0.1))
  (fp_line (start 2.65 -10.48) (end 1.27 -10.48) (layer F.Fab) (width 0.1))
  (fp_line (start 1.27 -5.4) (end 1.27 -4.76) (layer F.Fab) (width 0.1))
  (fp_line (start 1.27 -4.76) (end 2.65 -4.76) (layer F.Fab) (width 0.1))
  (fp_line (start 2.65 -4.76) (end 2.65 -5.4) (layer F.Fab) (width 0.1))
  (fp_line (start 2.65 -5.4) (end 1.27 -5.4) (layer F.Fab) (width 0.1))
  (fp_line (start 1.27 -0.32) (end 1.27 0.32) (layer F.Fab) (width 0.1))
  (fp_line (start 1.27 0.32) (end 2.65 0.32) (layer F.Fab) (width 0.1))
  (fp_line (start 2.65 0.32) (end 2.65 -0.32) (layer F.Fab) (width 0.1))
  (fp_line (start 2.65 -0.32) (end 1.27 -0.32) (layer F.Fab) (width 0.1))
  (fp_line (start 1.27 4.76) (end 1.27 5.4) (layer F.Fab) (width 0.1))
  (fp_line (start 1.27 5.4) (end 2.65 5.4) (layer F.Fab) (width 0.1))
  (fp_line (start 2.65 5.4) (end 2.65 4.76) (layer F.Fab) (width 0.1))
  (fp_line (start 2.65 4.76) (end 1.27 4.76) (layer F.Fab) (width 0.1))
  (fp_line (start 1.27 9.84) (end 1.27 10.48) (layer F.Fab) (width 0.1))
  (fp_line (start 1.27 10.48) (end 2.65 10.48) (layer F.Fab) (width 0.1))
  (fp_line (start 2.65 10.48) (end 2.65 9.84) (layer F.Fab) (width 0.1))
  (fp_line (start 2.65 9.84) (end 1.27 9.84) (layer F.Fab) (width 0.1))
  (fp_line (start 1.27 14.92) (end 1.27 15.56) (layer F.Fab) (width 0.1))
  (fp_line (start 1.27 15.56) (end 2.65 15.56) (layer F.Fab) (width 0.1))
  (fp_line (start 2.65 15.56) (end 2.65 14.92) (layer F.Fab) (width 0.1))
  (fp_line (start 2.65 14.92) (end 1.27 14.92) (layer F.Fab) (width 0.1))
  (fp_line (start 1.27 20) (end 1.27 20.64) (layer F.Fab) (width 0.1))
  (fp_line (start 1.27 20.64) (end 2.65 20.64) (layer F.Fab) (width 0.1))
  (fp_line (start 2.65 20.64) (end 2.65 20) (layer F.Fab) (width 0.1))
  (fp_line (start 2.65 20) (end 1.27 20) (layer F.Fab) (width 0.1))
  (fp_line (start 1.27 25.08) (end 1.27 25.72) (layer F.Fab) (width 0.1))
  (fp_line (start 1.27 25.72) (end 2.65 25.72) (layer F.Fab) (width 0.1))
  (fp_line (start 2.65 25.72) (end 2.65 25.08) (layer F.Fab) (width 0.1))
  (fp_line (start 2.65 25.08) (end 1.27 25.08) (layer F.Fab) (width 0.1))
  (fp_line (start -1.33 -28.74) (end -1.33 -29.27) (layer F.SilkS) (width 0.12))
  (fp_line (start -1.33 -29.27) (end 1.33 -29.27) (layer F.SilkS) (width 0.12))
  (fp_line (start 1.33 -29.27) (end 1.33 -28.74) (layer F.SilkS) (width 0.12))
  (fp_line (start -1.33 28.74) (end -1.33 29.27) (layer F.SilkS) (width 0.12))
  (fp_line (start -1.33 29.27) (end 1.33 29.27) (layer F.SilkS) (width 0.12))
  (fp_line (start 1.33 29.27) (end 1.33 28.74) (layer F.SilkS) (width 0.12))
  (fp_line (start 1.33 -29.27) (end 1.33 -26.08) (layer F.SilkS) (width 0.12))
  (fp_line (start -1.33 -28.74) (end -3 -28.74) (layer F.SilkS) (width 0.12))
  (fp_line (start 1.33 -24.72) (end 1.33 -21) (layer F.SilkS) (width 0.12))
  (fp_line (start 1.33 -19.64) (end 1.33 -15.92) (layer F.SilkS) (width 0.12))
  (fp_line (start 1.33 -14.56) (end 1.33 -10.84) (layer F.SilkS) (width 0.12))
  (fp_line (start 1.33 -9.48) (end 1.33 -5.76) (layer F.SilkS) (width 0.12))
  (fp_line (start 1.33 -4.4) (end 1.33 -0.68) (layer F.SilkS) (width 0.12))
  (fp_line (start 1.33 0.68) (end 1.33 4.4) (layer F.SilkS) (width 0.12))
  (fp_line (start 1.33 5.76) (end 1.33 9.48) (layer F.SilkS) (width 0.12))
  (fp_line (start 1.33 10.84) (end 1.33 14.56) (layer F.SilkS) (width 0.12))
  (fp_line (start 1.33 15.92) (end 1.33 19.64) (layer F.SilkS) (width 0.12))
  (fp_line (start 1.33 21) (end 1.33 24.72) (layer F.SilkS) (width 0.12))
  (fp_line (start 1.33 26.08) (end 1.33 29.27) (layer F.SilkS) (width 0.12))
  (fp_line (start -1.33 -27.26) (end -1.33 -23.54) (layer F.SilkS) (width 0.12))
  (fp_line (start -1.33 -22.18) (end -1.33 -18.46) (layer F.SilkS) (width 0.12))
  (fp_line (start -1.33 -17.1) (end -1.33 -13.38) (layer F.SilkS) (width 0.12))
  (fp_line (start -1.33 -12.02) (end -1.33 -8.3) (layer F.SilkS) (width 0.12))
  (fp_line (start -1.33 -6.94) (end -1.33 -3.22) (layer F.SilkS) (width 0.12))
  (fp_line (start -1.33 -1.86) (end -1.33 1.86) (layer F.SilkS) (width 0.12))
  (fp_line (start -1.33 3.22) (end -1.33 6.94) (layer F.SilkS) (width 0.12))
  (fp_line (start -1.33 8.3) (end -1.33 12.02) (layer F.SilkS) (width 0.12))
  (fp_line (start -1.33 13.38) (end -1.33 17.1) (layer F.SilkS) (width 0.12))
  (fp_line (start -1.33 18.46) (end -1.33 22.18) (layer F.SilkS) (width 0.12))
  (fp_line (start -1.33 23.54) (end -1.33 27.26) (layer F.SilkS) (width 0.12))
  (fp_line (start -3.25 -29.5) (end -3.25 29.5) (layer F.CrtYd) (width 0.05))
  (fp_line (start -3.25 29.5) (end 3.25 29.5) (layer F.CrtYd) (width 0.05))
  (fp_line (start 3.25 29.5) (end 3.25 -29.5) (layer F.CrtYd) (width 0.05))
  (fp_line (start 3.25 -29.5) (end -3.25 -29.5) (layer F.CrtYd) (width 0.05))
  (pad 1 smd rect (at -1.5 -27.94) (size 3 1) (layers F.Cu F.Mask))
  (pad 3 smd rect (at -1.5 -22.86) (size 3 1) (layers F.Cu F.Mask))
  (pad 5 smd rect (at -1.5 -17.78) (size 3 1) (layers F.Cu F.Mask))
  (pad 7 smd rect (at -1.5 -12.7) (size 3 1) (layers F.Cu F.Mask))
  (pad 9 smd rect (at -1.5 -7.62) (size 3 1) (layers F.Cu F.Mask))
  (pad 11 smd rect (at -1.5 -2.54) (size 3 1) (layers F.Cu F.Mask))
  (pad 13 smd rect (at -1.5 2.54) (size 3 1) (layers F.Cu F.Mask))
  (pad 15 smd rect (at -1.5 7.62) (size 3 1) (layers F.Cu F.Mask))
  (pad 17 smd rect (at -1.5 12.7) (size 3 1) (layers F.Cu F.Mask))
  (pad 19 smd rect (at -1.5 17.78) (size 3 1) (layers F.Cu F.Mask))
  (pad 21 smd rect (at -1.5 22.86) (size 3 1) (layers F.Cu F.Mask))
  (pad 23 smd rect (at -1.5 27.94) (size 3 1) (layers F.Cu F.Mask))
  (pad 2 smd rect (at 1.5 -25.4) (size 3 1) (layers F.Cu F.Mask))
  (pad 4 smd rect (at 1.5 -20.32) (size 3 1) (layers F.Cu F.Mask))
  (pad 6 smd rect (at 1.5 -15.24) (size 3 1) (layers F.Cu F.Mask))
  (pad 8 smd rect (at 1.5 -10.16) (size 3 1) (layers F.Cu F.Mask))
  (pad 10 smd rect (at 1.5 -5.08) (size 3 1) (layers F.Cu F.Mask))
  (pad 12 smd rect (at 1.5 0) (size 3 1) (layers F.Cu F.Mask))
  (pad 14 smd rect (at 1.5 5.08) (size 3 1) (layers F.Cu F.Mask))
  (pad 16 smd rect (at 1.5 10.16) (size 3 1) (layers F.Cu F.Mask))
  (pad 18 smd rect (at 1.5 15.24) (size 3 1) (layers F.Cu F.Mask))
  (pad 20 smd rect (at 1.5 20.32) (size 3 1) (layers F.Cu F.Mask))
  (pad 22 smd rect (at 1.5 25.4) (size 3 1) (layers F.Cu F.Mask))
  (model Pin_Headers.3dshapes/Pin_Header_Straight_1x23_Pitch2.54mm_SMD_Pin1Left.wrl
    (at (xyz 0 0 0))
    (scale (xyz 1 1 1))
    (rotate (xyz 0 0 0))
  )
)