(module Pin_Header_Straight_1x30_Pitch1.27mm_SMD_Pin1Left (layer F.Cu) (tedit 588DAF35)
  (descr "surface-mounted straight pin header, 1x30, 1.27mm pitch, single row, style 1 (pin 1 left)")
  (tags "Surface mounted pin header SMD 1x30 1.27mm single row style1 pin1 left")
  (attr smd)
  (fp_text reference REF** (at 0 -20.11) (layer F.SilkS)
    (effects (font (size 1 1) (thickness 0.15)))
  )
  (fp_text value Pin_Header_Straight_1x30_Pitch1.27mm_SMD_Pin1Left (at 0 20.11) (layer F.Fab)
    (effects (font (size 1 1) (thickness 0.15)))
  )
  (fp_line (start -0.635 -19.05) (end -0.635 19.05) (layer F.Fab) (width 0.1))
  (fp_line (start -0.635 19.05) (end 0.635 19.05) (layer F.Fab) (width 0.1))
  (fp_line (start 0.635 19.05) (end 0.635 -19.05) (layer F.Fab) (width 0.1))
  (fp_line (start 0.635 -19.05) (end -0.635 -19.05) (layer F.Fab) (width 0.1))
  (fp_line (start -0.635 -18.615) (end -0.635 -18.215) (layer F.Fab) (width 0.1))
  (fp_line (start -0.635 -18.215) (end -1.92 -18.215) (layer F.Fab) (width 0.1))
  (fp_line (start -1.92 -18.215) (end -1.92 -18.615) (layer F.Fab) (width 0.1))
  (fp_line (start -1.92 -18.615) (end -0.635 -18.615) (layer F.Fab) (width 0.1))
  (fp_line (start -0.635 -16.075) (end -0.635 -15.675) (layer F.Fab) (width 0.1))
  (fp_line (start -0.635 -15.675) (end -1.92 -15.675) (layer F.Fab) (width 0.1))
  (fp_line (start -1.92 -15.675) (end -1.92 -16.075) (layer F.Fab) (width 0.1))
  (fp_line (start -1.92 -16.075) (end -0.635 -16.075) (layer F.Fab) (width 0.1))
  (fp_line (start -0.635 -13.535) (end -0.635 -13.135) (layer F.Fab) (width 0.1))
  (fp_line (start -0.635 -13.135) (end -1.92 -13.135) (layer F.Fab) (width 0.1))
  (fp_line (start -1.92 -13.135) (end -1.92 -13.535) (layer F.Fab) (width 0.1))
  (fp_line (start -1.92 -13.535) (end -0.635 -13.535) (layer F.Fab) (width 0.1))
  (fp_line (start -0.635 -10.995) (end -0.635 -10.595) (layer F.Fab) (width 0.1))
  (fp_line (start -0.635 -10.595) (end -1.92 -10.595) (layer F.Fab) (width 0.1))
  (fp_line (start -1.92 -10.595) (end -1.92 -10.995) (layer F.Fab) (width 0.1))
  (fp_line (start -1.92 -10.995) (end -0.635 -10.995) (layer F.Fab) (width 0.1))
  (fp_line (start -0.635 -8.455) (end -0.635 -8.055) (layer F.Fab) (width 0.1))
  (fp_line (start -0.635 -8.055) (end -1.92 -8.055) (layer F.Fab) (width 0.1))
  (fp_line (start -1.92 -8.055) (end -1.92 -8.455) (layer F.Fab) (width 0.1))
  (fp_line (start -1.92 -8.455) (end -0.635 -8.455) (layer F.Fab) (width 0.1))
  (fp_line (start -0.635 -5.915) (end -0.635 -5.515) (layer F.Fab) (width 0.1))
  (fp_line (start -0.635 -5.515) (end -1.92 -5.515) (layer F.Fab) (width 0.1))
  (fp_line (start -1.92 -5.515) (end -1.92 -5.915) (layer F.Fab) (width 0.1))
  (fp_line (start -1.92 -5.915) (end -0.635 -5.915) (layer F.Fab) (width 0.1))
  (fp_line (start -0.635 -3.375) (end -0.635 -2.975) (layer F.Fab) (width 0.1))
  (fp_line (start -0.635 -2.975) (end -1.92 -2.975) (layer F.Fab) (width 0.1))
  (fp_line (start -1.92 -2.975) (end -1.92 -3.375) (layer F.Fab) (width 0.1))
  (fp_line (start -1.92 -3.375) (end -0.635 -3.375) (layer F.Fab) (width 0.1))
  (fp_line (start -0.635 -0.835) (end -0.635 -0.435) (layer F.Fab) (width 0.1))
  (fp_line (start -0.635 -0.435) (end -1.92 -0.435) (layer F.Fab) (width 0.1))
  (fp_line (start -1.92 -0.435) (end -1.92 -0.835) (layer F.Fab) (width 0.1))
  (fp_line (start -1.92 -0.835) (end -0.635 -0.835) (layer F.Fab) (width 0.1))
  (fp_line (start -0.635 1.705) (end -0.635 2.105) (layer F.Fab) (width 0.1))
  (fp_line (start -0.635 2.105) (end -1.92 2.105) (layer F.Fab) (width 0.1))
  (fp_line (start -1.92 2.105) (end -1.92 1.705) (layer F.Fab) (width 0.1))
  (fp_line (start -1.92 1.705) (end -0.635 1.705) (layer F.Fab) (width 0.1))
  (fp_line (start -0.635 4.245) (end -0.635 4.645) (layer F.Fab) (width 0.1))
  (fp_line (start -0.635 4.645) (end -1.92 4.645) (layer F.Fab) (width 0.1))
  (fp_line (start -1.92 4.645) (end -1.92 4.245) (layer F.Fab) (width 0.1))
  (fp_line (start -1.92 4.245) (end -0.635 4.245) (layer F.Fab) (width 0.1))
  (fp_line (start -0.635 6.785) (end -0.635 7.185) (layer F.Fab) (width 0.1))
  (fp_line (start -0.635 7.185) (end -1.92 7.185) (layer F.Fab) (width 0.1))
  (fp_line (start -1.92 7.185) (end -1.92 6.785) (layer F.Fab) (width 0.1))
  (fp_line (start -1.92 6.785) (end -0.635 6.785) (layer F.Fab) (width 0.1))
  (fp_line (start -0.635 9.325) (end -0.635 9.725) (layer F.Fab) (width 0.1))
  (fp_line (start -0.635 9.725) (end -1.92 9.725) (layer F.Fab) (width 0.1))
  (fp_line (start -1.92 9.725) (end -1.92 9.325) (layer F.Fab) (width 0.1))
  (fp_line (start -1.92 9.325) (end -0.635 9.325) (layer F.Fab) (width 0.1))
  (fp_line (start -0.635 11.865) (end -0.635 12.265) (layer F.Fab) (width 0.1))
  (fp_line (start -0.635 12.265) (end -1.92 12.265) (layer F.Fab) (width 0.1))
  (fp_line (start -1.92 12.265) (end -1.92 11.865) (layer F.Fab) (width 0.1))
  (fp_line (start -1.92 11.865) (end -0.635 11.865) (layer F.Fab) (width 0.1))
  (fp_line (start -0.635 14.405) (end -0.635 14.805) (layer F.Fab) (width 0.1))
  (fp_line (start -0.635 14.805) (end -1.92 14.805) (layer F.Fab) (width 0.1))
  (fp_line (start -1.92 14.805) (end -1.92 14.405) (layer F.Fab) (width 0.1))
  (fp_line (start -1.92 14.405) (end -0.635 14.405) (layer F.Fab) (width 0.1))
  (fp_line (start -0.635 16.945) (end -0.635 17.345) (layer F.Fab) (width 0.1))
  (fp_line (start -0.635 17.345) (end -1.92 17.345) (layer F.Fab) (width 0.1))
  (fp_line (start -1.92 17.345) (end -1.92 16.945) (layer F.Fab) (width 0.1))
  (fp_line (start -1.92 16.945) (end -0.635 16.945) (layer F.Fab) (width 0.1))
  (fp_line (start 0.635 -17.345) (end 0.635 -16.945) (layer F.Fab) (width 0.1))
  (fp_line (start 0.635 -16.945) (end 1.92 -16.945) (layer F.Fab) (width 0.1))
  (fp_line (start 1.92 -16.945) (end 1.92 -17.345) (layer F.Fab) (width 0.1))
  (fp_line (start 1.92 -17.345) (end 0.635 -17.345) (layer F.Fab) (width 0.1))
  (fp_line (start 0.635 -14.805) (end 0.635 -14.405) (layer F.Fab) (width 0.1))
  (fp_line (start 0.635 -14.405) (end 1.92 -14.405) (layer F.Fab) (width 0.1))
  (fp_line (start 1.92 -14.405) (end 1.92 -14.805) (layer F.Fab) (width 0.1))
  (fp_line (start 1.92 -14.805) (end 0.635 -14.805) (layer F.Fab) (width 0.1))
  (fp_line (start 0.635 -12.265) (end 0.635 -11.865) (layer F.Fab) (width 0.1))
  (fp_line (start 0.635 -11.865) (end 1.92 -11.865) (layer F.Fab) (width 0.1))
  (fp_line (start 1.92 -11.865) (end 1.92 -12.265) (layer F.Fab) (width 0.1))
  (fp_line (start 1.92 -12.265) (end 0.635 -12.265) (layer F.Fab) (width 0.1))
  (fp_line (start 0.635 -9.725) (end 0.635 -9.325) (layer F.Fab) (width 0.1))
  (fp_line (start 0.635 -9.325) (end 1.92 -9.325) (layer F.Fab) (width 0.1))
  (fp_line (start 1.92 -9.325) (end 1.92 -9.725) (layer F.Fab) (width 0.1))
  (fp_line (start 1.92 -9.725) (end 0.635 -9.725) (layer F.Fab) (width 0.1))
  (fp_line (start 0.635 -7.185) (end 0.635 -6.785) (layer F.Fab) (width 0.1))
  (fp_line (start 0.635 -6.785) (end 1.92 -6.785) (layer F.Fab) (width 0.1))
  (fp_line (start 1.92 -6.785) (end 1.92 -7.185) (layer F.Fab) (width 0.1))
  (fp_line (start 1.92 -7.185) (end 0.635 -7.185) (layer F.Fab) (width 0.1))
  (fp_line (start 0.635 -4.645) (end 0.635 -4.245) (layer F.Fab) (width 0.1))
  (fp_line (start 0.635 -4.245) (end 1.92 -4.245) (layer F.Fab) (width 0.1))
  (fp_line (start 1.92 -4.245) (end 1.92 -4.645) (layer F.Fab) (width 0.1))
  (fp_line (start 1.92 -4.645) (end 0.635 -4.645) (layer F.Fab) (width 0.1))
  (fp_line (start 0.635 -2.105) (end 0.635 -1.705) (layer F.Fab) (width 0.1))
  (fp_line (start 0.635 -1.705) (end 1.92 -1.705) (layer F.Fab) (width 0.1))
  (fp_line (start 1.92 -1.705) (end 1.92 -2.105) (layer F.Fab) (width 0.1))
  (fp_line (start 1.92 -2.105) (end 0.635 -2.105) (layer F.Fab) (width 0.1))
  (fp_line (start 0.635 0.435) (end 0.635 0.835) (layer F.Fab) (width 0.1))
  (fp_line (start 0.635 0.835) (end 1.92 0.835) (layer F.Fab) (width 0.1))
  (fp_line (start 1.92 0.835) (end 1.92 0.435) (layer F.Fab) (width 0.1))
  (fp_line (start 1.92 0.435) (end 0.635 0.435) (layer F.Fab) (width 0.1))
  (fp_line (start 0.635 2.975) (end 0.635 3.375) (layer F.Fab) (width 0.1))
  (fp_line (start 0.635 3.375) (end 1.92 3.375) (layer F.Fab) (width 0.1))
  (fp_line (start 1.92 3.375) (end 1.92 2.975) (layer F.Fab) (width 0.1))
  (fp_line (start 1.92 2.975) (end 0.635 2.975) (layer F.Fab) (width 0.1))
  (fp_line (start 0.635 5.515) (end 0.635 5.915) (layer F.Fab) (width 0.1))
  (fp_line (start 0.635 5.915) (end 1.92 5.915) (layer F.Fab) (width 0.1))
  (fp_line (start 1.92 5.915) (end 1.92 5.515) (layer F.Fab) (width 0.1))
  (fp_line (start 1.92 5.515) (end 0.635 5.515) (layer F.Fab) (width 0.1))
  (fp_line (start 0.635 8.055) (end 0.635 8.455) (layer F.Fab) (width 0.1))
  (fp_line (start 0.635 8.455) (end 1.92 8.455) (layer F.Fab) (width 0.1))
  (fp_line (start 1.92 8.455) (end 1.92 8.055) (layer F.Fab) (width 0.1))
  (fp_line (start 1.92 8.055) (end 0.635 8.055) (layer F.Fab) (width 0.1))
  (fp_line (start 0.635 10.595) (end 0.635 10.995) (layer F.Fab) (width 0.1))
  (fp_line (start 0.635 10.995) (end 1.92 10.995) (layer F.Fab) (width 0.1))
  (fp_line (start 1.92 10.995) (end 1.92 10.595) (layer F.Fab) (width 0.1))
  (fp_line (start 1.92 10.595) (end 0.635 10.595) (layer F.Fab) (width 0.1))
  (fp_line (start 0.635 13.135) (end 0.635 13.535) (layer F.Fab) (width 0.1))
  (fp_line (start 0.635 13.535) (end 1.92 13.535) (layer F.Fab) (width 0.1))
  (fp_line (start 1.92 13.535) (end 1.92 13.135) (layer F.Fab) (width 0.1))
  (fp_line (start 1.92 13.135) (end 0.635 13.135) (layer F.Fab) (width 0.1))
  (fp_line (start 0.635 15.675) (end 0.635 16.075) (layer F.Fab) (width 0.1))
  (fp_line (start 0.635 16.075) (end 1.92 16.075) (layer F.Fab) (width 0.1))
  (fp_line (start 1.92 16.075) (end 1.92 15.675) (layer F.Fab) (width 0.1))
  (fp_line (start 1.92 15.675) (end 0.635 15.675) (layer F.Fab) (width 0.1))
  (fp_line (start 0.635 18.215) (end 0.635 18.615) (layer F.Fab) (width 0.1))
  (fp_line (start 0.635 18.615) (end 1.92 18.615) (layer F.Fab) (width 0.1))
  (fp_line (start 1.92 18.615) (end 1.92 18.215) (layer F.Fab) (width 0.1))
  (fp_line (start 1.92 18.215) (end 0.635 18.215) (layer F.Fab) (width 0.1))
  (fp_line (start -0.695 -19.09) (end -0.695 -19.11) (layer F.SilkS) (width 0.12))
  (fp_line (start -0.695 -19.11) (end 0.695 -19.11) (layer F.SilkS) (width 0.12))
  (fp_line (start 0.695 -19.11) (end 0.695 -19.09) (layer F.SilkS) (width 0.12))
  (fp_line (start -0.695 19.09) (end -0.695 19.11) (layer F.SilkS) (width 0.12))
  (fp_line (start -0.695 19.11) (end 0.695 19.11) (layer F.SilkS) (width 0.12))
  (fp_line (start 0.695 19.11) (end 0.695 19.09) (layer F.SilkS) (width 0.12))
  (fp_line (start 0.695 -19.11) (end 0.695 -17.7) (layer F.SilkS) (width 0.12))
  (fp_line (start -0.695 -19.09) (end -3 -19.09) (layer F.SilkS) (width 0.12))
  (fp_line (start 0.695 -16.59) (end 0.695 -15.16) (layer F.SilkS) (width 0.12))
  (fp_line (start 0.695 -14.05) (end 0.695 -12.62) (layer F.SilkS) (width 0.12))
  (fp_line (start 0.695 -11.51) (end 0.695 -10.08) (layer F.SilkS) (width 0.12))
  (fp_line (start 0.695 -8.97) (end 0.695 -7.54) (layer F.SilkS) (width 0.12))
  (fp_line (start 0.695 -6.43) (end 0.695 -5) (layer F.SilkS) (width 0.12))
  (fp_line (start 0.695 -3.89) (end 0.695 -2.46) (layer F.SilkS) (width 0.12))
  (fp_line (start 0.695 -1.35) (end 0.695 0.08) (layer F.SilkS) (width 0.12))
  (fp_line (start 0.695 1.19) (end 0.695 2.62) (layer F.SilkS) (width 0.12))
  (fp_line (start 0.695 3.73) (end 0.695 5.16) (layer F.SilkS) (width 0.12))
  (fp_line (start 0.695 6.27) (end 0.695 7.7) (layer F.SilkS) (width 0.12))
  (fp_line (start 0.695 8.81) (end 0.695 10.24) (layer F.SilkS) (width 0.12))
  (fp_line (start 0.695 11.35) (end 0.695 12.78) (layer F.SilkS) (width 0.12))
  (fp_line (start 0.695 13.89) (end 0.695 15.32) (layer F.SilkS) (width 0.12))
  (fp_line (start 0.695 16.43) (end 0.695 17.86) (layer F.SilkS) (width 0.12))
  (fp_line (start -0.695 -17.86) (end -0.695 -16.43) (layer F.SilkS) (width 0.12))
  (fp_line (start -0.695 -15.32) (end -0.695 -13.89) (layer F.SilkS) (width 0.12))
  (fp_line (start -0.695 -12.78) (end -0.695 -11.35) (layer F.SilkS) (width 0.12))
  (fp_line (start -0.695 -10.24) (end -0.695 -8.81) (layer F.SilkS) (width 0.12))
  (fp_line (start -0.695 -7.7) (end -0.695 -6.27) (layer F.SilkS) (width 0.12))
  (fp_line (start -0.695 -5.16) (end -0.695 -3.73) (layer F.SilkS) (width 0.12))
  (fp_line (start -0.695 -2.62) (end -0.695 -1.19) (layer F.SilkS) (width 0.12))
  (fp_line (start -0.695 -0.08) (end -0.695 1.35) (layer F.SilkS) (width 0.12))
  (fp_line (start -0.695 2.46) (end -0.695 3.89) (layer F.SilkS) (width 0.12))
  (fp_line (start -0.695 5) (end -0.695 6.43) (layer F.SilkS) (width 0.12))
  (fp_line (start -0.695 7.54) (end -0.695 8.97) (layer F.SilkS) (width 0.12))
  (fp_line (start -0.695 10.08) (end -0.695 11.51) (layer F.SilkS) (width 0.12))
  (fp_line (start -0.695 12.62) (end -0.695 14.05) (layer F.SilkS) (width 0.12))
  (fp_line (start -0.695 15.16) (end -0.695 16.59) (layer F.SilkS) (width 0.12))
  (fp_line (start -0.695 17.7) (end -0.695 19.11) (layer F.SilkS) (width 0.12))
  (fp_line (start -3.25 -19.3) (end -3.25 19.3) (layer F.CrtYd) (width 0.05))
  (fp_line (start -3.25 19.3) (end 3.25 19.3) (layer F.CrtYd) (width 0.05))
  (fp_line (start 3.25 19.3) (end 3.25 -19.3) (layer F.CrtYd) (width 0.05))
  (fp_line (start 3.25 -19.3) (end -3.25 -19.3) (layer F.CrtYd) (width 0.05))
  (pad 1 smd rect (at -1.95 -18.415) (size 2.1 0.75) (layers F.Cu F.Mask))
  (pad 3 smd rect (at -1.95 -15.875) (size 2.1 0.75) (layers F.Cu F.Mask))
  (pad 5 smd rect (at -1.95 -13.335) (size 2.1 0.75) (layers F.Cu F.Mask))
  (pad 7 smd rect (at -1.95 -10.795) (size 2.1 0.75) (layers F.Cu F.Mask))
  (pad 9 smd rect (at -1.95 -8.255) (size 2.1 0.75) (layers F.Cu F.Mask))
  (pad 11 smd rect (at -1.95 -5.715) (size 2.1 0.75) (layers F.Cu F.Mask))
  (pad 13 smd rect (at -1.95 -3.175) (size 2.1 0.75) (layers F.Cu F.Mask))
  (pad 15 smd rect (at -1.95 -0.635) (size 2.1 0.75) (layers F.Cu F.Mask))
  (pad 17 smd rect (at -1.95 1.905) (size 2.1 0.75) (layers F.Cu F.Mask))
  (pad 19 smd rect (at -1.95 4.445) (size 2.1 0.75) (layers F.Cu F.Mask))
  (pad 21 smd rect (at -1.95 6.985) (size 2.1 0.75) (layers F.Cu F.Mask))
  (pad 23 smd rect (at -1.95 9.525) (size 2.1 0.75) (layers F.Cu F.Mask))
  (pad 25 smd rect (at -1.95 12.065) (size 2.1 0.75) (layers F.Cu F.Mask))
  (pad 27 smd rect (at -1.95 14.605) (size 2.1 0.75) (layers F.Cu F.Mask))
  (pad 29 smd rect (at -1.95 17.145) (size 2.1 0.75) (layers F.Cu F.Mask))
  (pad 2 smd rect (at 1.95 -17.145) (size 2.1 0.75) (layers F.Cu F.Mask))
  (pad 4 smd rect (at 1.95 -14.605) (size 2.1 0.75) (layers F.Cu F.Mask))
  (pad 6 smd rect (at 1.95 -12.065) (size 2.1 0.75) (layers F.Cu F.Mask))
  (pad 8 smd rect (at 1.95 -9.525) (size 2.1 0.75) (layers F.Cu F.Mask))
  (pad 10 smd rect (at 1.95 -6.985) (size 2.1 0.75) (layers F.Cu F.Mask))
  (pad 12 smd rect (at 1.95 -4.445) (size 2.1 0.75) (layers F.Cu F.Mask))
  (pad 14 smd rect (at 1.95 -1.905) (size 2.1 0.75) (layers F.Cu F.Mask))
  (pad 16 smd rect (at 1.95 0.635) (size 2.1 0.75) (layers F.Cu F.Mask))
  (pad 18 smd rect (at 1.95 3.175) (size 2.1 0.75) (layers F.Cu F.Mask))
  (pad 20 smd rect (at 1.95 5.715) (size 2.1 0.75) (layers F.Cu F.Mask))
  (pad 22 smd rect (at 1.95 8.255) (size 2.1 0.75) (layers F.Cu F.Mask))
  (pad 24 smd rect (at 1.95 10.795) (size 2.1 0.75) (layers F.Cu F.Mask))
  (pad 26 smd rect (at 1.95 13.335) (size 2.1 0.75) (layers F.Cu F.Mask))
  (pad 28 smd rect (at 1.95 15.875) (size 2.1 0.75) (layers F.Cu F.Mask))
  (pad 30 smd rect (at 1.95 18.415) (size 2.1 0.75) (layers F.Cu F.Mask))
  (model Pin_Headers.3dshapes/Pin_Header_Straight_1x30_Pitch1.27mm_SMD_Pin1Left.wrl
    (at (xyz 0 0 0))
    (scale (xyz 1 1 1))
    (rotate (xyz 0 0 0))
  )
)