(module Pin_Header_Straight_1x06_Pitch1.27mm_SMD_Pin1Left (layer F.Cu) (tedit 588DAF33)
  (descr "surface-mounted straight pin header, 1x06, 1.27mm pitch, single row, style 1 (pin 1 left)")
  (tags "Surface mounted pin header SMD 1x06 1.27mm single row style1 pin1 left")
  (attr smd)
  (fp_text reference REF** (at 0 -4.87) (layer F.SilkS)
    (effects (font (size 1 1) (thickness 0.15)))
  )
  (fp_text value Pin_Header_Straight_1x06_Pitch1.27mm_SMD_Pin1Left (at 0 4.87) (layer F.Fab)
    (effects (font (size 1 1) (thickness 0.15)))
  )
  (fp_line (start -0.635 -3.81) (end -0.635 3.81) (layer F.Fab) (width 0.1))
  (fp_line (start -0.635 3.81) (end 0.635 3.81) (layer F.Fab) (width 0.1))
  (fp_line (start 0.635 3.81) (end 0.635 -3.81) (layer F.Fab) (width 0.1))
  (fp_line (start 0.635 -3.81) (end -0.635 -3.81) (layer F.Fab) (width 0.1))
  (fp_line (start -0.635 -3.375) (end -0.635 -2.975) (layer F.Fab) (width 0.1))
  (fp_line (start -0.635 -2.975) (end -1.92 -2.975) (layer F.Fab) (width 0.1))
  (fp_line (start -1.92 -2.975) (end -1.92 -3.375) (layer F.Fab) (width 0.1))
  (fp_line (start -1.92 -3.375) (end -0.635 -3.375) (layer F.Fab) (width 0.1))
  (fp_line (start -0.635 -0.835) (end -0.635 -0.435) (layer F.Fab) (width 0.1))
  (fp_line (start -0.635 -0.435) (end -1.92 -0.435) (layer F.Fab) (width 0.1))
  (fp_line (start -1.92 -0.435) (end -1.92 -0.835) (layer F.Fab) (width 0.1))
  (fp_line (start -1.92 -0.835) (end -0.635 -0.835) (layer F.Fab) (width 0.1))
  (fp_line (start -0.635 1.705) (end -0.635 2.105) (layer F.Fab) (width 0.1))
  (fp_line (start -0.635 2.105) (end -1.92 2.105) (layer F.Fab) (width 0.1))
  (fp_line (start -1.92 2.105) (end -1.92 1.705) (layer F.Fab) (width 0.1))
  (fp_line (start -1.92 1.705) (end -0.635 1.705) (layer F.Fab) (width 0.1))
  (fp_line (start 0.635 -2.105) (end 0.635 -1.705) (layer F.Fab) (width 0.1))
  (fp_line (start 0.635 -1.705) (end 1.92 -1.705) (layer F.Fab) (width 0.1))
  (fp_line (start 1.92 -1.705) (end 1.92 -2.105) (layer F.Fab) (width 0.1))
  (fp_line (start 1.92 -2.105) (end 0.635 -2.105) (layer F.Fab) (width 0.1))
  (fp_line (start 0.635 0.435) (end 0.635 0.835) (layer F.Fab) (width 0.1))
  (fp_line (start 0.635 0.835) (end 1.92 0.835) (layer F.Fab) (width 0.1))
  (fp_line (start 1.92 0.835) (end 1.92 0.435) (layer F.Fab) (width 0.1))
  (fp_line (start 1.92 0.435) (end 0.635 0.435) (layer F.Fab) (width 0.1))
  (fp_line (start 0.635 2.975) (end 0.635 3.375) (layer F.Fab) (width 0.1))
  (fp_line (start 0.635 3.375) (end 1.92 3.375) (layer F.Fab) (width 0.1))
  (fp_line (start 1.92 3.375) (end 1.92 2.975) (layer F.Fab) (width 0.1))
  (fp_line (start 1.92 2.975) (end 0.635 2.975) (layer F.Fab) (width 0.1))
  (fp_line (start -0.695 -3.85) (end -0.695 -3.87) (layer F.SilkS) (width 0.12))
  (fp_line (start -0.695 -3.87) (end 0.695 -3.87) (layer F.SilkS) (width 0.12))
  (fp_line (start 0.695 -3.87) (end 0.695 -3.85) (layer F.SilkS) (width 0.12))
  (fp_line (start -0.695 3.85) (end -0.695 3.87) (layer F.SilkS) (width 0.12))
  (fp_line (start -0.695 3.87) (end 0.695 3.87) (layer F.SilkS) (width 0.12))
  (fp_line (start 0.695 3.87) (end 0.695 3.85) (layer F.SilkS) (width 0.12))
  (fp_line (start 0.695 -3.87) (end 0.695 -2.46) (layer F.SilkS) (width 0.12))
  (fp_line (start -0.695 -3.85) (end -3 -3.85) (layer F.SilkS) (width 0.12))
  (fp_line (start 0.695 -1.35) (end 0.695 0.08) (layer F.SilkS) (width 0.12))
  (fp_line (start 0.695 1.19) (end 0.695 2.62) (layer F.SilkS) (width 0.12))
  (fp_line (start -0.695 -2.62) (end -0.695 -1.19) (layer F.SilkS) (width 0.12))
  (fp_line (start -0.695 -0.08) (end -0.695 1.35) (layer F.SilkS) (width 0.12))
  (fp_line (start -0.695 2.46) (end -0.695 3.87) (layer F.SilkS) (width 0.12))
  (fp_line (start -3.25 -4.1) (end -3.25 4.1) (layer F.CrtYd) (width 0.05))
  (fp_line (start -3.25 4.1) (end 3.25 4.1) (layer F.CrtYd) (width 0.05))
  (fp_line (start 3.25 4.1) (end 3.25 -4.1) (layer F.CrtYd) (width 0.05))
  (fp_line (start 3.25 -4.1) (end -3.25 -4.1) (layer F.CrtYd) (width 0.05))
  (pad 1 smd rect (at -1.95 -3.175) (size 2.1 0.75) (layers F.Cu F.Mask))
  (pad 3 smd rect (at -1.95 -0.635) (size 2.1 0.75) (layers F.Cu F.Mask))
  (pad 5 smd rect (at -1.95 1.905) (size 2.1 0.75) (layers F.Cu F.Mask))
  (pad 2 smd rect (at 1.95 -1.905) (size 2.1 0.75) (layers F.Cu F.Mask))
  (pad 4 smd rect (at 1.95 0.635) (size 2.1 0.75) (layers F.Cu F.Mask))
  (pad 6 smd rect (at 1.95 3.175) (size 2.1 0.75) (layers F.Cu F.Mask))
  (model Pin_Headers.3dshapes/Pin_Header_Straight_1x06_Pitch1.27mm_SMD_Pin1Left.wrl
    (at (xyz 0 0 0))
    (scale (xyz 1 1 1))
    (rotate (xyz 0 0 0))
  )
)