(module Pin_Header_Straight_2x09_Pitch2.00mm_SMD (layer F.Cu) (tedit 588DAF31)
  (descr "surface-mounted straight pin header, 2x09, 2.00mm pitch, double rows")
  (tags "Surface mounted pin header SMD 2x09 2.00mm double row")
  (attr smd)
  (fp_text reference REF** (at 0 -10.06) (layer F.SilkS)
    (effects (font (size 1 1) (thickness 0.15)))
  )
  (fp_text value Pin_Header_Straight_2x09_Pitch2.00mm_SMD (at 0 10.06) (layer F.Fab)
    (effects (font (size 1 1) (thickness 0.15)))
  )
  (fp_line (start -2 -9) (end -2 9) (layer F.Fab) (width 0.1))
  (fp_line (start -2 9) (end 2 9) (layer F.Fab) (width 0.1))
  (fp_line (start 2 9) (end 2 -9) (layer F.Fab) (width 0.1))
  (fp_line (start 2 -9) (end -2 -9) (layer F.Fab) (width 0.1))
  (fp_line (start -2 -8.25) (end -2 -7.75) (layer F.Fab) (width 0.1))
  (fp_line (start -2 -7.75) (end -3 -7.75) (layer F.Fab) (width 0.1))
  (fp_line (start -3 -7.75) (end -3 -8.25) (layer F.Fab) (width 0.1))
  (fp_line (start -3 -8.25) (end -2 -8.25) (layer F.Fab) (width 0.1))
  (fp_line (start 2 -8.25) (end 2 -7.75) (layer F.Fab) (width 0.1))
  (fp_line (start 2 -7.75) (end 3 -7.75) (layer F.Fab) (width 0.1))
  (fp_line (start 3 -7.75) (end 3 -8.25) (layer F.Fab) (width 0.1))
  (fp_line (start 3 -8.25) (end 2 -8.25) (layer F.Fab) (width 0.1))
  (fp_line (start -2 -6.25) (end -2 -5.75) (layer F.Fab) (width 0.1))
  (fp_line (start -2 -5.75) (end -3 -5.75) (layer F.Fab) (width 0.1))
  (fp_line (start -3 -5.75) (end -3 -6.25) (layer F.Fab) (width 0.1))
  (fp_line (start -3 -6.25) (end -2 -6.25) (layer F.Fab) (width 0.1))
  (fp_line (start 2 -6.25) (end 2 -5.75) (layer F.Fab) (width 0.1))
  (fp_line (start 2 -5.75) (end 3 -5.75) (layer F.Fab) (width 0.1))
  (fp_line (start 3 -5.75) (end 3 -6.25) (layer F.Fab) (width 0.1))
  (fp_line (start 3 -6.25) (end 2 -6.25) (layer F.Fab) (width 0.1))
  (fp_line (start -2 -4.25) (end -2 -3.75) (layer F.Fab) (width 0.1))
  (fp_line (start -2 -3.75) (end -3 -3.75) (layer F.Fab) (width 0.1))
  (fp_line (start -3 -3.75) (end -3 -4.25) (layer F.Fab) (width 0.1))
  (fp_line (start -3 -4.25) (end -2 -4.25) (layer F.Fab) (width 0.1))
  (fp_line (start 2 -4.25) (end 2 -3.75) (layer F.Fab) (width 0.1))
  (fp_line (start 2 -3.75) (end 3 -3.75) (layer F.Fab) (width 0.1))
  (fp_line (start 3 -3.75) (end 3 -4.25) (layer F.Fab) (width 0.1))
  (fp_line (start 3 -4.25) (end 2 -4.25) (layer F.Fab) (width 0.1))
  (fp_line (start -2 -2.25) (end -2 -1.75) (layer F.Fab) (width 0.1))
  (fp_line (start -2 -1.75) (end -3 -1.75) (layer F.Fab) (width 0.1))
  (fp_line (start -3 -1.75) (end -3 -2.25) (layer F.Fab) (width 0.1))
  (fp_line (start -3 -2.25) (end -2 -2.25) (layer F.Fab) (width 0.1))
  (fp_line (start 2 -2.25) (end 2 -1.75) (layer F.Fab) (width 0.1))
  (fp_line (start 2 -1.75) (end 3 -1.75) (layer F.Fab) (width 0.1))
  (fp_line (start 3 -1.75) (end 3 -2.25) (layer F.Fab) (width 0.1))
  (fp_line (start 3 -2.25) (end 2 -2.25) (layer F.Fab) (width 0.1))
  (fp_line (start -2 -0.25) (end -2 0.25) (layer F.Fab) (width 0.1))
  (fp_line (start -2 0.25) (end -3 0.25) (layer F.Fab) (width 0.1))
  (fp_line (start -3 0.25) (end -3 -0.25) (layer F.Fab) (width 0.1))
  (fp_line (start -3 -0.25) (end -2 -0.25) (layer F.Fab) (width 0.1))
  (fp_line (start 2 -0.25) (end 2 0.25) (layer F.Fab) (width 0.1))
  (fp_line (start 2 0.25) (end 3 0.25) (layer F.Fab) (width 0.1))
  (fp_line (start 3 0.25) (end 3 -0.25) (layer F.Fab) (width 0.1))
  (fp_line (start 3 -0.25) (end 2 -0.25) (layer F.Fab) (width 0.1))
  (fp_line (start -2 1.75) (end -2 2.25) (layer F.Fab) (width 0.1))
  (fp_line (start -2 2.25) (end -3 2.25) (layer F.Fab) (width 0.1))
  (fp_line (start -3 2.25) (end -3 1.75) (layer F.Fab) (width 0.1))
  (fp_line (start -3 1.75) (end -2 1.75) (layer F.Fab) (width 0.1))
  (fp_line (start 2 1.75) (end 2 2.25) (layer F.Fab) (width 0.1))
  (fp_line (start 2 2.25) (end 3 2.25) (layer F.Fab) (width 0.1))
  (fp_line (start 3 2.25) (end 3 1.75) (layer F.Fab) (width 0.1))
  (fp_line (start 3 1.75) (end 2 1.75) (layer F.Fab) (width 0.1))
  (fp_line (start -2 3.75) (end -2 4.25) (layer F.Fab) (width 0.1))
  (fp_line (start -2 4.25) (end -3 4.25) (layer F.Fab) (width 0.1))
  (fp_line (start -3 4.25) (end -3 3.75) (layer F.Fab) (width 0.1))
  (fp_line (start -3 3.75) (end -2 3.75) (layer F.Fab) (width 0.1))
  (fp_line (start 2 3.75) (end 2 4.25) (layer F.Fab) (width 0.1))
  (fp_line (start 2 4.25) (end 3 4.25) (layer F.Fab) (width 0.1))
  (fp_line (start 3 4.25) (end 3 3.75) (layer F.Fab) (width 0.1))
  (fp_line (start 3 3.75) (end 2 3.75) (layer F.Fab) (width 0.1))
  (fp_line (start -2 5.75) (end -2 6.25) (layer F.Fab) (width 0.1))
  (fp_line (start -2 6.25) (end -3 6.25) (layer F.Fab) (width 0.1))
  (fp_line (start -3 6.25) (end -3 5.75) (layer F.Fab) (width 0.1))
  (fp_line (start -3 5.75) (end -2 5.75) (layer F.Fab) (width 0.1))
  (fp_line (start 2 5.75) (end 2 6.25) (layer F.Fab) (width 0.1))
  (fp_line (start 2 6.25) (end 3 6.25) (layer F.Fab) (width 0.1))
  (fp_line (start 3 6.25) (end 3 5.75) (layer F.Fab) (width 0.1))
  (fp_line (start 3 5.75) (end 2 5.75) (layer F.Fab) (width 0.1))
  (fp_line (start -2 7.75) (end -2 8.25) (layer F.Fab) (width 0.1))
  (fp_line (start -2 8.25) (end -3 8.25) (layer F.Fab) (width 0.1))
  (fp_line (start -3 8.25) (end -3 7.75) (layer F.Fab) (width 0.1))
  (fp_line (start -3 7.75) (end -2 7.75) (layer F.Fab) (width 0.1))
  (fp_line (start 2 7.75) (end 2 8.25) (layer F.Fab) (width 0.1))
  (fp_line (start 2 8.25) (end 3 8.25) (layer F.Fab) (width 0.1))
  (fp_line (start 3 8.25) (end 3 7.75) (layer F.Fab) (width 0.1))
  (fp_line (start 3 7.75) (end 2 7.75) (layer F.Fab) (width 0.1))
  (fp_line (start -2.06 -8.8) (end -2.06 -9.06) (layer F.SilkS) (width 0.12))
  (fp_line (start -2.06 -9.06) (end 2.06 -9.06) (layer F.SilkS) (width 0.12))
  (fp_line (start 2.06 -9.06) (end 2.06 -8.8) (layer F.SilkS) (width 0.12))
  (fp_line (start -2.06 8.8) (end -2.06 9.06) (layer F.SilkS) (width 0.12))
  (fp_line (start -2.06 9.06) (end 2.06 9.06) (layer F.SilkS) (width 0.12))
  (fp_line (start 2.06 9.06) (end 2.06 8.8) (layer F.SilkS) (width 0.12))
  (fp_line (start -4.5 -8.8) (end -2.06 -8.8) (layer F.SilkS) (width 0.12))
  (fp_line (start -4.75 -9.25) (end -4.75 9.25) (layer F.CrtYd) (width 0.05))
  (fp_line (start -4.75 9.25) (end 4.75 9.25) (layer F.CrtYd) (width 0.05))
  (fp_line (start 4.75 9.25) (end 4.75 -9.25) (layer F.CrtYd) (width 0.05))
  (fp_line (start 4.75 -9.25) (end -4.75 -9.25) (layer F.CrtYd) (width 0.05))
  (pad 1 smd rect (at -3.125 -8) (size 2.75 1) (layers F.Cu F.Mask))
  (pad 2 smd rect (at 3.125 -8) (size 2.75 1) (layers F.Cu F.Mask))
  (pad 3 smd rect (at -3.125 -6) (size 2.75 1) (layers F.Cu F.Mask))
  (pad 4 smd rect (at 3.125 -6) (size 2.75 1) (layers F.Cu F.Mask))
  (pad 5 smd rect (at -3.125 -4) (size 2.75 1) (layers F.Cu F.Mask))
  (pad 6 smd rect (at 3.125 -4) (size 2.75 1) (layers F.Cu F.Mask))
  (pad 7 smd rect (at -3.125 -2) (size 2.75 1) (layers F.Cu F.Mask))
  (pad 8 smd rect (at 3.125 -2) (size 2.75 1) (layers F.Cu F.Mask))
  (pad 9 smd rect (at -3.125 0) (size 2.75 1) (layers F.Cu F.Mask))
  (pad 10 smd rect (at 3.125 0) (size 2.75 1) (layers F.Cu F.Mask))
  (pad 11 smd rect (at -3.125 2) (size 2.75 1) (layers F.Cu F.Mask))
  (pad 12 smd rect (at 3.125 2) (size 2.75 1) (layers F.Cu F.Mask))
  (pad 13 smd rect (at -3.125 4) (size 2.75 1) (layers F.Cu F.Mask))
  (pad 14 smd rect (at 3.125 4) (size 2.75 1) (layers F.Cu F.Mask))
  (pad 15 smd rect (at -3.125 6) (size 2.75 1) (layers F.Cu F.Mask))
  (pad 16 smd rect (at 3.125 6) (size 2.75 1) (layers F.Cu F.Mask))
  (pad 17 smd rect (at -3.125 8) (size 2.75 1) (layers F.Cu F.Mask))
  (pad 18 smd rect (at 3.125 8) (size 2.75 1) (layers F.Cu F.Mask))
  (model Pin_Headers.3dshapes/Pin_Header_Straight_2x09_Pitch2.00mm_SMD.wrl
    (at (xyz 0 0 0))
    (scale (xyz 1 1 1))
    (rotate (xyz 0 0 0))
  )
)