(module Pin_Header_Straight_2x05_Pitch2.54mm_SMD (layer F.Cu) (tedit 588DAF2A)
  (descr "surface-mounted straight pin header, 2x05, 2.54mm pitch, double rows")
  (tags "Surface mounted pin header SMD 2x05 2.54mm double row")
  (attr smd)
  (fp_text reference REF** (at 0 -7.41) (layer F.SilkS)
    (effects (font (size 1 1) (thickness 0.15)))
  )
  (fp_text value Pin_Header_Straight_2x05_Pitch2.54mm_SMD (at 0 7.41) (layer F.Fab)
    (effects (font (size 1 1) (thickness 0.15)))
  )
  (fp_line (start -2.54 -6.35) (end -2.54 6.35) (layer F.Fab) (width 0.1))
  (fp_line (start -2.54 6.35) (end 2.54 6.35) (layer F.Fab) (width 0.1))
  (fp_line (start 2.54 6.35) (end 2.54 -6.35) (layer F.Fab) (width 0.1))
  (fp_line (start 2.54 -6.35) (end -2.54 -6.35) (layer F.Fab) (width 0.1))
  (fp_line (start -2.54 -5.4) (end -2.54 -4.76) (layer F.Fab) (width 0.1))
  (fp_line (start -2.54 -4.76) (end -3.92 -4.76) (layer F.Fab) (width 0.1))
  (fp_line (start -3.92 -4.76) (end -3.92 -5.4) (layer F.Fab) (width 0.1))
  (fp_line (start -3.92 -5.4) (end -2.54 -5.4) (layer F.Fab) (width 0.1))
  (fp_line (start 2.54 -5.4) (end 2.54 -4.76) (layer F.Fab) (width 0.1))
  (fp_line (start 2.54 -4.76) (end 3.92 -4.76) (layer F.Fab) (width 0.1))
  (fp_line (start 3.92 -4.76) (end 3.92 -5.4) (layer F.Fab) (width 0.1))
  (fp_line (start 3.92 -5.4) (end 2.54 -5.4) (layer F.Fab) (width 0.1))
  (fp_line (start -2.54 -2.86) (end -2.54 -2.22) (layer F.Fab) (width 0.1))
  (fp_line (start -2.54 -2.22) (end -3.92 -2.22) (layer F.Fab) (width 0.1))
  (fp_line (start -3.92 -2.22) (end -3.92 -2.86) (layer F.Fab) (width 0.1))
  (fp_line (start -3.92 -2.86) (end -2.54 -2.86) (layer F.Fab) (width 0.1))
  (fp_line (start 2.54 -2.86) (end 2.54 -2.22) (layer F.Fab) (width 0.1))
  (fp_line (start 2.54 -2.22) (end 3.92 -2.22) (layer F.Fab) (width 0.1))
  (fp_line (start 3.92 -2.22) (end 3.92 -2.86) (layer F.Fab) (width 0.1))
  (fp_line (start 3.92 -2.86) (end 2.54 -2.86) (layer F.Fab) (width 0.1))
  (fp_line (start -2.54 -0.32) (end -2.54 0.32) (layer F.Fab) (width 0.1))
  (fp_line (start -2.54 0.32) (end -3.92 0.32) (layer F.Fab) (width 0.1))
  (fp_line (start -3.92 0.32) (end -3.92 -0.32) (layer F.Fab) (width 0.1))
  (fp_line (start -3.92 -0.32) (end -2.54 -0.32) (layer F.Fab) (width 0.1))
  (fp_line (start 2.54 -0.32) (end 2.54 0.32) (layer F.Fab) (width 0.1))
  (fp_line (start 2.54 0.32) (end 3.92 0.32) (layer F.Fab) (width 0.1))
  (fp_line (start 3.92 0.32) (end 3.92 -0.32) (layer F.Fab) (width 0.1))
  (fp_line (start 3.92 -0.32) (end 2.54 -0.32) (layer F.Fab) (width 0.1))
  (fp_line (start -2.54 2.22) (end -2.54 2.86) (layer F.Fab) (width 0.1))
  (fp_line (start -2.54 2.86) (end -3.92 2.86) (layer F.Fab) (width 0.1))
  (fp_line (start -3.92 2.86) (end -3.92 2.22) (layer F.Fab) (width 0.1))
  (fp_line (start -3.92 2.22) (end -2.54 2.22) (layer F.Fab) (width 0.1))
  (fp_line (start 2.54 2.22) (end 2.54 2.86) (layer F.Fab) (width 0.1))
  (fp_line (start 2.54 2.86) (end 3.92 2.86) (layer F.Fab) (width 0.1))
  (fp_line (start 3.92 2.86) (end 3.92 2.22) (layer F.Fab) (width 0.1))
  (fp_line (start 3.92 2.22) (end 2.54 2.22) (layer F.Fab) (width 0.1))
  (fp_line (start -2.54 4.76) (end -2.54 5.4) (layer F.Fab) (width 0.1))
  (fp_line (start -2.54 5.4) (end -3.92 5.4) (layer F.Fab) (width 0.1))
  (fp_line (start -3.92 5.4) (end -3.92 4.76) (layer F.Fab) (width 0.1))
  (fp_line (start -3.92 4.76) (end -2.54 4.76) (layer F.Fab) (width 0.1))
  (fp_line (start 2.54 4.76) (end 2.54 5.4) (layer F.Fab) (width 0.1))
  (fp_line (start 2.54 5.4) (end 3.92 5.4) (layer F.Fab) (width 0.1))
  (fp_line (start 3.92 5.4) (end 3.92 4.76) (layer F.Fab) (width 0.1))
  (fp_line (start 3.92 4.76) (end 2.54 4.76) (layer F.Fab) (width 0.1))
  (fp_line (start -2.6 -5.88) (end -2.6 -6.41) (layer F.SilkS) (width 0.12))
  (fp_line (start -2.6 -6.41) (end 2.6 -6.41) (layer F.SilkS) (width 0.12))
  (fp_line (start 2.6 -6.41) (end 2.6 -5.88) (layer F.SilkS) (width 0.12))
  (fp_line (start -2.6 5.88) (end -2.6 6.41) (layer F.SilkS) (width 0.12))
  (fp_line (start -2.6 6.41) (end 2.6 6.41) (layer F.SilkS) (width 0.12))
  (fp_line (start 2.6 6.41) (end 2.6 5.88) (layer F.SilkS) (width 0.12))
  (fp_line (start -4.27 -5.88) (end -2.6 -5.88) (layer F.SilkS) (width 0.12))
  (fp_line (start -4.55 -6.6) (end -4.55 6.6) (layer F.CrtYd) (width 0.05))
  (fp_line (start -4.55 6.6) (end 4.55 6.6) (layer F.CrtYd) (width 0.05))
  (fp_line (start 4.55 6.6) (end 4.55 -6.6) (layer F.CrtYd) (width 0.05))
  (fp_line (start 4.55 -6.6) (end -4.55 -6.6) (layer F.CrtYd) (width 0.05))
  (pad 1 smd rect (at -2.77 -5.08) (size 3 1) (layers F.Cu F.Mask))
  (pad 2 smd rect (at 2.77 -5.08) (size 3 1) (layers F.Cu F.Mask))
  (pad 3 smd rect (at -2.77 -2.54) (size 3 1) (layers F.Cu F.Mask))
  (pad 4 smd rect (at 2.77 -2.54) (size 3 1) (layers F.Cu F.Mask))
  (pad 5 smd rect (at -2.77 0) (size 3 1) (layers F.Cu F.Mask))
  (pad 6 smd rect (at 2.77 0) (size 3 1) (layers F.Cu F.Mask))
  (pad 7 smd rect (at -2.77 2.54) (size 3 1) (layers F.Cu F.Mask))
  (pad 8 smd rect (at 2.77 2.54) (size 3 1) (layers F.Cu F.Mask))
  (pad 9 smd rect (at -2.77 5.08) (size 3 1) (layers F.Cu F.Mask))
  (pad 10 smd rect (at 2.77 5.08) (size 3 1) (layers F.Cu F.Mask))
  (model Pin_Headers.3dshapes/Pin_Header_Straight_2x05_Pitch2.54mm_SMD.wrl
    (at (xyz 0 0 0))
    (scale (xyz 1 1 1))
    (rotate (xyz 0 0 0))
  )
)