(export (version D)
  (design
    (source /home/mimt2/AVR_HAD/PCB/Kicad/HAD.sch)
    (date "Mon 31 Jul 2017 11:38:33 AM CEST")
    (tool "Eeschema 4.0.7-e1-6374~58~ubuntu14.04.1")
    (sheet (number 1) (name /) (tstamps /)
      (title_block
        (title)
        (company)
        (rev)
        (date)
        (source HAD.sch)
        (comment (number 1) (value ""))
        (comment (number 2) (value ""))
        (comment (number 3) (value ""))
        (comment (number 4) (value "")))))
  (components
    (comp (ref P3)
      (value CONN_02X07)
      (footprint Pin_Headers:Pin_Header_Straight_2x07_Pitch2.54mm_SMD)
      (libsource (lib conn) (part CONN_02X07))
      (sheetpath (names /) (tstamps /))
      (tstamp 58AAD17B))
    (comp (ref L1)
      (value INDUCTOR0805)
      (footprint adafruit:R0805)
      (libsource (lib SparkFun-Passives) (part INDUCTOR0805))
      (sheetpath (names /) (tstamps /))
      (tstamp 58AB0A68))
    (comp (ref JP1)
      (value PINHD-1X3)
      (footprint Pin_Headers:Pin_Header_Straight_1x03_Pitch2.54mm_SMD_Pin1Left)
      (libsource (lib adafruit) (part PINHD-1X3))
      (sheetpath (names /) (tstamps /))
      (tstamp 58AB0ED9))
    (comp (ref R2)
      (value 4k7)
      (footprint adafruit:R0805)
      (libsource (lib SparkFun-Passives) (part RESISTOR0805-RES))
      (sheetpath (names /) (tstamps /))
      (tstamp 58AB11E3))
    (comp (ref U1)
      (value MOD_MP2307)
      (footprint libs:MOD_MP2307)
      (libsource (lib mm) (part MOD_MP2307))
      (sheetpath (names /) (tstamps /))
      (tstamp 58ACB4EE))
    (comp (ref JP2)
      (value PINHD-1X2)
      (footprint Pin_Headers:Pin_Header_Straight_1x02_Pitch2.54mm_SMD_Pin1Left)
      (libsource (lib pinhead) (part PINHD-1X2))
      (sheetpath (names /) (tstamps /))
      (tstamp 58ACCE75))
    (comp (ref P2)
      (value CONN_01X05)
      (footprint Pin_Headers:Pin_Header_Straight_1x05_Pitch2.54mm_SMD_Pin1Right)
      (libsource (lib conn) (part CONN_01X05))
      (sheetpath (names /) (tstamps /))
      (tstamp 58AAD296))
    (comp (ref SH1)
      (value ARDUINO_NANO)
      (footprint libs:ARDUINO_NANO_2_SMD)
      (libsource (lib shield_arduino) (part ARDUINO_NANO))
      (sheetpath (names /) (tstamps /))
      (tstamp 58AACFFA))
    (comp (ref F1)
      (value 0.5A/13.2V)
      (footprint adafruit:R1206)
      (libsource (lib device) (part Polyfuse_Small))
      (sheetpath (names /) (tstamps /))
      (tstamp 58F8666E))
    (comp (ref U2)
      (value LD1117S33TR)
      (footprint TO_SOT_Packages_SMD:SOT-223)
      (libsource (lib regul) (part LD1117S33TR))
      (sheetpath (names /) (tstamps /))
      (tstamp 597F7F76))
    (comp (ref C1)
      (value 100n)
      (footprint 0805)
      (libsource (lib SparkFun-Capacitors) (part CAP0805))
      (sheetpath (names /) (tstamps /))
      (tstamp 597F874C))
    (comp (ref C2)
      (value 10u)
      (footprint 0805)
      (libsource (lib SparkFun-Capacitors) (part CAP0805))
      (sheetpath (names /) (tstamps /))
      (tstamp 597F883B)))
  (libparts
    (libpart (lib shield_arduino) (part ARDUINO_NANO)
      (description "schématic for build a shield or clone an \"arduino NANO\" based on version 2")
      (docs http://arduino.cc/en/Main/ArduinoBoardNano)
      (fields
        (field (name Reference) SH)
        (field (name Value) ARDUINO_NANO))
      (pins
        (pin (num 0) (name RX) (type input))
        (pin (num 1) (name TX) (type input))
        (pin (num 2) (name 2) (type input))
        (pin (num 3) (name "3_(*)") (type input))
        (pin (num 4) (name 4) (type input))
        (pin (num 5) (name "5_(*)") (type input))
        (pin (num 5V) (name 5V) (type input))
        (pin (num 6) (name "6_(*)") (type input))
        (pin (num 7) (name 7) (type input))
        (pin (num 8) (name 8) (type input))
        (pin (num 9) (name "9_(*)") (type input))
        (pin (num 10) (name "10_(SS/*)") (type input))
        (pin (num 11) (name "11_(MISO/*)") (type input))
        (pin (num 12) (name "12_(MOSI)") (type input))
        (pin (num 13) (name "13_(SCK)") (type input))
        (pin (num 3V3) (name 3V3) (type input))
        (pin (num A0) (name A0) (type input))
        (pin (num A1) (name A1) (type input))
        (pin (num A2) (name A2) (type input))
        (pin (num A3) (name A3) (type input))
        (pin (num A4) (name A4) (type input))
        (pin (num A5) (name A5) (type input))
        (pin (num A6) (name A6) (type input))
        (pin (num A7) (name A7) (type input))
        (pin (num AREF) (name AREF) (type input))
        (pin (num GND1) (name GND/1) (type input))
        (pin (num GND2) (name 2/GND) (type input))
        (pin (num RST1) (name RESET/1) (type input))
        (pin (num RST2) (name 2/RESET) (type input))
        (pin (num VIN) (name VIN) (type input))))
    (libpart (lib SparkFun-Capacitors) (part CAP0805)
      (footprints
        (fp *0805*))
      (fields
        (field (name Reference) C)
        (field (name Value) CAP0805)
        (field (name Footprint) 0805))
      (pins
        (pin (num 1) (name 1) (type passive))
        (pin (num 2) (name 2) (type passive))))
    (libpart (lib conn) (part CONN_01X05)
      (description "Connector, single row, 01x05, pin header")
      (footprints
        (fp Pin_Header_Straight_1X*)
        (fp Pin_Header_Angled_1X*)
        (fp Socket_Strip_Straight_1X*)
        (fp Socket_Strip_Angled_1X*))
      (fields
        (field (name Reference) J)
        (field (name Value) CONN_01X05))
      (pins
        (pin (num 1) (name P1) (type passive))
        (pin (num 2) (name P2) (type passive))
        (pin (num 3) (name P3) (type passive))
        (pin (num 4) (name P4) (type passive))
        (pin (num 5) (name P5) (type passive))))
    (libpart (lib conn) (part CONN_02X07)
      (description "Connector, double row, 02x07, pin header")
      (footprints
        (fp Pin_Header_Straight_2X*)
        (fp Pin_Header_Angled_2X*)
        (fp Socket_Strip_Straight_2X*)
        (fp Socket_Strip_Angled_2X*)
        (fp IDC_Header_Straight_*))
      (fields
        (field (name Reference) J)
        (field (name Value) CONN_02X07))
      (pins
        (pin (num 1) (name P1) (type passive))
        (pin (num 2) (name P2) (type passive))
        (pin (num 3) (name P3) (type passive))
        (pin (num 4) (name P4) (type passive))
        (pin (num 5) (name P5) (type passive))
        (pin (num 6) (name P6) (type passive))
        (pin (num 7) (name P7) (type passive))
        (pin (num 8) (name P8) (type passive))
        (pin (num 9) (name P9) (type passive))
        (pin (num 10) (name P10) (type passive))
        (pin (num 11) (name P11) (type passive))
        (pin (num 12) (name P12) (type passive))
        (pin (num 13) (name P13) (type passive))
        (pin (num 14) (name P14) (type passive))))
    (libpart (lib SparkFun-Passives) (part INDUCTOR0805)
      (footprints
        (fp *0805*))
      (fields
        (field (name Reference) L)
        (field (name Value) INDUCTOR0805)
        (field (name Footprint) 0805))
      (pins
        (pin (num 1) (name 1) (type passive))
        (pin (num 2) (name 2) (type passive))))
    (libpart (lib regul) (part LD1117S33TR)
      (aliases
        (alias LD1117S33CTR)
        (alias LD1117S12TR)
        (alias LD1117S12CTR)
        (alias LD1117S18TR)
        (alias LD1117S18CTR)
        (alias LD1117S25TR)
        (alias LD1117S25CTR)
        (alias LD1117S50TR)
        (alias LD1117S50CTR))
      (description "800mA Fixed Low Drop Positive Voltage Regulator, Fixed Output 3.3V, SOT223")
      (docs http://www.st.com/st-web-ui/static/active/en/resource/technical/document/datasheet/CD00000544.pdf)
      (footprints
        (fp SOT223))
      (fields
        (field (name Reference) U)
        (field (name Value) LD1117S33TR)
        (field (name Footprint) TO_SOT_Packages_SMD:SOT-223))
      (pins
        (pin (num 1) (name GND) (type power_in))
        (pin (num 2) (name VO) (type power_out))
        (pin (num 3) (name VI) (type power_in))))
    (libpart (lib mm) (part MOD_MP2307)
      (fields
        (field (name Reference) U)
        (field (name Value) MOD_MP2307))
      (pins
        (pin (num 1) (name GND) (type input))
        (pin (num 2) (name VIN) (type input))
        (pin (num 3) (name GND) (type input))
        (pin (num 4) (name VOUT) (type input))))
    (libpart (lib pinhead) (part PINHD-1X2)
      (fields
        (field (name Reference) JP)
        (field (name Value) PINHD-1X2)
        (field (name Footprint) pinhead-1X02))
      (pins
        (pin (num 1) (name 1) (type passive))
        (pin (num 2) (name 2) (type passive))))
    (libpart (lib adafruit) (part PINHD-1X3)
      (footprints
        (fp *1X03*)
        (fp *1X03-CLEANBIG*))
      (fields
        (field (name Reference) JP)
        (field (name Value) PINHD-1X3)
        (field (name Footprint) 1X03))
      (pins
        (pin (num 1) (name 1) (type passive))
        (pin (num 2) (name 2) (type passive))
        (pin (num 3) (name 3) (type passive))))
    (libpart (lib device) (part Polyfuse_Small)
      (description "resettable fuse, polymeric positive temperature coefficient (PPTC), small symbol")
      (footprints
        (fp *polyfuse*)
        (fp *PTC*))
      (fields
        (field (name Reference) F)
        (field (name Value) Polyfuse_Small))
      (pins
        (pin (num 1) (name ~) (type passive))
        (pin (num 2) (name ~) (type passive))))
    (libpart (lib SparkFun-Passives) (part RESISTOR0805-RES)
      (footprints
        (fp *0805*)
        (fp *1206*)
        (fp *R2010*)
        (fp *R2512*)
        (fp *1_6W-RES*))
      (fields
        (field (name Reference) R)
        (field (name Value) RESISTOR0805-RES)
        (field (name Footprint) 0805))
      (pins
        (pin (num 1) (name 1) (type passive))
        (pin (num 2) (name 2) (type passive)))))
  (libraries
    (library (logical device)
      (uri /usr/share/kicad/library/device.lib))
    (library (logical SparkFun-Capacitors)
      (uri /home/mimt2/AVR_HAD/PCB/Kicad/libs/SparkFun-Kicad-Libraries/SparkFun-Capacitors.lib))
    (library (logical adafruit)
      (uri /home/mimt2/AVR_HAD/PCB/Kicad/libs/SparkFun-Kicad-Libraries/adafruit.lib))
    (library (logical mm)
      (uri /home/mimt2/AVR_HAD/PCB/Kicad/libs/mm.lib))
    (library (logical pinhead)
      (uri /home/mimt2/AVR_HAD/PCB/Kicad/libs/pinhead.lib))
    (library (logical conn)
      (uri /usr/share/kicad/library/conn.lib))
    (library (logical regul)
      (uri /usr/share/kicad/library/regul.lib))
    (library (logical SparkFun-Passives)
      (uri /home/mimt2/AVR_HAD/PCB/Kicad/libs/SparkFun-Kicad-Libraries/SparkFun-Passives.lib))
    (library (logical shield_arduino)
      (uri /home/mimt2/AVR_HAD/PCB/Kicad/libs/Librairie_kicad_arduino/Library_schematic_shield_arduino/shield_arduino.lib)))
  (nets
    (net (code 1) (name +12V)
      (node (ref JP2) (pin 1))
      (node (ref F1) (pin 2)))
    (net (code 2) (name /SCK)
      (node (ref P3) (pin 1))
      (node (ref SH1) (pin 13)))
    (net (code 3) (name /ENC28J60_RST)
      (node (ref P3) (pin 12))
      (node (ref SH1) (pin 2)))
    (net (code 4) (name /MOSI)
      (node (ref P3) (pin 6))
      (node (ref SH1) (pin 11)))
    (net (code 5) (name +3V3)
      (node (ref P3) (pin 9))
      (node (ref C2) (pin 1))
      (node (ref U2) (pin 2)))
    (net (code 6) (name /MISO)
      (node (ref P3) (pin 4))
      (node (ref SH1) (pin 12)))
    (net (code 7) (name "Net-(L1-Pad1)")
      (node (ref L1) (pin 1))
      (node (ref P3) (pin 13)))
    (net (code 8) (name /OUTPUT1)
      (node (ref P3) (pin 8))
      (node (ref SH1) (pin 8)))
    (net (code 9) (name /PB3)
      (node (ref SH1) (pin 9))
      (node (ref P2) (pin 2)))
    (net (code 10) (name "Net-(SH1-Pad0)")
      (node (ref SH1) (pin 0)))
    (net (code 11) (name /PB1)
      (node (ref SH1) (pin 7))
      (node (ref P2) (pin 4)))
    (net (code 12) (name /PB2)
      (node (ref P2) (pin 3))
      (node (ref SH1) (pin 6)))
    (net (code 13) (name /OUTPUT3)
      (node (ref P3) (pin 10))
      (node (ref SH1) (pin 5)))
    (net (code 14) (name /PB4)
      (node (ref P2) (pin 1))
      (node (ref SH1) (pin 4)))
    (net (code 15) (name /ENC28J60_INT)
      (node (ref SH1) (pin 3))
      (node (ref P3) (pin 14)))
    (net (code 16) (name GND)
      (node (ref JP1) (pin 3))
      (node (ref P3) (pin 11))
      (node (ref P3) (pin 7))
      (node (ref U1) (pin 1))
      (node (ref C1) (pin 2))
      (node (ref U2) (pin 1))
      (node (ref C2) (pin 2))
      (node (ref U1) (pin 3))
      (node (ref JP2) (pin 2))
      (node (ref SH1) (pin GND1))
      (node (ref P2) (pin 5)))
    (net (code 17) (name +5V)
      (node (ref U1) (pin 4))
      (node (ref R2) (pin 1))
      (node (ref C1) (pin 1))
      (node (ref SH1) (pin 5V))
      (node (ref U2) (pin 3))
      (node (ref L1) (pin 2))
      (node (ref JP1) (pin 1)))
    (net (code 18) (name /SS)
      (node (ref P3) (pin 3))
      (node (ref SH1) (pin 10)))
    (net (code 19) (name "Net-(SH1-PadGND2)")
      (node (ref SH1) (pin GND2)))
    (net (code 20) (name /OUTPUT4)
      (node (ref P3) (pin 2))
      (node (ref SH1) (pin A5)))
    (net (code 21) (name "Net-(SH1-PadA7)")
      (node (ref SH1) (pin A7)))
    (net (code 22) (name /OUTPUT2)
      (node (ref P3) (pin 5))
      (node (ref SH1) (pin A3)))
    (net (code 23) (name "Net-(F1-Pad1)")
      (node (ref F1) (pin 1))
      (node (ref U1) (pin 2)))
    (net (code 24) (name "Net-(SH1-PadAREF)")
      (node (ref SH1) (pin AREF)))
    (net (code 25) (name "Net-(SH1-PadA2)")
      (node (ref SH1) (pin A2)))
    (net (code 26) (name "Net-(SH1-Pad1)")
      (node (ref SH1) (pin 1)))
    (net (code 27) (name "Net-(SH1-PadA1)")
      (node (ref SH1) (pin A1)))
    (net (code 28) (name "Net-(SH1-PadA4)")
      (node (ref SH1) (pin A4)))
    (net (code 29) (name "Net-(SH1-PadA6)")
      (node (ref SH1) (pin A6)))
    (net (code 30) (name "Net-(SH1-Pad3V3)")
      (node (ref SH1) (pin 3V3)))
    (net (code 31) (name "Net-(SH1-PadVIN)")
      (node (ref SH1) (pin VIN)))
    (net (code 32) (name "Net-(SH1-PadRST1)")
      (node (ref SH1) (pin RST1)))
    (net (code 33) (name "Net-(SH1-PadRST2)")
      (node (ref SH1) (pin RST2)))
    (net (code 34) (name /DS1820B)
      (node (ref JP1) (pin 2))
      (node (ref SH1) (pin A0))
      (node (ref R2) (pin 2)))))