EESchema Schematic File Version 2
LIBS:power
LIBS:device
LIBS:transistors
LIBS:conn
LIBS:linear
LIBS:regul
LIBS:74xx
LIBS:cmos4000
LIBS:adc-dac
LIBS:memory
LIBS:xilinx
LIBS:microcontrollers
LIBS:dsp
LIBS:microchip
LIBS:analog_switches
LIBS:motorola
LIBS:texas
LIBS:intel
LIBS:audio
LIBS:interface
LIBS:digital-audio
LIBS:philips
LIBS:display
LIBS:cypress
LIBS:siliconi
LIBS:opto
LIBS:atmel
LIBS:contrib
LIBS:valves
LIBS:shield_arduino
LIBS:adafruit
LIBS:GeekAmmo
LIBS:LilyPad-Wearables
LIBS:SparkFun-Aesthetics
LIBS:SparkFun-AnalogIC
LIBS:SparkFun-Boards
LIBS:SparkFun-Capacitors
LIBS:SparkFun-Connectors
LIBS:SparkFun-DigitalIC
LIBS:SparkFun-DiscreteSemi
LIBS:SparkFun-Displays
LIBS:SparkFun-Electromechanical
LIBS:SparkFun-FreqCtrl
LIBS:SparkFun-LED
LIBS:SparkFun-Passives
LIBS:SparkFun-PowerIC
LIBS:SparkFun-Resistors
LIBS:SparkFun-Retired
LIBS:SparkFun-RF
LIBS:SparkFun-Sensors
LIBS:Teensy_3_and_LC_Series_Boards_v1.1
LIBS:User-Submitted
LIBS:mm
LIBS:pinhead
LIBS:HAD-cache
EELAYER 25 0
EELAYER END
$Descr A4 11693 8268
encoding utf-8
Sheet 1 1
Title ""
Date ""
Rev ""
Comp ""
Comment1 ""
Comment2 ""
Comment3 ""
Comment4 ""
$EndDescr
$Comp
L CONN_02X07 P3
U 1 1 58AAD17B
P 9450 1450
F 0 "P3" H 9450 1850 50  0000 C CNN
F 1 "CONN_02X07" V 9450 1450 50  0000 C CNN
F 2 "Pin_Headers:Pin_Header_Straight_2x07_Pitch2.54mm_SMD" H 9450 250 50  0001 C CNN
F 3 "" H 9450 250 50  0000 C CNN
	1    9450 1450
	1    0    0    -1  
$EndComp
$Comp
L GND #PWR6
U 1 1 58AAE09D
P 3375 1475
F 0 "#PWR6" H 3375 1225 50  0001 C CNN
F 1 "GND" H 3375 1325 50  0000 C CNN
F 2 "" H 3375 1475 50  0000 C CNN
F 3 "" H 3375 1475 50  0000 C CNN
	1    3375 1475
	-1   0    0    1   
$EndComp
Text Label 3375 1675 0    60   ~ 0
PB1
Text Label 3375 1775 0    60   ~ 0
PB2
Text Label 3375 1875 0    60   ~ 0
PB3
Text Label 3375 1975 0    60   ~ 0
PB4
Text Label 8600 1150 0    60   ~ 0
SCK
Text Label 10000 1450 0    60   ~ 0
OUTPUT1
Text Label 8600 1350 0    60   ~ 0
OUTPUT2
Text Label 10000 1550 0    60   ~ 0
OUTPUT3
Text Label 10000 1150 0    60   ~ 0
OUTPUT4
$Comp
L +3.3V #PWR17
U 1 1 58AAEC1C
P 8225 1550
F 0 "#PWR17" H 8225 1400 50  0001 C CNN
F 1 "+3.3V" H 8225 1690 50  0000 C CNN
F 2 "" H 8225 1550 50  0000 C CNN
F 3 "" H 8225 1550 50  0000 C CNN
	1    8225 1550
	1    0    0    -1  
$EndComp
$Comp
L GND #PWR18
U 1 1 58AAEE15
P 8675 1650
F 0 "#PWR18" H 8675 1400 50  0001 C CNN
F 1 "GND" H 8675 1500 50  0000 C CNN
F 2 "" H 8675 1650 50  0000 C CNN
F 3 "" H 8675 1650 50  0000 C CNN
	1    8675 1650
	1    0    0    -1  
$EndComp
Text Label 10000 1250 0    60   ~ 0
MISO
Text Label 10000 1350 0    60   ~ 0
MOSI
Text Label 8600 1250 0    60   ~ 0
SS
Text Label 10000 1650 0    60   ~ 0
ENC28J60_RST
Text Label 6675 2900 0    60   ~ 0
DS1820B
Text Label 6855 3275 0    60   ~ 0
OUTPUT2
Text Label 6800 3525 0    60   ~ 0
OUTPUT4
$Comp
L +5V #PWR16
U 1 1 58AAF3C5
P 7150 2300
F 0 "#PWR16" H 7150 2150 50  0001 C CNN
F 1 "+5V" H 7150 2440 50  0000 C CNN
F 2 "" H 7150 2300 50  0000 C CNN
F 3 "" H 7150 2300 50  0000 C CNN
	1    7150 2300
	1    0    0    -1  
$EndComp
$Comp
L GND #PWR9
U 1 1 58AAF579
P 4400 2825
F 0 "#PWR9" H 4400 2575 50  0001 C CNN
F 1 "GND" H 4400 2675 50  0000 C CNN
F 2 "" H 4400 2825 50  0000 C CNN
F 3 "" H 4400 2825 50  0000 C CNN
	1    4400 2825
	1    0    0    -1  
$EndComp
Text Label 4725 3150 0    60   ~ 0
PB4
Text Label 4725 3025 0    60   ~ 0
ENC28J60_INT
Text Label 4725 3775 0    60   ~ 0
PB3
Text Label 4725 3275 0    60   ~ 0
OUTPUT3
Text Label 4725 3525 0    60   ~ 0
PB1
Text Label 4725 3400 0    60   ~ 0
PB2
Text Label 4725 3650 0    60   ~ 0
OUTPUT1
Text Label 4725 2900 0    60   ~ 0
ENC28J60_RST
Text Label 4725 3900 0    60   ~ 0
SS
Text Label 4725 4025 0    60   ~ 0
MOSI
Text Label 4725 4150 0    60   ~ 0
MISO
$Comp
L INDUCTOR0805 L1
U 1 1 58AB0A68
P 9000 2050
F 0 "L1" H 9100 2250 50  0000 L BNN
F 1 "INDUCTOR0805" H 9100 1850 50  0000 L BNN
F 2 "adafruit:R0805" H 9030 2200 20  0001 C CNN
F 3 "" H 9000 2050 60  0001 C CNN
	1    9000 2050
	1    0    0    -1  
$EndComp
$Comp
L +5V #PWR19
U 1 1 58AB0AF7
P 8775 2225
F 0 "#PWR19" H 8775 2075 50  0001 C CNN
F 1 "+5V" H 8775 2365 50  0000 C CNN
F 2 "" H 8775 2225 50  0000 C CNN
F 3 "" H 8775 2225 50  0000 C CNN
	1    8775 2225
	1    0    0    -1  
$EndComp
$Comp
L PINHD-1X3 JP1
U 1 1 58AB0ED9
P 1225 3850
F 0 "JP1" H 975 4075 50  0000 L BNN
F 1 "PINHD-1X3" H 975 3550 50  0000 L BNN
F 2 "Pin_Headers:Pin_Header_Straight_1x03_Pitch2.54mm_SMD_Pin1Left" H 1255 4000 20  0001 C CNN
F 3 "" H 1225 3850 60  0001 C CNN
	1    1225 3850
	-1   0    0    -1  
$EndComp
$Comp
L +5V #PWR4
U 1 1 58AB116A
P 1650 3250
F 0 "#PWR4" H 1650 3100 50  0001 C CNN
F 1 "+5V" H 1650 3390 50  0000 C CNN
F 2 "" H 1650 3250 50  0000 C CNN
F 3 "" H 1650 3250 50  0000 C CNN
	1    1650 3250
	1    0    0    -1  
$EndComp
$Comp
L GND #PWR5
U 1 1 58AB11B4
P 1650 4125
F 0 "#PWR5" H 1650 3875 50  0001 C CNN
F 1 "GND" H 1650 3975 50  0000 C CNN
F 2 "" H 1650 4125 50  0000 C CNN
F 3 "" H 1650 4125 50  0000 C CNN
	1    1650 4125
	1    0    0    -1  
$EndComp
$Comp
L RESISTOR0805-RES R2
U 1 1 58AB11E3
P 1850 3450
F 0 "R2" H 1700 3509 50  0000 L BNN
F 1 "4k7" H 1700 3320 50  0000 L BNN
F 2 "adafruit:R0805" H 1880 3600 20  0001 C CNN
F 3 "" H 1850 3450 60  0001 C CNN
	1    1850 3450
	0    1    1    0   
$EndComp
Text Label 2300 3850 0    60   ~ 0
DS1820B
NoConn ~ 6550 2400
NoConn ~ 6550 2650
NoConn ~ 6550 3025
NoConn ~ 6550 3150
NoConn ~ 6550 3400
NoConn ~ 5250 2400
NoConn ~ 5250 2525
NoConn ~ 5250 2650
NoConn ~ 6550 3650
NoConn ~ 6550 3900
NoConn ~ 6550 4025
Text Label 6650 4150 0    60   ~ 0
SCK
$Comp
L MOD_MP2307 U1
U 1 1 58ACB4EE
P 2720 5300
F 0 "U1" H 2720 5300 60  0000 C CNN
F 1 "MOD_MP2307" H 2720 5200 60  0000 C CNN
F 2 "libs:MOD_MP2307" H 2720 5300 60  0001 C CNN
F 3 "" H 2720 5300 60  0001 C CNN
	1    2720 5300
	1    0    0    -1  
$EndComp
$Comp
L GND #PWR7
U 1 1 58ACBBB0
P 3750 5150
F 0 "#PWR7" H 3750 4900 50  0001 C CNN
F 1 "GND" H 3750 5000 50  0000 C CNN
F 2 "" H 3750 5150 50  0000 C CNN
F 3 "" H 3750 5150 50  0000 C CNN
	1    3750 5150
	1    0    0    -1  
$EndComp
$Comp
L +3.3V #PWR12
U 1 1 58ACBC9A
P 5340 6950
F 0 "#PWR12" H 5340 6800 50  0001 C CNN
F 1 "+3.3V" H 5340 7090 50  0000 C CNN
F 2 "" H 5340 6950 50  0000 C CNN
F 3 "" H 5340 6950 50  0000 C CNN
	1    5340 6950
	1    0    0    -1  
$EndComp
$Comp
L +5V #PWR14
U 1 1 58ACBDB6
P 5830 6950
F 0 "#PWR14" H 5830 6800 50  0001 C CNN
F 1 "+5V" H 5830 7090 50  0000 C CNN
F 2 "" H 5830 6950 50  0000 C CNN
F 3 "" H 5830 6950 50  0000 C CNN
	1    5830 6950
	1    0    0    -1  
$EndComp
$Comp
L PWR_FLAG #FLG2
U 1 1 58ACBE12
P 5340 7090
F 0 "#FLG2" H 5340 7185 50  0001 C CNN
F 1 "PWR_FLAG" H 5340 7270 50  0000 C CNN
F 2 "" H 5340 7090 50  0000 C CNN
F 3 "" H 5340 7090 50  0000 C CNN
	1    5340 7090
	-1   0    0    1   
$EndComp
$Comp
L PWR_FLAG #FLG3
U 1 1 58ACBE62
P 5830 7090
F 0 "#FLG3" H 5830 7185 50  0001 C CNN
F 1 "PWR_FLAG" H 5830 7270 50  0000 C CNN
F 2 "" H 5830 7090 50  0000 C CNN
F 3 "" H 5830 7090 50  0000 C CNN
	1    5830 7090
	-1   0    0    1   
$EndComp
$Comp
L PWR_FLAG #FLG4
U 1 1 58ACBE8E
P 6250 7000
F 0 "#FLG4" H 6250 7095 50  0001 C CNN
F 1 "PWR_FLAG" H 6250 7180 50  0000 C CNN
F 2 "" H 6250 7000 50  0000 C CNN
F 3 "" H 6250 7000 50  0000 C CNN
	1    6250 7000
	1    0    0    -1  
$EndComp
$Comp
L GND #PWR15
U 1 1 58ACC01F
P 6250 7120
F 0 "#PWR15" H 6250 6870 50  0001 C CNN
F 1 "GND" H 6250 6970 50  0000 C CNN
F 2 "" H 6250 7120 50  0000 C CNN
F 3 "" H 6250 7120 50  0000 C CNN
	1    6250 7120
	1    0    0    -1  
$EndComp
$Comp
L GND #PWR10
U 1 1 58ACC1AA
P 4640 5900
F 0 "#PWR10" H 4640 5650 50  0001 C CNN
F 1 "GND" H 4640 5750 50  0000 C CNN
F 2 "" H 4640 5900 50  0000 C CNN
F 3 "" H 4640 5900 50  0000 C CNN
	1    4640 5900
	1    0    0    -1  
$EndComp
$Comp
L GND #PWR3
U 1 1 58ACC256
P 1530 5150
F 0 "#PWR3" H 1530 4900 50  0001 C CNN
F 1 "GND" H 1530 5000 50  0000 C CNN
F 2 "" H 1530 5150 50  0000 C CNN
F 3 "" H 1530 5150 50  0000 C CNN
	1    1530 5150
	1    0    0    -1  
$EndComp
$Comp
L +3.3V #PWR13
U 1 1 58ACC478
P 5610 5020
F 0 "#PWR13" H 5610 4870 50  0001 C CNN
F 1 "+3.3V" H 5610 5160 50  0000 C CNN
F 2 "" H 5610 5020 50  0000 C CNN
F 3 "" H 5610 5020 50  0000 C CNN
	1    5610 5020
	1    0    0    -1  
$EndComp
$Comp
L +5V #PWR8
U 1 1 58ACC4A4
P 4060 5070
F 0 "#PWR8" H 4060 4920 50  0001 C CNN
F 1 "+5V" H 4060 5210 50  0000 C CNN
F 2 "" H 4060 5070 50  0000 C CNN
F 3 "" H 4060 5070 50  0000 C CNN
	1    4060 5070
	1    0    0    -1  
$EndComp
$Comp
L PINHD-1X2 JP2
U 1 1 58ACCE75
P 730 5200
F 0 "JP2" H 480 5425 50  0000 L BNN
F 1 "PINHD-1X2" H 480 5000 50  0000 L BNN
F 2 "Pin_Headers:Pin_Header_Straight_1x02_Pitch2.54mm_SMD_Pin1Left" H 730 5350 50  0001 C CNN
F 3 "" H 730 5200 60  0001 C CNN
	1    730  5200
	-1   0    0    1   
$EndComp
$Comp
L GND #PWR1
U 1 1 58ACD084
P 1080 4880
F 0 "#PWR1" H 1080 4630 50  0001 C CNN
F 1 "GND" H 1080 4730 50  0000 C CNN
F 2 "" H 1080 4880 50  0000 C CNN
F 3 "" H 1080 4880 50  0000 C CNN
	1    1080 4880
	-1   0    0    1   
$EndComp
$Comp
L +12V #PWR2
U 1 1 58ACD74E
P 1310 4860
F 0 "#PWR2" H 1310 4710 50  0001 C CNN
F 1 "+12V" H 1310 5000 50  0000 C CNN
F 2 "" H 1310 4860 50  0000 C CNN
F 3 "" H 1310 4860 50  0000 C CNN
	1    1310 4860
	1    0    0    -1  
$EndComp
$Comp
L +12V #PWR11
U 1 1 58ACD968
P 4930 6950
F 0 "#PWR11" H 4930 6800 50  0001 C CNN
F 1 "+12V" H 4930 7090 50  0000 C CNN
F 2 "" H 4930 6950 50  0000 C CNN
F 3 "" H 4930 6950 50  0000 C CNN
	1    4930 6950
	1    0    0    -1  
$EndComp
$Comp
L PWR_FLAG #FLG1
U 1 1 58ACD996
P 4930 7080
F 0 "#FLG1" H 4930 7175 50  0001 C CNN
F 1 "PWR_FLAG" H 4930 7260 50  0000 C CNN
F 2 "" H 4930 7080 50  0000 C CNN
F 3 "" H 4930 7080 50  0000 C CNN
	1    4930 7080
	-1   0    0    1   
$EndComp
Text Label 10000 1750 0    60   ~ 0
ENC28J60_INT
$Comp
L CONN_01X05 P2
U 1 1 58AAD296
P 1125 1775
F 0 "P2" H 1125 2075 50  0000 C CNN
F 1 "CONN_01X05" V 1225 1775 50  0000 C CNN
F 2 "Pin_Headers:Pin_Header_Straight_1x05_Pitch2.54mm_SMD_Pin1Right" V 1350 1775 50  0001 C CNN
F 3 "" H 1125 1775 50  0000 C CNN
	1    1125 1775
	-1   0    0    1   
$EndComp
Wire Wire Line
	6550 4150 6800 4150
Wire Wire Line
	1650 3950 1650 4125
Wire Wire Line
	1325 3950 1650 3950
Connection ~ 1650 3250
Connection ~ 1850 3850
Wire Wire Line
	1850 3650 1850 3850
Wire Wire Line
	1325 3850 2300 3850
Wire Wire Line
	1850 3250 1650 3250
Wire Wire Line
	1650 3750 1325 3750
Wire Wire Line
	1650 3250 1650 3750
Wire Wire Line
	8775 2350 9000 2350
Wire Wire Line
	8775 2225 8775 2350
Wire Wire Line
	5250 4150 4725 4150
Wire Wire Line
	5250 4025 4725 4025
Wire Wire Line
	5250 3900 4725 3900
Wire Wire Line
	5250 3775 4725 3775
Wire Wire Line
	5250 3650 4725 3650
Wire Wire Line
	5250 3525 4725 3525
Wire Wire Line
	5250 3400 4725 3400
Wire Wire Line
	5250 3275 4725 3275
Wire Wire Line
	5250 3150 4725 3150
Wire Wire Line
	5250 3025 4725 3025
Wire Wire Line
	5250 2900 4725 2900
Wire Wire Line
	4400 2775 4400 2825
Wire Wire Line
	5250 2775 4400 2775
Wire Wire Line
	7150 2775 7150 2300
Wire Wire Line
	6550 2775 7150 2775
Wire Wire Line
	6550 2900 6800 2900
Wire Wire Line
	9200 1350 8600 1350
Wire Wire Line
	9200 1250 8600 1250
Wire Wire Line
	9200 1150 8600 1150
Wire Wire Line
	1325 1875 3375 1875
Wire Wire Line
	1325 1675 3375 1675
Wire Wire Line
	1325 1575 3375 1575
Wire Wire Line
	3750 5150 3470 5150
Wire Wire Line
	5830 6950 5830 7090
Wire Wire Line
	5340 6950 5340 7090
Wire Wire Line
	1970 5150 1530 5150
Wire Wire Line
	5610 5020 5610 5450
Wire Wire Line
	6250 7000 6250 7120
Wire Wire Line
	830  5200 1080 5200
Wire Wire Line
	1080 5200 1080 4880
Wire Wire Line
	1070 5300 830  5300
Wire Wire Line
	1070 5450 1070 5300
Wire Wire Line
	1310 4860 1310 5450
Wire Wire Line
	4930 6950 4930 7080
Wire Wire Line
	9700 1750 10000 1750
Wire Wire Line
	9700 1650 10000 1650
Wire Wire Line
	9700 1550 10000 1550
Wire Wire Line
	9700 1450 10000 1450
Wire Wire Line
	9700 1350 10000 1350
Wire Wire Line
	9700 1150 10000 1150
Wire Wire Line
	9200 1550 8225 1550
Wire Wire Line
	9700 1250 10000 1250
Wire Wire Line
	9200 1650 8675 1650
Wire Wire Line
	9200 1750 9000 1750
Wire Wire Line
	1325 1975 3375 1975
Wire Wire Line
	3375 1575 3375 1475
Wire Wire Line
	1325 1775 3375 1775
$Comp
L ARDUINO_NANO SH1
U 1 1 58AACFFA
P 5900 3250
F 0 "SH1" H 5875 2175 60  0000 C CNN
F 1 "ARDUINO_NANO" H 5875 4300 60  0000 C CNN
F 2 "libs:ARDUINO_NANO_2_SMD" V 5900 3325 60  0001 C CNN
F 3 "" H 4975 2650 60  0000 C CNN
	1    5900 3250
	1    0    0    -1  
$EndComp
NoConn ~ 6550 2525
Wire Wire Line
	6550 3525 6800 3525
NoConn ~ 6550 3775
Wire Wire Line
	6550 3275 6855 3275
Wire Wire Line
	9200 1450 9130 1450
Wire Wire Line
	9130 1450 9130 1650
Connection ~ 9130 1650
$Comp
L Polyfuse_Small F1
U 1 1 58F8666E
P 1700 5450
F 0 "F1" V 1625 5450 50  0000 C CNN
F 1 "0.5A/13.2V" V 1775 5450 50  0000 C CNN
F 2 "adafruit:R1206" H 1750 5250 50  0001 L CNN
F 3 "" H 1700 5450 50  0001 C CNN
	1    1700 5450
	0    1    1    0   
$EndComp
Wire Wire Line
	1600 5450 1070 5450
Connection ~ 1310 5450
Wire Wire Line
	1970 5450 1800 5450
$Comp
L LD1117S33TR U2
U 1 1 597F7F76
P 4640 5500
F 0 "U2" H 4640 5750 50  0000 C CNN
F 1 "LD1117S33TR" H 4640 5700 50  0000 C CNN
F 2 "TO_SOT_Packages_SMD:SOT-223" H 4640 5600 50  0001 C CNN
F 3 "" H 4640 5500 50  0001 C CNN
	1    4640 5500
	1    0    0    -1  
$EndComp
Wire Wire Line
	4640 5750 4640 5900
Wire Wire Line
	4240 5450 3470 5450
Wire Wire Line
	4060 5070 4060 5550
Connection ~ 4060 5450
Wire Wire Line
	5610 5450 5040 5450
$Comp
L CAP0805 C1
U 1 1 597F874C
P 4060 5750
F 0 "C1" H 4120 5865 50  0000 L BNN
F 1 "100n" H 4120 5665 50  0000 L BNN
F 2 "0805" H 4090 5900 20  0001 C CNN
F 3 "" H 4060 5750 60  0001 C CNN
	1    4060 5750
	1    0    0    -1  
$EndComp
$Comp
L CAP0805 C2
U 1 1 597F883B
P 5160 5750
F 0 "C2" H 5220 5865 50  0000 L BNN
F 1 "10u" H 5220 5665 50  0000 L BNN
F 2 "0805" H 5190 5900 20  0001 C CNN
F 3 "" H 5160 5750 60  0001 C CNN
	1    5160 5750
	1    0    0    -1  
$EndComp
Wire Wire Line
	5160 5550 5160 5450
Connection ~ 5160 5450
Wire Wire Line
	4060 5850 5160 5850
Connection ~ 4640 5850
$EndSCHEMATC
