(module TACT-SWITCH (layer F.Cu) (tedit 58F768AF)
  (attr smd)
  (fp_text reference SW1 (at -0.24 -1.79 180) (layer F.Fab)
    (effects (font (size 0.29972 0.29972) (thickness 0.07493)))
  )
  (fp_text value RESET_SW (at -0.04 0 180) (layer F.Fab)
    (effects (font (size 0.29972 0.29972) (thickness 0.07493)))
  )
  (fp_line (start -0.8001 -1.50114) (end -0.8001 -2.10058) (layer F.Fab) (width 0.001))
  (fp_line (start -0.8001 -2.10058) (end 0.8001 -2.10058) (layer F.Fab) (width 0.001))
  (fp_line (start 0.8001 -2.10058) (end 0.8001 -1.50114) (layer F.Fab) (width 0.001))
  (fp_line (start 1.99898 1.50114) (end -1.99898 1.50114) (layer F.Fab) (width 0.001))
  (fp_line (start -1.99898 1.50114) (end -1.99898 -1.50114) (layer F.Fab) (width 0.001))
  (fp_line (start -1.99898 -1.50114) (end 1.99898 -1.50114) (layer F.Fab) (width 0.001))
  (fp_line (start 1.99898 -1.50114) (end 1.99898 1.50114) (layer F.Fab) (width 0.001))
  (pad 1 smd rect (at -2.09898 0) (size 1.2 1.80086) (layers F.Cu F.Paste F.Mask)
    (clearance 0.14986))
  (pad 2 smd rect (at 2.09898 0) (size 1.20076 1.80086) (layers F.Cu F.Paste F.Mask)
    (clearance 0.14986))
  (pad "" thru_hole circle (at 0 0.89916) (size 0.8001 0.8001) (drill 0.8001) (layers *.Cu *.Mask F.SilkS)
    (clearance 0.14986))
  (pad "" thru_hole circle (at 0 -0.89916) (size 0.8001 0.8001) (drill 0.8001) (layers *.Cu *.Mask F.SilkS)
    (clearance 0.14986))
  (model brick_taster.wrl
    (at (xyz 0 0 0))
    (scale (xyz 1 1 1))
    (rotate (xyz -90 0 0))
  )
)
