(module Pin_Header_Straight_1x09_Pitch2.00mm_SMD_Pin1Right (layer F.Cu) (tedit 588DAF2E)
  (descr "surface-mounted straight pin header, 1x09, 2.00mm pitch, single row, style 2 (pin 1 right)")
  (tags "Surface mounted pin header SMD 1x09 2.00mm single row style2 pin1 right")
  (attr smd)
  (fp_text reference REF** (at 0 -10.06) (layer F.SilkS)
    (effects (font (size 1 1) (thickness 0.15)))
  )
  (fp_text value Pin_Header_Straight_1x09_Pitch2.00mm_SMD_Pin1Right (at 0 10.06) (layer F.Fab)
    (effects (font (size 1 1) (thickness 0.15)))
  )
  (fp_line (start -1 -9) (end -1 9) (layer F.Fab) (width 0.1))
  (fp_line (start -1 9) (end 1 9) (layer F.Fab) (width 0.1))
  (fp_line (start 1 9) (end 1 -9) (layer F.Fab) (width 0.1))
  (fp_line (start 1 -9) (end -1 -9) (layer F.Fab) (width 0.1))
  (fp_line (start -1 -6.25) (end -1 -5.75) (layer F.Fab) (width 0.1))
  (fp_line (start -1 -5.75) (end -2 -5.75) (layer F.Fab) (width 0.1))
  (fp_line (start -2 -5.75) (end -2 -6.25) (layer F.Fab) (width 0.1))
  (fp_line (start -2 -6.25) (end -1 -6.25) (layer F.Fab) (width 0.1))
  (fp_line (start -1 -2.25) (end -1 -1.75) (layer F.Fab) (width 0.1))
  (fp_line (start -1 -1.75) (end -2 -1.75) (layer F.Fab) (width 0.1))
  (fp_line (start -2 -1.75) (end -2 -2.25) (layer F.Fab) (width 0.1))
  (fp_line (start -2 -2.25) (end -1 -2.25) (layer F.Fab) (width 0.1))
  (fp_line (start -1 1.75) (end -1 2.25) (layer F.Fab) (width 0.1))
  (fp_line (start -1 2.25) (end -2 2.25) (layer F.Fab) (width 0.1))
  (fp_line (start -2 2.25) (end -2 1.75) (layer F.Fab) (width 0.1))
  (fp_line (start -2 1.75) (end -1 1.75) (layer F.Fab) (width 0.1))
  (fp_line (start -1 5.75) (end -1 6.25) (layer F.Fab) (width 0.1))
  (fp_line (start -1 6.25) (end -2 6.25) (layer F.Fab) (width 0.1))
  (fp_line (start -2 6.25) (end -2 5.75) (layer F.Fab) (width 0.1))
  (fp_line (start -2 5.75) (end -1 5.75) (layer F.Fab) (width 0.1))
  (fp_line (start 1 -8.25) (end 1 -7.75) (layer F.Fab) (width 0.1))
  (fp_line (start 1 -7.75) (end 2 -7.75) (layer F.Fab) (width 0.1))
  (fp_line (start 2 -7.75) (end 2 -8.25) (layer F.Fab) (width 0.1))
  (fp_line (start 2 -8.25) (end 1 -8.25) (layer F.Fab) (width 0.1))
  (fp_line (start 1 -4.25) (end 1 -3.75) (layer F.Fab) (width 0.1))
  (fp_line (start 1 -3.75) (end 2 -3.75) (layer F.Fab) (width 0.1))
  (fp_line (start 2 -3.75) (end 2 -4.25) (layer F.Fab) (width 0.1))
  (fp_line (start 2 -4.25) (end 1 -4.25) (layer F.Fab) (width 0.1))
  (fp_line (start 1 -0.25) (end 1 0.25) (layer F.Fab) (width 0.1))
  (fp_line (start 1 0.25) (end 2 0.25) (layer F.Fab) (width 0.1))
  (fp_line (start 2 0.25) (end 2 -0.25) (layer F.Fab) (width 0.1))
  (fp_line (start 2 -0.25) (end 1 -0.25) (layer F.Fab) (width 0.1))
  (fp_line (start 1 3.75) (end 1 4.25) (layer F.Fab) (width 0.1))
  (fp_line (start 1 4.25) (end 2 4.25) (layer F.Fab) (width 0.1))
  (fp_line (start 2 4.25) (end 2 3.75) (layer F.Fab) (width 0.1))
  (fp_line (start 2 3.75) (end 1 3.75) (layer F.Fab) (width 0.1))
  (fp_line (start 1 7.75) (end 1 8.25) (layer F.Fab) (width 0.1))
  (fp_line (start 1 8.25) (end 2 8.25) (layer F.Fab) (width 0.1))
  (fp_line (start 2 8.25) (end 2 7.75) (layer F.Fab) (width 0.1))
  (fp_line (start 2 7.75) (end 1 7.75) (layer F.Fab) (width 0.1))
  (fp_line (start -1.06 -8.8) (end -1.06 -9.06) (layer F.SilkS) (width 0.12))
  (fp_line (start -1.06 -9.06) (end 1.06 -9.06) (layer F.SilkS) (width 0.12))
  (fp_line (start 1.06 -9.06) (end 1.06 -8.8) (layer F.SilkS) (width 0.12))
  (fp_line (start -1.06 8.8) (end -1.06 9.06) (layer F.SilkS) (width 0.12))
  (fp_line (start -1.06 9.06) (end 1.06 9.06) (layer F.SilkS) (width 0.12))
  (fp_line (start 1.06 9.06) (end 1.06 8.8) (layer F.SilkS) (width 0.12))
  (fp_line (start 1.06 -7.32) (end 1.06 -4.68) (layer F.SilkS) (width 0.12))
  (fp_line (start 1.06 -3.32) (end 1.06 -0.68) (layer F.SilkS) (width 0.12))
  (fp_line (start 1.06 0.68) (end 1.06 3.32) (layer F.SilkS) (width 0.12))
  (fp_line (start 1.06 4.68) (end 1.06 7.32) (layer F.SilkS) (width 0.12))
  (fp_line (start -1.06 -9.06) (end -1.06 -6.68) (layer F.SilkS) (width 0.12))
  (fp_line (start 1.06 -8.8) (end 3.5 -8.8) (layer F.SilkS) (width 0.12))
  (fp_line (start -1.06 -5.32) (end -1.06 -2.68) (layer F.SilkS) (width 0.12))
  (fp_line (start -1.06 -1.32) (end -1.06 1.32) (layer F.SilkS) (width 0.12))
  (fp_line (start -1.06 2.68) (end -1.06 5.32) (layer F.SilkS) (width 0.12))
  (fp_line (start -1.06 6.68) (end -1.06 9.06) (layer F.SilkS) (width 0.12))
  (fp_line (start -3.75 -9.25) (end -3.75 9.25) (layer F.CrtYd) (width 0.05))
  (fp_line (start -3.75 9.25) (end 3.75 9.25) (layer F.CrtYd) (width 0.05))
  (fp_line (start 3.75 9.25) (end 3.75 -9.25) (layer F.CrtYd) (width 0.05))
  (fp_line (start 3.75 -9.25) (end -3.75 -9.25) (layer F.CrtYd) (width 0.05))
  (pad 2 smd rect (at -2.125 -6) (size 2.75 1) (layers F.Cu F.Mask))
  (pad 4 smd rect (at -2.125 -2) (size 2.75 1) (layers F.Cu F.Mask))
  (pad 6 smd rect (at -2.125 2) (size 2.75 1) (layers F.Cu F.Mask))
  (pad 8 smd rect (at -2.125 6) (size 2.75 1) (layers F.Cu F.Mask))
  (pad 1 smd rect (at 2.125 -8) (size 2.75 1) (layers F.Cu F.Mask))
  (pad 3 smd rect (at 2.125 -4) (size 2.75 1) (layers F.Cu F.Mask))
  (pad 5 smd rect (at 2.125 0) (size 2.75 1) (layers F.Cu F.Mask))
  (pad 7 smd rect (at 2.125 4) (size 2.75 1) (layers F.Cu F.Mask))
  (pad 9 smd rect (at 2.125 8) (size 2.75 1) (layers F.Cu F.Mask))
  (model Pin_Headers.3dshapes/Pin_Header_Straight_1x09_Pitch2.00mm_SMD_Pin1Right.wrl
    (at (xyz 0 0 0))
    (scale (xyz 1 1 1))
    (rotate (xyz 0 0 0))
  )
)