(module Pin_Header_Straight_1x04_Pitch1.27mm_SMD_Pin1Right (layer F.Cu) (tedit 588DAF33)
  (descr "surface-mounted straight pin header, 1x04, 1.27mm pitch, single row, style 2 (pin 1 right)")
  (tags "Surface mounted pin header SMD 1x04 1.27mm single row style2 pin1 right")
  (attr smd)
  (fp_text reference REF** (at 0 -3.6) (layer F.SilkS)
    (effects (font (size 1 1) (thickness 0.15)))
  )
  (fp_text value Pin_Header_Straight_1x04_Pitch1.27mm_SMD_Pin1Right (at 0 3.6) (layer F.Fab)
    (effects (font (size 1 1) (thickness 0.15)))
  )
  (fp_line (start -0.635 -2.54) (end -0.635 2.54) (layer F.Fab) (width 0.1))
  (fp_line (start -0.635 2.54) (end 0.635 2.54) (layer F.Fab) (width 0.1))
  (fp_line (start 0.635 2.54) (end 0.635 -2.54) (layer F.Fab) (width 0.1))
  (fp_line (start 0.635 -2.54) (end -0.635 -2.54) (layer F.Fab) (width 0.1))
  (fp_line (start -0.635 -0.835) (end -0.635 -0.435) (layer F.Fab) (width 0.1))
  (fp_line (start -0.635 -0.435) (end -1.92 -0.435) (layer F.Fab) (width 0.1))
  (fp_line (start -1.92 -0.435) (end -1.92 -0.835) (layer F.Fab) (width 0.1))
  (fp_line (start -1.92 -0.835) (end -0.635 -0.835) (layer F.Fab) (width 0.1))
  (fp_line (start -0.635 1.705) (end -0.635 2.105) (layer F.Fab) (width 0.1))
  (fp_line (start -0.635 2.105) (end -1.92 2.105) (layer F.Fab) (width 0.1))
  (fp_line (start -1.92 2.105) (end -1.92 1.705) (layer F.Fab) (width 0.1))
  (fp_line (start -1.92 1.705) (end -0.635 1.705) (layer F.Fab) (width 0.1))
  (fp_line (start 0.635 -2.105) (end 0.635 -1.705) (layer F.Fab) (width 0.1))
  (fp_line (start 0.635 -1.705) (end 1.92 -1.705) (layer F.Fab) (width 0.1))
  (fp_line (start 1.92 -1.705) (end 1.92 -2.105) (layer F.Fab) (width 0.1))
  (fp_line (start 1.92 -2.105) (end 0.635 -2.105) (layer F.Fab) (width 0.1))
  (fp_line (start 0.635 0.435) (end 0.635 0.835) (layer F.Fab) (width 0.1))
  (fp_line (start 0.635 0.835) (end 1.92 0.835) (layer F.Fab) (width 0.1))
  (fp_line (start 1.92 0.835) (end 1.92 0.435) (layer F.Fab) (width 0.1))
  (fp_line (start 1.92 0.435) (end 0.635 0.435) (layer F.Fab) (width 0.1))
  (fp_line (start -0.695 -2.58) (end -0.695 -2.6) (layer F.SilkS) (width 0.12))
  (fp_line (start -0.695 -2.6) (end 0.695 -2.6) (layer F.SilkS) (width 0.12))
  (fp_line (start 0.695 -2.6) (end 0.695 -2.58) (layer F.SilkS) (width 0.12))
  (fp_line (start -0.695 2.58) (end -0.695 2.6) (layer F.SilkS) (width 0.12))
  (fp_line (start -0.695 2.6) (end 0.695 2.6) (layer F.SilkS) (width 0.12))
  (fp_line (start 0.695 2.6) (end 0.695 2.58) (layer F.SilkS) (width 0.12))
  (fp_line (start 0.695 -1.35) (end 0.695 0.08) (layer F.SilkS) (width 0.12))
  (fp_line (start 0.695 1.19) (end 0.695 2.6) (layer F.SilkS) (width 0.12))
  (fp_line (start -0.695 -2.6) (end -0.695 -1.19) (layer F.SilkS) (width 0.12))
  (fp_line (start 0.695 -2.58) (end 3 -2.58) (layer F.SilkS) (width 0.12))
  (fp_line (start -0.695 -0.08) (end -0.695 1.35) (layer F.SilkS) (width 0.12))
  (fp_line (start -3.25 -2.8) (end -3.25 2.8) (layer F.CrtYd) (width 0.05))
  (fp_line (start -3.25 2.8) (end 3.25 2.8) (layer F.CrtYd) (width 0.05))
  (fp_line (start 3.25 2.8) (end 3.25 -2.8) (layer F.CrtYd) (width 0.05))
  (fp_line (start 3.25 -2.8) (end -3.25 -2.8) (layer F.CrtYd) (width 0.05))
  (pad 2 smd rect (at -1.95 -0.635) (size 2.1 0.75) (layers F.Cu F.Mask))
  (pad 4 smd rect (at -1.95 1.905) (size 2.1 0.75) (layers F.Cu F.Mask))
  (pad 1 smd rect (at 1.95 -1.905) (size 2.1 0.75) (layers F.Cu F.Mask))
  (pad 3 smd rect (at 1.95 0.635) (size 2.1 0.75) (layers F.Cu F.Mask))
  (model Pin_Headers.3dshapes/Pin_Header_Straight_1x04_Pitch1.27mm_SMD_Pin1Right.wrl
    (at (xyz 0 0 0))
    (scale (xyz 1 1 1))
    (rotate (xyz 0 0 0))
  )
)