(module Pin_Header_Straight_1x09_Pitch1.27mm_SMD_Pin1Right (layer F.Cu) (tedit 588DAF33)
  (descr "surface-mounted straight pin header, 1x09, 1.27mm pitch, single row, style 2 (pin 1 right)")
  (tags "Surface mounted pin header SMD 1x09 1.27mm single row style2 pin1 right")
  (attr smd)
  (fp_text reference REF** (at 0 -6.775) (layer F.SilkS)
    (effects (font (size 1 1) (thickness 0.15)))
  )
  (fp_text value Pin_Header_Straight_1x09_Pitch1.27mm_SMD_Pin1Right (at 0 6.775) (layer F.Fab)
    (effects (font (size 1 1) (thickness 0.15)))
  )
  (fp_line (start -0.635 -5.715) (end -0.635 5.715) (layer F.Fab) (width 0.1))
  (fp_line (start -0.635 5.715) (end 0.635 5.715) (layer F.Fab) (width 0.1))
  (fp_line (start 0.635 5.715) (end 0.635 -5.715) (layer F.Fab) (width 0.1))
  (fp_line (start 0.635 -5.715) (end -0.635 -5.715) (layer F.Fab) (width 0.1))
  (fp_line (start -0.635 -4.01) (end -0.635 -3.61) (layer F.Fab) (width 0.1))
  (fp_line (start -0.635 -3.61) (end -1.92 -3.61) (layer F.Fab) (width 0.1))
  (fp_line (start -1.92 -3.61) (end -1.92 -4.01) (layer F.Fab) (width 0.1))
  (fp_line (start -1.92 -4.01) (end -0.635 -4.01) (layer F.Fab) (width 0.1))
  (fp_line (start -0.635 -1.47) (end -0.635 -1.07) (layer F.Fab) (width 0.1))
  (fp_line (start -0.635 -1.07) (end -1.92 -1.07) (layer F.Fab) (width 0.1))
  (fp_line (start -1.92 -1.07) (end -1.92 -1.47) (layer F.Fab) (width 0.1))
  (fp_line (start -1.92 -1.47) (end -0.635 -1.47) (layer F.Fab) (width 0.1))
  (fp_line (start -0.635 1.07) (end -0.635 1.47) (layer F.Fab) (width 0.1))
  (fp_line (start -0.635 1.47) (end -1.92 1.47) (layer F.Fab) (width 0.1))
  (fp_line (start -1.92 1.47) (end -1.92 1.07) (layer F.Fab) (width 0.1))
  (fp_line (start -1.92 1.07) (end -0.635 1.07) (layer F.Fab) (width 0.1))
  (fp_line (start -0.635 3.61) (end -0.635 4.01) (layer F.Fab) (width 0.1))
  (fp_line (start -0.635 4.01) (end -1.92 4.01) (layer F.Fab) (width 0.1))
  (fp_line (start -1.92 4.01) (end -1.92 3.61) (layer F.Fab) (width 0.1))
  (fp_line (start -1.92 3.61) (end -0.635 3.61) (layer F.Fab) (width 0.1))
  (fp_line (start 0.635 -5.28) (end 0.635 -4.88) (layer F.Fab) (width 0.1))
  (fp_line (start 0.635 -4.88) (end 1.92 -4.88) (layer F.Fab) (width 0.1))
  (fp_line (start 1.92 -4.88) (end 1.92 -5.28) (layer F.Fab) (width 0.1))
  (fp_line (start 1.92 -5.28) (end 0.635 -5.28) (layer F.Fab) (width 0.1))
  (fp_line (start 0.635 -2.74) (end 0.635 -2.34) (layer F.Fab) (width 0.1))
  (fp_line (start 0.635 -2.34) (end 1.92 -2.34) (layer F.Fab) (width 0.1))
  (fp_line (start 1.92 -2.34) (end 1.92 -2.74) (layer F.Fab) (width 0.1))
  (fp_line (start 1.92 -2.74) (end 0.635 -2.74) (layer F.Fab) (width 0.1))
  (fp_line (start 0.635 -0.2) (end 0.635 0.2) (layer F.Fab) (width 0.1))
  (fp_line (start 0.635 0.2) (end 1.92 0.2) (layer F.Fab) (width 0.1))
  (fp_line (start 1.92 0.2) (end 1.92 -0.2) (layer F.Fab) (width 0.1))
  (fp_line (start 1.92 -0.2) (end 0.635 -0.2) (layer F.Fab) (width 0.1))
  (fp_line (start 0.635 2.34) (end 0.635 2.74) (layer F.Fab) (width 0.1))
  (fp_line (start 0.635 2.74) (end 1.92 2.74) (layer F.Fab) (width 0.1))
  (fp_line (start 1.92 2.74) (end 1.92 2.34) (layer F.Fab) (width 0.1))
  (fp_line (start 1.92 2.34) (end 0.635 2.34) (layer F.Fab) (width 0.1))
  (fp_line (start 0.635 4.88) (end 0.635 5.28) (layer F.Fab) (width 0.1))
  (fp_line (start 0.635 5.28) (end 1.92 5.28) (layer F.Fab) (width 0.1))
  (fp_line (start 1.92 5.28) (end 1.92 4.88) (layer F.Fab) (width 0.1))
  (fp_line (start 1.92 4.88) (end 0.635 4.88) (layer F.Fab) (width 0.1))
  (fp_line (start -0.695 -5.755) (end -0.695 -5.775) (layer F.SilkS) (width 0.12))
  (fp_line (start -0.695 -5.775) (end 0.695 -5.775) (layer F.SilkS) (width 0.12))
  (fp_line (start 0.695 -5.775) (end 0.695 -5.755) (layer F.SilkS) (width 0.12))
  (fp_line (start -0.695 5.755) (end -0.695 5.775) (layer F.SilkS) (width 0.12))
  (fp_line (start -0.695 5.775) (end 0.695 5.775) (layer F.SilkS) (width 0.12))
  (fp_line (start 0.695 5.775) (end 0.695 5.755) (layer F.SilkS) (width 0.12))
  (fp_line (start 0.695 -4.525) (end 0.695 -3.095) (layer F.SilkS) (width 0.12))
  (fp_line (start 0.695 -1.985) (end 0.695 -0.555) (layer F.SilkS) (width 0.12))
  (fp_line (start 0.695 0.555) (end 0.695 1.985) (layer F.SilkS) (width 0.12))
  (fp_line (start 0.695 3.095) (end 0.695 4.525) (layer F.SilkS) (width 0.12))
  (fp_line (start -0.695 -5.775) (end -0.695 -4.365) (layer F.SilkS) (width 0.12))
  (fp_line (start 0.695 -5.755) (end 3 -5.755) (layer F.SilkS) (width 0.12))
  (fp_line (start -0.695 -3.255) (end -0.695 -1.825) (layer F.SilkS) (width 0.12))
  (fp_line (start -0.695 -0.715) (end -0.695 0.715) (layer F.SilkS) (width 0.12))
  (fp_line (start -0.695 1.825) (end -0.695 3.255) (layer F.SilkS) (width 0.12))
  (fp_line (start -0.695 4.365) (end -0.695 5.775) (layer F.SilkS) (width 0.12))
  (fp_line (start -3.25 -6) (end -3.25 6) (layer F.CrtYd) (width 0.05))
  (fp_line (start -3.25 6) (end 3.25 6) (layer F.CrtYd) (width 0.05))
  (fp_line (start 3.25 6) (end 3.25 -6) (layer F.CrtYd) (width 0.05))
  (fp_line (start 3.25 -6) (end -3.25 -6) (layer F.CrtYd) (width 0.05))
  (pad 2 smd rect (at -1.95 -3.81) (size 2.1 0.75) (layers F.Cu F.Mask))
  (pad 4 smd rect (at -1.95 -1.27) (size 2.1 0.75) (layers F.Cu F.Mask))
  (pad 6 smd rect (at -1.95 1.27) (size 2.1 0.75) (layers F.Cu F.Mask))
  (pad 8 smd rect (at -1.95 3.81) (size 2.1 0.75) (layers F.Cu F.Mask))
  (pad 1 smd rect (at 1.95 -5.08) (size 2.1 0.75) (layers F.Cu F.Mask))
  (pad 3 smd rect (at 1.95 -2.54) (size 2.1 0.75) (layers F.Cu F.Mask))
  (pad 5 smd rect (at 1.95 0) (size 2.1 0.75) (layers F.Cu F.Mask))
  (pad 7 smd rect (at 1.95 2.54) (size 2.1 0.75) (layers F.Cu F.Mask))
  (pad 9 smd rect (at 1.95 5.08) (size 2.1 0.75) (layers F.Cu F.Mask))
  (model Pin_Headers.3dshapes/Pin_Header_Straight_1x09_Pitch1.27mm_SMD_Pin1Right.wrl
    (at (xyz 0 0 0))
    (scale (xyz 1 1 1))
    (rotate (xyz 0 0 0))
  )
)