(module Pin_Header_Straight_2x06_Pitch1.27mm_SMD (layer F.Cu) (tedit 588DAF37)
  (descr "surface-mounted straight pin header, 2x06, 1.27mm pitch, double rows")
  (tags "Surface mounted pin header SMD 2x06 1.27mm double row")
  (attr smd)
  (fp_text reference REF** (at 0 -4.87) (layer F.SilkS)
    (effects (font (size 1 1) (thickness 0.15)))
  )
  (fp_text value Pin_Header_Straight_2x06_Pitch1.27mm_SMD (at 0 4.87) (layer F.Fab)
    (effects (font (size 1 1) (thickness 0.15)))
  )
  (fp_line (start -1.27 -3.81) (end -1.27 3.81) (layer F.Fab) (width 0.1))
  (fp_line (start -1.27 3.81) (end 1.27 3.81) (layer F.Fab) (width 0.1))
  (fp_line (start 1.27 3.81) (end 1.27 -3.81) (layer F.Fab) (width 0.1))
  (fp_line (start 1.27 -3.81) (end -1.27 -3.81) (layer F.Fab) (width 0.1))
  (fp_line (start -1.27 -3.375) (end -1.27 -2.975) (layer F.Fab) (width 0.1))
  (fp_line (start -1.27 -2.975) (end -2.555 -2.975) (layer F.Fab) (width 0.1))
  (fp_line (start -2.555 -2.975) (end -2.555 -3.375) (layer F.Fab) (width 0.1))
  (fp_line (start -2.555 -3.375) (end -1.27 -3.375) (layer F.Fab) (width 0.1))
  (fp_line (start 1.27 -3.375) (end 1.27 -2.975) (layer F.Fab) (width 0.1))
  (fp_line (start 1.27 -2.975) (end 2.555 -2.975) (layer F.Fab) (width 0.1))
  (fp_line (start 2.555 -2.975) (end 2.555 -3.375) (layer F.Fab) (width 0.1))
  (fp_line (start 2.555 -3.375) (end 1.27 -3.375) (layer F.Fab) (width 0.1))
  (fp_line (start -1.27 -2.105) (end -1.27 -1.705) (layer F.Fab) (width 0.1))
  (fp_line (start -1.27 -1.705) (end -2.555 -1.705) (layer F.Fab) (width 0.1))
  (fp_line (start -2.555 -1.705) (end -2.555 -2.105) (layer F.Fab) (width 0.1))
  (fp_line (start -2.555 -2.105) (end -1.27 -2.105) (layer F.Fab) (width 0.1))
  (fp_line (start 1.27 -2.105) (end 1.27 -1.705) (layer F.Fab) (width 0.1))
  (fp_line (start 1.27 -1.705) (end 2.555 -1.705) (layer F.Fab) (width 0.1))
  (fp_line (start 2.555 -1.705) (end 2.555 -2.105) (layer F.Fab) (width 0.1))
  (fp_line (start 2.555 -2.105) (end 1.27 -2.105) (layer F.Fab) (width 0.1))
  (fp_line (start -1.27 -0.835) (end -1.27 -0.435) (layer F.Fab) (width 0.1))
  (fp_line (start -1.27 -0.435) (end -2.555 -0.435) (layer F.Fab) (width 0.1))
  (fp_line (start -2.555 -0.435) (end -2.555 -0.835) (layer F.Fab) (width 0.1))
  (fp_line (start -2.555 -0.835) (end -1.27 -0.835) (layer F.Fab) (width 0.1))
  (fp_line (start 1.27 -0.835) (end 1.27 -0.435) (layer F.Fab) (width 0.1))
  (fp_line (start 1.27 -0.435) (end 2.555 -0.435) (layer F.Fab) (width 0.1))
  (fp_line (start 2.555 -0.435) (end 2.555 -0.835) (layer F.Fab) (width 0.1))
  (fp_line (start 2.555 -0.835) (end 1.27 -0.835) (layer F.Fab) (width 0.1))
  (fp_line (start -1.27 0.435) (end -1.27 0.835) (layer F.Fab) (width 0.1))
  (fp_line (start -1.27 0.835) (end -2.555 0.835) (layer F.Fab) (width 0.1))
  (fp_line (start -2.555 0.835) (end -2.555 0.435) (layer F.Fab) (width 0.1))
  (fp_line (start -2.555 0.435) (end -1.27 0.435) (layer F.Fab) (width 0.1))
  (fp_line (start 1.27 0.435) (end 1.27 0.835) (layer F.Fab) (width 0.1))
  (fp_line (start 1.27 0.835) (end 2.555 0.835) (layer F.Fab) (width 0.1))
  (fp_line (start 2.555 0.835) (end 2.555 0.435) (layer F.Fab) (width 0.1))
  (fp_line (start 2.555 0.435) (end 1.27 0.435) (layer F.Fab) (width 0.1))
  (fp_line (start -1.27 1.705) (end -1.27 2.105) (layer F.Fab) (width 0.1))
  (fp_line (start -1.27 2.105) (end -2.555 2.105) (layer F.Fab) (width 0.1))
  (fp_line (start -2.555 2.105) (end -2.555 1.705) (layer F.Fab) (width 0.1))
  (fp_line (start -2.555 1.705) (end -1.27 1.705) (layer F.Fab) (width 0.1))
  (fp_line (start 1.27 1.705) (end 1.27 2.105) (layer F.Fab) (width 0.1))
  (fp_line (start 1.27 2.105) (end 2.555 2.105) (layer F.Fab) (width 0.1))
  (fp_line (start 2.555 2.105) (end 2.555 1.705) (layer F.Fab) (width 0.1))
  (fp_line (start 2.555 1.705) (end 1.27 1.705) (layer F.Fab) (width 0.1))
  (fp_line (start -1.27 2.975) (end -1.27 3.375) (layer F.Fab) (width 0.1))
  (fp_line (start -1.27 3.375) (end -2.555 3.375) (layer F.Fab) (width 0.1))
  (fp_line (start -2.555 3.375) (end -2.555 2.975) (layer F.Fab) (width 0.1))
  (fp_line (start -2.555 2.975) (end -1.27 2.975) (layer F.Fab) (width 0.1))
  (fp_line (start 1.27 2.975) (end 1.27 3.375) (layer F.Fab) (width 0.1))
  (fp_line (start 1.27 3.375) (end 2.555 3.375) (layer F.Fab) (width 0.1))
  (fp_line (start 2.555 3.375) (end 2.555 2.975) (layer F.Fab) (width 0.1))
  (fp_line (start 2.555 2.975) (end 1.27 2.975) (layer F.Fab) (width 0.1))
  (fp_line (start -1.33 -3.85) (end -1.33 -3.87) (layer F.SilkS) (width 0.12))
  (fp_line (start -1.33 -3.87) (end 1.33 -3.87) (layer F.SilkS) (width 0.12))
  (fp_line (start 1.33 -3.87) (end 1.33 -3.85) (layer F.SilkS) (width 0.12))
  (fp_line (start -1.33 3.85) (end -1.33 3.87) (layer F.SilkS) (width 0.12))
  (fp_line (start -1.33 3.87) (end 1.33 3.87) (layer F.SilkS) (width 0.12))
  (fp_line (start 1.33 3.87) (end 1.33 3.85) (layer F.SilkS) (width 0.12))
  (fp_line (start -3.635 -3.85) (end -1.33 -3.85) (layer F.SilkS) (width 0.12))
  (fp_line (start -3.9 -4.1) (end -3.9 4.1) (layer F.CrtYd) (width 0.05))
  (fp_line (start -3.9 4.1) (end 3.9 4.1) (layer F.CrtYd) (width 0.05))
  (fp_line (start 3.9 4.1) (end 3.9 -4.1) (layer F.CrtYd) (width 0.05))
  (fp_line (start 3.9 -4.1) (end -3.9 -4.1) (layer F.CrtYd) (width 0.05))
  (pad 1 smd rect (at -2.585 -3.175) (size 2.1 0.75) (layers F.Cu F.Mask))
  (pad 2 smd rect (at 2.585 -3.175) (size 2.1 0.75) (layers F.Cu F.Mask))
  (pad 3 smd rect (at -2.585 -1.905) (size 2.1 0.75) (layers F.Cu F.Mask))
  (pad 4 smd rect (at 2.585 -1.905) (size 2.1 0.75) (layers F.Cu F.Mask))
  (pad 5 smd rect (at -2.585 -0.635) (size 2.1 0.75) (layers F.Cu F.Mask))
  (pad 6 smd rect (at 2.585 -0.635) (size 2.1 0.75) (layers F.Cu F.Mask))
  (pad 7 smd rect (at -2.585 0.635) (size 2.1 0.75) (layers F.Cu F.Mask))
  (pad 8 smd rect (at 2.585 0.635) (size 2.1 0.75) (layers F.Cu F.Mask))
  (pad 9 smd rect (at -2.585 1.905) (size 2.1 0.75) (layers F.Cu F.Mask))
  (pad 10 smd rect (at 2.585 1.905) (size 2.1 0.75) (layers F.Cu F.Mask))
  (pad 11 smd rect (at -2.585 3.175) (size 2.1 0.75) (layers F.Cu F.Mask))
  (pad 12 smd rect (at 2.585 3.175) (size 2.1 0.75) (layers F.Cu F.Mask))
  (model Pin_Headers.3dshapes/Pin_Header_Straight_2x06_Pitch1.27mm_SMD.wrl
    (at (xyz 0 0 0))
    (scale (xyz 1 1 1))
    (rotate (xyz 0 0 0))
  )
)