EESchema Schematic File Version 4
LIBS:HAD-cache
EELAYER 26 0
EELAYER END
$Descr A4 11693 8268
encoding utf-8
Sheet 1 1
Title ""
Date ""
Rev ""
Comp ""
Comment1 ""
Comment2 ""
Comment3 ""
Comment4 ""
$EndDescr
$Comp
L Connector_Generic:Conn_02x08_Odd_Even P3
U 1 1 58AAD17B
P 9495 1400
F 0 "P3" H 9495 1800 50  0000 C CNN
F 1 "Conn_02x08_Odd_Even" V 9540 1355 50  0001 C CNN
F 2 "Pin_Headers:Pin_Header_Straight_2x08_Pitch2.54mm_SMD" H 9495 200 50  0001 C CNN
F 3 "" H 9495 200 50  0000 C CNN
	1    9495 1400
	-1   0    0    1   
$EndComp
$Comp
L power:GND #PWR06
U 1 1 58AAE09D
P 3375 1475
F 0 "#PWR06" H 3375 1225 50  0001 C CNN
F 1 "GND" H 3375 1325 50  0000 C CNN
F 2 "" H 3375 1475 50  0000 C CNN
F 3 "" H 3375 1475 50  0000 C CNN
	1    3375 1475
	-1   0    0    1   
$EndComp
Text Label 3375 1675 0    60   ~ 0
PB1
Text Label 3375 1775 0    60   ~ 0
PB2
Text Label 3375 1875 0    60   ~ 0
PB3
Text Label 3375 1975 0    60   ~ 0
PB4
Text Label 9950 1500 0    60   ~ 0
SCK
Text Label 9950 1100 0    60   ~ 0
OUTPUT1
Text Label 8950 1100 2    60   ~ 0
OUTPUT2
Text Label 9950 1000 0    60   ~ 0
OUTPUT3
Text Label 8950 1000 2    60   ~ 0
OUTPUT4
$Comp
L power:+3.3V #PWR017
U 1 1 58AAEC1C
P 8965 2380
F 0 "#PWR017" H 8965 2230 50  0001 C CNN
F 1 "+3.3V" H 8965 2520 50  0000 C CNN
F 2 "" H 8965 2380 50  0000 C CNN
F 3 "" H 8965 2380 50  0000 C CNN
	1    8965 2380
	-1   0    0    1   
$EndComp
$Comp
L power:GND #PWR018
U 1 1 58AAEE15
P 9695 1845
F 0 "#PWR018" H 9695 1595 50  0001 C CNN
F 1 "GND" H 9695 1695 50  0000 C CNN
F 2 "" H 9695 1845 50  0000 C CNN
F 3 "" H 9695 1845 50  0000 C CNN
	1    9695 1845
	1    0    0    -1  
$EndComp
Text Label 9955 1400 0    60   ~ 0
MISO
Text Label 8950 1500 2    60   ~ 0
MOSI
Text Label 8955 1600 2    60   ~ 0
SS
Text Label 9935 1600 0    60   ~ 0
ENC28J60_RST
$Comp
L power:+5V #PWR019
U 1 1 58AB0AF7
P 8430 1200
F 0 "#PWR019" H 8430 1050 50  0001 C CNN
F 1 "+5V" H 8430 1340 50  0000 C CNN
F 2 "" H 8430 1200 50  0000 C CNN
F 3 "" H 8430 1200 50  0000 C CNN
	1    8430 1200
	-1   0    0    1   
$EndComp
$Comp
L HAD-rescue:PINHD-1X3-pinhead JP1
U 1 1 58AB0ED9
P 1225 3850
F 0 "JP1" H 975 4075 50  0000 L BNN
F 1 "PINHD-1X3" H 975 3550 50  0000 L BNN
F 2 "Pin_Headers:Pin_Header_Straight_1x03_Pitch2.54mm_SMD_Pin1Left" H 1255 4000 20  0001 C CNN
F 3 "" H 1225 3850 60  0001 C CNN
	1    1225 3850
	-1   0    0    -1  
$EndComp
$Comp
L power:GND #PWR05
U 1 1 58AB11B4
P 1650 4125
F 0 "#PWR05" H 1650 3875 50  0001 C CNN
F 1 "GND" H 1650 3975 50  0000 C CNN
F 2 "" H 1650 4125 50  0000 C CNN
F 3 "" H 1650 4125 50  0000 C CNN
	1    1650 4125
	1    0    0    -1  
$EndComp
$Comp
L HAD-rescue:RESISTOR0805-RES-SparkFun-Passives R2
U 1 1 58AB11E3
P 1850 3450
F 0 "R2" H 1700 3509 50  0000 L BNN
F 1 "4k7" H 1700 3320 50  0000 L BNN
F 2 "pcbLibs:R0805" H 1880 3600 20  0001 C CNN
F 3 "" H 1850 3450 60  0001 C CNN
	1    1850 3450
	0    1    1    0   
$EndComp
Text Label 2300 3850 0    60   ~ 0
DS1820B
$Comp
L HAD-rescue:MOD_MP2307-mm U1
U 1 1 58ACB4EE
P 2720 5300
F 0 "U1" H 2720 5300 60  0000 C CNN
F 1 "MOD_MP2307" H 2720 5200 60  0000 C CNN
F 2 "libs:MOD_MP2307" H 2720 5300 60  0001 C CNN
F 3 "" H 2720 5300 60  0001 C CNN
	1    2720 5300
	1    0    0    -1  
$EndComp
$Comp
L power:GND #PWR07
U 1 1 58ACBBB0
P 3750 5150
F 0 "#PWR07" H 3750 4900 50  0001 C CNN
F 1 "GND" H 3750 5000 50  0000 C CNN
F 2 "" H 3750 5150 50  0000 C CNN
F 3 "" H 3750 5150 50  0000 C CNN
	1    3750 5150
	1    0    0    -1  
$EndComp
$Comp
L power:+3.3V #PWR012
U 1 1 58ACBC9A
P 5340 6950
F 0 "#PWR012" H 5340 6800 50  0001 C CNN
F 1 "+3.3V" H 5340 7090 50  0000 C CNN
F 2 "" H 5340 6950 50  0000 C CNN
F 3 "" H 5340 6950 50  0000 C CNN
	1    5340 6950
	1    0    0    -1  
$EndComp
$Comp
L power:+5V #PWR014
U 1 1 58ACBDB6
P 5830 6950
F 0 "#PWR014" H 5830 6800 50  0001 C CNN
F 1 "+5V" H 5830 7090 50  0000 C CNN
F 2 "" H 5830 6950 50  0000 C CNN
F 3 "" H 5830 6950 50  0000 C CNN
	1    5830 6950
	1    0    0    -1  
$EndComp
$Comp
L power:PWR_FLAG #FLG02
U 1 1 58ACBE12
P 5340 7090
F 0 "#FLG02" H 5340 7185 50  0001 C CNN
F 1 "PWR_FLAG" H 5340 7270 50  0000 C CNN
F 2 "" H 5340 7090 50  0000 C CNN
F 3 "" H 5340 7090 50  0000 C CNN
	1    5340 7090
	-1   0    0    1   
$EndComp
$Comp
L power:PWR_FLAG #FLG03
U 1 1 58ACBE62
P 5830 7090
F 0 "#FLG03" H 5830 7185 50  0001 C CNN
F 1 "PWR_FLAG" H 5830 7270 50  0000 C CNN
F 2 "" H 5830 7090 50  0000 C CNN
F 3 "" H 5830 7090 50  0000 C CNN
	1    5830 7090
	-1   0    0    1   
$EndComp
$Comp
L power:PWR_FLAG #FLG04
U 1 1 58ACBE8E
P 6250 7000
F 0 "#FLG04" H 6250 7095 50  0001 C CNN
F 1 "PWR_FLAG" H 6250 7180 50  0000 C CNN
F 2 "" H 6250 7000 50  0000 C CNN
F 3 "" H 6250 7000 50  0000 C CNN
	1    6250 7000
	1    0    0    -1  
$EndComp
$Comp
L power:GND #PWR015
U 1 1 58ACC01F
P 6250 7120
F 0 "#PWR015" H 6250 6870 50  0001 C CNN
F 1 "GND" H 6250 6970 50  0000 C CNN
F 2 "" H 6250 7120 50  0000 C CNN
F 3 "" H 6250 7120 50  0000 C CNN
	1    6250 7120
	1    0    0    -1  
$EndComp
$Comp
L power:GND #PWR010
U 1 1 58ACC1AA
P 4640 5900
F 0 "#PWR010" H 4640 5650 50  0001 C CNN
F 1 "GND" H 4640 5750 50  0000 C CNN
F 2 "" H 4640 5900 50  0000 C CNN
F 3 "" H 4640 5900 50  0000 C CNN
	1    4640 5900
	1    0    0    -1  
$EndComp
$Comp
L power:GND #PWR03
U 1 1 58ACC256
P 1530 5150
F 0 "#PWR03" H 1530 4900 50  0001 C CNN
F 1 "GND" H 1530 5000 50  0000 C CNN
F 2 "" H 1530 5150 50  0000 C CNN
F 3 "" H 1530 5150 50  0000 C CNN
	1    1530 5150
	1    0    0    -1  
$EndComp
$Comp
L power:+3.3V #PWR013
U 1 1 58ACC478
P 5610 5020
F 0 "#PWR013" H 5610 4870 50  0001 C CNN
F 1 "+3.3V" H 5610 5160 50  0000 C CNN
F 2 "" H 5610 5020 50  0000 C CNN
F 3 "" H 5610 5020 50  0000 C CNN
	1    5610 5020
	1    0    0    -1  
$EndComp
$Comp
L power:+5V #PWR08
U 1 1 58ACC4A4
P 4060 5070
F 0 "#PWR08" H 4060 4920 50  0001 C CNN
F 1 "+5V" H 4060 5210 50  0000 C CNN
F 2 "" H 4060 5070 50  0000 C CNN
F 3 "" H 4060 5070 50  0000 C CNN
	1    4060 5070
	1    0    0    -1  
$EndComp
$Comp
L power:GND #PWR01
U 1 1 58ACD084
P 1080 4880
F 0 "#PWR01" H 1080 4630 50  0001 C CNN
F 1 "GND" H 1080 4730 50  0000 C CNN
F 2 "" H 1080 4880 50  0000 C CNN
F 3 "" H 1080 4880 50  0000 C CNN
	1    1080 4880
	-1   0    0    1   
$EndComp
$Comp
L power:+12V #PWR02
U 1 1 58ACD74E
P 1310 4860
F 0 "#PWR02" H 1310 4710 50  0001 C CNN
F 1 "+12V" H 1310 5000 50  0000 C CNN
F 2 "" H 1310 4860 50  0000 C CNN
F 3 "" H 1310 4860 50  0000 C CNN
	1    1310 4860
	1    0    0    -1  
$EndComp
$Comp
L power:+12V #PWR011
U 1 1 58ACD968
P 4930 6950
F 0 "#PWR011" H 4930 6800 50  0001 C CNN
F 1 "+12V" H 4930 7090 50  0000 C CNN
F 2 "" H 4930 6950 50  0000 C CNN
F 3 "" H 4930 6950 50  0000 C CNN
	1    4930 6950
	1    0    0    -1  
$EndComp
$Comp
L power:PWR_FLAG #FLG01
U 1 1 58ACD996
P 4930 7080
F 0 "#FLG01" H 4930 7175 50  0001 C CNN
F 1 "PWR_FLAG" H 4930 7260 50  0000 C CNN
F 2 "" H 4930 7080 50  0000 C CNN
F 3 "" H 4930 7080 50  0000 C CNN
	1    4930 7080
	-1   0    0    1   
$EndComp
Text Label 9950 1300 0    60   ~ 0
ENC28J60_INT
$Comp
L HAD-rescue:CONN_01X05 P2
U 1 1 58AAD296
P 1125 1775
F 0 "P2" H 1125 2075 50  0000 C CNN
F 1 "CONN_01X05" V 1225 1775 50  0000 C CNN
F 2 "Pin_Headers:Pin_Header_Straight_1x05_Pitch2.54mm_SMD_Pin1Right" V 1350 1775 50  0001 C CNN
F 3 "" H 1125 1775 50  0000 C CNN
	1    1125 1775
	-1   0    0    1   
$EndComp
Wire Wire Line
	1650 3950 1650 4125
Wire Wire Line
	1325 3950 1650 3950
Connection ~ 1850 3850
Wire Wire Line
	1850 3650 1850 3850
Wire Wire Line
	1325 3850 1850 3850
Wire Wire Line
	1850 3250 1650 3250
Wire Wire Line
	1650 3750 1325 3750
Wire Wire Line
	1650 3250 1650 3750
Wire Wire Line
	1325 1875 3375 1875
Wire Wire Line
	1325 1675 3375 1675
Wire Wire Line
	1325 1575 3375 1575
Wire Wire Line
	3750 5150 3470 5150
Wire Wire Line
	5830 6950 5830 7090
Wire Wire Line
	5340 6950 5340 7090
Wire Wire Line
	1970 5150 1530 5150
Wire Wire Line
	5610 5020 5610 5450
Wire Wire Line
	6250 7000 6250 7120
Wire Wire Line
	1080 5200 1080 4880
Wire Wire Line
	1070 5300 830  5300
Wire Wire Line
	1070 5450 1070 5300
Wire Wire Line
	1310 4860 1310 5450
Wire Wire Line
	4930 6950 4930 7080
Wire Wire Line
	1325 1975 3375 1975
Wire Wire Line
	3375 1575 3375 1475
Wire Wire Line
	1325 1775 3375 1775
$Comp
L HAD-rescue:Polyfuse_Small F1
U 1 1 58F8666E
P 1700 5450
F 0 "F1" V 1625 5450 50  0000 C CNN
F 1 "0.5A/13.2V" V 1775 5450 50  0000 C CNN
F 2 "adafruit:R1206" H 1750 5250 50  0001 L CNN
F 3 "" H 1700 5450 50  0001 C CNN
	1    1700 5450
	0    1    1    0   
$EndComp
Wire Wire Line
	1600 5450 1310 5450
Connection ~ 1310 5450
Wire Wire Line
	1970 5450 1800 5450
$Comp
L HAD-rescue:LD1117S33TR U2
U 1 1 597F7F76
P 4640 5500
F 0 "U2" H 4640 5750 50  0000 C CNN
F 1 "LD1117S33TR" H 4640 5700 50  0000 C CNN
F 2 "TO_SOT_Packages_SMD:SOT-223" H 4640 5600 50  0001 C CNN
F 3 "" H 4640 5500 50  0001 C CNN
	1    4640 5500
	1    0    0    -1  
$EndComp
Wire Wire Line
	4640 5750 4640 5850
Wire Wire Line
	4240 5450 4060 5450
Wire Wire Line
	4060 5070 4060 5450
Connection ~ 4060 5450
Wire Wire Line
	5610 5450 5160 5450
$Comp
L HAD-rescue:CAP0805-SparkFun-Capacitors C1
U 1 1 597F874C
P 4060 5750
F 0 "C1" H 4120 5865 50  0000 L BNN
F 1 "100n" H 4120 5665 50  0000 L BNN
F 2 "pcbLibs:R0805" H 4090 5900 20  0001 C CNN
F 3 "" H 4060 5750 60  0001 C CNN
	1    4060 5750
	1    0    0    -1  
$EndComp
$Comp
L HAD-rescue:CAP0805-SparkFun-Capacitors C2
U 1 1 597F883B
P 5160 5750
F 0 "C2" H 5220 5865 50  0000 L BNN
F 1 "10u" H 5220 5665 50  0000 L BNN
F 2 "pcbLibs:R0805" H 5190 5900 20  0001 C CNN
F 3 "" H 5160 5750 60  0001 C CNN
	1    5160 5750
	1    0    0    -1  
$EndComp
Wire Wire Line
	5160 5550 5160 5450
Connection ~ 5160 5450
Wire Wire Line
	4060 5850 4640 5850
Connection ~ 4640 5850
Wire Wire Line
	1850 3850 2300 3850
Wire Wire Line
	1310 5450 1070 5450
Wire Wire Line
	4060 5450 3470 5450
Wire Wire Line
	4060 5450 4060 5550
Wire Wire Line
	5160 5450 5040 5450
Wire Wire Line
	4640 5850 4640 5900
Wire Wire Line
	4640 5850 5160 5850
$Comp
L power:+5V #PWR0101
U 1 1 5DE0E3C2
P 4425 3960
F 0 "#PWR0101" H 4425 3810 50  0001 C CNN
F 1 "+5V" H 4440 4133 50  0000 C CNN
F 2 "" H 4425 3960 50  0001 C CNN
F 3 "" H 4425 3960 50  0001 C CNN
	1    4425 3960
	-1   0    0    1   
$EndComp
$Comp
L power:GND #PWR0102
U 1 1 5DE0E432
P 4700 3960
F 0 "#PWR0102" H 4700 3710 50  0001 C CNN
F 1 "GND" H 4705 3787 50  0000 C CNN
F 2 "" H 4700 3960 50  0001 C CNN
F 3 "" H 4700 3960 50  0001 C CNN
	1    4700 3960
	1    0    0    -1  
$EndComp
$Comp
L power:GND #PWR0103
U 1 1 5DE0E478
P 6740 2430
F 0 "#PWR0103" H 6740 2180 50  0001 C CNN
F 1 "GND" H 6745 2257 50  0000 C CNN
F 2 "" H 6740 2430 50  0001 C CNN
F 3 "" H 6740 2430 50  0001 C CNN
	1    6740 2430
	1    0    0    -1  
$EndComp
Wire Wire Line
	6300 2345 6740 2345
Wire Wire Line
	6740 2345 6740 2430
Wire Wire Line
	6300 2425 6300 2345
Wire Wire Line
	5140 3705 4425 3705
Wire Wire Line
	4425 3705 4425 3960
Wire Wire Line
	5140 3785 4700 3785
Wire Wire Line
	4700 3785 4700 3960
NoConn ~ 6300 3865
NoConn ~ 6300 2585
$Comp
L HAD-rescue:INDUCTOR0805-SparkFun-Passives L1
U 1 1 58AB0A68
P 8965 2000
F 0 "L1" H 9065 2200 50  0000 L BNN
F 1 "INDUCTOR0805" H 9065 1800 50  0000 L BNN
F 2 "pcbLibs:R0805" H 8995 2150 20  0001 C CNN
F 3 "" H 8965 2000 60  0001 C CNN
	1    8965 2000
	1    0    0    -1  
$EndComp
Wire Wire Line
	9695 1845 9695 1700
Wire Wire Line
	9935 1600 9695 1600
Wire Wire Line
	9195 1600 8955 1600
Wire Wire Line
	9950 1500 9695 1500
Wire Wire Line
	9950 1300 9695 1300
Wire Wire Line
	9195 1500 8950 1500
Wire Wire Line
	9955 1400 9695 1400
NoConn ~ 9195 1400
NoConn ~ 9195 1300
Wire Wire Line
	9950 1000 9695 1000
Wire Wire Line
	9950 1100 9695 1100
Wire Wire Line
	9195 1000 8950 1000
Wire Wire Line
	9195 1100 8950 1100
Wire Wire Line
	9195 1200 8430 1200
Wire Wire Line
	9195 1700 8965 1700
$Comp
L power:GND #PWR0104
U 1 1 5DE37AF5
P 10745 1200
F 0 "#PWR0104" H 10745 950 50  0001 C CNN
F 1 "GND" H 10745 1050 50  0000 C CNN
F 2 "" H 10745 1200 50  0000 C CNN
F 3 "" H 10745 1200 50  0000 C CNN
	1    10745 1200
	1    0    0    -1  
$EndComp
Wire Wire Line
	10745 1200 9695 1200
Text Label 6585 2985 0    60   ~ 0
MOSI
Wire Wire Line
	6585 2985 6300 2985
Text Label 6585 3065 0    60   ~ 0
MISO
Wire Wire Line
	6585 3065 6300 3065
Text Label 6600 3145 0    60   ~ 0
SCK
Wire Wire Line
	6600 3145 6300 3145
Text Label 4425 3590 0    60   ~ 0
DS1820B
Text Label 4695 3225 0    60   ~ 0
PB1
Text Label 4485 3305 0    60   ~ 0
PB2
Text Label 4295 3385 0    60   ~ 0
PB3
Text Label 4110 3465 0    60   ~ 0
PB4
Wire Wire Line
	8965 2300 8965 2380
$Comp
L HAD-rescue:PINHD-1X2-pinhead JP2
U 1 1 58ACCE75
P 730 5300
F 0 "JP2" H 480 5525 50  0000 L BNN
F 1 "PINHD-1X2" H 480 5100 50  0000 L BNN
F 2 "Pin_Headers:Pin_Header_Straight_1x02_Pitch2.54mm_SMD_Pin1Left" H 730 5450 50  0001 C CNN
F 3 "" H 730 5300 60  0001 C CNN
	1    730  5300
	-1   0    0    -1  
$EndComp
Wire Wire Line
	1080 5200 830  5200
Wire Wire Line
	6300 2505 6580 2505
Wire Wire Line
	6580 2505 6580 2745
Wire Wire Line
	6580 2745 7060 2745
Text Label 7060 2745 0    60   ~ 0
+3V3_STM32
Text Label 5140 4220 0    60   ~ 0
+3V3_STM32
Wire Wire Line
	5140 3865 5140 4220
Wire Wire Line
	1650 3020 1650 3250
Connection ~ 1650 3250
Text Label 4595 2345 0    60   ~ 0
OUTPUT1
Wire Wire Line
	5140 2345 4595 2345
Text Label 4590 2425 0    60   ~ 0
OUTPUT2
Wire Wire Line
	5140 2425 4590 2425
Text Label 4595 2505 0    60   ~ 0
OUTPUT3
Wire Wire Line
	5140 2505 4595 2505
Text Label 4590 2585 0    60   ~ 0
OUTPUT4
Wire Wire Line
	5140 2585 4590 2585
Text Label 6605 3305 0    60   ~ 0
SS
Wire Wire Line
	6605 3305 6300 3305
Text Label 6605 3385 0    60   ~ 0
ENC28J60_RST
Wire Wire Line
	6605 3385 6300 3385
Wire Wire Line
	3040 3305 5140 3305
Wire Wire Line
	2830 3385 5140 3385
Wire Wire Line
	2630 3465 5140 3465
Connection ~ 6300 2345
$Comp
L mm:MOD_STM32F103C8T6 U3
U 1 1 5DE0E15A
P 5760 3105
F 0 "U3" V 4693 3065 60  0000 C CNN
F 1 "MOD_STM32F103C8T6" V 4799 3065 60  0000 C CNN
F 2 "pcbLibs:stm32_module" H 5760 3105 60  0001 C CNN
F 3 "" H 5760 3105 60  0001 C CNN
	1    5760 3105
	0    1    1    0   
$EndComp
Text Label 1650 3020 0    60   ~ 0
+3V3_STM32
Wire Wire Line
	5140 3625 4425 3625
Wire Wire Line
	4425 3625 4425 3590
Wire Wire Line
	3275 3225 5140 3225
Text Label 6605 3465 0    60   ~ 0
ENC28J60_INT
Wire Wire Line
	6605 3465 6300 3465
$EndSCHEMATC
