(module Pin_Header_Straight_1x26_Pitch2.54mm_SMD_Pin1Left (layer F.Cu) (tedit 588DAF29)
  (descr "surface-mounted straight pin header, 1x26, 2.54mm pitch, single row, style 1 (pin 1 left)")
  (tags "Surface mounted pin header SMD 1x26 2.54mm single row style1 pin1 left")
  (attr smd)
  (fp_text reference REF** (at 0 -34.08) (layer F.SilkS)
    (effects (font (size 1 1) (thickness 0.15)))
  )
  (fp_text value Pin_Header_Straight_1x26_Pitch2.54mm_SMD_Pin1Left (at 0 34.08) (layer F.Fab)
    (effects (font (size 1 1) (thickness 0.15)))
  )
  (fp_line (start -1.27 -33.02) (end -1.27 33.02) (layer F.Fab) (width 0.1))
  (fp_line (start -1.27 33.02) (end 1.27 33.02) (layer F.Fab) (width 0.1))
  (fp_line (start 1.27 33.02) (end 1.27 -33.02) (layer F.Fab) (width 0.1))
  (fp_line (start 1.27 -33.02) (end -1.27 -33.02) (layer F.Fab) (width 0.1))
  (fp_line (start -1.27 -32.07) (end -1.27 -31.43) (layer F.Fab) (width 0.1))
  (fp_line (start -1.27 -31.43) (end -2.65 -31.43) (layer F.Fab) (width 0.1))
  (fp_line (start -2.65 -31.43) (end -2.65 -32.07) (layer F.Fab) (width 0.1))
  (fp_line (start -2.65 -32.07) (end -1.27 -32.07) (layer F.Fab) (width 0.1))
  (fp_line (start -1.27 -26.99) (end -1.27 -26.35) (layer F.Fab) (width 0.1))
  (fp_line (start -1.27 -26.35) (end -2.65 -26.35) (layer F.Fab) (width 0.1))
  (fp_line (start -2.65 -26.35) (end -2.65 -26.99) (layer F.Fab) (width 0.1))
  (fp_line (start -2.65 -26.99) (end -1.27 -26.99) (layer F.Fab) (width 0.1))
  (fp_line (start -1.27 -21.91) (end -1.27 -21.27) (layer F.Fab) (width 0.1))
  (fp_line (start -1.27 -21.27) (end -2.65 -21.27) (layer F.Fab) (width 0.1))
  (fp_line (start -2.65 -21.27) (end -2.65 -21.91) (layer F.Fab) (width 0.1))
  (fp_line (start -2.65 -21.91) (end -1.27 -21.91) (layer F.Fab) (width 0.1))
  (fp_line (start -1.27 -16.83) (end -1.27 -16.19) (layer F.Fab) (width 0.1))
  (fp_line (start -1.27 -16.19) (end -2.65 -16.19) (layer F.Fab) (width 0.1))
  (fp_line (start -2.65 -16.19) (end -2.65 -16.83) (layer F.Fab) (width 0.1))
  (fp_line (start -2.65 -16.83) (end -1.27 -16.83) (layer F.Fab) (width 0.1))
  (fp_line (start -1.27 -11.75) (end -1.27 -11.11) (layer F.Fab) (width 0.1))
  (fp_line (start -1.27 -11.11) (end -2.65 -11.11) (layer F.Fab) (width 0.1))
  (fp_line (start -2.65 -11.11) (end -2.65 -11.75) (layer F.Fab) (width 0.1))
  (fp_line (start -2.65 -11.75) (end -1.27 -11.75) (layer F.Fab) (width 0.1))
  (fp_line (start -1.27 -6.67) (end -1.27 -6.03) (layer F.Fab) (width 0.1))
  (fp_line (start -1.27 -6.03) (end -2.65 -6.03) (layer F.Fab) (width 0.1))
  (fp_line (start -2.65 -6.03) (end -2.65 -6.67) (layer F.Fab) (width 0.1))
  (fp_line (start -2.65 -6.67) (end -1.27 -6.67) (layer F.Fab) (width 0.1))
  (fp_line (start -1.27 -1.59) (end -1.27 -0.95) (layer F.Fab) (width 0.1))
  (fp_line (start -1.27 -0.95) (end -2.65 -0.95) (layer F.Fab) (width 0.1))
  (fp_line (start -2.65 -0.95) (end -2.65 -1.59) (layer F.Fab) (width 0.1))
  (fp_line (start -2.65 -1.59) (end -1.27 -1.59) (layer F.Fab) (width 0.1))
  (fp_line (start -1.27 3.49) (end -1.27 4.13) (layer F.Fab) (width 0.1))
  (fp_line (start -1.27 4.13) (end -2.65 4.13) (layer F.Fab) (width 0.1))
  (fp_line (start -2.65 4.13) (end -2.65 3.49) (layer F.Fab) (width 0.1))
  (fp_line (start -2.65 3.49) (end -1.27 3.49) (layer F.Fab) (width 0.1))
  (fp_line (start -1.27 8.57) (end -1.27 9.21) (layer F.Fab) (width 0.1))
  (fp_line (start -1.27 9.21) (end -2.65 9.21) (layer F.Fab) (width 0.1))
  (fp_line (start -2.65 9.21) (end -2.65 8.57) (layer F.Fab) (width 0.1))
  (fp_line (start -2.65 8.57) (end -1.27 8.57) (layer F.Fab) (width 0.1))
  (fp_line (start -1.27 13.65) (end -1.27 14.29) (layer F.Fab) (width 0.1))
  (fp_line (start -1.27 14.29) (end -2.65 14.29) (layer F.Fab) (width 0.1))
  (fp_line (start -2.65 14.29) (end -2.65 13.65) (layer F.Fab) (width 0.1))
  (fp_line (start -2.65 13.65) (end -1.27 13.65) (layer F.Fab) (width 0.1))
  (fp_line (start -1.27 18.73) (end -1.27 19.37) (layer F.Fab) (width 0.1))
  (fp_line (start -1.27 19.37) (end -2.65 19.37) (layer F.Fab) (width 0.1))
  (fp_line (start -2.65 19.37) (end -2.65 18.73) (layer F.Fab) (width 0.1))
  (fp_line (start -2.65 18.73) (end -1.27 18.73) (layer F.Fab) (width 0.1))
  (fp_line (start -1.27 23.81) (end -1.27 24.45) (layer F.Fab) (width 0.1))
  (fp_line (start -1.27 24.45) (end -2.65 24.45) (layer F.Fab) (width 0.1))
  (fp_line (start -2.65 24.45) (end -2.65 23.81) (layer F.Fab) (width 0.1))
  (fp_line (start -2.65 23.81) (end -1.27 23.81) (layer F.Fab) (width 0.1))
  (fp_line (start -1.27 28.89) (end -1.27 29.53) (layer F.Fab) (width 0.1))
  (fp_line (start -1.27 29.53) (end -2.65 29.53) (layer F.Fab) (width 0.1))
  (fp_line (start -2.65 29.53) (end -2.65 28.89) (layer F.Fab) (width 0.1))
  (fp_line (start -2.65 28.89) (end -1.27 28.89) (layer F.Fab) (width 0.1))
  (fp_line (start 1.27 -29.53) (end 1.27 -28.89) (layer F.Fab) (width 0.1))
  (fp_line (start 1.27 -28.89) (end 2.65 -28.89) (layer F.Fab) (width 0.1))
  (fp_line (start 2.65 -28.89) (end 2.65 -29.53) (layer F.Fab) (width 0.1))
  (fp_line (start 2.65 -29.53) (end 1.27 -29.53) (layer F.Fab) (width 0.1))
  (fp_line (start 1.27 -24.45) (end 1.27 -23.81) (layer F.Fab) (width 0.1))
  (fp_line (start 1.27 -23.81) (end 2.65 -23.81) (layer F.Fab) (width 0.1))
  (fp_line (start 2.65 -23.81) (end 2.65 -24.45) (layer F.Fab) (width 0.1))
  (fp_line (start 2.65 -24.45) (end 1.27 -24.45) (layer F.Fab) (width 0.1))
  (fp_line (start 1.27 -19.37) (end 1.27 -18.73) (layer F.Fab) (width 0.1))
  (fp_line (start 1.27 -18.73) (end 2.65 -18.73) (layer F.Fab) (width 0.1))
  (fp_line (start 2.65 -18.73) (end 2.65 -19.37) (layer F.Fab) (width 0.1))
  (fp_line (start 2.65 -19.37) (end 1.27 -19.37) (layer F.Fab) (width 0.1))
  (fp_line (start 1.27 -14.29) (end 1.27 -13.65) (layer F.Fab) (width 0.1))
  (fp_line (start 1.27 -13.65) (end 2.65 -13.65) (layer F.Fab) (width 0.1))
  (fp_line (start 2.65 -13.65) (end 2.65 -14.29) (layer F.Fab) (width 0.1))
  (fp_line (start 2.65 -14.29) (end 1.27 -14.29) (layer F.Fab) (width 0.1))
  (fp_line (start 1.27 -9.21) (end 1.27 -8.57) (layer F.Fab) (width 0.1))
  (fp_line (start 1.27 -8.57) (end 2.65 -8.57) (layer F.Fab) (width 0.1))
  (fp_line (start 2.65 -8.57) (end 2.65 -9.21) (layer F.Fab) (width 0.1))
  (fp_line (start 2.65 -9.21) (end 1.27 -9.21) (layer F.Fab) (width 0.1))
  (fp_line (start 1.27 -4.13) (end 1.27 -3.49) (layer F.Fab) (width 0.1))
  (fp_line (start 1.27 -3.49) (end 2.65 -3.49) (layer F.Fab) (width 0.1))
  (fp_line (start 2.65 -3.49) (end 2.65 -4.13) (layer F.Fab) (width 0.1))
  (fp_line (start 2.65 -4.13) (end 1.27 -4.13) (layer F.Fab) (width 0.1))
  (fp_line (start 1.27 0.95) (end 1.27 1.59) (layer F.Fab) (width 0.1))
  (fp_line (start 1.27 1.59) (end 2.65 1.59) (layer F.Fab) (width 0.1))
  (fp_line (start 2.65 1.59) (end 2.65 0.95) (layer F.Fab) (width 0.1))
  (fp_line (start 2.65 0.95) (end 1.27 0.95) (layer F.Fab) (width 0.1))
  (fp_line (start 1.27 6.03) (end 1.27 6.67) (layer F.Fab) (width 0.1))
  (fp_line (start 1.27 6.67) (end 2.65 6.67) (layer F.Fab) (width 0.1))
  (fp_line (start 2.65 6.67) (end 2.65 6.03) (layer F.Fab) (width 0.1))
  (fp_line (start 2.65 6.03) (end 1.27 6.03) (layer F.Fab) (width 0.1))
  (fp_line (start 1.27 11.11) (end 1.27 11.75) (layer F.Fab) (width 0.1))
  (fp_line (start 1.27 11.75) (end 2.65 11.75) (layer F.Fab) (width 0.1))
  (fp_line (start 2.65 11.75) (end 2.65 11.11) (layer F.Fab) (width 0.1))
  (fp_line (start 2.65 11.11) (end 1.27 11.11) (layer F.Fab) (width 0.1))
  (fp_line (start 1.27 16.19) (end 1.27 16.83) (layer F.Fab) (width 0.1))
  (fp_line (start 1.27 16.83) (end 2.65 16.83) (layer F.Fab) (width 0.1))
  (fp_line (start 2.65 16.83) (end 2.65 16.19) (layer F.Fab) (width 0.1))
  (fp_line (start 2.65 16.19) (end 1.27 16.19) (layer F.Fab) (width 0.1))
  (fp_line (start 1.27 21.27) (end 1.27 21.91) (layer F.Fab) (width 0.1))
  (fp_line (start 1.27 21.91) (end 2.65 21.91) (layer F.Fab) (width 0.1))
  (fp_line (start 2.65 21.91) (end 2.65 21.27) (layer F.Fab) (width 0.1))
  (fp_line (start 2.65 21.27) (end 1.27 21.27) (layer F.Fab) (width 0.1))
  (fp_line (start 1.27 26.35) (end 1.27 26.99) (layer F.Fab) (width 0.1))
  (fp_line (start 1.27 26.99) (end 2.65 26.99) (layer F.Fab) (width 0.1))
  (fp_line (start 2.65 26.99) (end 2.65 26.35) (layer F.Fab) (width 0.1))
  (fp_line (start 2.65 26.35) (end 1.27 26.35) (layer F.Fab) (width 0.1))
  (fp_line (start 1.27 31.43) (end 1.27 32.07) (layer F.Fab) (width 0.1))
  (fp_line (start 1.27 32.07) (end 2.65 32.07) (layer F.Fab) (width 0.1))
  (fp_line (start 2.65 32.07) (end 2.65 31.43) (layer F.Fab) (width 0.1))
  (fp_line (start 2.65 31.43) (end 1.27 31.43) (layer F.Fab) (width 0.1))
  (fp_line (start -1.33 -32.55) (end -1.33 -33.08) (layer F.SilkS) (width 0.12))
  (fp_line (start -1.33 -33.08) (end 1.33 -33.08) (layer F.SilkS) (width 0.12))
  (fp_line (start 1.33 -33.08) (end 1.33 -32.55) (layer F.SilkS) (width 0.12))
  (fp_line (start -1.33 32.55) (end -1.33 33.08) (layer F.SilkS) (width 0.12))
  (fp_line (start -1.33 33.08) (end 1.33 33.08) (layer F.SilkS) (width 0.12))
  (fp_line (start 1.33 33.08) (end 1.33 32.55) (layer F.SilkS) (width 0.12))
  (fp_line (start 1.33 -33.08) (end 1.33 -29.89) (layer F.SilkS) (width 0.12))
  (fp_line (start -1.33 -32.55) (end -3 -32.55) (layer F.SilkS) (width 0.12))
  (fp_line (start 1.33 -28.53) (end 1.33 -24.81) (layer F.SilkS) (width 0.12))
  (fp_line (start 1.33 -23.45) (end 1.33 -19.73) (layer F.SilkS) (width 0.12))
  (fp_line (start 1.33 -18.37) (end 1.33 -14.65) (layer F.SilkS) (width 0.12))
  (fp_line (start 1.33 -13.29) (end 1.33 -9.57) (layer F.SilkS) (width 0.12))
  (fp_line (start 1.33 -8.21) (end 1.33 -4.49) (layer F.SilkS) (width 0.12))
  (fp_line (start 1.33 -3.13) (end 1.33 0.59) (layer F.SilkS) (width 0.12))
  (fp_line (start 1.33 1.95) (end 1.33 5.67) (layer F.SilkS) (width 0.12))
  (fp_line (start 1.33 7.03) (end 1.33 10.75) (layer F.SilkS) (width 0.12))
  (fp_line (start 1.33 12.11) (end 1.33 15.83) (layer F.SilkS) (width 0.12))
  (fp_line (start 1.33 17.19) (end 1.33 20.91) (layer F.SilkS) (width 0.12))
  (fp_line (start 1.33 22.27) (end 1.33 25.99) (layer F.SilkS) (width 0.12))
  (fp_line (start 1.33 27.35) (end 1.33 31.07) (layer F.SilkS) (width 0.12))
  (fp_line (start -1.33 -31.07) (end -1.33 -27.35) (layer F.SilkS) (width 0.12))
  (fp_line (start -1.33 -25.99) (end -1.33 -22.27) (layer F.SilkS) (width 0.12))
  (fp_line (start -1.33 -20.91) (end -1.33 -17.19) (layer F.SilkS) (width 0.12))
  (fp_line (start -1.33 -15.83) (end -1.33 -12.11) (layer F.SilkS) (width 0.12))
  (fp_line (start -1.33 -10.75) (end -1.33 -7.03) (layer F.SilkS) (width 0.12))
  (fp_line (start -1.33 -5.67) (end -1.33 -1.95) (layer F.SilkS) (width 0.12))
  (fp_line (start -1.33 -0.59) (end -1.33 3.13) (layer F.SilkS) (width 0.12))
  (fp_line (start -1.33 4.49) (end -1.33 8.21) (layer F.SilkS) (width 0.12))
  (fp_line (start -1.33 9.57) (end -1.33 13.29) (layer F.SilkS) (width 0.12))
  (fp_line (start -1.33 14.65) (end -1.33 18.37) (layer F.SilkS) (width 0.12))
  (fp_line (start -1.33 19.73) (end -1.33 23.45) (layer F.SilkS) (width 0.12))
  (fp_line (start -1.33 24.81) (end -1.33 28.53) (layer F.SilkS) (width 0.12))
  (fp_line (start -1.33 29.89) (end -1.33 33.08) (layer F.SilkS) (width 0.12))
  (fp_line (start -3.25 -33.3) (end -3.25 33.3) (layer F.CrtYd) (width 0.05))
  (fp_line (start -3.25 33.3) (end 3.25 33.3) (layer F.CrtYd) (width 0.05))
  (fp_line (start 3.25 33.3) (end 3.25 -33.3) (layer F.CrtYd) (width 0.05))
  (fp_line (start 3.25 -33.3) (end -3.25 -33.3) (layer F.CrtYd) (width 0.05))
  (pad 1 smd rect (at -1.5 -31.75) (size 3 1) (layers F.Cu F.Mask))
  (pad 3 smd rect (at -1.5 -26.67) (size 3 1) (layers F.Cu F.Mask))
  (pad 5 smd rect (at -1.5 -21.59) (size 3 1) (layers F.Cu F.Mask))
  (pad 7 smd rect (at -1.5 -16.51) (size 3 1) (layers F.Cu F.Mask))
  (pad 9 smd rect (at -1.5 -11.43) (size 3 1) (layers F.Cu F.Mask))
  (pad 11 smd rect (at -1.5 -6.35) (size 3 1) (layers F.Cu F.Mask))
  (pad 13 smd rect (at -1.5 -1.27) (size 3 1) (layers F.Cu F.Mask))
  (pad 15 smd rect (at -1.5 3.81) (size 3 1) (layers F.Cu F.Mask))
  (pad 17 smd rect (at -1.5 8.89) (size 3 1) (layers F.Cu F.Mask))
  (pad 19 smd rect (at -1.5 13.97) (size 3 1) (layers F.Cu F.Mask))
  (pad 21 smd rect (at -1.5 19.05) (size 3 1) (layers F.Cu F.Mask))
  (pad 23 smd rect (at -1.5 24.13) (size 3 1) (layers F.Cu F.Mask))
  (pad 25 smd rect (at -1.5 29.21) (size 3 1) (layers F.Cu F.Mask))
  (pad 2 smd rect (at 1.5 -29.21) (size 3 1) (layers F.Cu F.Mask))
  (pad 4 smd rect (at 1.5 -24.13) (size 3 1) (layers F.Cu F.Mask))
  (pad 6 smd rect (at 1.5 -19.05) (size 3 1) (layers F.Cu F.Mask))
  (pad 8 smd rect (at 1.5 -13.97) (size 3 1) (layers F.Cu F.Mask))
  (pad 10 smd rect (at 1.5 -8.89) (size 3 1) (layers F.Cu F.Mask))
  (pad 12 smd rect (at 1.5 -3.81) (size 3 1) (layers F.Cu F.Mask))
  (pad 14 smd rect (at 1.5 1.27) (size 3 1) (layers F.Cu F.Mask))
  (pad 16 smd rect (at 1.5 6.35) (size 3 1) (layers F.Cu F.Mask))
  (pad 18 smd rect (at 1.5 11.43) (size 3 1) (layers F.Cu F.Mask))
  (pad 20 smd rect (at 1.5 16.51) (size 3 1) (layers F.Cu F.Mask))
  (pad 22 smd rect (at 1.5 21.59) (size 3 1) (layers F.Cu F.Mask))
  (pad 24 smd rect (at 1.5 26.67) (size 3 1) (layers F.Cu F.Mask))
  (pad 26 smd rect (at 1.5 31.75) (size 3 1) (layers F.Cu F.Mask))
  (model Pin_Headers.3dshapes/Pin_Header_Straight_1x26_Pitch2.54mm_SMD_Pin1Left.wrl
    (at (xyz 0 0 0))
    (scale (xyz 1 1 1))
    (rotate (xyz 0 0 0))
  )
)