(module Pin_Header_Straight_1x05_Pitch2.54mm_SMD_Pin1Right (layer F.Cu) (tedit 588DAF27)
  (descr "surface-mounted straight pin header, 1x05, 2.54mm pitch, single row, style 2 (pin 1 right)")
  (tags "Surface mounted pin header SMD 1x05 2.54mm single row style2 pin1 right")
  (attr smd)
  (fp_text reference REF** (at 0 -7.41) (layer F.SilkS)
    (effects (font (size 1 1) (thickness 0.15)))
  )
  (fp_text value Pin_Header_Straight_1x05_Pitch2.54mm_SMD_Pin1Right (at 0 7.41) (layer F.Fab)
    (effects (font (size 1 1) (thickness 0.15)))
  )
  (fp_line (start -1.27 -6.35) (end -1.27 6.35) (layer F.Fab) (width 0.1))
  (fp_line (start -1.27 6.35) (end 1.27 6.35) (layer F.Fab) (width 0.1))
  (fp_line (start 1.27 6.35) (end 1.27 -6.35) (layer F.Fab) (width 0.1))
  (fp_line (start 1.27 -6.35) (end -1.27 -6.35) (layer F.Fab) (width 0.1))
  (fp_line (start -1.27 -2.86) (end -1.27 -2.22) (layer F.Fab) (width 0.1))
  (fp_line (start -1.27 -2.22) (end -2.65 -2.22) (layer F.Fab) (width 0.1))
  (fp_line (start -2.65 -2.22) (end -2.65 -2.86) (layer F.Fab) (width 0.1))
  (fp_line (start -2.65 -2.86) (end -1.27 -2.86) (layer F.Fab) (width 0.1))
  (fp_line (start -1.27 2.22) (end -1.27 2.86) (layer F.Fab) (width 0.1))
  (fp_line (start -1.27 2.86) (end -2.65 2.86) (layer F.Fab) (width 0.1))
  (fp_line (start -2.65 2.86) (end -2.65 2.22) (layer F.Fab) (width 0.1))
  (fp_line (start -2.65 2.22) (end -1.27 2.22) (layer F.Fab) (width 0.1))
  (fp_line (start 1.27 -5.4) (end 1.27 -4.76) (layer F.Fab) (width 0.1))
  (fp_line (start 1.27 -4.76) (end 2.65 -4.76) (layer F.Fab) (width 0.1))
  (fp_line (start 2.65 -4.76) (end 2.65 -5.4) (layer F.Fab) (width 0.1))
  (fp_line (start 2.65 -5.4) (end 1.27 -5.4) (layer F.Fab) (width 0.1))
  (fp_line (start 1.27 -0.32) (end 1.27 0.32) (layer F.Fab) (width 0.1))
  (fp_line (start 1.27 0.32) (end 2.65 0.32) (layer F.Fab) (width 0.1))
  (fp_line (start 2.65 0.32) (end 2.65 -0.32) (layer F.Fab) (width 0.1))
  (fp_line (start 2.65 -0.32) (end 1.27 -0.32) (layer F.Fab) (width 0.1))
  (fp_line (start 1.27 4.76) (end 1.27 5.4) (layer F.Fab) (width 0.1))
  (fp_line (start 1.27 5.4) (end 2.65 5.4) (layer F.Fab) (width 0.1))
  (fp_line (start 2.65 5.4) (end 2.65 4.76) (layer F.Fab) (width 0.1))
  (fp_line (start 2.65 4.76) (end 1.27 4.76) (layer F.Fab) (width 0.1))
  (fp_line (start -1.33 -5.88) (end -1.33 -6.41) (layer F.SilkS) (width 0.12))
  (fp_line (start -1.33 -6.41) (end 1.33 -6.41) (layer F.SilkS) (width 0.12))
  (fp_line (start 1.33 -6.41) (end 1.33 -5.88) (layer F.SilkS) (width 0.12))
  (fp_line (start -1.33 5.88) (end -1.33 6.41) (layer F.SilkS) (width 0.12))
  (fp_line (start -1.33 6.41) (end 1.33 6.41) (layer F.SilkS) (width 0.12))
  (fp_line (start 1.33 6.41) (end 1.33 5.88) (layer F.SilkS) (width 0.12))
  (fp_line (start 1.33 -4.4) (end 1.33 -0.68) (layer F.SilkS) (width 0.12))
  (fp_line (start 1.33 0.68) (end 1.33 4.4) (layer F.SilkS) (width 0.12))
  (fp_line (start -1.33 -6.41) (end -1.33 -3.22) (layer F.SilkS) (width 0.12))
  (fp_line (start 1.33 -5.88) (end 3 -5.88) (layer F.SilkS) (width 0.12))
  (fp_line (start -1.33 -1.86) (end -1.33 1.86) (layer F.SilkS) (width 0.12))
  (fp_line (start -1.33 3.22) (end -1.33 6.41) (layer F.SilkS) (width 0.12))
  (fp_line (start -3.25 -6.6) (end -3.25 6.6) (layer F.CrtYd) (width 0.05))
  (fp_line (start -3.25 6.6) (end 3.25 6.6) (layer F.CrtYd) (width 0.05))
  (fp_line (start 3.25 6.6) (end 3.25 -6.6) (layer F.CrtYd) (width 0.05))
  (fp_line (start 3.25 -6.6) (end -3.25 -6.6) (layer F.CrtYd) (width 0.05))
  (pad 2 smd rect (at -1.5 -2.54) (size 3 1) (layers F.Cu F.Mask))
  (pad 4 smd rect (at -1.5 2.54) (size 3 1) (layers F.Cu F.Mask))
  (pad 1 smd rect (at 1.5 -5.08) (size 3 1) (layers F.Cu F.Mask))
  (pad 3 smd rect (at 1.5 0) (size 3 1) (layers F.Cu F.Mask))
  (pad 5 smd rect (at 1.5 5.08) (size 3 1) (layers F.Cu F.Mask))
  (model Pin_Headers.3dshapes/Pin_Header_Straight_1x05_Pitch2.54mm_SMD_Pin1Right.wrl
    (at (xyz 0 0 0))
    (scale (xyz 1 1 1))
    (rotate (xyz 0 0 0))
  )
)