{
  "lessons": [
    {
      "slug": "3021",
      "introduction": [
        "You will learn the art of planning and implementing Plutus contracts.",
        "We'll start by laying the foundation for effective contract development, covering key concepts such as contract design, logic structure, and data management.",
        "In this lesson, you will discover how to translate real-world scenarios and business logic into Plutus code, enabling you to bring your unique ideas to life on the blockchain."
      ],
      "links": [],
      "videoHeading": "How to Think Like a Smart Contract",
      "youtubeId": "C_ueSBN4Kvs",
      "successComponent": false,
      "success": {
        "criteria": "",
        "text": ""
      },
      "assignmentComponent": true,
      "markdownComponent": false
    },
    {
      "slug": "3022",
      "introduction": [
        "You will learn the process of creating your Plutus project from scratch, the essential steps, such as project structure, file organization, and setting up the development environment.",
        "Learning how to utilize version control systems effectively, enabling you to manage and track changes to your Plutus projects seamlessly.",
        "You will gain expertise in keeping your projects up-to-date with the latest advancements in the Cardano ecosystem."
      ],
      "links": [],
      "videoHeading": "How to Build a Plutus Project From Scratch",
      "youtubeId": "",
      "successComponent": false,
      "success": {
        "criteria": "",
        "text": ""
      },
      "assignmentComponent": true,
      "markdownComponent": false
    },
    {
      "slug": "3023",
      "introduction": [
        "You will gain a understanding of how time functions in Plutus, including the crucial concepts of POSIXTime and Ledger Slot Numbers.",
        "Time plays a pivotal role in the world of blockchain and smart contract development.",
        "It influences the execution of various operations, contract validation, and the orchestration of decentralized applications (DApps).",
        "In this lesson, you will learn how to work with POSIXTime to create time-sensitive smart contracts and applications as well discovering how these slot numbers are used to measure time intervals, schedule contract executions, and manage blockchain events."
      ],
      "links": [
        {
          "url": "https://gitlab.com/gimbalabs/ppbl-2023/ppbl2023-plutus-template/",
          "linkText": "PPBL 2023 Plutus Template"
        }
      ],
      "videoHeading": "How Time Works in Plutus and Cardano",
      "youtubeId": "",
      "successComponent": false,
      "success": {
        "criteria": "",
        "text": ""
      },
      "assignmentComponent": true,
      "markdownComponent": false
    }
  ]
}