{
  "lessons": [
    {
      "slug": "3031",
      "introduction": [
       "In this module, you'll find essential resources to support your learning journey. Expect to consult these resources often during the module."
      ],
      "links": [
        {
          "url": "https://aiken-lang.org/installation-instructions",
          "linkText": "Aiken Documentation"
        },
        {
          "url": "https://aiken-lang.github.io/stdlib/",
          "linkText": "Standard Library API Documentation"
        },
        {
          "url": "https://aiken-lang.github.io/prelude/",
          "linkText": "Prelude API Documentation"
        },
        {
          "url": "https://play.aiken-lang.org/",
          "linkText": "Aiken Playground"
        }
      ],
      "videoHeading": "",
      "youtubeId": "",
      "successComponent": false,
      "success": {
        "criteria": "",
        "text": ""
      },
      "assignmentComponent": true,
      "markdownComponent": false
    },
    {
      "slug": "3032",
      "introduction": [
       "In this lesson you will learn how to be in the good flow and avoid the bad flow. This means have an understanding about how to express the logic of your program, in this case the smart contract. Here we will see the most common ways to manage the logic of your program, but there are more complex features in the documentation (they are less used though). Make sure that you understand the types and variables section of the documentation."
      ],
      "links": [],
      "videoHeading": "",
      "youtubeId": "",
      "successComponent": false,
      "success": {
        "criteria": "",
        "text": ""
      },
      "assignmentComponent": true,
      "markdownComponent": false
    },
    {
      "slug": "3033",
      "introduction": [
       "In Module 203, you learned how to use a minting validator written in PlutusTx. In this lesson, you will see how to rewrite the same validator in Aiken.",
       "By investigating the differences between the two versions, you will learn how to use the Aiken language to write validators."
      ],
      "links": [],
      "videoHeading": "",
      "youtubeId": "",
      "successComponent": false,
      "success": {
        "criteria": "",
        "text": ""
      },
      "assignmentComponent": true,
      "markdownComponent": false
    },
    {
      "slug": "3034",
      "introduction": [
       "In Module 204, you completed the PPBL Faucet Project. Now, your challenge is rewrite the PPBL Faucet validator in Aiken."
      ],
      "links": [],
      "videoHeading": "",
      "youtubeId": "",
      "successComponent": false,
      "success": {
        "criteria": "",
        "text": ""
      },
      "assignmentComponent": true,
      "markdownComponent": false
    }
  ]
}