<svg width="64" height="61" viewBox="0 0 64 61" fill="none" xmlns="http://www.w3.org/2000/svg">
<path d="M26.3529 11.2941C24.356 11.2941 22.4409 12.0874 21.0288 13.4994C19.6168 14.9115 18.8235 16.8266 18.8235 18.8235C18.8235 20.8205 19.6168 22.7356 21.0288 24.1476C22.4409 25.5597 24.356 26.3529 26.3529 26.3529C28.3499 26.3529 30.265 25.5597 31.677 24.1476C33.0891 22.7356 33.8824 20.8205 33.8824 18.8235C33.8824 16.8266 33.0891 14.9115 31.677 13.4994C30.265 12.0874 28.3499 11.2941 26.3529 11.2941ZM22.5882 18.8235C22.5882 17.8251 22.9849 16.8675 23.6909 16.1615C24.3969 15.4555 25.3545 15.0588 26.3529 15.0588C27.3514 15.0588 28.309 15.4555 29.015 16.1615C29.721 16.8675 30.1176 17.8251 30.1176 18.8235C30.1176 19.822 29.721 20.7796 29.015 21.4856C28.309 22.1916 27.3514 22.5882 26.3529 22.5882C25.3545 22.5882 24.3969 22.1916 23.6909 21.4856C22.9849 20.7796 22.5882 19.822 22.5882 18.8235ZM0 5.64706C0 4.14937 0.594956 2.71301 1.65399 1.65399C2.71301 0.594957 4.14937 0 5.64706 0H47.0588C48.5565 0 49.9929 0.594957 51.0519 1.65399C52.1109 2.71301 52.7059 4.14937 52.7059 5.64706V18.8235H48.9412V15.0588H45.1765C43.1795 15.0588 41.2644 14.2655 39.8524 12.8535C38.4403 11.4415 37.6471 9.52634 37.6471 7.52941V3.76471H15.0588V7.52941C15.0588 9.52634 14.2655 11.4415 12.8535 12.8535C11.4415 14.2655 9.52634 15.0588 7.52941 15.0588H3.76471V22.5882H7.52941C9.52634 22.5882 11.4415 23.3815 12.8535 24.7936C14.2655 26.2056 15.0588 28.1207 15.0588 30.1176V33.8824H33.8824V37.6471H5.64706C4.14937 37.6471 2.71301 37.0521 1.65399 35.9931C0.594956 34.934 0 33.4977 0 32V5.64706ZM5.64706 3.76471C5.14783 3.76471 4.66904 3.96303 4.31603 4.31603C3.96303 4.66904 3.76471 5.14783 3.76471 5.64706V11.2941H7.52941C8.52787 11.2941 9.48544 10.8975 10.1915 10.1915C10.8975 9.48544 11.2941 8.52787 11.2941 7.52941V3.76471H5.64706ZM47.0588 3.76471H41.4118V7.52941C41.4118 8.52787 41.8084 9.48544 42.5144 10.1915C43.2204 10.8975 44.178 11.2941 45.1765 11.2941H48.9412V5.64706C48.9412 5.14783 48.7429 4.66904 48.3899 4.31603C48.0368 3.96303 47.5581 3.76471 47.0588 3.76471ZM5.64706 33.8824H11.2941V30.1176C11.2941 29.1192 10.8975 28.1616 10.1915 27.4556C9.48544 26.7496 8.52787 26.3529 7.52941 26.3529H3.76471V32C3.76471 32.4992 3.96303 32.978 4.31603 33.331C4.66904 33.684 5.14783 33.8824 5.64706 33.8824ZM56.4706 18.8235V7.84941C57.5721 8.23884 58.5256 8.96031 59.1999 9.91439C59.8742 10.8685 60.2359 12.0082 60.2353 13.1765V18.8235H56.4706ZM33.8824 41.4118V45.1765H13.1765C12.0082 45.1771 10.8685 44.8153 9.91439 44.1411C8.96031 43.4668 8.23884 42.5132 7.84941 41.4118H33.8824ZM43.2941 22.5882C41.7964 22.5882 40.3601 23.1832 39.301 24.2422C38.242 25.3013 37.6471 26.7376 37.6471 28.2353V54.5882C37.6471 56.0859 38.242 57.5223 39.301 58.5813C40.3601 59.6403 41.7964 60.2353 43.2941 60.2353H58.3529C59.8506 60.2353 61.287 59.6403 62.346 58.5813C63.405 57.5223 64 56.0859 64 54.5882V28.2353C64 26.7376 63.405 25.3013 62.346 24.2422C61.287 23.1832 59.8506 22.5882 58.3529 22.5882H43.2941ZM43.2941 37.6471H47.0588C47.5581 37.6471 48.0368 37.8454 48.3899 38.1984C48.7429 38.5514 48.9412 39.0302 48.9412 39.5294C48.9412 40.0286 48.7429 40.5074 48.3899 40.8604C48.0368 41.2135 47.5581 41.4118 47.0588 41.4118H43.2941C42.7949 41.4118 42.3161 41.2135 41.9631 40.8604C41.6101 40.5074 41.4118 40.0286 41.4118 39.5294C41.4118 39.0302 41.6101 38.5514 41.9631 38.1984C42.3161 37.8454 42.7949 37.6471 43.2941 37.6471ZM54.5882 37.6471H58.3529C58.8522 37.6471 59.331 37.8454 59.684 38.1984C60.037 38.5514 60.2353 39.0302 60.2353 39.5294C60.2353 40.0286 60.037 40.5074 59.684 40.8604C59.331 41.2135 58.8522 41.4118 58.3529 41.4118H54.5882C54.089 41.4118 53.6102 41.2135 53.2572 40.8604C52.9042 40.5074 52.7059 40.0286 52.7059 39.5294C52.7059 39.0302 52.9042 38.5514 53.2572 38.1984C53.6102 37.8454 54.089 37.6471 54.5882 37.6471ZM43.2941 45.1765H47.0588C47.5581 45.1765 48.0368 45.3748 48.3899 45.7278C48.7429 46.0808 48.9412 46.5596 48.9412 47.0588C48.9412 47.5581 48.7429 48.0368 48.3899 48.3899C48.0368 48.7429 47.5581 48.9412 47.0588 48.9412H43.2941C42.7949 48.9412 42.3161 48.7429 41.9631 48.3899C41.6101 48.0368 41.4118 47.5581 41.4118 47.0588C41.4118 46.5596 41.6101 46.0808 41.9631 45.7278C42.3161 45.3748 42.7949 45.1765 43.2941 45.1765ZM54.5882 45.1765H58.3529C58.8522 45.1765 59.331 45.3748 59.684 45.7278C60.037 46.0808 60.2353 46.5596 60.2353 47.0588C60.2353 47.5581 60.037 48.0368 59.684 48.3899C59.331 48.7429 58.8522 48.9412 58.3529 48.9412H54.5882C54.089 48.9412 53.6102 48.7429 53.2572 48.3899C52.9042 48.0368 52.7059 47.5581 52.7059 47.0588C52.7059 46.5596 52.9042 46.0808 53.2572 45.7278C53.6102 45.3748 54.089 45.1765 54.5882 45.1765ZM43.2941 52.7059H47.0588C47.5581 52.7059 48.0368 52.9042 48.3899 53.2572C48.7429 53.6102 48.9412 54.089 48.9412 54.5882C48.9412 55.0875 48.7429 55.5663 48.3899 55.9193C48.0368 56.2723 47.5581 56.4706 47.0588 56.4706H43.2941C42.7949 56.4706 42.3161 56.2723 41.9631 55.9193C41.6101 55.5663 41.4118 55.0875 41.4118 54.5882C41.4118 54.089 41.6101 53.6102 41.9631 53.2572C42.3161 52.9042 42.7949 52.7059 43.2941 52.7059ZM54.5882 52.7059H58.3529C58.8522 52.7059 59.331 52.9042 59.684 53.2572C60.037 53.6102 60.2353 54.089 60.2353 54.5882C60.2353 55.0875 60.037 55.5663 59.684 55.9193C59.331 56.2723 58.8522 56.4706 58.3529 56.4706H54.5882C54.089 56.4706 53.6102 56.2723 53.2572 55.9193C52.9042 55.5663 52.7059 55.0875 52.7059 54.5882C52.7059 54.089 52.9042 53.6102 53.2572 53.2572C53.6102 52.9042 54.089 52.7059 54.5882 52.7059ZM41.4118 28.2353C41.4118 27.7361 41.6101 27.2573 41.9631 26.9043C42.3161 26.5513 42.7949 26.3529 43.2941 26.3529H58.3529C58.8522 26.3529 59.331 26.5513 59.684 26.9043C60.037 27.2573 60.2353 27.7361 60.2353 28.2353V32C60.2353 32.4992 60.037 32.978 59.684 33.331C59.331 33.684 58.8522 33.8824 58.3529 33.8824H43.2941C42.7949 33.8824 42.3161 33.684 41.9631 33.331C41.6101 32.978 41.4118 32.4992 41.4118 32V28.2353Z" fill="#242333"/>
</svg>
