{
  "arch": "haswell",
  "topology": {
    "numa_nodes": [
      "0xffffff"
    ],
    "sockets": [
      "0xffffff"
    ],
    "cores": [
      "0x001001",
      "0x002002",
      "0x004004",
      "0x008008",
      "0x010010",
      "0x020020",
      "0x040040",
      "0x080080",
      "0x100100",
      "0x200200",
      "0x400400",
      "0x800800"
    ],
    "caches": [
      {
        "type": "L2",
        "size": 262144,
        "linesize": 64,
        "associativity": 8,
        "num_cpus": 2,
        "cpusets": [
          "0x001001",
          "0x002002",
          "0x004004",
          "0x008008",
          "0x010010",
          "0x020020",
          "0x040040",
          "0x080080",
          "0x100100",
          "0x200200",
          "0x400400",
          "0x800800"
        ]
      },
      {
        "type": "L1",
        "size": 32768,
        "linesize": 64,
        "associativity": 8,
        "num_cpus": 2,
        "cpusets": [
          "0x001001",
          "0x002002",
          "0x004004",
          "0x008008",
          "0x010010",
          "0x020020",
          "0x040040",
          "0x080080",
          "0x100100",
          "0x200200",
          "0x400400",
          "0x800800"
        ]
      },
      {
        "type": "L3",
        "size": 31457280,
        "linesize": 64,
        "associativity": 20,
        "num_cpus": 24,
        "cpusets": [
          "0xffffff"
        ]
      }
    ]
  },
  "num_cpus": 24,
  "num_cpus_per_core": 2,
  "num_cpus_per_socket": 24,
  "num_sockets": 1
}