2022-05-11T08:29:00+02:00|reframe 3.10.0-dev.3|NcclPerfTest_sendrecv on cscs-daint:daint-icc21-impi21-ib-umod-gpu using nccl-test|jobid=38343080|algbw_in_8=0.0|GB/s|ref=0 (l=null, u=null)|sendrecv,git=None,comm_type=sendrecv,num_nodes=1,min_msg_size=8,num_gpus=1,max_msg_size=128M
2022-05-11T08:29:00+02:00|reframe 3.10.0-dev.3|NcclPerfTest_sendrecv on cscs-daint:daint-icc21-impi21-ib-umod-gpu using nccl-test|jobid=38343080|busbw_in_8=0.0|GB/s|ref=0 (l=null, u=null)|sendrecv,git=None,comm_type=sendrecv,num_nodes=1,min_msg_size=8,num_gpus=1,max_msg_size=128M
2022-05-11T08:29:00+02:00|reframe 3.10.0-dev.3|NcclPerfTest_sendrecv on cscs-daint:daint-icc21-impi21-ib-umod-gpu using nccl-test|jobid=38343080|time_in_8=11.65|us|ref=0 (l=null, u=null)|sendrecv,git=None,comm_type=sendrecv,num_nodes=1,min_msg_size=8,num_gpus=1,max_msg_size=128M
2022-05-11T08:29:00+02:00|reframe 3.10.0-dev.3|NcclPerfTest_sendrecv on cscs-daint:daint-icc21-impi21-ib-umod-gpu using nccl-test|jobid=38343080|algbw_out_8=0.0|GB/s|ref=0 (l=null, u=null)|sendrecv,git=None,comm_type=sendrecv,num_nodes=1,min_msg_size=8,num_gpus=1,max_msg_size=128M
2022-05-11T08:29:00+02:00|reframe 3.10.0-dev.3|NcclPerfTest_sendrecv on cscs-daint:daint-icc21-impi21-ib-umod-gpu using nccl-test|jobid=38343080|busbw_out_8=0.0|GB/s|ref=0 (l=null, u=null)|sendrecv,git=None,comm_type=sendrecv,num_nodes=1,min_msg_size=8,num_gpus=1,max_msg_size=128M
2022-05-11T08:29:00+02:00|reframe 3.10.0-dev.3|NcclPerfTest_sendrecv on cscs-daint:daint-icc21-impi21-ib-umod-gpu using nccl-test|jobid=38343080|time_out_8=10.51|us|ref=0 (l=null, u=null)|sendrecv,git=None,comm_type=sendrecv,num_nodes=1,min_msg_size=8,num_gpus=1,max_msg_size=128M
2022-05-11T08:29:00+02:00|reframe 3.10.0-dev.3|NcclPerfTest_sendrecv on cscs-daint:daint-icc21-impi21-ib-umod-gpu using nccl-test|jobid=38343080|algbw_in_16=0.0|GB/s|ref=0 (l=null, u=null)|sendrecv,git=None,comm_type=sendrecv,num_nodes=1,min_msg_size=8,num_gpus=1,max_msg_size=128M
2022-05-11T08:29:00+02:00|reframe 3.10.0-dev.3|NcclPerfTest_sendrecv on cscs-daint:daint-icc21-impi21-ib-umod-gpu using nccl-test|jobid=38343080|algbw_in_32=0.0|GB/s|ref=0 (l=null, u=null)|sendrecv,git=None,comm_type=sendrecv,num_nodes=1,min_msg_size=8,num_gpus=1,max_msg_size=128M
2022-05-11T08:29:00+02:00|reframe 3.10.0-dev.3|NcclPerfTest_sendrecv on cscs-daint:daint-icc21-impi21-ib-umod-gpu using nccl-test|jobid=38343080|algbw_in_64=0.01|GB/s|ref=0 (l=null, u=null)|sendrecv,git=None,comm_type=sendrecv,num_nodes=1,min_msg_size=8,num_gpus=1,max_msg_size=128M
2022-05-11T08:29:00+02:00|reframe 3.10.0-dev.3|NcclPerfTest_sendrecv on cscs-daint:daint-icc21-impi21-ib-umod-gpu using nccl-test|jobid=38343080|algbw_in_128=0.01|GB/s|ref=0 (l=null, u=null)|sendrecv,git=None,comm_type=sendrecv,num_nodes=1,min_msg_size=8,num_gpus=1,max_msg_size=128M
2022-05-11T08:29:00+02:00|reframe 3.10.0-dev.3|NcclPerfTest_sendrecv on cscs-daint:daint-icc21-impi21-ib-umod-gpu using nccl-test|jobid=38343080|algbw_in_256=0.02|GB/s|ref=0 (l=null, u=null)|sendrecv,git=None,comm_type=sendrecv,num_nodes=1,min_msg_size=8,num_gpus=1,max_msg_size=128M
2022-05-11T08:29:00+02:00|reframe 3.10.0-dev.3|NcclPerfTest_sendrecv on cscs-daint:daint-icc21-impi21-ib-umod-gpu using nccl-test|jobid=38343080|algbw_in_512=0.05|GB/s|ref=0 (l=null, u=null)|sendrecv,git=None,comm_type=sendrecv,num_nodes=1,min_msg_size=8,num_gpus=1,max_msg_size=128M
2022-05-11T08:29:00+02:00|reframe 3.10.0-dev.3|NcclPerfTest_sendrecv on cscs-daint:daint-icc21-impi21-ib-umod-gpu using nccl-test|jobid=38343080|algbw_in_1024=0.09|GB/s|ref=0 (l=null, u=null)|sendrecv,git=None,comm_type=sendrecv,num_nodes=1,min_msg_size=8,num_gpus=1,max_msg_size=128M
2022-05-11T08:29:00+02:00|reframe 3.10.0-dev.3|NcclPerfTest_sendrecv on cscs-daint:daint-icc21-impi21-ib-umod-gpu using nccl-test|jobid=38343080|algbw_in_2048=0.18|GB/s|ref=0 (l=null, u=null)|sendrecv,git=None,comm_type=sendrecv,num_nodes=1,min_msg_size=8,num_gpus=1,max_msg_size=128M
2022-05-11T08:29:00+02:00|reframe 3.10.0-dev.3|NcclPerfTest_sendrecv on cscs-daint:daint-icc21-impi21-ib-umod-gpu using nccl-test|jobid=38343080|algbw_in_4096=0.36|GB/s|ref=0 (l=null, u=null)|sendrecv,git=None,comm_type=sendrecv,num_nodes=1,min_msg_size=8,num_gpus=1,max_msg_size=128M
2022-05-11T08:29:00+02:00|reframe 3.10.0-dev.3|NcclPerfTest_sendrecv on cscs-daint:daint-icc21-impi21-ib-umod-gpu using nccl-test|jobid=38343080|algbw_in_8192=0.73|GB/s|ref=0 (l=null, u=null)|sendrecv,git=None,comm_type=sendrecv,num_nodes=1,min_msg_size=8,num_gpus=1,max_msg_size=128M
2022-05-11T08:29:00+02:00|reframe 3.10.0-dev.3|NcclPerfTest_sendrecv on cscs-daint:daint-icc21-impi21-ib-umod-gpu using nccl-test|jobid=38343080|algbw_in_16384=1.42|GB/s|ref=0 (l=null, u=null)|sendrecv,git=None,comm_type=sendrecv,num_nodes=1,min_msg_size=8,num_gpus=1,max_msg_size=128M
2022-05-11T08:29:00+02:00|reframe 3.10.0-dev.3|NcclPerfTest_sendrecv on cscs-daint:daint-icc21-impi21-ib-umod-gpu using nccl-test|jobid=38343080|algbw_in_32768=2.66|GB/s|ref=0 (l=null, u=null)|sendrecv,git=None,comm_type=sendrecv,num_nodes=1,min_msg_size=8,num_gpus=1,max_msg_size=128M
2022-05-11T08:29:00+02:00|reframe 3.10.0-dev.3|NcclPerfTest_sendrecv on cscs-daint:daint-icc21-impi21-ib-umod-gpu using nccl-test|jobid=38343080|algbw_in_65536=4.71|GB/s|ref=0 (l=null, u=null)|sendrecv,git=None,comm_type=sendrecv,num_nodes=1,min_msg_size=8,num_gpus=1,max_msg_size=128M
2022-05-11T08:29:00+02:00|reframe 3.10.0-dev.3|NcclPerfTest_sendrecv on cscs-daint:daint-icc21-impi21-ib-umod-gpu using nccl-test|jobid=38343080|algbw_in_131072=7.89|GB/s|ref=0 (l=null, u=null)|sendrecv,git=None,comm_type=sendrecv,num_nodes=1,min_msg_size=8,num_gpus=1,max_msg_size=128M
2022-05-11T08:29:00+02:00|reframe 3.10.0-dev.3|NcclPerfTest_sendrecv on cscs-daint:daint-icc21-impi21-ib-umod-gpu using nccl-test|jobid=38343080|algbw_in_262144=11.6|GB/s|ref=0 (l=null, u=null)|sendrecv,git=None,comm_type=sendrecv,num_nodes=1,min_msg_size=8,num_gpus=1,max_msg_size=128M
2022-05-11T08:29:00+02:00|reframe 3.10.0-dev.3|NcclPerfTest_sendrecv on cscs-daint:daint-icc21-impi21-ib-umod-gpu using nccl-test|jobid=38343080|algbw_in_524288=15.72|GB/s|ref=0 (l=null, u=null)|sendrecv,git=None,comm_type=sendrecv,num_nodes=1,min_msg_size=8,num_gpus=1,max_msg_size=128M
2022-05-11T08:29:00+02:00|reframe 3.10.0-dev.3|NcclPerfTest_sendrecv on cscs-daint:daint-icc21-impi21-ib-umod-gpu using nccl-test|jobid=38343080|algbw_in_1048576=25.42|GB/s|ref=0 (l=null, u=null)|sendrecv,git=None,comm_type=sendrecv,num_nodes=1,min_msg_size=8,num_gpus=1,max_msg_size=128M
2022-05-11T08:29:00+02:00|reframe 3.10.0-dev.3|NcclPerfTest_sendrecv on cscs-daint:daint-icc21-impi21-ib-umod-gpu using nccl-test|jobid=38343080|algbw_in_2097152=45.14|GB/s|ref=0 (l=null, u=null)|sendrecv,git=None,comm_type=sendrecv,num_nodes=1,min_msg_size=8,num_gpus=1,max_msg_size=128M
2022-05-11T08:29:00+02:00|reframe 3.10.0-dev.3|NcclPerfTest_sendrecv on cscs-daint:daint-icc21-impi21-ib-umod-gpu using nccl-test|jobid=38343080|algbw_in_4194304=68.13|GB/s|ref=0 (l=null, u=null)|sendrecv,git=None,comm_type=sendrecv,num_nodes=1,min_msg_size=8,num_gpus=1,max_msg_size=128M
2022-05-11T08:29:00+02:00|reframe 3.10.0-dev.3|NcclPerfTest_sendrecv on cscs-daint:daint-icc21-impi21-ib-umod-gpu using nccl-test|jobid=38343080|algbw_in_8388608=129.66|GB/s|ref=0 (l=null, u=null)|sendrecv,git=None,comm_type=sendrecv,num_nodes=1,min_msg_size=8,num_gpus=1,max_msg_size=128M
2022-05-11T08:29:00+02:00|reframe 3.10.0-dev.3|NcclPerfTest_sendrecv on cscs-daint:daint-icc21-impi21-ib-umod-gpu using nccl-test|jobid=38343080|algbw_in_16777216=169.12|GB/s|ref=0 (l=null, u=null)|sendrecv,git=None,comm_type=sendrecv,num_nodes=1,min_msg_size=8,num_gpus=1,max_msg_size=128M
2022-05-11T08:29:00+02:00|reframe 3.10.0-dev.3|NcclPerfTest_sendrecv on cscs-daint:daint-icc21-impi21-ib-umod-gpu using nccl-test|jobid=38343080|algbw_in_33554432=198.15|GB/s|ref=0 (l=null, u=null)|sendrecv,git=None,comm_type=sendrecv,num_nodes=1,min_msg_size=8,num_gpus=1,max_msg_size=128M
2022-05-11T08:29:00+02:00|reframe 3.10.0-dev.3|NcclPerfTest_sendrecv on cscs-daint:daint-icc21-impi21-ib-umod-gpu using nccl-test|jobid=38343080|algbw_in_67108864=217.63|GB/s|ref=0 (l=null, u=null)|sendrecv,git=None,comm_type=sendrecv,num_nodes=1,min_msg_size=8,num_gpus=1,max_msg_size=128M
2022-05-11T08:29:00+02:00|reframe 3.10.0-dev.3|NcclPerfTest_sendrecv on cscs-daint:daint-icc21-impi21-ib-umod-gpu using nccl-test|jobid=38343080|algbw_in_134217728=226.95|GB/s|ref=0 (l=null, u=null)|sendrecv,git=None,comm_type=sendrecv,num_nodes=1,min_msg_size=8,num_gpus=1,max_msg_size=128M
2022-05-11T08:29:00+02:00|reframe 3.10.0-dev.3|NcclPerfTest_sendrecv on cscs-daint:daint-icc21-impi21-ib-umod-gpu using nccl-test|jobid=38343080|algbw_out_16=0.0|GB/s|ref=0 (l=null, u=null)|sendrecv,git=None,comm_type=sendrecv,num_nodes=1,min_msg_size=8,num_gpus=1,max_msg_size=128M
2022-05-11T08:29:00+02:00|reframe 3.10.0-dev.3|NcclPerfTest_sendrecv on cscs-daint:daint-icc21-impi21-ib-umod-gpu using nccl-test|jobid=38343080|algbw_out_32=0.0|GB/s|ref=0 (l=null, u=null)|sendrecv,git=None,comm_type=sendrecv,num_nodes=1,min_msg_size=8,num_gpus=1,max_msg_size=128M
2022-05-11T08:29:00+02:00|reframe 3.10.0-dev.3|NcclPerfTest_sendrecv on cscs-daint:daint-icc21-impi21-ib-umod-gpu using nccl-test|jobid=38343080|algbw_out_64=0.01|GB/s|ref=0 (l=null, u=null)|sendrecv,git=None,comm_type=sendrecv,num_nodes=1,min_msg_size=8,num_gpus=1,max_msg_size=128M
2022-05-11T08:29:00+02:00|reframe 3.10.0-dev.3|NcclPerfTest_sendrecv on cscs-daint:daint-icc21-impi21-ib-umod-gpu using nccl-test|jobid=38343080|algbw_out_128=0.01|GB/s|ref=0 (l=null, u=null)|sendrecv,git=None,comm_type=sendrecv,num_nodes=1,min_msg_size=8,num_gpus=1,max_msg_size=128M
2022-05-11T08:29:00+02:00|reframe 3.10.0-dev.3|NcclPerfTest_sendrecv on cscs-daint:daint-icc21-impi21-ib-umod-gpu using nccl-test|jobid=38343080|algbw_out_256=0.02|GB/s|ref=0 (l=null, u=null)|sendrecv,git=None,comm_type=sendrecv,num_nodes=1,min_msg_size=8,num_gpus=1,max_msg_size=128M
2022-05-11T08:29:00+02:00|reframe 3.10.0-dev.3|NcclPerfTest_sendrecv on cscs-daint:daint-icc21-impi21-ib-umod-gpu using nccl-test|jobid=38343080|algbw_out_512=0.05|GB/s|ref=0 (l=null, u=null)|sendrecv,git=None,comm_type=sendrecv,num_nodes=1,min_msg_size=8,num_gpus=1,max_msg_size=128M
2022-05-11T08:29:00+02:00|reframe 3.10.0-dev.3|NcclPerfTest_sendrecv on cscs-daint:daint-icc21-impi21-ib-umod-gpu using nccl-test|jobid=38343080|algbw_out_1024=0.1|GB/s|ref=0 (l=null, u=null)|sendrecv,git=None,comm_type=sendrecv,num_nodes=1,min_msg_size=8,num_gpus=1,max_msg_size=128M
2022-05-11T08:29:00+02:00|reframe 3.10.0-dev.3|NcclPerfTest_sendrecv on cscs-daint:daint-icc21-impi21-ib-umod-gpu using nccl-test|jobid=38343080|algbw_out_2048=0.19|GB/s|ref=0 (l=null, u=null)|sendrecv,git=None,comm_type=sendrecv,num_nodes=1,min_msg_size=8,num_gpus=1,max_msg_size=128M
2022-05-11T08:29:00+02:00|reframe 3.10.0-dev.3|NcclPerfTest_sendrecv on cscs-daint:daint-icc21-impi21-ib-umod-gpu using nccl-test|jobid=38343080|algbw_out_4096=0.39|GB/s|ref=0 (l=null, u=null)|sendrecv,git=None,comm_type=sendrecv,num_nodes=1,min_msg_size=8,num_gpus=1,max_msg_size=128M
2022-05-11T08:29:00+02:00|reframe 3.10.0-dev.3|NcclPerfTest_sendrecv on cscs-daint:daint-icc21-impi21-ib-umod-gpu using nccl-test|jobid=38343080|algbw_out_8192=0.76|GB/s|ref=0 (l=null, u=null)|sendrecv,git=None,comm_type=sendrecv,num_nodes=1,min_msg_size=8,num_gpus=1,max_msg_size=128M
2022-05-11T08:29:00+02:00|reframe 3.10.0-dev.3|NcclPerfTest_sendrecv on cscs-daint:daint-icc21-impi21-ib-umod-gpu using nccl-test|jobid=38343080|algbw_out_16384=1.56|GB/s|ref=0 (l=null, u=null)|sendrecv,git=None,comm_type=sendrecv,num_nodes=1,min_msg_size=8,num_gpus=1,max_msg_size=128M
2022-05-11T08:29:00+02:00|reframe 3.10.0-dev.3|NcclPerfTest_sendrecv on cscs-daint:daint-icc21-impi21-ib-umod-gpu using nccl-test|jobid=38343080|algbw_out_32768=3.12|GB/s|ref=0 (l=null, u=null)|sendrecv,git=None,comm_type=sendrecv,num_nodes=1,min_msg_size=8,num_gpus=1,max_msg_size=128M
2022-05-11T08:29:00+02:00|reframe 3.10.0-dev.3|NcclPerfTest_sendrecv on cscs-daint:daint-icc21-impi21-ib-umod-gpu using nccl-test|jobid=38343080|algbw_out_65536=6.2|GB/s|ref=0 (l=null, u=null)|sendrecv,git=None,comm_type=sendrecv,num_nodes=1,min_msg_size=8,num_gpus=1,max_msg_size=128M
2022-05-11T08:29:00+02:00|reframe 3.10.0-dev.3|NcclPerfTest_sendrecv on cscs-daint:daint-icc21-impi21-ib-umod-gpu using nccl-test|jobid=38343080|algbw_out_131072=12.44|GB/s|ref=0 (l=null, u=null)|sendrecv,git=None,comm_type=sendrecv,num_nodes=1,min_msg_size=8,num_gpus=1,max_msg_size=128M
2022-05-11T08:29:00+02:00|reframe 3.10.0-dev.3|NcclPerfTest_sendrecv on cscs-daint:daint-icc21-impi21-ib-umod-gpu using nccl-test|jobid=38343080|algbw_out_262144=24.9|GB/s|ref=0 (l=null, u=null)|sendrecv,git=None,comm_type=sendrecv,num_nodes=1,min_msg_size=8,num_gpus=1,max_msg_size=128M
2022-05-11T08:29:00+02:00|reframe 3.10.0-dev.3|NcclPerfTest_sendrecv on cscs-daint:daint-icc21-impi21-ib-umod-gpu using nccl-test|jobid=38343080|algbw_out_524288=47.57|GB/s|ref=0 (l=null, u=null)|sendrecv,git=None,comm_type=sendrecv,num_nodes=1,min_msg_size=8,num_gpus=1,max_msg_size=128M
2022-05-11T08:29:00+02:00|reframe 3.10.0-dev.3|NcclPerfTest_sendrecv on cscs-daint:daint-icc21-impi21-ib-umod-gpu using nccl-test|jobid=38343080|algbw_out_1048576=56.9|GB/s|ref=0 (l=null, u=null)|sendrecv,git=None,comm_type=sendrecv,num_nodes=1,min_msg_size=8,num_gpus=1,max_msg_size=128M
2022-05-11T08:29:00+02:00|reframe 3.10.0-dev.3|NcclPerfTest_sendrecv on cscs-daint:daint-icc21-impi21-ib-umod-gpu using nccl-test|jobid=38343080|algbw_out_2097152=89.87|GB/s|ref=0 (l=null, u=null)|sendrecv,git=None,comm_type=sendrecv,num_nodes=1,min_msg_size=8,num_gpus=1,max_msg_size=128M
2022-05-11T08:29:00+02:00|reframe 3.10.0-dev.3|NcclPerfTest_sendrecv on cscs-daint:daint-icc21-impi21-ib-umod-gpu using nccl-test|jobid=38343080|algbw_out_4194304=156.35|GB/s|ref=0 (l=null, u=null)|sendrecv,git=None,comm_type=sendrecv,num_nodes=1,min_msg_size=8,num_gpus=1,max_msg_size=128M
2022-05-11T08:29:00+02:00|reframe 3.10.0-dev.3|NcclPerfTest_sendrecv on cscs-daint:daint-icc21-impi21-ib-umod-gpu using nccl-test|jobid=38343080|algbw_out_8388608=298.86|GB/s|ref=0 (l=null, u=null)|sendrecv,git=None,comm_type=sendrecv,num_nodes=1,min_msg_size=8,num_gpus=1,max_msg_size=128M
2022-05-11T08:29:00+02:00|reframe 3.10.0-dev.3|NcclPerfTest_sendrecv on cscs-daint:daint-icc21-impi21-ib-umod-gpu using nccl-test|jobid=38343080|algbw_out_16777216=590.49|GB/s|ref=0 (l=null, u=null)|sendrecv,git=None,comm_type=sendrecv,num_nodes=1,min_msg_size=8,num_gpus=1,max_msg_size=128M
2022-05-11T08:29:00+02:00|reframe 3.10.0-dev.3|NcclPerfTest_sendrecv on cscs-daint:daint-icc21-impi21-ib-umod-gpu using nccl-test|jobid=38343080|algbw_out_33554432=1182.26|GB/s|ref=0 (l=null, u=null)|sendrecv,git=None,comm_type=sendrecv,num_nodes=1,min_msg_size=8,num_gpus=1,max_msg_size=128M
2022-05-11T08:29:00+02:00|reframe 3.10.0-dev.3|NcclPerfTest_sendrecv on cscs-daint:daint-icc21-impi21-ib-umod-gpu using nccl-test|jobid=38343080|algbw_out_67108864=2351.23|GB/s|ref=0 (l=null, u=null)|sendrecv,git=None,comm_type=sendrecv,num_nodes=1,min_msg_size=8,num_gpus=1,max_msg_size=128M
2022-05-11T08:29:00+02:00|reframe 3.10.0-dev.3|NcclPerfTest_sendrecv on cscs-daint:daint-icc21-impi21-ib-umod-gpu using nccl-test|jobid=38343080|algbw_out_134217728=4719.46|GB/s|ref=0 (l=null, u=null)|sendrecv,git=None,comm_type=sendrecv,num_nodes=1,min_msg_size=8,num_gpus=1,max_msg_size=128M
2022-05-11T08:29:00+02:00|reframe 3.10.0-dev.3|NcclPerfTest_sendrecv on cscs-daint:daint-icc21-impi21-ib-umod-gpu using nccl-test|jobid=38343080|busbw_in_16=0.0|GB/s|ref=0 (l=null, u=null)|sendrecv,git=None,comm_type=sendrecv,num_nodes=1,min_msg_size=8,num_gpus=1,max_msg_size=128M
2022-05-11T08:29:00+02:00|reframe 3.10.0-dev.3|NcclPerfTest_sendrecv on cscs-daint:daint-icc21-impi21-ib-umod-gpu using nccl-test|jobid=38343080|busbw_in_32=0.0|GB/s|ref=0 (l=null, u=null)|sendrecv,git=None,comm_type=sendrecv,num_nodes=1,min_msg_size=8,num_gpus=1,max_msg_size=128M
2022-05-11T08:29:00+02:00|reframe 3.10.0-dev.3|NcclPerfTest_sendrecv on cscs-daint:daint-icc21-impi21-ib-umod-gpu using nccl-test|jobid=38343080|busbw_in_64=0.01|GB/s|ref=0 (l=null, u=null)|sendrecv,git=None,comm_type=sendrecv,num_nodes=1,min_msg_size=8,num_gpus=1,max_msg_size=128M
2022-05-11T08:29:00+02:00|reframe 3.10.0-dev.3|NcclPerfTest_sendrecv on cscs-daint:daint-icc21-impi21-ib-umod-gpu using nccl-test|jobid=38343080|busbw_in_128=0.01|GB/s|ref=0 (l=null, u=null)|sendrecv,git=None,comm_type=sendrecv,num_nodes=1,min_msg_size=8,num_gpus=1,max_msg_size=128M
2022-05-11T08:29:00+02:00|reframe 3.10.0-dev.3|NcclPerfTest_sendrecv on cscs-daint:daint-icc21-impi21-ib-umod-gpu using nccl-test|jobid=38343080|busbw_in_256=0.02|GB/s|ref=0 (l=null, u=null)|sendrecv,git=None,comm_type=sendrecv,num_nodes=1,min_msg_size=8,num_gpus=1,max_msg_size=128M
2022-05-11T08:29:00+02:00|reframe 3.10.0-dev.3|NcclPerfTest_sendrecv on cscs-daint:daint-icc21-impi21-ib-umod-gpu using nccl-test|jobid=38343080|busbw_in_512=0.05|GB/s|ref=0 (l=null, u=null)|sendrecv,git=None,comm_type=sendrecv,num_nodes=1,min_msg_size=8,num_gpus=1,max_msg_size=128M
2022-05-11T08:29:00+02:00|reframe 3.10.0-dev.3|NcclPerfTest_sendrecv on cscs-daint:daint-icc21-impi21-ib-umod-gpu using nccl-test|jobid=38343080|busbw_in_1024=0.09|GB/s|ref=0 (l=null, u=null)|sendrecv,git=None,comm_type=sendrecv,num_nodes=1,min_msg_size=8,num_gpus=1,max_msg_size=128M
2022-05-11T08:29:00+02:00|reframe 3.10.0-dev.3|NcclPerfTest_sendrecv on cscs-daint:daint-icc21-impi21-ib-umod-gpu using nccl-test|jobid=38343080|busbw_in_2048=0.18|GB/s|ref=0 (l=null, u=null)|sendrecv,git=None,comm_type=sendrecv,num_nodes=1,min_msg_size=8,num_gpus=1,max_msg_size=128M
2022-05-11T08:29:00+02:00|reframe 3.10.0-dev.3|NcclPerfTest_sendrecv on cscs-daint:daint-icc21-impi21-ib-umod-gpu using nccl-test|jobid=38343080|busbw_in_4096=0.36|GB/s|ref=0 (l=null, u=null)|sendrecv,git=None,comm_type=sendrecv,num_nodes=1,min_msg_size=8,num_gpus=1,max_msg_size=128M
2022-05-11T08:29:00+02:00|reframe 3.10.0-dev.3|NcclPerfTest_sendrecv on cscs-daint:daint-icc21-impi21-ib-umod-gpu using nccl-test|jobid=38343080|busbw_in_8192=0.73|GB/s|ref=0 (l=null, u=null)|sendrecv,git=None,comm_type=sendrecv,num_nodes=1,min_msg_size=8,num_gpus=1,max_msg_size=128M
2022-05-11T08:29:00+02:00|reframe 3.10.0-dev.3|NcclPerfTest_sendrecv on cscs-daint:daint-icc21-impi21-ib-umod-gpu using nccl-test|jobid=38343080|busbw_in_16384=1.42|GB/s|ref=0 (l=null, u=null)|sendrecv,git=None,comm_type=sendrecv,num_nodes=1,min_msg_size=8,num_gpus=1,max_msg_size=128M
2022-05-11T08:29:00+02:00|reframe 3.10.0-dev.3|NcclPerfTest_sendrecv on cscs-daint:daint-icc21-impi21-ib-umod-gpu using nccl-test|jobid=38343080|busbw_in_32768=2.66|GB/s|ref=0 (l=null, u=null)|sendrecv,git=None,comm_type=sendrecv,num_nodes=1,min_msg_size=8,num_gpus=1,max_msg_size=128M
2022-05-11T08:29:00+02:00|reframe 3.10.0-dev.3|NcclPerfTest_sendrecv on cscs-daint:daint-icc21-impi21-ib-umod-gpu using nccl-test|jobid=38343080|busbw_in_65536=4.71|GB/s|ref=0 (l=null, u=null)|sendrecv,git=None,comm_type=sendrecv,num_nodes=1,min_msg_size=8,num_gpus=1,max_msg_size=128M
2022-05-11T08:29:00+02:00|reframe 3.10.0-dev.3|NcclPerfTest_sendrecv on cscs-daint:daint-icc21-impi21-ib-umod-gpu using nccl-test|jobid=38343080|busbw_in_131072=7.89|GB/s|ref=0 (l=null, u=null)|sendrecv,git=None,comm_type=sendrecv,num_nodes=1,min_msg_size=8,num_gpus=1,max_msg_size=128M
2022-05-11T08:29:00+02:00|reframe 3.10.0-dev.3|NcclPerfTest_sendrecv on cscs-daint:daint-icc21-impi21-ib-umod-gpu using nccl-test|jobid=38343080|busbw_in_262144=11.6|GB/s|ref=0 (l=null, u=null)|sendrecv,git=None,comm_type=sendrecv,num_nodes=1,min_msg_size=8,num_gpus=1,max_msg_size=128M
2022-05-11T08:29:00+02:00|reframe 3.10.0-dev.3|NcclPerfTest_sendrecv on cscs-daint:daint-icc21-impi21-ib-umod-gpu using nccl-test|jobid=38343080|busbw_in_524288=15.72|GB/s|ref=0 (l=null, u=null)|sendrecv,git=None,comm_type=sendrecv,num_nodes=1,min_msg_size=8,num_gpus=1,max_msg_size=128M
2022-05-11T08:29:00+02:00|reframe 3.10.0-dev.3|NcclPerfTest_sendrecv on cscs-daint:daint-icc21-impi21-ib-umod-gpu using nccl-test|jobid=38343080|busbw_in_1048576=25.42|GB/s|ref=0 (l=null, u=null)|sendrecv,git=None,comm_type=sendrecv,num_nodes=1,min_msg_size=8,num_gpus=1,max_msg_size=128M
2022-05-11T08:29:00+02:00|reframe 3.10.0-dev.3|NcclPerfTest_sendrecv on cscs-daint:daint-icc21-impi21-ib-umod-gpu using nccl-test|jobid=38343080|busbw_in_2097152=45.14|GB/s|ref=0 (l=null, u=null)|sendrecv,git=None,comm_type=sendrecv,num_nodes=1,min_msg_size=8,num_gpus=1,max_msg_size=128M
2022-05-11T08:29:00+02:00|reframe 3.10.0-dev.3|NcclPerfTest_sendrecv on cscs-daint:daint-icc21-impi21-ib-umod-gpu using nccl-test|jobid=38343080|busbw_in_4194304=68.13|GB/s|ref=0 (l=null, u=null)|sendrecv,git=None,comm_type=sendrecv,num_nodes=1,min_msg_size=8,num_gpus=1,max_msg_size=128M
2022-05-11T08:29:00+02:00|reframe 3.10.0-dev.3|NcclPerfTest_sendrecv on cscs-daint:daint-icc21-impi21-ib-umod-gpu using nccl-test|jobid=38343080|busbw_in_8388608=129.66|GB/s|ref=0 (l=null, u=null)|sendrecv,git=None,comm_type=sendrecv,num_nodes=1,min_msg_size=8,num_gpus=1,max_msg_size=128M
2022-05-11T08:29:00+02:00|reframe 3.10.0-dev.3|NcclPerfTest_sendrecv on cscs-daint:daint-icc21-impi21-ib-umod-gpu using nccl-test|jobid=38343080|busbw_in_16777216=169.12|GB/s|ref=0 (l=null, u=null)|sendrecv,git=None,comm_type=sendrecv,num_nodes=1,min_msg_size=8,num_gpus=1,max_msg_size=128M
2022-05-11T08:29:00+02:00|reframe 3.10.0-dev.3|NcclPerfTest_sendrecv on cscs-daint:daint-icc21-impi21-ib-umod-gpu using nccl-test|jobid=38343080|busbw_in_33554432=198.15|GB/s|ref=0 (l=null, u=null)|sendrecv,git=None,comm_type=sendrecv,num_nodes=1,min_msg_size=8,num_gpus=1,max_msg_size=128M
2022-05-11T08:29:00+02:00|reframe 3.10.0-dev.3|NcclPerfTest_sendrecv on cscs-daint:daint-icc21-impi21-ib-umod-gpu using nccl-test|jobid=38343080|busbw_in_67108864=217.63|GB/s|ref=0 (l=null, u=null)|sendrecv,git=None,comm_type=sendrecv,num_nodes=1,min_msg_size=8,num_gpus=1,max_msg_size=128M
2022-05-11T08:29:00+02:00|reframe 3.10.0-dev.3|NcclPerfTest_sendrecv on cscs-daint:daint-icc21-impi21-ib-umod-gpu using nccl-test|jobid=38343080|busbw_in_134217728=226.95|GB/s|ref=0 (l=null, u=null)|sendrecv,git=None,comm_type=sendrecv,num_nodes=1,min_msg_size=8,num_gpus=1,max_msg_size=128M
2022-05-11T08:29:00+02:00|reframe 3.10.0-dev.3|NcclPerfTest_sendrecv on cscs-daint:daint-icc21-impi21-ib-umod-gpu using nccl-test|jobid=38343080|busbw_out_16=0.0|GB/s|ref=0 (l=null, u=null)|sendrecv,git=None,comm_type=sendrecv,num_nodes=1,min_msg_size=8,num_gpus=1,max_msg_size=128M
2022-05-11T08:29:00+02:00|reframe 3.10.0-dev.3|NcclPerfTest_sendrecv on cscs-daint:daint-icc21-impi21-ib-umod-gpu using nccl-test|jobid=38343080|busbw_out_32=0.0|GB/s|ref=0 (l=null, u=null)|sendrecv,git=None,comm_type=sendrecv,num_nodes=1,min_msg_size=8,num_gpus=1,max_msg_size=128M
2022-05-11T08:29:00+02:00|reframe 3.10.0-dev.3|NcclPerfTest_sendrecv on cscs-daint:daint-icc21-impi21-ib-umod-gpu using nccl-test|jobid=38343080|busbw_out_64=0.01|GB/s|ref=0 (l=null, u=null)|sendrecv,git=None,comm_type=sendrecv,num_nodes=1,min_msg_size=8,num_gpus=1,max_msg_size=128M
2022-05-11T08:29:00+02:00|reframe 3.10.0-dev.3|NcclPerfTest_sendrecv on cscs-daint:daint-icc21-impi21-ib-umod-gpu using nccl-test|jobid=38343080|busbw_out_128=0.01|GB/s|ref=0 (l=null, u=null)|sendrecv,git=None,comm_type=sendrecv,num_nodes=1,min_msg_size=8,num_gpus=1,max_msg_size=128M
2022-05-11T08:29:00+02:00|reframe 3.10.0-dev.3|NcclPerfTest_sendrecv on cscs-daint:daint-icc21-impi21-ib-umod-gpu using nccl-test|jobid=38343080|busbw_out_256=0.02|GB/s|ref=0 (l=null, u=null)|sendrecv,git=None,comm_type=sendrecv,num_nodes=1,min_msg_size=8,num_gpus=1,max_msg_size=128M
2022-05-11T08:29:00+02:00|reframe 3.10.0-dev.3|NcclPerfTest_sendrecv on cscs-daint:daint-icc21-impi21-ib-umod-gpu using nccl-test|jobid=38343080|busbw_out_512=0.05|GB/s|ref=0 (l=null, u=null)|sendrecv,git=None,comm_type=sendrecv,num_nodes=1,min_msg_size=8,num_gpus=1,max_msg_size=128M
2022-05-11T08:29:00+02:00|reframe 3.10.0-dev.3|NcclPerfTest_sendrecv on cscs-daint:daint-icc21-impi21-ib-umod-gpu using nccl-test|jobid=38343080|busbw_out_1024=0.1|GB/s|ref=0 (l=null, u=null)|sendrecv,git=None,comm_type=sendrecv,num_nodes=1,min_msg_size=8,num_gpus=1,max_msg_size=128M
2022-05-11T08:29:00+02:00|reframe 3.10.0-dev.3|NcclPerfTest_sendrecv on cscs-daint:daint-icc21-impi21-ib-umod-gpu using nccl-test|jobid=38343080|busbw_out_2048=0.19|GB/s|ref=0 (l=null, u=null)|sendrecv,git=None,comm_type=sendrecv,num_nodes=1,min_msg_size=8,num_gpus=1,max_msg_size=128M
2022-05-11T08:29:00+02:00|reframe 3.10.0-dev.3|NcclPerfTest_sendrecv on cscs-daint:daint-icc21-impi21-ib-umod-gpu using nccl-test|jobid=38343080|busbw_out_4096=0.39|GB/s|ref=0 (l=null, u=null)|sendrecv,git=None,comm_type=sendrecv,num_nodes=1,min_msg_size=8,num_gpus=1,max_msg_size=128M
2022-05-11T08:29:00+02:00|reframe 3.10.0-dev.3|NcclPerfTest_sendrecv on cscs-daint:daint-icc21-impi21-ib-umod-gpu using nccl-test|jobid=38343080|busbw_out_8192=0.76|GB/s|ref=0 (l=null, u=null)|sendrecv,git=None,comm_type=sendrecv,num_nodes=1,min_msg_size=8,num_gpus=1,max_msg_size=128M
2022-05-11T08:29:00+02:00|reframe 3.10.0-dev.3|NcclPerfTest_sendrecv on cscs-daint:daint-icc21-impi21-ib-umod-gpu using nccl-test|jobid=38343080|busbw_out_16384=1.56|GB/s|ref=0 (l=null, u=null)|sendrecv,git=None,comm_type=sendrecv,num_nodes=1,min_msg_size=8,num_gpus=1,max_msg_size=128M
2022-05-11T08:29:00+02:00|reframe 3.10.0-dev.3|NcclPerfTest_sendrecv on cscs-daint:daint-icc21-impi21-ib-umod-gpu using nccl-test|jobid=38343080|busbw_out_32768=3.12|GB/s|ref=0 (l=null, u=null)|sendrecv,git=None,comm_type=sendrecv,num_nodes=1,min_msg_size=8,num_gpus=1,max_msg_size=128M
2022-05-11T08:29:00+02:00|reframe 3.10.0-dev.3|NcclPerfTest_sendrecv on cscs-daint:daint-icc21-impi21-ib-umod-gpu using nccl-test|jobid=38343080|busbw_out_65536=6.2|GB/s|ref=0 (l=null, u=null)|sendrecv,git=None,comm_type=sendrecv,num_nodes=1,min_msg_size=8,num_gpus=1,max_msg_size=128M
2022-05-11T08:29:00+02:00|reframe 3.10.0-dev.3|NcclPerfTest_sendrecv on cscs-daint:daint-icc21-impi21-ib-umod-gpu using nccl-test|jobid=38343080|busbw_out_131072=12.44|GB/s|ref=0 (l=null, u=null)|sendrecv,git=None,comm_type=sendrecv,num_nodes=1,min_msg_size=8,num_gpus=1,max_msg_size=128M
2022-05-11T08:29:00+02:00|reframe 3.10.0-dev.3|NcclPerfTest_sendrecv on cscs-daint:daint-icc21-impi21-ib-umod-gpu using nccl-test|jobid=38343080|busbw_out_262144=24.9|GB/s|ref=0 (l=null, u=null)|sendrecv,git=None,comm_type=sendrecv,num_nodes=1,min_msg_size=8,num_gpus=1,max_msg_size=128M
2022-05-11T08:29:00+02:00|reframe 3.10.0-dev.3|NcclPerfTest_sendrecv on cscs-daint:daint-icc21-impi21-ib-umod-gpu using nccl-test|jobid=38343080|busbw_out_524288=47.57|GB/s|ref=0 (l=null, u=null)|sendrecv,git=None,comm_type=sendrecv,num_nodes=1,min_msg_size=8,num_gpus=1,max_msg_size=128M
2022-05-11T08:29:00+02:00|reframe 3.10.0-dev.3|NcclPerfTest_sendrecv on cscs-daint:daint-icc21-impi21-ib-umod-gpu using nccl-test|jobid=38343080|busbw_out_1048576=56.9|GB/s|ref=0 (l=null, u=null)|sendrecv,git=None,comm_type=sendrecv,num_nodes=1,min_msg_size=8,num_gpus=1,max_msg_size=128M
2022-05-11T08:29:00+02:00|reframe 3.10.0-dev.3|NcclPerfTest_sendrecv on cscs-daint:daint-icc21-impi21-ib-umod-gpu using nccl-test|jobid=38343080|busbw_out_2097152=89.87|GB/s|ref=0 (l=null, u=null)|sendrecv,git=None,comm_type=sendrecv,num_nodes=1,min_msg_size=8,num_gpus=1,max_msg_size=128M
2022-05-11T08:29:00+02:00|reframe 3.10.0-dev.3|NcclPerfTest_sendrecv on cscs-daint:daint-icc21-impi21-ib-umod-gpu using nccl-test|jobid=38343080|busbw_out_4194304=156.35|GB/s|ref=0 (l=null, u=null)|sendrecv,git=None,comm_type=sendrecv,num_nodes=1,min_msg_size=8,num_gpus=1,max_msg_size=128M
2022-05-11T08:29:00+02:00|reframe 3.10.0-dev.3|NcclPerfTest_sendrecv on cscs-daint:daint-icc21-impi21-ib-umod-gpu using nccl-test|jobid=38343080|busbw_out_8388608=298.86|GB/s|ref=0 (l=null, u=null)|sendrecv,git=None,comm_type=sendrecv,num_nodes=1,min_msg_size=8,num_gpus=1,max_msg_size=128M
2022-05-11T08:29:00+02:00|reframe 3.10.0-dev.3|NcclPerfTest_sendrecv on cscs-daint:daint-icc21-impi21-ib-umod-gpu using nccl-test|jobid=38343080|busbw_out_16777216=590.49|GB/s|ref=0 (l=null, u=null)|sendrecv,git=None,comm_type=sendrecv,num_nodes=1,min_msg_size=8,num_gpus=1,max_msg_size=128M
2022-05-11T08:29:00+02:00|reframe 3.10.0-dev.3|NcclPerfTest_sendrecv on cscs-daint:daint-icc21-impi21-ib-umod-gpu using nccl-test|jobid=38343080|busbw_out_33554432=1182.26|GB/s|ref=0 (l=null, u=null)|sendrecv,git=None,comm_type=sendrecv,num_nodes=1,min_msg_size=8,num_gpus=1,max_msg_size=128M
2022-05-11T08:29:00+02:00|reframe 3.10.0-dev.3|NcclPerfTest_sendrecv on cscs-daint:daint-icc21-impi21-ib-umod-gpu using nccl-test|jobid=38343080|busbw_out_67108864=2351.23|GB/s|ref=0 (l=null, u=null)|sendrecv,git=None,comm_type=sendrecv,num_nodes=1,min_msg_size=8,num_gpus=1,max_msg_size=128M
2022-05-11T08:29:00+02:00|reframe 3.10.0-dev.3|NcclPerfTest_sendrecv on cscs-daint:daint-icc21-impi21-ib-umod-gpu using nccl-test|jobid=38343080|busbw_out_134217728=4719.46|GB/s|ref=0 (l=null, u=null)|sendrecv,git=None,comm_type=sendrecv,num_nodes=1,min_msg_size=8,num_gpus=1,max_msg_size=128M
2022-05-11T08:29:00+02:00|reframe 3.10.0-dev.3|NcclPerfTest_sendrecv on cscs-daint:daint-icc21-impi21-ib-umod-gpu using nccl-test|jobid=38343080|time_in_16=10.95|us|ref=0 (l=null, u=null)|sendrecv,git=None,comm_type=sendrecv,num_nodes=1,min_msg_size=8,num_gpus=1,max_msg_size=128M
2022-05-11T08:29:00+02:00|reframe 3.10.0-dev.3|NcclPerfTest_sendrecv on cscs-daint:daint-icc21-impi21-ib-umod-gpu using nccl-test|jobid=38343080|time_in_32=10.96|us|ref=0 (l=null, u=null)|sendrecv,git=None,comm_type=sendrecv,num_nodes=1,min_msg_size=8,num_gpus=1,max_msg_size=128M
2022-05-11T08:29:00+02:00|reframe 3.10.0-dev.3|NcclPerfTest_sendrecv on cscs-daint:daint-icc21-impi21-ib-umod-gpu using nccl-test|jobid=38343080|time_in_64=11.39|us|ref=0 (l=null, u=null)|sendrecv,git=None,comm_type=sendrecv,num_nodes=1,min_msg_size=8,num_gpus=1,max_msg_size=128M
2022-05-11T08:29:00+02:00|reframe 3.10.0-dev.3|NcclPerfTest_sendrecv on cscs-daint:daint-icc21-impi21-ib-umod-gpu using nccl-test|jobid=38343080|time_in_128=10.97|us|ref=0 (l=null, u=null)|sendrecv,git=None,comm_type=sendrecv,num_nodes=1,min_msg_size=8,num_gpus=1,max_msg_size=128M
2022-05-11T08:29:00+02:00|reframe 3.10.0-dev.3|NcclPerfTest_sendrecv on cscs-daint:daint-icc21-impi21-ib-umod-gpu using nccl-test|jobid=38343080|time_in_256=10.97|us|ref=0 (l=null, u=null)|sendrecv,git=None,comm_type=sendrecv,num_nodes=1,min_msg_size=8,num_gpus=1,max_msg_size=128M
2022-05-11T08:29:00+02:00|reframe 3.10.0-dev.3|NcclPerfTest_sendrecv on cscs-daint:daint-icc21-impi21-ib-umod-gpu using nccl-test|jobid=38343080|time_in_512=11.0|us|ref=0 (l=null, u=null)|sendrecv,git=None,comm_type=sendrecv,num_nodes=1,min_msg_size=8,num_gpus=1,max_msg_size=128M
2022-05-11T08:29:00+02:00|reframe 3.10.0-dev.3|NcclPerfTest_sendrecv on cscs-daint:daint-icc21-impi21-ib-umod-gpu using nccl-test|jobid=38343080|time_in_1024=11.03|us|ref=0 (l=null, u=null)|sendrecv,git=None,comm_type=sendrecv,num_nodes=1,min_msg_size=8,num_gpus=1,max_msg_size=128M
2022-05-11T08:29:00+02:00|reframe 3.10.0-dev.3|NcclPerfTest_sendrecv on cscs-daint:daint-icc21-impi21-ib-umod-gpu using nccl-test|jobid=38343080|time_in_2048=11.18|us|ref=0 (l=null, u=null)|sendrecv,git=None,comm_type=sendrecv,num_nodes=1,min_msg_size=8,num_gpus=1,max_msg_size=128M
2022-05-11T08:29:00+02:00|reframe 3.10.0-dev.3|NcclPerfTest_sendrecv on cscs-daint:daint-icc21-impi21-ib-umod-gpu using nccl-test|jobid=38343080|time_in_4096=11.5|us|ref=0 (l=null, u=null)|sendrecv,git=None,comm_type=sendrecv,num_nodes=1,min_msg_size=8,num_gpus=1,max_msg_size=128M
2022-05-11T08:29:00+02:00|reframe 3.10.0-dev.3|NcclPerfTest_sendrecv on cscs-daint:daint-icc21-impi21-ib-umod-gpu using nccl-test|jobid=38343080|time_in_8192=11.27|us|ref=0 (l=null, u=null)|sendrecv,git=None,comm_type=sendrecv,num_nodes=1,min_msg_size=8,num_gpus=1,max_msg_size=128M
2022-05-11T08:29:00+02:00|reframe 3.10.0-dev.3|NcclPerfTest_sendrecv on cscs-daint:daint-icc21-impi21-ib-umod-gpu using nccl-test|jobid=38343080|time_in_16384=11.5|us|ref=0 (l=null, u=null)|sendrecv,git=None,comm_type=sendrecv,num_nodes=1,min_msg_size=8,num_gpus=1,max_msg_size=128M
2022-05-11T08:29:00+02:00|reframe 3.10.0-dev.3|NcclPerfTest_sendrecv on cscs-daint:daint-icc21-impi21-ib-umod-gpu using nccl-test|jobid=38343080|time_in_32768=12.34|us|ref=0 (l=null, u=null)|sendrecv,git=None,comm_type=sendrecv,num_nodes=1,min_msg_size=8,num_gpus=1,max_msg_size=128M
2022-05-11T08:29:00+02:00|reframe 3.10.0-dev.3|NcclPerfTest_sendrecv on cscs-daint:daint-icc21-impi21-ib-umod-gpu using nccl-test|jobid=38343080|time_in_65536=13.9|us|ref=0 (l=null, u=null)|sendrecv,git=None,comm_type=sendrecv,num_nodes=1,min_msg_size=8,num_gpus=1,max_msg_size=128M
2022-05-11T08:29:00+02:00|reframe 3.10.0-dev.3|NcclPerfTest_sendrecv on cscs-daint:daint-icc21-impi21-ib-umod-gpu using nccl-test|jobid=38343080|time_in_131072=16.62|us|ref=0 (l=null, u=null)|sendrecv,git=None,comm_type=sendrecv,num_nodes=1,min_msg_size=8,num_gpus=1,max_msg_size=128M
2022-05-11T08:29:00+02:00|reframe 3.10.0-dev.3|NcclPerfTest_sendrecv on cscs-daint:daint-icc21-impi21-ib-umod-gpu using nccl-test|jobid=38343080|time_in_262144=22.61|us|ref=0 (l=null, u=null)|sendrecv,git=None,comm_type=sendrecv,num_nodes=1,min_msg_size=8,num_gpus=1,max_msg_size=128M
2022-05-11T08:29:00+02:00|reframe 3.10.0-dev.3|NcclPerfTest_sendrecv on cscs-daint:daint-icc21-impi21-ib-umod-gpu using nccl-test|jobid=38343080|time_in_524288=33.34|us|ref=0 (l=null, u=null)|sendrecv,git=None,comm_type=sendrecv,num_nodes=1,min_msg_size=8,num_gpus=1,max_msg_size=128M
2022-05-11T08:29:00+02:00|reframe 3.10.0-dev.3|NcclPerfTest_sendrecv on cscs-daint:daint-icc21-impi21-ib-umod-gpu using nccl-test|jobid=38343080|time_in_1048576=41.25|us|ref=0 (l=null, u=null)|sendrecv,git=None,comm_type=sendrecv,num_nodes=1,min_msg_size=8,num_gpus=1,max_msg_size=128M
2022-05-11T08:29:00+02:00|reframe 3.10.0-dev.3|NcclPerfTest_sendrecv on cscs-daint:daint-icc21-impi21-ib-umod-gpu using nccl-test|jobid=38343080|time_in_2097152=46.46|us|ref=0 (l=null, u=null)|sendrecv,git=None,comm_type=sendrecv,num_nodes=1,min_msg_size=8,num_gpus=1,max_msg_size=128M
2022-05-11T08:29:00+02:00|reframe 3.10.0-dev.3|NcclPerfTest_sendrecv on cscs-daint:daint-icc21-impi21-ib-umod-gpu using nccl-test|jobid=38343080|time_in_4194304=61.56|us|ref=0 (l=null, u=null)|sendrecv,git=None,comm_type=sendrecv,num_nodes=1,min_msg_size=8,num_gpus=1,max_msg_size=128M
2022-05-11T08:29:00+02:00|reframe 3.10.0-dev.3|NcclPerfTest_sendrecv on cscs-daint:daint-icc21-impi21-ib-umod-gpu using nccl-test|jobid=38343080|time_in_8388608=64.7|us|ref=0 (l=null, u=null)|sendrecv,git=None,comm_type=sendrecv,num_nodes=1,min_msg_size=8,num_gpus=1,max_msg_size=128M
2022-05-11T08:29:00+02:00|reframe 3.10.0-dev.3|NcclPerfTest_sendrecv on cscs-daint:daint-icc21-impi21-ib-umod-gpu using nccl-test|jobid=38343080|time_in_16777216=99.2|us|ref=0 (l=null, u=null)|sendrecv,git=None,comm_type=sendrecv,num_nodes=1,min_msg_size=8,num_gpus=1,max_msg_size=128M
2022-05-11T08:29:00+02:00|reframe 3.10.0-dev.3|NcclPerfTest_sendrecv on cscs-daint:daint-icc21-impi21-ib-umod-gpu using nccl-test|jobid=38343080|time_in_33554432=169.3|us|ref=0 (l=null, u=null)|sendrecv,git=None,comm_type=sendrecv,num_nodes=1,min_msg_size=8,num_gpus=1,max_msg_size=128M
2022-05-11T08:29:00+02:00|reframe 3.10.0-dev.3|NcclPerfTest_sendrecv on cscs-daint:daint-icc21-impi21-ib-umod-gpu using nccl-test|jobid=38343080|time_in_67108864=308.4|us|ref=0 (l=null, u=null)|sendrecv,git=None,comm_type=sendrecv,num_nodes=1,min_msg_size=8,num_gpus=1,max_msg_size=128M
2022-05-11T08:29:00+02:00|reframe 3.10.0-dev.3|NcclPerfTest_sendrecv on cscs-daint:daint-icc21-impi21-ib-umod-gpu using nccl-test|jobid=38343080|time_in_134217728=591.4|us|ref=0 (l=null, u=null)|sendrecv,git=None,comm_type=sendrecv,num_nodes=1,min_msg_size=8,num_gpus=1,max_msg_size=128M
2022-05-11T08:29:00+02:00|reframe 3.10.0-dev.3|NcclPerfTest_sendrecv on cscs-daint:daint-icc21-impi21-ib-umod-gpu using nccl-test|jobid=38343080|time_out_16=10.55|us|ref=0 (l=null, u=null)|sendrecv,git=None,comm_type=sendrecv,num_nodes=1,min_msg_size=8,num_gpus=1,max_msg_size=128M
2022-05-11T08:29:00+02:00|reframe 3.10.0-dev.3|NcclPerfTest_sendrecv on cscs-daint:daint-icc21-impi21-ib-umod-gpu using nccl-test|jobid=38343080|time_out_32=10.56|us|ref=0 (l=null, u=null)|sendrecv,git=None,comm_type=sendrecv,num_nodes=1,min_msg_size=8,num_gpus=1,max_msg_size=128M
2022-05-11T08:29:00+02:00|reframe 3.10.0-dev.3|NcclPerfTest_sendrecv on cscs-daint:daint-icc21-impi21-ib-umod-gpu using nccl-test|jobid=38343080|time_out_64=10.65|us|ref=0 (l=null, u=null)|sendrecv,git=None,comm_type=sendrecv,num_nodes=1,min_msg_size=8,num_gpus=1,max_msg_size=128M
2022-05-11T08:29:00+02:00|reframe 3.10.0-dev.3|NcclPerfTest_sendrecv on cscs-daint:daint-icc21-impi21-ib-umod-gpu using nccl-test|jobid=38343080|time_out_128=10.51|us|ref=0 (l=null, u=null)|sendrecv,git=None,comm_type=sendrecv,num_nodes=1,min_msg_size=8,num_gpus=1,max_msg_size=128M
2022-05-11T08:29:00+02:00|reframe 3.10.0-dev.3|NcclPerfTest_sendrecv on cscs-daint:daint-icc21-impi21-ib-umod-gpu using nccl-test|jobid=38343080|time_out_256=10.5|us|ref=0 (l=null, u=null)|sendrecv,git=None,comm_type=sendrecv,num_nodes=1,min_msg_size=8,num_gpus=1,max_msg_size=128M
2022-05-11T08:29:00+02:00|reframe 3.10.0-dev.3|NcclPerfTest_sendrecv on cscs-daint:daint-icc21-impi21-ib-umod-gpu using nccl-test|jobid=38343080|time_out_512=10.57|us|ref=0 (l=null, u=null)|sendrecv,git=None,comm_type=sendrecv,num_nodes=1,min_msg_size=8,num_gpus=1,max_msg_size=128M
2022-05-11T08:29:00+02:00|reframe 3.10.0-dev.3|NcclPerfTest_sendrecv on cscs-daint:daint-icc21-impi21-ib-umod-gpu using nccl-test|jobid=38343080|time_out_1024=10.54|us|ref=0 (l=null, u=null)|sendrecv,git=None,comm_type=sendrecv,num_nodes=1,min_msg_size=8,num_gpus=1,max_msg_size=128M
2022-05-11T08:29:00+02:00|reframe 3.10.0-dev.3|NcclPerfTest_sendrecv on cscs-daint:daint-icc21-impi21-ib-umod-gpu using nccl-test|jobid=38343080|time_out_2048=10.52|us|ref=0 (l=null, u=null)|sendrecv,git=None,comm_type=sendrecv,num_nodes=1,min_msg_size=8,num_gpus=1,max_msg_size=128M
2022-05-11T08:29:00+02:00|reframe 3.10.0-dev.3|NcclPerfTest_sendrecv on cscs-daint:daint-icc21-impi21-ib-umod-gpu using nccl-test|jobid=38343080|time_out_4096=10.55|us|ref=0 (l=null, u=null)|sendrecv,git=None,comm_type=sendrecv,num_nodes=1,min_msg_size=8,num_gpus=1,max_msg_size=128M
2022-05-11T08:29:00+02:00|reframe 3.10.0-dev.3|NcclPerfTest_sendrecv on cscs-daint:daint-icc21-impi21-ib-umod-gpu using nccl-test|jobid=38343080|time_out_8192=10.83|us|ref=0 (l=null, u=null)|sendrecv,git=None,comm_type=sendrecv,num_nodes=1,min_msg_size=8,num_gpus=1,max_msg_size=128M
2022-05-11T08:29:00+02:00|reframe 3.10.0-dev.3|NcclPerfTest_sendrecv on cscs-daint:daint-icc21-impi21-ib-umod-gpu using nccl-test|jobid=38343080|time_out_16384=10.5|us|ref=0 (l=null, u=null)|sendrecv,git=None,comm_type=sendrecv,num_nodes=1,min_msg_size=8,num_gpus=1,max_msg_size=128M
2022-05-11T08:29:00+02:00|reframe 3.10.0-dev.3|NcclPerfTest_sendrecv on cscs-daint:daint-icc21-impi21-ib-umod-gpu using nccl-test|jobid=38343080|time_out_32768=10.52|us|ref=0 (l=null, u=null)|sendrecv,git=None,comm_type=sendrecv,num_nodes=1,min_msg_size=8,num_gpus=1,max_msg_size=128M
2022-05-11T08:29:00+02:00|reframe 3.10.0-dev.3|NcclPerfTest_sendrecv on cscs-daint:daint-icc21-impi21-ib-umod-gpu using nccl-test|jobid=38343080|time_out_65536=10.57|us|ref=0 (l=null, u=null)|sendrecv,git=None,comm_type=sendrecv,num_nodes=1,min_msg_size=8,num_gpus=1,max_msg_size=128M
2022-05-11T08:29:00+02:00|reframe 3.10.0-dev.3|NcclPerfTest_sendrecv on cscs-daint:daint-icc21-impi21-ib-umod-gpu using nccl-test|jobid=38343080|time_out_131072=10.53|us|ref=0 (l=null, u=null)|sendrecv,git=None,comm_type=sendrecv,num_nodes=1,min_msg_size=8,num_gpus=1,max_msg_size=128M
2022-05-11T08:29:00+02:00|reframe 3.10.0-dev.3|NcclPerfTest_sendrecv on cscs-daint:daint-icc21-impi21-ib-umod-gpu using nccl-test|jobid=38343080|time_out_262144=10.53|us|ref=0 (l=null, u=null)|sendrecv,git=None,comm_type=sendrecv,num_nodes=1,min_msg_size=8,num_gpus=1,max_msg_size=128M
2022-05-11T08:29:00+02:00|reframe 3.10.0-dev.3|NcclPerfTest_sendrecv on cscs-daint:daint-icc21-impi21-ib-umod-gpu using nccl-test|jobid=38343080|time_out_524288=11.02|us|ref=0 (l=null, u=null)|sendrecv,git=None,comm_type=sendrecv,num_nodes=1,min_msg_size=8,num_gpus=1,max_msg_size=128M
2022-05-11T08:29:00+02:00|reframe 3.10.0-dev.3|NcclPerfTest_sendrecv on cscs-daint:daint-icc21-impi21-ib-umod-gpu using nccl-test|jobid=38343080|time_out_1048576=18.43|us|ref=0 (l=null, u=null)|sendrecv,git=None,comm_type=sendrecv,num_nodes=1,min_msg_size=8,num_gpus=1,max_msg_size=128M
2022-05-11T08:29:00+02:00|reframe 3.10.0-dev.3|NcclPerfTest_sendrecv on cscs-daint:daint-icc21-impi21-ib-umod-gpu using nccl-test|jobid=38343080|time_out_2097152=23.34|us|ref=0 (l=null, u=null)|sendrecv,git=None,comm_type=sendrecv,num_nodes=1,min_msg_size=8,num_gpus=1,max_msg_size=128M
2022-05-11T08:29:00+02:00|reframe 3.10.0-dev.3|NcclPerfTest_sendrecv on cscs-daint:daint-icc21-impi21-ib-umod-gpu using nccl-test|jobid=38343080|time_out_4194304=26.83|us|ref=0 (l=null, u=null)|sendrecv,git=None,comm_type=sendrecv,num_nodes=1,min_msg_size=8,num_gpus=1,max_msg_size=128M
2022-05-11T08:29:00+02:00|reframe 3.10.0-dev.3|NcclPerfTest_sendrecv on cscs-daint:daint-icc21-impi21-ib-umod-gpu using nccl-test|jobid=38343080|time_out_8388608=28.07|us|ref=0 (l=null, u=null)|sendrecv,git=None,comm_type=sendrecv,num_nodes=1,min_msg_size=8,num_gpus=1,max_msg_size=128M
2022-05-11T08:29:00+02:00|reframe 3.10.0-dev.3|NcclPerfTest_sendrecv on cscs-daint:daint-icc21-impi21-ib-umod-gpu using nccl-test|jobid=38343080|time_out_16777216=28.41|us|ref=0 (l=null, u=null)|sendrecv,git=None,comm_type=sendrecv,num_nodes=1,min_msg_size=8,num_gpus=1,max_msg_size=128M
2022-05-11T08:29:00+02:00|reframe 3.10.0-dev.3|NcclPerfTest_sendrecv on cscs-daint:daint-icc21-impi21-ib-umod-gpu using nccl-test|jobid=38343080|time_out_33554432=28.38|us|ref=0 (l=null, u=null)|sendrecv,git=None,comm_type=sendrecv,num_nodes=1,min_msg_size=8,num_gpus=1,max_msg_size=128M
2022-05-11T08:29:00+02:00|reframe 3.10.0-dev.3|NcclPerfTest_sendrecv on cscs-daint:daint-icc21-impi21-ib-umod-gpu using nccl-test|jobid=38343080|time_out_67108864=28.54|us|ref=0 (l=null, u=null)|sendrecv,git=None,comm_type=sendrecv,num_nodes=1,min_msg_size=8,num_gpus=1,max_msg_size=128M
2022-05-11T08:29:00+02:00|reframe 3.10.0-dev.3|NcclPerfTest_sendrecv on cscs-daint:daint-icc21-impi21-ib-umod-gpu using nccl-test|jobid=38343080|time_out_134217728=28.44|us|ref=0 (l=null, u=null)|sendrecv,git=None,comm_type=sendrecv,num_nodes=1,min_msg_size=8,num_gpus=1,max_msg_size=128M
