2022-11-07T14:44:20+01:00|reframe 3.12.0|FunclibDftTest %conf=baselines=64,channels=512 @cscs-daint:daint-gcc9-ompi4-ib-umod-gpu+funclib-test|jobid=42691637|elapsed_time_v00_cpu=0.21988|s|ref=0 (l=null, u=null)|git_src=None,pols=1,step=100000,start=100000000,baselines=64,times=10,version=2,num_components=20,device=2,channels=512,num_cores=24,git=None,unique_key=b49c44bc-a1a4-43b6-84f3-ed021e81546e
2022-11-07T14:44:20+01:00|reframe 3.12.0|FunclibDftTest %conf=baselines=64,channels=512 @cscs-daint:daint-gcc9-ompi4-ib-umod-gpu+funclib-test|jobid=42691637|elapsed_time_v00_gpu=0.0019|s|ref=0 (l=null, u=null)|git_src=None,pols=1,step=100000,start=100000000,baselines=64,times=10,version=2,num_components=20,device=2,channels=512,num_cores=24,git=None,unique_key=b49c44bc-a1a4-43b6-84f3-ed021e81546e
2022-11-07T14:44:20+01:00|reframe 3.12.0|FunclibDftTest %conf=baselines=64,channels=512 @cscs-daint:daint-gcc9-ompi4-ib-umod-gpu+funclib-test|jobid=42691637|elapsed_time_v01_cpu=0.01904|s|ref=0 (l=null, u=null)|git_src=None,pols=1,step=100000,start=100000000,baselines=64,times=10,version=2,num_components=20,device=2,channels=512,num_cores=24,git=None,unique_key=b49c44bc-a1a4-43b6-84f3-ed021e81546e
2022-11-07T14:44:20+01:00|reframe 3.12.0|FunclibDftTest %conf=baselines=64,channels=512 @cscs-daint:daint-gcc9-ompi4-ib-umod-gpu+funclib-test|jobid=42691637|elapsed_time_v01_gpu=0.00017|s|ref=0 (l=null, u=null)|git_src=None,pols=1,step=100000,start=100000000,baselines=64,times=10,version=2,num_components=20,device=2,channels=512,num_cores=24,git=None,unique_key=b49c44bc-a1a4-43b6-84f3-ed021e81546e
2022-11-07T14:55:10+01:00|reframe 3.12.0|FunclibDftTest %conf=baselines=64,channels=512 @cscs-daint:daint-gcc9-ompi4-ib-umod-gpu+funclib-test|jobid=42692043|elapsed_time_v00_cpu=0.28124|s|ref=0 (l=null, u=null)|times=10,pols=1,step=100000,unique_key=8f75847e-d7fe-4011-852d-d0fc75a1b9b5,version=2,start=100000000,git=None,baselines=64,channels=512,device=2,num_cores=24,num_components=20,git_src=None
2022-11-07T14:55:10+01:00|reframe 3.12.0|FunclibDftTest %conf=baselines=64,channels=512 @cscs-daint:daint-gcc9-ompi4-ib-umod-gpu+funclib-test|jobid=42692043|elapsed_time_v00_gpu=0.00195|s|ref=0 (l=null, u=null)|times=10,pols=1,step=100000,unique_key=8f75847e-d7fe-4011-852d-d0fc75a1b9b5,version=2,start=100000000,git=None,baselines=64,channels=512,device=2,num_cores=24,num_components=20,git_src=None
2022-11-07T14:55:10+01:00|reframe 3.12.0|FunclibDftTest %conf=baselines=64,channels=512 @cscs-daint:daint-gcc9-ompi4-ib-umod-gpu+funclib-test|jobid=42692043|elapsed_time_v01_cpu=0.03078|s|ref=0 (l=null, u=null)|times=10,pols=1,step=100000,unique_key=8f75847e-d7fe-4011-852d-d0fc75a1b9b5,version=2,start=100000000,git=None,baselines=64,channels=512,device=2,num_cores=24,num_components=20,git_src=None
2022-11-07T14:55:10+01:00|reframe 3.12.0|FunclibDftTest %conf=baselines=64,channels=512 @cscs-daint:daint-gcc9-ompi4-ib-umod-gpu+funclib-test|jobid=42692043|elapsed_time_v01_gpu=0.00016|s|ref=0 (l=null, u=null)|times=10,pols=1,step=100000,unique_key=8f75847e-d7fe-4011-852d-d0fc75a1b9b5,version=2,start=100000000,git=None,baselines=64,channels=512,device=2,num_cores=24,num_components=20,git_src=None
2022-11-07T15:05:00+01:00|reframe 3.12.0|FunclibDftTest %conf=baselines=64,channels=512 @cscs-daint:daint-gcc9-ompi4-ib-umod-gpu+funclib-test|jobid=42692520|elapsed_time_v00_cpu=0.23755|s|ref=0 (l=null, u=null)|channels=512,times=10,step=100000,git_src=None,unique_key=845e18b4-ea2a-4350-b8b1-e5beea0cd779,start=100000000,version=2,num_components=20,baselines=64,pols=1,num_cores=24,git=None,device=2
2022-11-07T15:05:00+01:00|reframe 3.12.0|FunclibDftTest %conf=baselines=64,channels=512 @cscs-daint:daint-gcc9-ompi4-ib-umod-gpu+funclib-test|jobid=42692520|elapsed_time_v00_gpu=0.00184|s|ref=0 (l=null, u=null)|channels=512,times=10,step=100000,git_src=None,unique_key=845e18b4-ea2a-4350-b8b1-e5beea0cd779,start=100000000,version=2,num_components=20,baselines=64,pols=1,num_cores=24,git=None,device=2
2022-11-07T15:05:00+01:00|reframe 3.12.0|FunclibDftTest %conf=baselines=64,channels=512 @cscs-daint:daint-gcc9-ompi4-ib-umod-gpu+funclib-test|jobid=42692520|elapsed_time_v01_cpu=0.01748|s|ref=0 (l=null, u=null)|channels=512,times=10,step=100000,git_src=None,unique_key=845e18b4-ea2a-4350-b8b1-e5beea0cd779,start=100000000,version=2,num_components=20,baselines=64,pols=1,num_cores=24,git=None,device=2
2022-11-07T15:05:00+01:00|reframe 3.12.0|FunclibDftTest %conf=baselines=64,channels=512 @cscs-daint:daint-gcc9-ompi4-ib-umod-gpu+funclib-test|jobid=42692520|elapsed_time_v01_gpu=0.00016|s|ref=0 (l=null, u=null)|channels=512,times=10,step=100000,git_src=None,unique_key=845e18b4-ea2a-4350-b8b1-e5beea0cd779,start=100000000,version=2,num_components=20,baselines=64,pols=1,num_cores=24,git=None,device=2
2022-11-07T16:01:04+01:00|reframe 3.12.0|FunclibDftTest %conf=baselines=64,channels=512 @cscs-daint:daint-gcc9-ompi4-ib-umod-gpu+funclib-test|jobid=42694615|elapsed_time_v00_cpu=0.14373|s|ref=0 (l=null, u=null)|times=10,baselines=64,start=100000000,git=None,pols=1,step=100000,num_components=20,device=2,channels=512,git_src=None,unique_key=84c41e83-07d6-4365-9a4c-47a25f569622,version=2,num_cores=24
2022-11-07T16:01:04+01:00|reframe 3.12.0|FunclibDftTest %conf=baselines=64,channels=512 @cscs-daint:daint-gcc9-ompi4-ib-umod-gpu+funclib-test|jobid=42694615|elapsed_time_v00_gpu=0.00207|s|ref=0 (l=null, u=null)|times=10,baselines=64,start=100000000,git=None,pols=1,step=100000,num_components=20,device=2,channels=512,git_src=None,unique_key=84c41e83-07d6-4365-9a4c-47a25f569622,version=2,num_cores=24
2022-11-07T16:01:04+01:00|reframe 3.12.0|FunclibDftTest %conf=baselines=64,channels=512 @cscs-daint:daint-gcc9-ompi4-ib-umod-gpu+funclib-test|jobid=42694615|elapsed_time_v01_cpu=0.02413|s|ref=0 (l=null, u=null)|times=10,baselines=64,start=100000000,git=None,pols=1,step=100000,num_components=20,device=2,channels=512,git_src=None,unique_key=84c41e83-07d6-4365-9a4c-47a25f569622,version=2,num_cores=24
2022-11-07T16:01:04+01:00|reframe 3.12.0|FunclibDftTest %conf=baselines=64,channels=512 @cscs-daint:daint-gcc9-ompi4-ib-umod-gpu+funclib-test|jobid=42694615|elapsed_time_v01_gpu=0.00016|s|ref=0 (l=null, u=null)|times=10,baselines=64,start=100000000,git=None,pols=1,step=100000,num_components=20,device=2,channels=512,git_src=None,unique_key=84c41e83-07d6-4365-9a4c-47a25f569622,version=2,num_cores=24
2022-11-08T13:34:30+01:00|reframe 3.12.0|FunclibDftTest %conf=baselines=64,channels=512 @cscs-daint:daint-gcc9-ompi4-ib-umod-gpu+funclib-test|jobid=42722007|elapsed_time_v00_cpu=0.15481|s|ref=0 (l=null, u=null)|step=100000,channels=512,num_components=20,baselines=64,unique_key=352cdc3b-0cdd-4ccf-ba61-01213234bab4,pols=1,device=2,git_src=None,start=100000000,num_cores=24,times=10,git=None,version=2
2022-11-08T13:34:30+01:00|reframe 3.12.0|FunclibDftTest %conf=baselines=64,channels=512 @cscs-daint:daint-gcc9-ompi4-ib-umod-gpu+funclib-test|jobid=42722007|elapsed_time_v00_gpu=0.00189|s|ref=0 (l=null, u=null)|step=100000,channels=512,num_components=20,baselines=64,unique_key=352cdc3b-0cdd-4ccf-ba61-01213234bab4,pols=1,device=2,git_src=None,start=100000000,num_cores=24,times=10,git=None,version=2
2022-11-08T13:34:30+01:00|reframe 3.12.0|FunclibDftTest %conf=baselines=64,channels=512 @cscs-daint:daint-gcc9-ompi4-ib-umod-gpu+funclib-test|jobid=42722007|elapsed_time_v01_cpu=0.01789|s|ref=0 (l=null, u=null)|step=100000,channels=512,num_components=20,baselines=64,unique_key=352cdc3b-0cdd-4ccf-ba61-01213234bab4,pols=1,device=2,git_src=None,start=100000000,num_cores=24,times=10,git=None,version=2
2022-11-08T13:34:30+01:00|reframe 3.12.0|FunclibDftTest %conf=baselines=64,channels=512 @cscs-daint:daint-gcc9-ompi4-ib-umod-gpu+funclib-test|jobid=42722007|elapsed_time_v01_gpu=0.00016|s|ref=0 (l=null, u=null)|step=100000,channels=512,num_components=20,baselines=64,unique_key=352cdc3b-0cdd-4ccf-ba61-01213234bab4,pols=1,device=2,git_src=None,start=100000000,num_cores=24,times=10,git=None,version=2
2022-11-08T15:10:58+01:00|reframe 3.12.0|FunclibDftTest %conf=baselines=64,channels=512 @cscs-daint:daint-gcc9-ompi4-ib-umod-gpu+funclib-test|jobid=42722781|elapsed_time_v00_cpu=0.13044|s|ref=0 (l=null, u=null)|pols=1,num_cores=24,start=100000000,channels=512,version=2,step=100000,git=None,device=2,num_components=20,git_src=None,baselines=64,unique_key=2c372309-9ee7-45ef-9f8e-81226dd405f4,times=10
2022-11-08T15:10:58+01:00|reframe 3.12.0|FunclibDftTest %conf=baselines=64,channels=512 @cscs-daint:daint-gcc9-ompi4-ib-umod-gpu+funclib-test|jobid=42722781|elapsed_time_v00_gpu=0.00197|s|ref=0 (l=null, u=null)|pols=1,num_cores=24,start=100000000,channels=512,version=2,step=100000,git=None,device=2,num_components=20,git_src=None,baselines=64,unique_key=2c372309-9ee7-45ef-9f8e-81226dd405f4,times=10
2022-11-08T15:10:58+01:00|reframe 3.12.0|FunclibDftTest %conf=baselines=64,channels=512 @cscs-daint:daint-gcc9-ompi4-ib-umod-gpu+funclib-test|jobid=42722781|elapsed_time_v01_cpu=0.01503|s|ref=0 (l=null, u=null)|pols=1,num_cores=24,start=100000000,channels=512,version=2,step=100000,git=None,device=2,num_components=20,git_src=None,baselines=64,unique_key=2c372309-9ee7-45ef-9f8e-81226dd405f4,times=10
2022-11-08T15:10:58+01:00|reframe 3.12.0|FunclibDftTest %conf=baselines=64,channels=512 @cscs-daint:daint-gcc9-ompi4-ib-umod-gpu+funclib-test|jobid=42722781|elapsed_time_v01_gpu=0.00016|s|ref=0 (l=null, u=null)|pols=1,num_cores=24,start=100000000,channels=512,version=2,step=100000,git=None,device=2,num_components=20,git_src=None,baselines=64,unique_key=2c372309-9ee7-45ef-9f8e-81226dd405f4,times=10
2022-11-08T15:28:32+01:00|reframe 3.12.0|FunclibDftTest %conf=baselines=64,channels=512 @cscs-daint:daint-gcc9-ompi4-ib-umod-gpu+funclib-test|jobid=42725540|elapsed_time_v00_cpu=0.14405|s|ref=0 (l=null, u=null)|baselines=64,num_cores=24,pols=1,num_components=20,channels=512,git=None,step=100000,start=100000000,git_src=None,device=2,version=2,times=10,unique_key=f7ba7074-0838-4761-8e77-3dfb801f9a9f
2022-11-08T15:28:32+01:00|reframe 3.12.0|FunclibDftTest %conf=baselines=64,channels=512 @cscs-daint:daint-gcc9-ompi4-ib-umod-gpu+funclib-test|jobid=42725540|elapsed_time_v00_gpu=0.00187|s|ref=0 (l=null, u=null)|baselines=64,num_cores=24,pols=1,num_components=20,channels=512,git=None,step=100000,start=100000000,git_src=None,device=2,version=2,times=10,unique_key=f7ba7074-0838-4761-8e77-3dfb801f9a9f
2022-11-08T15:28:32+01:00|reframe 3.12.0|FunclibDftTest %conf=baselines=64,channels=512 @cscs-daint:daint-gcc9-ompi4-ib-umod-gpu+funclib-test|jobid=42725540|elapsed_time_v01_cpu=0.01655|s|ref=0 (l=null, u=null)|baselines=64,num_cores=24,pols=1,num_components=20,channels=512,git=None,step=100000,start=100000000,git_src=None,device=2,version=2,times=10,unique_key=f7ba7074-0838-4761-8e77-3dfb801f9a9f
2022-11-08T15:28:32+01:00|reframe 3.12.0|FunclibDftTest %conf=baselines=64,channels=512 @cscs-daint:daint-gcc9-ompi4-ib-umod-gpu+funclib-test|jobid=42725540|elapsed_time_v01_gpu=0.00017|s|ref=0 (l=null, u=null)|baselines=64,num_cores=24,pols=1,num_components=20,channels=512,git=None,step=100000,start=100000000,git_src=None,device=2,version=2,times=10,unique_key=f7ba7074-0838-4761-8e77-3dfb801f9a9f
2022-11-08T15:52:52+01:00|reframe 3.12.0|FunclibDftTest %conf=baselines=64,channels=512 @cscs-daint:daint-gcc9-ompi4-ib-umod-gpu+funclib-test|jobid=42726115|elapsed_time_v00_cpu=0.23998|s|ref=0 (l=null, u=null)|pols=1,baselines=64,git=None,num_cores=24,git_src=None,unique_key=af8b33f0-afe3-478e-8bb2-4b89b22ca03f,device=2,step=100000,channels=512,version=2,num_components=20,start=100000000,times=10
2022-11-08T15:52:52+01:00|reframe 3.12.0|FunclibDftTest %conf=baselines=64,channels=512 @cscs-daint:daint-gcc9-ompi4-ib-umod-gpu+funclib-test|jobid=42726115|elapsed_time_v00_gpu=0.00193|s|ref=0 (l=null, u=null)|pols=1,baselines=64,git=None,num_cores=24,git_src=None,unique_key=af8b33f0-afe3-478e-8bb2-4b89b22ca03f,device=2,step=100000,channels=512,version=2,num_components=20,start=100000000,times=10
2022-11-08T15:52:52+01:00|reframe 3.12.0|FunclibDftTest %conf=baselines=64,channels=512 @cscs-daint:daint-gcc9-ompi4-ib-umod-gpu+funclib-test|jobid=42726115|elapsed_time_v01_cpu=0.01767|s|ref=0 (l=null, u=null)|pols=1,baselines=64,git=None,num_cores=24,git_src=None,unique_key=af8b33f0-afe3-478e-8bb2-4b89b22ca03f,device=2,step=100000,channels=512,version=2,num_components=20,start=100000000,times=10
2022-11-08T15:52:52+01:00|reframe 3.12.0|FunclibDftTest %conf=baselines=64,channels=512 @cscs-daint:daint-gcc9-ompi4-ib-umod-gpu+funclib-test|jobid=42726115|elapsed_time_v01_gpu=0.00016|s|ref=0 (l=null, u=null)|pols=1,baselines=64,git=None,num_cores=24,git_src=None,unique_key=af8b33f0-afe3-478e-8bb2-4b89b22ca03f,device=2,step=100000,channels=512,version=2,num_components=20,start=100000000,times=10
2022-11-08T16:26:35+01:00|reframe 3.12.0|FunclibDftTest %conf=baselines=64,channels=512 @cscs-daint:daint-gcc9-ompi4-ib-umod-gpu+funclib-test|jobid=42727779|elapsed_time_v00_cpu=0.09308|s|ref=0 (l=null, u=null)|start=100000000,channels=512,times=10,step=100000,num_components=20,pols=1,git_src=None,version=2,unique_key=3b4aaebd-d596-4511-aac8-3fb6e68c6156,baselines=64,git=None,device=2,num_cores=24
2022-11-08T16:26:35+01:00|reframe 3.12.0|FunclibDftTest %conf=baselines=64,channels=512 @cscs-daint:daint-gcc9-ompi4-ib-umod-gpu+funclib-test|jobid=42727779|elapsed_time_v00_gpu=0.00186|s|ref=0 (l=null, u=null)|start=100000000,channels=512,times=10,step=100000,num_components=20,pols=1,git_src=None,version=2,unique_key=3b4aaebd-d596-4511-aac8-3fb6e68c6156,baselines=64,git=None,device=2,num_cores=24
2022-11-08T16:26:35+01:00|reframe 3.12.0|FunclibDftTest %conf=baselines=64,channels=512 @cscs-daint:daint-gcc9-ompi4-ib-umod-gpu+funclib-test|jobid=42727779|elapsed_time_v01_cpu=0.01487|s|ref=0 (l=null, u=null)|start=100000000,channels=512,times=10,step=100000,num_components=20,pols=1,git_src=None,version=2,unique_key=3b4aaebd-d596-4511-aac8-3fb6e68c6156,baselines=64,git=None,device=2,num_cores=24
2022-11-08T16:26:35+01:00|reframe 3.12.0|FunclibDftTest %conf=baselines=64,channels=512 @cscs-daint:daint-gcc9-ompi4-ib-umod-gpu+funclib-test|jobid=42727779|elapsed_time_v01_gpu=0.00016|s|ref=0 (l=null, u=null)|start=100000000,channels=512,times=10,step=100000,num_components=20,pols=1,git_src=None,version=2,unique_key=3b4aaebd-d596-4511-aac8-3fb6e68c6156,baselines=64,git=None,device=2,num_cores=24
2022-11-08T16:59:30+01:00|reframe 3.12.0|FunclibDftTest %conf=baselines=64,channels=512 @cscs-daint:daint-gcc9-ompi4-ib-umod-gpu+funclib-test|jobid=42728123|elapsed_time_v00_cpu=0.1682|s|ref=0 (l=null, u=null)|version=2,num_cores=24,git=None,step=100000,times=10,pols=1,num_components=20,device=2,baselines=64,channels=512,git_src=None,unique_key=7c36cf33-3484-45b4-bbb3-08626cbdcd38,start=100000000
2022-11-08T16:59:30+01:00|reframe 3.12.0|FunclibDftTest %conf=baselines=64,channels=512 @cscs-daint:daint-gcc9-ompi4-ib-umod-gpu+funclib-test|jobid=42728123|elapsed_time_v00_gpu=0.00197|s|ref=0 (l=null, u=null)|version=2,num_cores=24,git=None,step=100000,times=10,pols=1,num_components=20,device=2,baselines=64,channels=512,git_src=None,unique_key=7c36cf33-3484-45b4-bbb3-08626cbdcd38,start=100000000
2022-11-08T16:59:30+01:00|reframe 3.12.0|FunclibDftTest %conf=baselines=64,channels=512 @cscs-daint:daint-gcc9-ompi4-ib-umod-gpu+funclib-test|jobid=42728123|elapsed_time_v01_cpu=0.01462|s|ref=0 (l=null, u=null)|version=2,num_cores=24,git=None,step=100000,times=10,pols=1,num_components=20,device=2,baselines=64,channels=512,git_src=None,unique_key=7c36cf33-3484-45b4-bbb3-08626cbdcd38,start=100000000
2022-11-08T16:59:30+01:00|reframe 3.12.0|FunclibDftTest %conf=baselines=64,channels=512 @cscs-daint:daint-gcc9-ompi4-ib-umod-gpu+funclib-test|jobid=42728123|elapsed_time_v01_gpu=0.00016|s|ref=0 (l=null, u=null)|version=2,num_cores=24,git=None,step=100000,times=10,pols=1,num_components=20,device=2,baselines=64,channels=512,git_src=None,unique_key=7c36cf33-3484-45b4-bbb3-08626cbdcd38,start=100000000
