{
  "arch": "broadwell",
  "topology": {
    "numa_nodes": [
      "0x00000fffff00000fffff",
      "0xfffff00000fffff00000"
    ],
    "sockets": [
      "0x00000fffff00000fffff",
      "0xfffff00000fffff00000"
    ],
    "cores": [
      "0x00000000010000000001",
      "0x00000000020000000002",
      "0x00000000040000000004",
      "0x00000000080000000008",
      "0x00000000100000000010",
      "0x00000000200000000020",
      "0x00000000400000000040",
      "0x00000000800000000080",
      "0x00000001000000000100",
      "0x00000002000000000200",
      "0x00000004000000000400",
      "0x00000008000000000800",
      "0x00000010000000001000",
      "0x00000020000000002000",
      "0x00000040000000004000",
      "0x00000080000000008000",
      "0x00000100000000010000",
      "0x00000200000000020000",
      "0x00000400000000040000",
      "0x00000800000000080000",
      "0x00001000000000100000",
      "0x00002000000000200000",
      "0x00004000000000400000",
      "0x00008000000000800000",
      "0x00010000000001000000",
      "0x00020000000002000000",
      "0x00040000000004000000",
      "0x00080000000008000000",
      "0x00100000000010000000",
      "0x00200000000020000000",
      "0x00400000000040000000",
      "0x00800000000080000000",
      "0x01000000000100000000",
      "0x02000000000200000000",
      "0x04000000000400000000",
      "0x08000000000800000000",
      "0x10000000001000000000",
      "0x20000000002000000000",
      "0x40000000004000000000",
      "0x80000000008000000000"
    ],
    "caches": [
      {
        "type": "L2",
        "size": 262144,
        "linesize": 64,
        "associativity": 8,
        "num_cpus": 2,
        "cpusets": [
          "0x00000000010000000001",
          "0x00000000020000000002",
          "0x00000000040000000004",
          "0x00000000080000000008",
          "0x00000000100000000010",
          "0x00000000200000000020",
          "0x00000000400000000040",
          "0x00000000800000000080",
          "0x00000001000000000100",
          "0x00000002000000000200",
          "0x00000004000000000400",
          "0x00000008000000000800",
          "0x00000010000000001000",
          "0x00000020000000002000",
          "0x00000040000000004000",
          "0x00000080000000008000",
          "0x00000100000000010000",
          "0x00000200000000020000",
          "0x00000400000000040000",
          "0x00000800000000080000",
          "0x00001000000000100000",
          "0x00002000000000200000",
          "0x00004000000000400000",
          "0x00008000000000800000",
          "0x00010000000001000000",
          "0x00020000000002000000",
          "0x00040000000004000000",
          "0x00080000000008000000",
          "0x00100000000010000000",
          "0x00200000000020000000",
          "0x00400000000040000000",
          "0x00800000000080000000",
          "0x01000000000100000000",
          "0x02000000000200000000",
          "0x04000000000400000000",
          "0x08000000000800000000",
          "0x10000000001000000000",
          "0x20000000002000000000",
          "0x40000000004000000000",
          "0x80000000008000000000"
        ]
      },
      {
        "type": "L1",
        "size": 32768,
        "linesize": 64,
        "associativity": 8,
        "num_cpus": 2,
        "cpusets": [
          "0x00000000010000000001",
          "0x00000000020000000002",
          "0x00000000040000000004",
          "0x00000000080000000008",
          "0x00000000100000000010",
          "0x00000000200000000020",
          "0x00000000400000000040",
          "0x00000000800000000080",
          "0x00000001000000000100",
          "0x00000002000000000200",
          "0x00000004000000000400",
          "0x00000008000000000800",
          "0x00000010000000001000",
          "0x00000020000000002000",
          "0x00000040000000004000",
          "0x00000080000000008000",
          "0x00000100000000010000",
          "0x00000200000000020000",
          "0x00000400000000040000",
          "0x00000800000000080000",
          "0x00001000000000100000",
          "0x00002000000000200000",
          "0x00004000000000400000",
          "0x00008000000000800000",
          "0x00010000000001000000",
          "0x00020000000002000000",
          "0x00040000000004000000",
          "0x00080000000008000000",
          "0x00100000000010000000",
          "0x00200000000020000000",
          "0x00400000000040000000",
          "0x00800000000080000000",
          "0x01000000000100000000",
          "0x02000000000200000000",
          "0x04000000000400000000",
          "0x08000000000800000000",
          "0x10000000001000000000",
          "0x20000000002000000000",
          "0x40000000004000000000",
          "0x80000000008000000000"
        ]
      },
      {
        "type": "L3",
        "size": 52428800,
        "linesize": 64,
        "associativity": 20,
        "num_cpus": 40,
        "cpusets": [
          "0x00000fffff00000fffff",
          "0xfffff00000fffff00000"
        ]
      }
    ]
  },
  "num_cpus": 80,
  "num_cpus_per_core": 2,
  "num_cpus_per_socket": 40,
  "num_sockets": 2
}
