{ "height":20,
 "layers":[
        {
         "data":[87, 87, 87, 87, 87, 87, 87, 87, 87, 87, 87, 87, 87, 87, 87, 87, 87, 87, 87, 87, 87, 0, 0, 0, 0, 0, 87, 0, 0, 0, 0, 0, 0, 87, 0, 0, 0, 0, 0, 87, 87, 0, 87, 87, 87, 0, 87, 0, 0, 0, 0, 0, 0, 87, 0, 87, 87, 87, 0, 87, 87, 0, 87, 87, 87, 0, 87, 0, 87, 0, 0, 87, 0, 87, 0, 87, 87, 87, 0, 87, 87, 0, 87, 87, 87, 0, 0, 0, 87, 0, 0, 87, 0, 0, 0, 87, 87, 87, 0, 87, 87, 0, 87, 87, 87, 0, 87, 87, 87, 87, 87, 87, 87, 87, 0, 87, 87, 87, 0, 87, 87, 0, 0, 0, 0, 0, 0, 0, 87, 0, 0, 87, 0, 0, 0, 0, 0, 0, 0, 87, 87, 0, 87, 87, 87, 87, 87, 0, 87, 0, 0, 87, 0, 87, 87, 87, 87, 87, 0, 87, 87, 0, 87, 0, 0, 0, 0, 0, 0, 0, 0, 0, 0, 0, 0, 0, 0, 87, 0, 87, 87, 0, 87, 0, 87, 87, 87, 0, 87, 31, 87, 87, 0, 87, 87, 87, 0, 87, 0, 87, 87, 0, 87, 0, 87, 87, 87, 0, 87, 31, 31, 87, 0, 87, 87, 87, 0, 87, 0, 87, 87, 0, 87, 0, 0, 0, 0, 0, 87, 87, 87, 87, 0, 0, 0, 0, 0, 87, 0, 87, 87, 0, 87, 87, 87, 87, 87, 0, 0, 0, 0, 0, 0, 87, 87, 87, 87, 87, 0, 87, 87, 0, 0, 0, 0, 0, 0, 0, 87, 0, 0, 87, 0, 0, 0, 0, 0, 0, 0, 87, 87, 0, 87, 87, 87, 0, 87, 87, 87, 87, 87, 87, 87, 87, 0, 87, 87, 87, 0, 87, 87, 0, 87, 87, 87, 0, 0, 0, 87, 0, 0, 87, 0, 0, 0, 87, 87, 87, 0, 87, 87, 0, 87, 87, 87, 0, 87, 0, 87, 0, 0, 87, 0, 87, 0, 87, 87, 87, 0, 87, 87, 0, 87, 87, 87, 0, 87, 0, 87, 0, 0, 87, 0, 87, 0, 87, 87, 87, 0, 87, 87, 41, 0, 0, 0, 0, 87, 0, 0, 0, 0, 0, 0, 87, 0, 0, 0, 0, 0, 87, 87, 87, 87, 87, 87, 87, 87, 87, 87, 87, 87, 87, 87, 87, 87, 87, 87, 87, 87, 87],
         "height":20,
         "name":"Kachelebene 1",
         "opacity":1,
         "type":"tilelayer",
         "visible":true,
         "width":20,
         "x":0,
         "y":0
        }],
 "orientation":"orthogonal",
 "properties":
    {

    },
 "tileheight":32,
 "tilesets":[
        {
         "firstgid":1,
         "image":"ChomperMazeTiles.png",
         "imageheight":96,
         "imagewidth":320,
         "margin":0,
         "name":"ChomperMazeTiles",
         "properties":
            {

            },
         "spacing":0,
         "tileheight":32,
         "tileproperties":
            {
             "0":
                {
                 "components":"Wall"
                },
             "1":
                {
                 "components":"Wall"
                },
             "10":
                {
                 "components":"Wall"
                },
             "11":
                {
                 "components":"Wall"
                },
             "12":
                {
                 "components":"Wall"
                },
             "13":
                {
                 "components":"Wall"
                },
             "14":
                {
                 "components":"Wall"
                },
             "15":
                {
                 "components":"Wall"
                },
             "16":
                {
                 "components":"Wall"
                },
             "17":
                {
                 "components":"Wall"
                },
             "18":
                {
                 "components":"Wall"
                },
             "19":
                {
                 "components":"Wall"
                },
             "2":
                {
                 "components":"Wall"
                },
             "20":
                {
                 "components":"Wall"
                },
             "21":
                {
                 "components":"Wall"
                },
             "22":
                {
                 "components":"Wall"
                },
             "23":
                {
                 "components":"Wall"
                },
             "24":
                {
                 "components":"Wall"
                },
             "25":
                {
                 "components":"Wall"
                },
             "26":
                {
                 "components":"Wall"
                },
             "3":
                {
                 "components":"Wall"
                },
             "4":
                {
                 "components":"Wall"
                },
             "5":
                {
                 "components":"Wall"
                },
             "6":
                {
                 "components":"Wall"
                },
             "7":
                {
                 "components":"Wall"
                },
             "8":
                {
                 "components":"Wall"
                },
             "9":
                {
                 "components":"Wall"
                }
            },
         "tilewidth":32
        }, 
        {
         "firstgid":31,
         "image":"ChomperSprites.png",
         "imageheight":128,
         "imagewidth":448,
         "margin":0,
         "name":"ChomperSprites",
         "properties":
            {

            },
         "spacing":0,
         "tileheight":32,
         "tileproperties":
            {
             "0":
                {
                 "components":"Enemy"
                },
             "10":
                {
                 "components":"Player"
                }
            },
         "tilewidth":32
        }, 
        {
         "firstgid":87,
         "image":"crate.png",
         "imageheight":32,
         "imagewidth":32,
         "margin":0,
         "name":"crate",
         "properties":
            {

            },
         "spacing":0,
         "tileheight":32,
         "tileproperties":
            {
             "0":
                {
                 "components":"Wall"
                }
            },
         "tilewidth":32
        }],
 "tilewidth":32,
 "version":1,
 "width":20
}