
{
	"Solve Equation":true, 
	"Save Solution":false, 

	"Save Electric fields":false, 
	"Save Total fields":true, 

	"Output directory": "opt_bkg", 
	"Input  directory": "", 

	"Computational Parameters":
	{
		"N" : 100000,
		"N_RC" : 100000,
		"Use optimal conductivity" : true,
		"Use only lateral components": false,


		"Ngauss_IE_phi"   : 8,
		"Ngauss_IE_theta" : 8,

		"Ngauss_RC_phi"   : 32,
		"Ngauss_RC_theta" : 32,

		"Step pow": 16,
		"Q accuracy": 1e-4
	},

	"Model Radius":6371200,

	"Anomaly":{
		"Globe": true,   
		"Nphi"      : 360,
		"Ntheta"    : 180,
		"rdepths": [0,   1000],
		"Conductivity": "WE_hemisphere_1x1.h5" 
	}
	,
	"Receivers":{
		"Depths": [0]
	},

	"Sources":[
		{ "Period":86400,
			"Source Type" : "SHS",
			"Source Data" : "shs_1_0.shs",
			"Output suffix": "WE_24_h"
		}
	],

	"FGMRES":{
		"OuterBufferSize": 100,
		"InnerBufferSize": 100,
		"MaxRestart":300,
		"Tolerance":1e-7
	},

	"Background": {
		"Conductivity": [
			1e-4,
			0.01,
			0.1,
			2
		],
		"Thickness": [
			 100000,  300000, 250000
		]
	}
}
