{

	"Source Domain":{
		"Globe": true,   
		"Nphi"      : 360,
		"Ntheta"    : 180,
		"Nr"        : 1,
		"dphi"      : 1,
		"Thetas"    : [1],
		"rdepths": [0,    1],
		"Data": "MT_J_theta_pol_3.bin" 
	}
}
