<svg width="24" height="24" viewBox="0 0 24 24" fill="none" xmlns="http://www.w3.org/2000/svg">
<rect width="24" height="24" fill="white" fill-opacity="0.01"/>
<path fill-rule="evenodd" clip-rule="evenodd" d="M21 2H3V15L4.5 13.5V4H19.5V6.5L21 5V2ZM3 18L9 12L14 14L21 7V21H3V18ZM4.5 19H19.5V11L14.5 16L9.5 14L4.5 18.5V19Z" fill="#6879BB"/>
</svg>
