"02.10.2022";"Wilhelmshaven";"JADE";"WANGEROOGE NORD";"9420030";"W_O";"cm";"XXX,XXX";"XX.XX.XXXX";"XX:XX";"PNP";"-5,04"
"00:01";"574"
"00:02";"574"
"00:03";"574"
"00:04";"575"
"00:05";"577"
"00:06";"578"
"00:07";"579"
"00:08";"581"
"00:09";"581"
"00:10";"583"
"00:11";"584"
"00:12";"585"
"00:13";"586"
"00:14";"587"
"00:15";"587"
"00:16";"588"
"00:17";"589"
"00:18";"591"
"00:19";"592"
"00:20";"593"
"00:21";"595"
"00:22";"595"
"00:23";"596"
"00:24";"597"
"00:25";"598"
"00:26";"599"
"00:27";"600"
"00:28";"601"
"00:29";"602"
"00:30";"601"
"00:31";"604"
"00:32";"604"
"00:33";"606"
"00:34";"608"
"00:35";"606"
"00:36";"608"
"00:37";"608"
"00:38";"609"
"00:39";"610"
"00:40";"612"
"00:41";"613"
"00:42";"612"
"00:43";"614"
"00:44";"615"
"00:45";"617"
"00:46";"618"
"00:47";"618"
"00:48";"620"
"00:49";"622"
"00:50";"623"
"00:51";"624"
"00:52";"624"
"00:53";"626"
"00:54";"626"
"00:55";"625"
"00:56";"625"
"00:57";"628"
"00:58";"628"
"00:59";"628"
"01:00";"629"
"01:01";"628"
"01:02";"630"
"01:03";"630"
"01:04";"632"
"01:05";"631"
"01:06";"632"
"01:07";"634"
"01:08";"634"
"01:09";"635"
"01:10";"635"
"01:11";"635"
"01:12";"637"
"01:13";"637"
"01:14";"639"
"01:15";"639"
"01:16";"640"
"01:17";"639"
"01:18";"641"
"01:19";"640"
"01:20";"641"
"01:21";"643"
"01:22";"644"
"01:23";"645"
"01:24";"646"
"01:25";"646"
"01:26";"646"
"01:27";"646"
"01:28";"647"
"01:29";"650"
"01:30";"649"
"01:31";"650"
"01:32";"651"
"01:33";"649"
"01:34";"652"
"01:35";"653"
"01:36";"653"
"01:37";"654"
"01:38";"654"
"01:39";"655"
"01:40";"656"
"01:41";"657"
"01:42";"657"
"01:43";"658"
"01:44";"659"
"01:45";"659"
"01:46";"659"
"01:47";"659"
"01:48";"660"
"01:49";"662"
"01:50";"662"
"01:51";"661"
"01:52";"661"
"01:53";"662"
"01:54";"662"
"01:55";"663"
"01:56";"663"
"01:57";"663"
"01:58";"664"
"01:59";"665"
"02:00";"666"
"02:01";"668"
"02:02";"667"
"02:03";"668"
"02:04";"669"
"02:05";"669"
"02:06";"670"
"02:07";"670"
"02:08";"671"
"02:09";"670"
"02:10";"672"
"02:11";"672"
"02:12";"672"
"02:13";"674"
"02:14";"675"
"02:15";"675"
"02:16";"675"
"02:17";"676"
"02:18";"676"
"02:19";"677"
"02:20";"677"
"02:21";"678"
"02:22";"679"
"02:23";"679"
"02:24";"680"
"02:25";"680"
"02:26";"680"
"02:27";"679"
"02:28";"681"
"02:29";"680"
"02:30";"681"
"02:31";"681"
"02:32";"682"
"02:33";"682"
"02:34";"682"
"02:35";"683"
"02:36";"682"
"02:37";"683"
"02:38";"682"
"02:39";"684"
"02:40";"683"
"02:41";"684"
"02:42";"684"
"02:43";"685"
"02:44";"685"
"02:45";"686"
"02:46";"686"
"02:47";"685"
"02:48";"685"
"02:49";"686"
"02:50";"686"
"02:51";"686"
"02:52";"686"
"02:53";"685"
"02:54";"686"
"02:55";"687"
"02:56";"687"
"02:57";"688"
"02:58";"688"
"02:59";"687"
"03:00";"689"
"03:01";"690"
"03:02";"690"
"03:03";"691"
"03:04";"692"
"03:05";"690"
"03:06";"690"
"03:07";"691"
"03:08";"690"
"03:09";"691"
"03:10";"691"
"03:11";"691"
"03:12";"692"
"03:13";"690"
"03:14";"690"
"03:15";"691"
"03:16";"690"
"03:17";"690"
"03:18";"691"
"03:19";"691"
"03:20";"690"
"03:21";"690"
"03:22";"690"
"03:23";"690"
"03:24";"691"
"03:25";"690"
"03:26";"691"
"03:27";"691"
"03:28";"690"
"03:29";"690"
"03:30";"690"
"03:31";"690"
"03:32";"689"
"03:33";"690"
"03:34";"690"
"03:35";"689"
"03:36";"690"
"03:37";"690"
"03:38";"689"
"03:39";"688"
"03:40";"688"
"03:41";"687"
"03:42";"688"
"03:43";"687"
"03:44";"687"
"03:45";"687"
"03:46";"687"
"03:47";"686"
"03:48";"686"
"03:49";"686"
"03:50";"686"
"03:51";"684"
"03:52";"685"
"03:53";"685"
"03:54";"685"
"03:55";"684"
"03:56";"683"
"03:57";"682"
"03:58";"682"
"03:59";"682"
"04:00";"682"
"04:01";"681"
"04:02";"681"
"04:03";"680"
"04:04";"680"
"04:05";"678"
"04:06";"678"
"04:07";"677"
"04:08";"677"
"04:09";"676"
"04:10";"675"
"04:11";"676"
"04:12";"674"
"04:13";"675"
"04:14";"674"
"04:15";"674"
"04:16";"673"
"04:17";"672"
"04:18";"671"
"04:19";"670"
"04:20";"670"
"04:21";"670"
"04:22";"668"
"04:23";"665"
"04:24";"666"
"04:25";"664"
"04:26";"664"
"04:27";"663"
"04:28";"662"
"04:29";"662"
"04:30";"661"
"04:31";"660"
"04:32";"660"
"04:33";"658"
"04:34";"658"
"04:35";"657"
"04:36";"656"
"04:37";"654"
"04:38";"654"
"04:39";"652"
"04:40";"652"
"04:41";"650"
"04:42";"649"
"04:43";"650"
"04:44";"648"
"04:45";"647"
"04:46";"646"
"04:47";"645"
"04:48";"644"
"04:49";"643"
"04:50";"642"
"04:51";"641"
"04:52";"640"
"04:53";"640"
"04:54";"638"
"04:55";"637"
"04:56";"635"
"04:57";"635"
"04:58";"633"
"04:59";"632"
"05:00";"631"
"05:01";"629"
"05:02";"629"
"05:03";"627"
"05:04";"626"
"05:05";"624"
"05:06";"624"
"05:07";"623"
"05:08";"622"
"05:09";"620"
"05:10";"618"
"05:11";"618"
"05:12";"617"
"05:13";"616"
"05:14";"615"
"05:15";"614"
"05:16";"614"
"05:17";"612"
"05:18";"612"
"05:19";"610"
"05:20";"609"
"05:21";"607"
"05:22";"606"
"05:23";"605"
"05:24";"602"
"05:25";"601"
"05:26";"600"
"05:27";"598"
"05:28";"597"
"05:29";"597"
"05:30";"595"
"05:31";"593"
"05:32";"594"
"05:33";"593"
"05:34";"591"
"05:35";"591"
"05:36";"590"
"05:37";"588"
"05:38";"586"
"05:39";"586"
"05:40";"585"
"05:41";"583"
"05:42";"583"
"05:43";"581"
"05:44";"578"
"05:45";"578"
"05:46";"576"
"05:47";"575"
"05:48";"574"
"05:49";"574"
"05:50";"572"
"05:51";"571"
"05:52";"570"
"05:53";"570"
"05:54";"568"
"05:55";"568"
"05:56";"566"
"05:57";"563"
"05:58";"564"
"05:59";"561"
"06:00";"560"
"06:01";"559"
"06:02";"558"
"06:03";"557"
"06:04";"556"
"06:05";"554"
"06:06";"553"
"06:07";"550"
"06:08";"550"
"06:09";"549"
"06:10";"548"
"06:11";"546"
"06:12";"545"
"06:13";"543"
"06:14";"544"
"06:15";"542"
"06:16";"542"
"06:17";"541"
"06:18";"540"
"06:19";"539"
"06:20";"538"
"06:21";"537"
"06:22";"537"
"06:23";"535"
"06:24";"534"
"06:25";"532"
"06:26";"531"
"06:27";"530"
"06:28";"529"
"06:29";"529"
"06:30";"527"
"06:31";"527"
"06:32";"525"
"06:33";"524"
"06:34";"523"
"06:35";"521"
"06:36";"522"
"06:37";"520"
"06:38";"519"
"06:39";"519"
"06:40";"518"
"06:41";"517"
"06:42";"516"
"06:43";"515"
"06:44";"514"
"06:45";"513"
"06:46";"513"
"06:47";"512"
"06:48";"510"
"06:49";"508"
"06:50";"506"
"06:51";"507"
"06:52";"507"
"06:53";"506"
"06:54";"504"
"06:55";"504"
"06:56";"503"
"06:57";"503"
"06:58";"502"
"06:59";"502"
"07:00";"501"
"07:01";"501"
"07:02";"500"
"07:03";"499"
"07:04";"498"
"07:05";"497"
"07:06";"496"
"07:07";"496"
"07:08";"495"
"07:09";"493"
"07:10";"492"
"07:11";"492"
"07:12";"490"
"07:13";"489"
"07:14";"489"
"07:15";"488"
"07:16";"488"
"07:17";"488"
"07:18";"487"
"07:19";"486"
"07:20";"484"
"07:21";"485"
"07:22";"484"
"07:23";"483"
"07:24";"482"
"07:25";"481"
"07:26";"481"
"07:27";"480"
"07:28";"478"
"07:29";"477"
"07:30";"477"
"07:31";"475"
"07:32";"474"
"07:33";"473"
"07:34";"473"
"07:35";"472"
"07:36";"471"
"07:37";"471"
"07:38";"470"
"07:39";"469"
"07:40";"469"
"07:41";"468"
"07:42";"468"
"07:43";"467"
"07:44";"466"
"07:45";"464"
"07:46";"465"
"07:47";"465"
"07:48";"463"
"07:49";"464"
"07:50";"462"
"07:51";"461"
"07:52";"461"
"07:53";"460"
"07:54";"461"
"07:55";"459"
"07:56";"458"
"07:57";"459"
"07:58";"457"
"07:59";"456"
"08:00";"456"
"08:01";"456"
"08:02";"455"
"08:03";"456"
"08:04";"455"
"08:05";"455"
"08:06";"454"
"08:07";"453"
"08:08";"453"
"08:09";"453"
"08:10";"452"
"08:11";"450"
"08:12";"449"
"08:13";"448"
"08:14";"447"
"08:15";"447"
"08:16";"446"
"08:17";"446"
"08:18";"443"
"08:19";"444"
"08:20";"443"
"08:21";"443"
"08:22";"443"
"08:23";"443"
"08:24";"442"
"08:25";"441"
"08:26";"440"
"08:27";"440"
"08:28";"438"
"08:29";"438"
"08:30";"439"
"08:31";"437"
"08:32";"437"
"08:33";"437"
"08:34";"436"
"08:35";"435"
"08:36";"434"
"08:37";"434"
"08:38";"434"
"08:39";"433"
"08:40";"433"
"08:41";"433"
"08:42";"433"
"08:43";"431"
"08:44";"430"
"08:45";"430"
"08:46";"430"
"08:47";"430"
"08:48";"428"
"08:49";"428"
"08:50";"428"
"08:51";"426"
"08:52";"426"
"08:53";"427"
"08:54";"426"
"08:55";"426"
"08:56";"425"
"08:57";"425"
"08:58";"425"
"08:59";"424"
"09:00";"425"
"09:01";"424"
"09:02";"424"
"09:03";"424"
"09:04";"422"
"09:05";"423"
"09:06";"422"
"09:07";"422"
"09:08";"422"
"09:09";"422"
"09:10";"422"
"09:11";"419"
"09:12";"420"
"09:13";"419"
"09:14";"420"
"09:15";"419"
"09:16";"419"
"09:17";"420"
"09:18";"418"
"09:19";"418"
"09:20";"418"
"09:21";"418"
"09:22";"418"
"09:23";"417"
"09:24";"418"
"09:25";"417"
"09:26";"416"
"09:27";"416"
"09:28";"416"
"09:29";"416"
"09:30";"415"
"09:31";"414"
"09:32";"415"
"09:33";"414"
"09:34";"414"
"09:35";"413"
"09:36";"413"
"09:37";"412"
"09:38";"412"
"09:39";"413"
"09:40";"412"
"09:41";"412"
"09:42";"412"
"09:43";"412"
"09:44";"412"
"09:45";"410"
"09:46";"412"
"09:47";"411"
"09:48";"412"
"09:49";"410"
"09:50";"411"
"09:51";"411"
"09:52";"411"
"09:53";"411"
"09:54";"412"
"09:55";"412"
"09:56";"412"
"09:57";"411"
"09:58";"411"
"09:59";"411"
"10:00";"413"
"10:01";"411"
"10:02";"413"
"10:03";"413"
"10:04";"413"
"10:05";"412"
"10:06";"413"
"10:07";"415"
"10:08";"413"
"10:09";"413"
"10:10";"413"
"10:11";"413"
"10:12";"414"
"10:13";"414"
"10:14";"414"
"10:15";"414"
"10:16";"414"
"10:17";"414"
"10:18";"414"
"10:19";"414"
"10:20";"416"
"10:21";"414"
"10:22";"414"
"10:23";"414"
"10:24";"415"
"10:25";"414"
"10:26";"416"
"10:27";"417"
"10:28";"416"
"10:29";"417"
"10:30";"418"
"10:31";"417"
"10:32";"419"
"10:33";"418"
"10:34";"418"
"10:35";"419"
"10:36";"420"
"10:37";"421"
"10:38";"422"
"10:39";"422"
"10:40";"422"
"10:41";"423"
"10:42";"423"
"10:43";"423"
"10:44";"426"
"10:45";"426"
"10:46";"424"
"10:47";"426"
"10:48";"426"
"10:49";"426"
"10:50";"427"
"10:51";"427"
"10:52";"429"
"10:53";"430"
"10:54";"430"
"10:55";"431"
"10:56";"432"
"10:57";"431"
"10:58";"434"
"10:59";"434"
"11:00";"434"
"11:01";"436"
"11:02";"436"
"11:03";"438"
"11:04";"439"
"11:05";"439"
"11:06";"441"
"11:07";"442"
"11:08";"443"
"11:09";"444"
"11:10";"445"
"11:11";"447"
"11:12";"446"
"11:13";"449"
"11:14";"451"
"11:15";"452"
"11:16";"453"
"11:17";"454"
"11:18";"454"
"11:19";"456"
"11:20";"458"
"11:21";"458"
"11:22";"460"
"11:23";"460"
"11:24";"463"
"11:25";"464"
"11:26";"467"
"11:27";"467"
"11:28";"469"
"11:29";"470"
"11:30";"471"
"11:31";"473"
"11:32";"475"
"11:33";"478"
"11:34";"478"
"11:35";"480"
"11:36";"483"
"11:37";"482"
"11:38";"484"
"11:39";"485"
"11:40";"487"
"11:41";"486"
"11:42";"489"
"11:43";"490"
"11:44";"492"
"11:45";"493"
"11:46";"495"
"11:47";"497"
"11:48";"498"
"11:49";"499"
"11:50";"499"
"11:51";"502"
"11:52";"504"
"11:53";"506"
"11:54";"508"
"11:55";"509"
"11:56";"509"
"11:57";"512"
"11:58";"513"
"11:59";"514"
"12:00";"516"
"12:01";"517"
"12:02";"519"
"12:03";"520"
"12:04";"522"
"12:05";"523"
"12:06";"524"
"12:07";"524"
"12:08";"527"
"12:09";"529"
"12:10";"529"
"12:11";"530"
"12:12";"531"
"12:13";"531"
"12:14";"534"
"12:15";"536"
"12:16";"536"
"12:17";"538"
"12:18";"539"
"12:19";"541"
"12:20";"542"
"12:21";"544"
"12:22";"545"
"12:23";"545"
"12:24";"548"
"12:25";"549"
"12:26";"550"
"12:27";"550"
"12:28";"552"
"12:29";"552"
"12:30";"555"
"12:31";"555"
"12:32";"556"
"12:33";"558"
"12:34";"560"
"12:35";"560"
"12:36";"563"
"12:37";"563"
"12:38";"564"
"12:39";"565"
"12:40";"567"
"12:41";"568"
"12:42";"569"
"12:43";"570"
"12:44";"571"
"12:45";"573"
"12:46";"574"
"12:47";"574"
"12:48";"576"
"12:49";"577"
"12:50";"575"
"12:51";"578"
"12:52";"580"
"12:53";"581"
"12:54";"581"
"12:55";"583"
"12:56";"584"
"12:57";"584"
"12:58";"586"
"12:59";"587"
"13:00";"588"
"13:01";"588"
"13:02";"590"
"13:03";"591"
"13:04";"592"
"13:05";"592"
"13:06";"594"
"13:07";"595"
"13:08";"595"
"13:09";"597"
"13:10";"598"
"13:11";"599"
"13:12";"600"
"13:13";"599"
"13:14";"602"
"13:15";"602"
"13:16";"601"
"13:17";"603"
"13:18";"604"
"13:19";"606"
"13:20";"606"
"13:21";"608"
"13:22";"609"
"13:23";"610"
"13:24";"610"
"13:25";"612"
"13:26";"613"
"13:27";"613"
"13:28";"613"
"13:29";"615"
"13:30";"616"
"13:31";"618"
"13:32";"618"
"13:33";"619"
"13:34";"621"
"13:35";"620"
"13:36";"621"
"13:37";"623"
"13:38";"622"
"13:39";"624"
"13:40";"624"
"13:41";"624"
"13:42";"625"
"13:43";"626"
"13:44";"626"
"13:45";"627"
"13:46";"629"
"13:47";"630"
"13:48";"631"
"13:49";"632"
"13:50";"632"
"13:51";"634"
"13:52";"635"
"13:53";"635"
"13:54";"637"
"13:55";"636"
"13:56";"637"
"13:57";"639"
"13:58";"640"
"13:59";"640"
"14:00";"640"
"14:01";"640"
"14:02";"642"
"14:03";"643"
"14:04";"644"
"14:05";"644"
"14:06";"644"
"14:07";"645"
"14:08";"646"
"14:09";"647"
"14:10";"649"
"14:11";"649"
"14:12";"649"
"14:13";"651"
"14:14";"650"
"14:15";"651"
"14:16";"650"
"14:17";"652"
"14:18";"651"
"14:19";"653"
"14:20";"652"
"14:21";"653"
"14:22";"654"
"14:23";"654"
"14:24";"655"
"14:25";"655"
"14:26";"656"
"14:27";"656"
"14:28";"658"
"14:29";"658"
"14:30";"658"
"14:31";"658"
"14:32";"659"
"14:33";"660"
"14:34";"660"
"14:35";"659"
"14:36";"661"
"14:37";"662"
"14:38";"662"
"14:39";"661"
"14:40";"662"
"14:41";"662"
"14:42";"663"
"14:43";"662"
"14:44";"663"
"14:45";"664"
"14:46";"664"
"14:47";"665"
"14:48";"665"
"14:49";"667"
"14:50";"668"
"14:51";"668"
"14:52";"668"
"14:53";"668"
"14:54";"668"
"14:55";"670"
"14:56";"671"
"14:57";"670"
"14:58";"669"
"14:59";"669"
"15:00";"671"
"15:01";"669"
"15:02";"670"
"15:03";"670"
"15:04";"671"
"15:05";"671"
"15:06";"673"
"15:07";"672"
"15:08";"673"
"15:09";"674"
"15:10";"675"
"15:11";"674"
"15:12";"675"
"15:13";"676"
"15:14";"676"
"15:15";"676"
"15:16";"674"
"15:17";"675"
"15:18";"676"
"15:19";"676"
"15:20";"676"
"15:21";"676"
"15:22";"677"
"15:23";"676"
"15:24";"677"
"15:25";"677"
"15:26";"676"
"15:27";"678"
"15:28";"678"
"15:29";"678"
"15:30";"678"
"15:31";"678"
"15:32";"677"
"15:33";"678"
"15:34";"678"
"15:35";"677"
"15:36";"676"
"15:37";"678"
"15:38";"676"
"15:39";"678"
"15:40";"676"
"15:41";"677"
"15:42";"677"
"15:43";"676"
"15:44";"676"
"15:45";"676"
"15:46";"677"
"15:47";"676"
"15:48";"676"
"15:49";"677"
"15:50";"676"
"15:51";"677"
"15:52";"676"
"15:53";"676"
"15:54";"676"
"15:55";"675"
"15:56";"675"
"15:57";"674"
"15:58";"674"
"15:59";"674"
"16:00";"673"
"16:01";"674"
"16:02";"674"
"16:03";"673"
"16:04";"672"
"16:05";"673"
"16:06";"672"
"16:07";"671"
"16:08";"672"
"16:09";"671"
"16:10";"671"
"16:11";"670"
"16:12";"670"
"16:13";"668"
"16:14";"669"
"16:15";"668"
"16:16";"667"
"16:17";"668"
"16:18";"667"
"16:19";"666"
"16:20";"667"
"16:21";"665"
"16:22";"665"
"16:23";"664"
"16:24";"664"
"16:25";"662"
"16:26";"663"
"16:27";"662"
"16:28";"662"
"16:29";"663"
"16:30";"661"
"16:31";"661"
"16:32";"660"
"16:33";"660"
"16:34";"658"
"16:35";"658"
"16:36";"657"
"16:37";"657"
"16:38";"656"
"16:39";"656"
"16:40";"654"
"16:41";"654"
"16:42";"653"
"16:43";"653"
"16:44";"653"
"16:45";"652"
"16:46";"649"
"16:47";"650"
"16:48";"648"
"16:49";"648"
"16:50";"648"
"16:51";"648"
"16:52";"646"
"16:53";"645"
"16:54";"645"
"16:55";"644"
"16:56";"642"
"16:57";"643"
"16:58";"642"
"16:59";"640"
"17:00";"639"
"17:01";"639"
"17:02";"638"
"17:03";"637"
"17:04";"636"
"17:05";"636"
"17:06";"634"
"17:07";"633"
"17:08";"632"
"17:09";"632"
"17:10";"629"
"17:11";"629"
"17:12";"628"
"17:13";"627"
"17:14";"624"
"17:15";"624"
"17:16";"622"
"17:17";"622"
"17:18";"622"
"17:19";"620"
"17:20";"620"
"17:21";"618"
"17:22";"617"
"17:23";"615"
"17:24";"616"
"17:25";"614"
"17:26";"613"
"17:27";"612"
"17:28";"610"
"17:29";"609"
"17:30";"608"
"17:31";"607"
"17:32";"607"
"17:33";"606"
"17:34";"604"
"17:35";"604"
"17:36";"602"
"17:37";"600"
"17:38";"600"
"17:39";"599"
"17:40";"599"
"17:41";"597"
"17:42";"596"
"17:43";"594"
"17:44";"594"
"17:45";"592"
"17:46";"591"
"17:47";"590"
"17:48";"588"
"17:49";"586"
"17:50";"586"
"17:51";"585"
"17:52";"583"
"17:53";"581"
"17:54";"581"
"17:55";"579"
"17:56";"579"
"17:57";"578"
"17:58";"577"
"17:59";"576"
"18:00";"575"
"18:01";"573"
"18:02";"572"
"18:03";"571"
"18:04";"570"
"18:05";"570"
"18:06";"569"
"18:07";"568"
"18:08";"566"
"18:09";"564"
"18:10";"564"
"18:11";"563"
"18:12";"560"
"18:13";"560"
"18:14";"558"
"18:15";"557"
"18:16";"556"
"18:17";"556"
"18:18";"555"
"18:19";"554"
"18:20";"552"
"18:21";"551"
"18:22";"550"
"18:23";"549"
"18:24";"547"
"18:25";"547"
"18:26";"546"
"18:27";"544"
"18:28";"543"
"18:29";"542"
"18:30";"541"
"18:31";"539"
"18:32";"538"
"18:33";"536"
"18:34";"537"
"18:35";"535"
"18:36";"534"
"18:37";"532"
"18:38";"530"
"18:39";"530"
"18:40";"528"
"18:41";"529"
"18:42";"529"
"18:43";"528"
"18:44";"526"
"18:45";"525"
"18:46";"523"
"18:47";"524"
"18:48";"522"
"18:49";"521"
"18:50";"518"
"18:51";"518"
"18:52";"516"
"18:53";"515"
"18:54";"516"
"18:55";"513"
"18:56";"511"
"18:57";"512"
"18:58";"510"
"18:59";"510"
"19:00";"508"
"19:01";"509"
"19:02";"506"
"19:03";"506"
"19:04";"505"
"19:05";"505"
"19:06";"504"
"19:07";"503"
"19:08";"501"
"19:09";"500"
"19:10";"500"
"19:11";"500"
"19:12";"500"
"19:13";"499"
"19:14";"496"
"19:15";"497"
"19:16";"497"
"19:17";"496"
"19:18";"495"
"19:19";"494"
"19:20";"494"
"19:21";"493"
"19:22";"493"
"19:23";"491"
"19:24";"490"
"19:25";"489"
"19:26";"490"
"19:27";"488"
"19:28";"487"
"19:29";"486"
"19:30";"484"
"19:31";"485"
"19:32";"483"
"19:33";"483"
"19:34";"483"
"19:35";"481"
"19:36";"481"
"19:37";"480"
"19:38";"480"
"19:39";"479"
"19:40";"478"
"19:41";"479"
"19:42";"478"
"19:43";"477"
"19:44";"477"
"19:45";"476"
"19:46";"475"
"19:47";"476"
"19:48";"474"
"19:49";"473"
"19:50";"472"
"19:51";"472"
"19:52";"470"
"19:53";"470"
"19:54";"472"
"19:55";"469"
"19:56";"469"
"19:57";"468"
"19:58";"469"
"19:59";"466"
"20:00";"467"
"20:01";"465"
"20:02";"466"
"20:03";"464"
"20:04";"464"
"20:05";"462"
"20:06";"462"
"20:07";"462"
"20:08";"461"
"20:09";"462"
"20:10";"460"
"20:11";"460"
"20:12";"458"
"20:13";"457"
"20:14";"459"
"20:15";"457"
"20:16";"458"
"20:17";"456"
"20:18";"455"
"20:19";"455"
"20:20";"454"
"20:21";"454"
"20:22";"453"
"20:23";"452"
"20:24";"453"
"20:25";"451"
"20:26";"452"
"20:27";"451"
"20:28";"450"
"20:29";"449"
"20:30";"449"
"20:31";"448"
"20:32";"448"
"20:33";"446"
"20:34";"448"
"20:35";"448"
"20:36";"446"
"20:37";"445"
"20:38";"445"
"20:39";"445"
"20:40";"444"
"20:41";"445"
"20:42";"444"
"20:43";"443"
"20:44";"443"
"20:45";"442"
"20:46";"440"
"20:47";"441"
"20:48";"441"
"20:49";"440"
"20:50";"439"
"20:51";"438"
"20:52";"438"
"20:53";"438"
"20:54";"438"
"20:55";"436"
"20:56";"437"
"20:57";"436"
"20:58";"435"
"20:59";"434"
"21:00";"434"
"21:01";"435"
"21:02";"434"
"21:03";"434"
"21:04";"433"
"21:05";"432"
"21:06";"432"
"21:07";"432"
"21:08";"431"
"21:09";"431"
"21:10";"429"
"21:11";"429"
"21:12";"429"
"21:13";"429"
"21:14";"428"
"21:15";"428"
"21:16";"427"
"21:17";"427"
"21:18";"426"
"21:19";"426"
"21:20";"426"
"21:21";"425"
"21:22";"425"
"21:23";"425"
"21:24";"425"
"21:25";"424"
"21:26";"424"
"21:27";"424"
"21:28";"424"
"21:29";"423"
"21:30";"423"
"21:31";"423"
"21:32";"422"
"21:33";"422"
"21:34";"422"
"21:35";"421"
"21:36";"422"
"21:37";"420"
"21:38";"422"
"21:39";"421"
"21:40";"419"
"21:41";"420"
"21:42";"420"
"21:43";"420"
"21:44";"419"
"21:45";"419"
"21:46";"418"
"21:47";"418"
"21:48";"417"
"21:49";"417"
"21:50";"416"
"21:51";"416"
"21:52";"416"
"21:53";"416"
"21:54";"416"
"21:55";"417"
"21:56";"416"
"21:57";"414"
"21:58";"415"
"21:59";"416"
"22:00";"414"
"22:01";"414"
"22:02";"414"
"22:03";"416"
"22:04";"416"
"22:05";"414"
"22:06";"415"
"22:07";"414"
"22:08";"414"
"22:09";"416"
"22:10";"416"
"22:11";"415"
"22:12";"414"
"22:13";"416"
"22:14";"416"
"22:15";"415"
"22:16";"416"
"22:17";"415"
"22:18";"415"
"22:19";"416"
"22:20";"415"
"22:21";"416"
"22:22";"416"
"22:23";"415"
"22:24";"416"
"22:25";"416"
"22:26";"415"
"22:27";"415"
"22:28";"415"
"22:29";"416"
"22:30";"415"
"22:31";"416"
"22:32";"416"
"22:33";"416"
"22:34";"415"
"22:35";"416"
"22:36";"416"
"22:37";"416"
"22:38";"416"
"22:39";"417"
"22:40";"418"
"22:41";"415"
"22:42";"418"
"22:43";"418"
"22:44";"417"
"22:45";"419"
"22:46";"418"
"22:47";"419"
"22:48";"420"
"22:49";"420"
"22:50";"421"
"22:51";"422"
"22:52";"421"
"22:53";"423"
"22:54";"423"
"22:55";"422"
"22:56";"423"
"22:57";"423"
"22:58";"424"
"22:59";"425"
"23:00";"425"
"23:01";"425"
"23:02";"426"
"23:03";"426"
"23:04";"427"
"23:05";"428"
"23:06";"427"
"23:07";"428"
"23:08";"428"
"23:09";"429"
"23:10";"430"
"23:11";"431"
"23:12";"432"
"23:13";"432"
"23:14";"434"
"23:15";"434"
"23:16";"435"
"23:17";"434"
"23:18";"436"
"23:19";"437"
"23:20";"437"
"23:21";"439"
"23:22";"439"
"23:23";"439"
"23:24";"440"
"23:25";"441"
"23:26";"442"
"23:27";"443"
"23:28";"444"
"23:29";"445"
"23:30";"446"
"23:31";"448"
"23:32";"448"
"23:33";"449"
"23:34";"450"
"23:35";"452"
"23:36";"453"
"23:37";"454"
"23:38";"454"
"23:39";"456"
"23:40";"458"
"23:41";"458"
"23:42";"460"
"23:43";"461"
"23:44";"462"
"23:45";"463"
"23:46";"465"
"23:47";"466"
"23:48";"466"
"23:49";"468"
"23:50";"470"
"23:51";"471"
"23:52";"473"
"23:53";"473"
"23:54";"474"
"23:55";"476"
"23:56";"478"
"23:57";"478"
"23:58";"480"
"23:59";"480"
"24:00";"482"
