"01.06.2022";"Wilhelmshaven";"JADE";"WANGEROOGE NORD";"9420030";"W_O";"cm";"XXX,XXX";"XX.XX.XXXX";"XX:XX";"PNP";"-5,04"
"00:01";"643"
"00:02";"643"
"00:03";"644"
"00:04";"644"
"00:05";"644"
"00:06";"645"
"00:07";"645"
"00:08";"645"
"00:09";"646"
"00:10";"646"
"00:11";"646"
"00:12";"646"
"00:13";"647"
"00:14";"647"
"00:15";"647"
"00:16";"647"
"00:17";"648"
"00:18";"648"
"00:19";"648"
"00:20";"648"
"00:21";"648"
"00:22";"648"
"00:23";"649"
"00:24";"649"
"00:25";"649"
"00:26";"649"
"00:27";"649"
"00:28";"650"
"00:29";"649"
"00:30";"650"
"00:31";"650"
"00:32";"650"
"00:33";"650"
"00:34";"650"
"00:35";"650"
"00:36";"650"
"00:37";"650"
"00:38";"650"
"00:39";"650"
"00:40";"650"
"00:41";"650"
"00:42";"650"
"00:43";"650"
"00:44";"650"
"00:45";"650"
"00:46";"650"
"00:47";"650"
"00:48";"650"
"00:49";"650"
"00:50";"650"
"00:51";"650"
"00:52";"650"
"00:53";"650"
"00:54";"650"
"00:55";"650"
"00:56";"650"
"00:57";"649"
"00:58";"648"
"00:59";"648"
"01:00";"648"
"01:01";"648"
"01:02";"648"
"01:03";"647"
"01:04";"647"
"01:05";"647"
"01:06";"647"
"01:07";"647"
"01:08";"647"
"01:09";"646"
"01:10";"646"
"01:11";"646"
"01:12";"645"
"01:13";"645"
"01:14";"645"
"01:15";"644"
"01:16";"644"
"01:17";"643"
"01:18";"643"
"01:19";"643"
"01:20";"642"
"01:21";"642"
"01:22";"641"
"01:23";"641"
"01:24";"640"
"01:25";"640"
"01:26";"639"
"01:27";"639"
"01:28";"638"
"01:29";"638"
"01:30";"637"
"01:31";"636"
"01:32";"636"
"01:33";"636"
"01:34";"635"
"01:35";"634"
"01:36";"633"
"01:37";"633"
"01:38";"632"
"01:39";"632"
"01:40";"631"
"01:41";"630"
"01:42";"629"
"01:43";"628"
"01:44";"627"
"01:45";"626"
"01:46";"625"
"01:47";"624"
"01:48";"624"
"01:49";"623"
"01:50";"622"
"01:51";"622"
"01:52";"621"
"01:53";"620"
"01:54";"619"
"01:55";"619"
"01:56";"618"
"01:57";"617"
"01:58";"616"
"01:59";"615"
"02:00";"614"
"02:01";"613"
"02:02";"612"
"02:03";"611"
"02:04";"610"
"02:05";"609"
"02:06";"608"
"02:07";"607"
"02:08";"606"
"02:09";"605"
"02:10";"604"
"02:11";"603"
"02:12";"602"
"02:13";"601"
"02:14";"600"
"02:15";"599"
"02:16";"598"
"02:17";"597"
"02:18";"596"
"02:19";"595"
"02:20";"593"
"02:21";"592"
"02:22";"591"
"02:23";"590"
"02:24";"589"
"02:25";"588"
"02:26";"586"
"02:27";"585"
"02:28";"584"
"02:29";"582"
"02:30";"581"
"02:31";"580"
"02:32";"579"
"02:33";"578"
"02:34";"577"
"02:35";"575"
"02:36";"574"
"02:37";"573"
"02:38";"572"
"02:39";"570"
"02:40";"569"
"02:41";"568"
"02:42";"566"
"02:43";"565"
"02:44";"564"
"02:45";"562"
"02:46";"561"
"02:47";"560"
"02:48";"558"
"02:49";"557"
"02:50";"556"
"02:51";"555"
"02:52";"553"
"02:53";"552"
"02:54";"550"
"02:55";"550"
"02:56";"548"
"02:57";"547"
"02:58";"546"
"02:59";"544"
"03:00";"543"
"03:01";"541"
"03:02";"540"
"03:03";"539"
"03:04";"537"
"03:05";"536"
"03:06";"535"
"03:07";"534"
"03:08";"532"
"03:09";"531"
"03:10";"530"
"03:11";"528"
"03:12";"527"
"03:13";"526"
"03:14";"524"
"03:15";"523"
"03:16";"522"
"03:17";"521"
"03:18";"520"
"03:19";"518"
"03:20";"517"
"03:21";"516"
"03:22";"514"
"03:23";"513"
"03:24";"512"
"03:25";"511"
"03:26";"510"
"03:27";"509"
"03:28";"507"
"03:29";"506"
"03:30";"505"
"03:31";"503"
"03:32";"502"
"03:33";"501"
"03:34";"500"
"03:35";"499"
"03:36";"498"
"03:37";"497"
"03:38";"496"
"03:39";"494"
"03:40";"493"
"03:41";"492"
"03:42";"490"
"03:43";"489"
"03:44";"488"
"03:45";"487"
"03:46";"486"
"03:47";"484"
"03:48";"483"
"03:49";"482"
"03:50";"481"
"03:51";"480"
"03:52";"479"
"03:53";"478"
"03:54";"476"
"03:55";"475"
"03:56";"474"
"03:57";"473"
"03:58";"472"
"03:59";"471"
"04:00";"470"
"04:01";"469"
"04:02";"468"
"04:03";"467"
"04:04";"466"
"04:05";"465"
"04:06";"463"
"04:07";"462"
"04:08";"461"
"04:09";"460"
"04:10";"459"
"04:11";"458"
"04:12";"457"
"04:13";"456"
"04:14";"455"
"04:15";"454"
"04:16";"453"
"04:17";"452"
"04:18";"451"
"04:19";"450"
"04:20";"449"
"04:21";"448"
"04:22";"446"
"04:23";"445"
"04:24";"444"
"04:25";"443"
"04:26";"443"
"04:27";"441"
"04:28";"441"
"04:29";"439"
"04:30";"439"
"04:31";"438"
"04:32";"436"
"04:33";"436"
"04:34";"435"
"04:35";"434"
"04:36";"434"
"04:37";"432"
"04:38";"431"
"04:39";"430"
"04:40";"429"
"04:41";"428"
"04:42";"427"
"04:43";"427"
"04:44";"426"
"04:45";"425"
"04:46";"424"
"04:47";"424"
"04:48";"423"
"04:49";"422"
"04:50";"421"
"04:51";"420"
"04:52";"420"
"04:53";"418"
"04:54";"418"
"04:55";"417"
"04:56";"416"
"04:57";"415"
"04:58";"414"
"04:59";"413"
"05:00";"412"
"05:01";"412"
"05:02";"411"
"05:03";"410"
"05:04";"409"
"05:05";"408"
"05:06";"408"
"05:07";"407"
"05:08";"406"
"05:09";"405"
"05:10";"404"
"05:11";"403"
"05:12";"403"
"05:13";"402"
"05:14";"401"
"05:15";"400"
"05:16";"400"
"05:17";"399"
"05:18";"398"
"05:19";"397"
"05:20";"396"
"05:21";"396"
"05:22";"395"
"05:23";"394"
"05:24";"393"
"05:25";"392"
"05:26";"391"
"05:27";"390"
"05:28";"390"
"05:29";"389"
"05:30";"388"
"05:31";"388"
"05:32";"387"
"05:33";"386"
"05:34";"386"
"05:35";"385"
"05:36";"385"
"05:37";"384"
"05:38";"382"
"05:39";"382"
"05:40";"381"
"05:41";"380"
"05:42";"379"
"05:43";"378"
"05:44";"378"
"05:45";"377"
"05:46";"377"
"05:47";"376"
"05:48";"375"
"05:49";"374"
"05:50";"374"
"05:51";"373"
"05:52";"372"
"05:53";"372"
"05:54";"371"
"05:55";"371"
"05:56";"370"
"05:57";"369"
"05:58";"368"
"05:59";"367"
"06:00";"366"
"06:01";"366"
"06:02";"365"
"06:03";"364"
"06:04";"364"
"06:05";"363"
"06:06";"363"
"06:07";"362"
"06:08";"361"
"06:09";"361"
"06:10";"360"
"06:11";"360"
"06:12";"360"
"06:13";"359"
"06:14";"358"
"06:15";"357"
"06:16";"357"
"06:17";"356"
"06:18";"356"
"06:19";"355"
"06:20";"354"
"06:21";"354"
"06:22";"353"
"06:23";"352"
"06:24";"351"
"06:25";"351"
"06:26";"350"
"06:27";"350"
"06:28";"350"
"06:29";"349"
"06:30";"349"
"06:31";"348"
"06:32";"347"
"06:33";"348"
"06:34";"347"
"06:35";"347"
"06:36";"346"
"06:37";"346"
"06:38";"345"
"06:39";"345"
"06:40";"344"
"06:41";"344"
"06:42";"344"
"06:43";"344"
"06:44";"344"
"06:45";"343"
"06:46";"343"
"06:47";"342"
"06:48";"342"
"06:49";"342"
"06:50";"341"
"06:51";"341"
"06:52";"341"
"06:53";"341"
"06:54";"341"
"06:55";"341"
"06:56";"341"
"06:57";"340"
"06:58";"340"
"06:59";"340"
"07:00";"339"
"07:01";"339"
"07:02";"339"
"07:03";"339"
"07:04";"339"
"07:05";"338"
"07:06";"339"
"07:07";"339"
"07:08";"339"
"07:09";"339"
"07:10";"339"
"07:11";"339"
"07:12";"339"
"07:13";"339"
"07:14";"339"
"07:15";"339"
"07:16";"340"
"07:17";"340"
"07:18";"340"
"07:19";"340"
"07:20";"341"
"07:21";"341"
"07:22";"341"
"07:23";"342"
"07:24";"341"
"07:25";"342"
"07:26";"342"
"07:27";"342"
"07:28";"343"
"07:29";"343"
"07:30";"343"
"07:31";"344"
"07:32";"344"
"07:33";"344"
"07:34";"345"
"07:35";"345"
"07:36";"346"
"07:37";"346"
"07:38";"347"
"07:39";"347"
"07:40";"347"
"07:41";"348"
"07:42";"348"
"07:43";"349"
"07:44";"350"
"07:45";"350"
"07:46";"351"
"07:47";"352"
"07:48";"353"
"07:49";"354"
"07:50";"354"
"07:51";"355"
"07:52";"356"
"07:53";"357"
"07:54";"358"
"07:55";"359"
"07:56";"360"
"07:57";"360"
"07:58";"361"
"07:59";"362"
"08:00";"363"
"08:01";"363"
"08:02";"365"
"08:03";"366"
"08:04";"366"
"08:05";"368"
"08:06";"369"
"08:07";"369"
"08:08";"371"
"08:09";"372"
"08:10";"373"
"08:11";"374"
"08:12";"375"
"08:13";"376"
"08:14";"378"
"08:15";"378"
"08:16";"380"
"08:17";"382"
"08:18";"383"
"08:19";"385"
"08:20";"386"
"08:21";"387"
"08:22";"388"
"08:23";"390"
"08:24";"391"
"08:25";"393"
"08:26";"394"
"08:27";"396"
"08:28";"397"
"08:29";"399"
"08:30";"400"
"08:31";"402"
"08:32";"404"
"08:33";"406"
"08:34";"407"
"08:35";"409"
"08:36";"410"
"08:37";"412"
"08:38";"413"
"08:39";"415"
"08:40";"417"
"08:41";"419"
"08:42";"421"
"08:43";"422"
"08:44";"424"
"08:45";"426"
"08:46";"427"
"08:47";"429"
"08:48";"431"
"08:49";"433"
"08:50";"435"
"08:51";"436"
"08:52";"438"
"08:53";"440"
"08:54";"442"
"08:55";"444"
"08:56";"445"
"08:57";"447"
"08:58";"449"
"08:59";"451"
"09:00";"453"
"09:01";"454"
"09:02";"456"
"09:03";"457"
"09:04";"459"
"09:05";"461"
"09:06";"463"
"09:07";"465"
"09:08";"467"
"09:09";"468"
"09:10";"470"
"09:11";"471"
"09:12";"473"
"09:13";"475"
"09:14";"476"
"09:15";"478"
"09:16";"480"
"09:17";"481"
"09:18";"482"
"09:19";"484"
"09:20";"485"
"09:21";"486"
"09:22";"487"
"09:23";"489"
"09:24";"490"
"09:25";"492"
"09:26";"493"
"09:27";"495"
"09:28";"496"
"09:29";"498"
"09:30";"499"
"09:31";"501"
"09:32";"502"
"09:33";"504"
"09:34";"505"
"09:35";"507"
"09:36";"509"
"09:37";"510"
"09:38";"511"
"09:39";"513"
"09:40";"514"
"09:41";"516"
"09:42";"517"
"09:43";"518"
"09:44";"520"
"09:45";"521"
"09:46";"523"
"09:47";"524"
"09:48";"525"
"09:49";"526"
"09:50";"528"
"09:51";"529"
"09:52";"530"
"09:53";"532"
"09:54";"533"
"09:55";"535"
"09:56";"536"
"09:57";"537"
"09:58";"538"
"09:59";"539"
"10:00";"541"
"10:01";"542"
"10:02";"543"
"10:03";"544"
"10:04";"545"
"10:05";"546"
"10:06";"547"
"10:07";"548"
"10:08";"550"
"10:09";"551"
"10:10";"552"
"10:11";"553"
"10:12";"555"
"10:13";"556"
"10:14";"557"
"10:15";"559"
"10:16";"560"
"10:17";"561"
"10:18";"562"
"10:19";"563"
"10:20";"564"
"10:21";"566"
"10:22";"567"
"10:23";"569"
"10:24";"570"
"10:25";"571"
"10:26";"572"
"10:27";"574"
"10:28";"574"
"10:29";"576"
"10:30";"577"
"10:31";"578"
"10:32";"578"
"10:33";"579"
"10:34";"581"
"10:35";"582"
"10:36";"583"
"10:37";"584"
"10:38";"585"
"10:39";"586"
"10:40";"587"
"10:41";"588"
"10:42";"589"
"10:43";"590"
"10:44";"591"
"10:45";"592"
"10:46";"592"
"10:47";"593"
"10:48";"594"
"10:49";"595"
"10:50";"596"
"10:51";"597"
"10:52";"598"
"10:53";"599"
"10:54";"600"
"10:55";"601"
"10:56";"602"
"10:57";"603"
"10:58";"604"
"10:59";"604"
"11:00";"605"
"11:01";"606"
"11:02";"607"
"11:03";"608"
"11:04";"609"
"11:05";"610"
"11:06";"610"
"11:07";"611"
"11:08";"612"
"11:09";"613"
"11:10";"614"
"11:11";"615"
"11:12";"616"
"11:13";"616"
"11:14";"617"
"11:15";"618"
"11:16";"618"
"11:17";"619"
"11:18";"620"
"11:19";"621"
"11:20";"622"
"11:21";"622"
"11:22";"623"
"11:23";"624"
"11:24";"624"
"11:25";"625"
"11:26";"626"
"11:27";"627"
"11:28";"627"
"11:29";"628"
"11:30";"629"
"11:31";"630"
"11:32";"631"
"11:33";"631"
"11:34";"632"
"11:35";"632"
"11:36";"633"
"11:37";"633"
"11:38";"634"
"11:39";"635"
"11:40";"636"
"11:41";"636"
"11:42";"636"
"11:43";"637"
"11:44";"638"
"11:45";"638"
"11:46";"639"
"11:47";"640"
"11:48";"640"
"11:49";"640"
"11:50";"641"
"11:51";"642"
"11:52";"642"
"11:53";"643"
"11:54";"644"
"11:55";"644"
"11:56";"644"
"11:57";"645"
"11:58";"645"
"11:59";"646"
"12:00";"646"
"12:01";"647"
"12:02";"647"
"12:03";"647"
"12:04";"648"
"12:05";"649"
"12:06";"649"
"12:07";"649"
"12:08";"650"
"12:09";"650"
"12:10";"651"
"12:11";"651"
"12:12";"651"
"12:13";"652"
"12:14";"652"
"12:15";"653"
"12:16";"653"
"12:17";"653"
"12:18";"654"
"12:19";"654"
"12:20";"654"
"12:21";"654"
"12:22";"655"
"12:23";"655"
"12:24";"655"
"12:25";"655"
"12:26";"656"
"12:27";"656"
"12:28";"656"
"12:29";"657"
"12:30";"657"
"12:31";"657"
"12:32";"657"
"12:33";"658"
"12:34";"658"
"12:35";"658"
"12:36";"658"
"12:37";"658"
"12:38";"658"
"12:39";"658"
"12:40";"658"
"12:41";"658"
"12:42";"659"
"12:43";"659"
"12:44";"659"
"12:45";"659"
"12:46";"659"
"12:47";"659"
"12:48";"659"
"12:49";"659"
"12:50";"659"
"12:51";"660"
"12:52";"660"
"12:53";"660"
"12:54";"659"
"12:55";"660"
"12:56";"660"
"12:57";"660"
"12:58";"659"
"12:59";"659"
"13:00";"659"
"13:01";"659"
"13:02";"659"
"13:03";"659"
"13:04";"659"
"13:05";"659"
"13:06";"659"
"13:07";"659"
"13:08";"659"
"13:09";"659"
"13:10";"659"
"13:11";"659"
"13:12";"659"
"13:13";"658"
"13:14";"658"
"13:15";"658"
"13:16";"658"
"13:17";"657"
"13:18";"657"
"13:19";"657"
"13:20";"656"
"13:21";"656"
"13:22";"655"
"13:23";"655"
"13:24";"655"
"13:25";"654"
"13:26";"654"
"13:27";"654"
"13:28";"653"
"13:29";"653"
"13:30";"652"
"13:31";"652"
"13:32";"651"
"13:33";"651"
"13:34";"651"
"13:35";"650"
"13:36";"650"
"13:37";"649"
"13:38";"649"
"13:39";"649"
"13:40";"648"
"13:41";"648"
"13:42";"647"
"13:43";"647"
"13:44";"646"
"13:45";"646"
"13:46";"645"
"13:47";"644"
"13:48";"644"
"13:49";"643"
"13:50";"642"
"13:51";"641"
"13:52";"641"
"13:53";"640"
"13:54";"639"
"13:55";"639"
"13:56";"638"
"13:57";"637"
"13:58";"636"
"13:59";"636"
"14:00";"635"
"14:01";"634"
"14:02";"633"
"14:03";"632"
"14:04";"631"
"14:05";"631"
"14:06";"630"
"14:07";"628"
"14:08";"628"
"14:09";"627"
"14:10";"626"
"14:11";"625"
"14:12";"624"
"14:13";"623"
"14:14";"622"
"14:15";"622"
"14:16";"621"
"14:17";"620"
"14:18";"618"
"14:19";"618"
"14:20";"617"
"14:21";"615"
"14:22";"614"
"14:23";"614"
"14:24";"612"
"14:25";"611"
"14:26";"610"
"14:27";"609"
"14:28";"608"
"14:29";"608"
"14:30";"606"
"14:31";"605"
"14:32";"604"
"14:33";"603"
"14:34";"602"
"14:35";"601"
"14:36";"600"
"14:37";"599"
"14:38";"597"
"14:39";"596"
"14:40";"595"
"14:41";"594"
"14:42";"593"
"14:43";"592"
"14:44";"591"
"14:45";"590"
"14:46";"589"
"14:47";"588"
"14:48";"586"
"14:49";"585"
"14:50";"584"
"14:51";"582"
"14:52";"581"
"14:53";"580"
"14:54";"578"
"14:55";"578"
"14:56";"576"
"14:57";"575"
"14:58";"574"
"14:59";"572"
"15:00";"571"
"15:01";"570"
"15:02";"569"
"15:03";"568"
"15:04";"566"
"15:05";"565"
"15:06";"564"
"15:07";"562"
"15:08";"561"
"15:09";"560"
"15:10";"559"
"15:11";"558"
"15:12";"556"
"15:13";"555"
"15:14";"554"
"15:15";"552"
"15:16";"551"
"15:17";"550"
"15:18";"548"
"15:19";"547"
"15:20";"546"
"15:21";"545"
"15:22";"544"
"15:23";"542"
"15:24";"541"
"15:25";"540"
"15:26";"538"
"15:27";"537"
"15:28";"536"
"15:29";"534"
"15:30";"533"
"15:31";"532"
"15:32";"531"
"15:33";"530"
"15:34";"528"
"15:35";"527"
"15:36";"526"
"15:37";"524"
"15:38";"523"
"15:39";"522"
"15:40";"520"
"15:41";"519"
"15:42";"518"
"15:43";"516"
"15:44";"515"
"15:45";"514"
"15:46";"513"
"15:47";"512"
"15:48";"510"
"15:49";"509"
"15:50";"508"
"15:51";"506"
"15:52";"505"
"15:53";"503"
"15:54";"502"
"15:55";"501"
"15:56";"500"
"15:57";"499"
"15:58";"498"
"15:59";"497"
"16:00";"495"
"16:01";"494"
"16:02";"493"
"16:03";"492"
"16:04";"490"
"16:05";"489"
"16:06";"488"
"16:07";"487"
"16:08";"485"
"16:09";"484"
"16:10";"483"
"16:11";"482"
"16:12";"481"
"16:13";"480"
"16:14";"478"
"16:15";"477"
"16:16";"476"
"16:17";"475"
"16:18";"474"
"16:19";"472"
"16:20";"472"
"16:21";"470"
"16:22";"470"
"16:23";"469"
"16:24";"468"
"16:25";"466"
"16:26";"466"
"16:27";"465"
"16:28";"463"
"16:29";"462"
"16:30";"462"
"16:31";"460"
"16:32";"459"
"16:33";"458"
"16:34";"457"
"16:35";"456"
"16:36";"456"
"16:37";"455"
"16:38";"454"
"16:39";"453"
"16:40";"452"
"16:41";"451"
"16:42";"450"
"16:43";"449"
"16:44";"448"
"16:45";"447"
"16:46";"446"
"16:47";"445"
"16:48";"444"
"16:49";"443"
"16:50";"442"
"16:51";"441"
"16:52";"440"
"16:53";"439"
"16:54";"438"
"16:55";"437"
"16:56";"436"
"16:57";"435"
"16:58";"434"
"16:59";"434"
"17:00";"433"
"17:01";"432"
"17:02";"431"
"17:03";"430"
"17:04";"429"
"17:05";"428"
"17:06";"427"
"17:07";"426"
"17:08";"425"
"17:09";"425"
"17:10";"424"
"17:11";"423"
"17:12";"422"
"17:13";"422"
"17:14";"421"
"17:15";"420"
"17:16";"419"
"17:17";"418"
"17:18";"418"
"17:19";"416"
"17:20";"416"
"17:21";"414"
"17:22";"414"
"17:23";"413"
"17:24";"412"
"17:25";"411"
"17:26";"410"
"17:27";"410"
"17:28";"409"
"17:29";"408"
"17:30";"407"
"17:31";"406"
"17:32";"405"
"17:33";"404"
"17:34";"404"
"17:35";"403"
"17:36";"402"
"17:37";"401"
"17:38";"400"
"17:39";"400"
"17:40";"399"
"17:41";"398"
"17:42";"398"
"17:43";"396"
"17:44";"396"
"17:45";"395"
"17:46";"394"
"17:47";"394"
"17:48";"393"
"17:49";"392"
"17:50";"391"
"17:51";"391"
"17:52";"390"
"17:53";"389"
"17:54";"388"
"17:55";"388"
"17:56";"387"
"17:57";"386"
"17:58";"386"
"17:59";"385"
"18:00";"384"
"18:01";"383"
"18:02";"382"
"18:03";"381"
"18:04";"381"
"18:05";"380"
"18:06";"379"
"18:07";"379"
"18:08";"378"
"18:09";"377"
"18:10";"377"
"18:11";"376"
"18:12";"376"
"18:13";"374"
"18:14";"374"
"18:15";"373"
"18:16";"373"
"18:17";"372"
"18:18";"371"
"18:19";"371"
"18:20";"370"
"18:21";"369"
"18:22";"368"
"18:23";"368"
"18:24";"367"
"18:25";"366"
"18:26";"366"
"18:27";"365"
"18:28";"364"
"18:29";"363"
"18:30";"363"
"18:31";"362"
"18:32";"362"
"18:33";"361"
"18:34";"361"
"18:35";"360"
"18:36";"360"
"18:37";"359"
"18:38";"359"
"18:39";"358"
"18:40";"358"
"18:41";"357"
"18:42";"357"
"18:43";"356"
"18:44";"356"
"18:45";"355"
"18:46";"355"
"18:47";"354"
"18:48";"354"
"18:49";"353"
"18:50";"353"
"18:51";"352"
"18:52";"351"
"18:53";"351"
"18:54";"351"
"18:55";"350"
"18:56";"350"
"18:57";"350"
"18:58";"349"
"18:59";"349"
"19:00";"348"
"19:01";"348"
"19:02";"348"
"19:03";"347"
"19:04";"347"
"19:05";"347"
"19:06";"347"
"19:07";"347"
"19:08";"346"
"19:09";"346"
"19:10";"346"
"19:11";"345"
"19:12";"345"
"19:13";"345"
"19:14";"344"
"19:15";"344"
"19:16";"344"
"19:17";"344"
"19:18";"344"
"19:19";"344"
"19:20";"344"
"19:21";"344"
"19:22";"343"
"19:23";"343"
"19:24";"343"
"19:25";"343"
"19:26";"343"
"19:27";"343"
"19:28";"343"
"19:29";"343"
"19:30";"343"
"19:31";"343"
"19:32";"343"
"19:33";"344"
"19:34";"344"
"19:35";"344"
"19:36";"344"
"19:37";"344"
"19:38";"344"
"19:39";"344"
"19:40";"344"
"19:41";"344"
"19:42";"345"
"19:43";"344"
"19:44";"344"
"19:45";"344"
"19:46";"345"
"19:47";"345"
"19:48";"345"
"19:49";"345"
"19:50";"345"
"19:51";"345"
"19:52";"346"
"19:53";"346"
"19:54";"346"
"19:55";"347"
"19:56";"347"
"19:57";"347"
"19:58";"347"
"19:59";"347"
"20:00";"348"
"20:01";"348"
"20:02";"349"
"20:03";"349"
"20:04";"350"
"20:05";"350"
"20:06";"350"
"20:07";"351"
"20:08";"352"
"20:09";"353"
"20:10";"353"
"20:11";"353"
"20:12";"354"
"20:13";"355"
"20:14";"356"
"20:15";"356"
"20:16";"358"
"20:17";"358"
"20:18";"359"
"20:19";"359"
"20:20";"360"
"20:21";"361"
"20:22";"361"
"20:23";"362"
"20:24";"363"
"20:25";"364"
"20:26";"365"
"20:27";"367"
"20:28";"368"
"20:29";"368"
"20:30";"370"
"20:31";"371"
"20:32";"372"
"20:33";"373"
"20:34";"374"
"20:35";"375"
"20:36";"376"
"20:37";"377"
"20:38";"377"
"20:39";"378"
"20:40";"379"
"20:41";"380"
"20:42";"381"
"20:43";"382"
"20:44";"383"
"20:45";"385"
"20:46";"386"
"20:47";"387"
"20:48";"388"
"20:49";"389"
"20:50";"390"
"20:51";"391"
"20:52";"392"
"20:53";"393"
"20:54";"395"
"20:55";"396"
"20:56";"398"
"20:57";"399"
"20:58";"400"
"20:59";"402"
"21:00";"404"
"21:01";"405"
"21:02";"407"
"21:03";"408"
"21:04";"410"
"21:05";"412"
"21:06";"414"
"21:07";"417"
"21:08";"419"
"21:09";"422"
"21:10";"423"
"21:11";"425"
"21:12";"427"
"21:13";"429"
"21:14";"430"
"21:15";"432"
"21:16";"434"
"21:17";"435"
"21:18";"437"
"21:19";"439"
"21:20";"441"
"21:21";"442"
"21:22";"444"
"21:23";"446"
"21:24";"447"
"21:25";"449"
"21:26";"451"
"21:27";"452"
"21:28";"454"
"21:29";"456"
"21:30";"457"
"21:31";"459"
"21:32";"461"
"21:33";"463"
"21:34";"464"
"21:35";"466"
"21:36";"468"
"21:37";"469"
"21:38";"470"
"21:39";"472"
"21:40";"473"
"21:41";"475"
"21:42";"477"
"21:43";"478"
"21:44";"480"
"21:45";"481"
"21:46";"483"
"21:47";"484"
"21:48";"486"
"21:49";"487"
"21:50";"489"
"21:51";"490"
"21:52";"492"
"21:53";"493"
"21:54";"495"
"21:55";"496"
"21:56";"498"
"21:57";"499"
"21:58";"500"
"21:59";"502"
"22:00";"503"
"22:01";"505"
"22:02";"506"
"22:03";"507"
"22:04";"509"
"22:05";"510"
"22:06";"511"
"22:07";"513"
"22:08";"514"
"22:09";"516"
"22:10";"517"
"22:11";"519"
"22:12";"520"
"22:13";"522"
"22:14";"523"
"22:15";"524"
"22:16";"525"
"22:17";"526"
"22:18";"527"
"22:19";"529"
"22:20";"530"
"22:21";"531"
"22:22";"532"
"22:23";"534"
"22:24";"535"
"22:25";"536"
"22:26";"537"
"22:27";"539"
"22:28";"540"
"22:29";"541"
"22:30";"542"
"22:31";"543"
"22:32";"545"
"22:33";"546"
"22:34";"547"
"22:35";"548"
"22:36";"550"
"22:37";"551"
"22:38";"552"
"22:39";"554"
"22:40";"555"
"22:41";"556"
"22:42";"557"
"22:43";"559"
"22:44";"560"
"22:45";"561"
"22:46";"562"
"22:47";"563"
"22:48";"564"
"22:49";"566"
"22:50";"567"
"22:51";"568"
"22:52";"569"
"22:53";"570"
"22:54";"571"
"22:55";"572"
"22:56";"573"
"22:57";"574"
"22:58";"575"
"22:59";"576"
"23:00";"577"
"23:01";"578"
"23:02";"579"
"23:03";"580"
"23:04";"581"
"23:05";"582"
"23:06";"583"
"23:07";"584"
"23:08";"585"
"23:09";"586"
"23:10";"587"
"23:11";"588"
"23:12";"589"
"23:13";"590"
"23:14";"591"
"23:15";"592"
"23:16";"592"
"23:17";"593"
"23:18";"594"
"23:19";"595"
"23:20";"596"
"23:21";"597"
"23:22";"598"
"23:23";"599"
"23:24";"600"
"23:25";"600"
"23:26";"601"
"23:27";"602"
"23:28";"603"
"23:29";"603"
"23:30";"604"
"23:31";"605"
"23:32";"605"
"23:33";"606"
"23:34";"607"
"23:35";"608"
"23:36";"608"
"23:37";"608"
"23:38";"609"
"23:39";"610"
"23:40";"610"
"23:41";"611"
"23:42";"612"
"23:43";"613"
"23:44";"614"
"23:45";"615"
"23:46";"615"
"23:47";"616"
"23:48";"617"
"23:49";"618"
"23:50";"618"
"23:51";"619"
"23:52";"619"
"23:53";"620"
"23:54";"621"
"23:55";"621"
"23:56";"622"
"23:57";"623"
"23:58";"623"
"23:59";"624"
"24:00";"624"
