"16.10.2022";"Emden";"NORDSEE";"SPIEKEROOG";"9410010";"W_O";"cm";"XXX,XXX";"XX.XX.XXXX";"XX:XX";"PNP";"-5,08"
"00:01";"556"
"00:02";"556"
"00:03";"556"
"00:04";"557"
"00:05";"558"
"00:06";"559"
"00:07";"559"
"00:08";"560"
"00:09";"561"
"00:10";"562"
"00:11";"562"
"00:12";"563"
"00:13";"564"
"00:14";"564"
"00:15";"565"
"00:16";"566"
"00:17";"567"
"00:18";"568"
"00:19";"569"
"00:20";"569"
"00:21";"570"
"00:22";"571"
"00:23";"571"
"00:24";"572"
"00:25";"572"
"00:26";"573"
"00:27";"574"
"00:28";"575"
"00:29";"576"
"00:30";"576"
"00:31";"577"
"00:32";"578"
"00:33";"578"
"00:34";"579"
"00:35";"580"
"00:36";"581"
"00:37";"582"
"00:38";"583"
"00:39";"584"
"00:40";"584"
"00:41";"585"
"00:42";"586"
"00:43";"587"
"00:44";"588"
"00:45";"588"
"00:46";"589"
"00:47";"590"
"00:48";"590"
"00:49";"591"
"00:50";"592"
"00:51";"593"
"00:52";"594"
"00:53";"594"
"00:54";"595"
"00:55";"596"
"00:56";"597"
"00:57";"598"
"00:58";"598"
"00:59";"599"
"01:00";"599"
"01:01";"600"
"01:02";"601"
"01:03";"602"
"01:04";"603"
"01:05";"604"
"01:06";"604"
"01:07";"605"
"01:08";"606"
"01:09";"607"
"01:10";"607"
"01:11";"608"
"01:12";"609"
"01:13";"610"
"01:14";"611"
"01:15";"611"
"01:16";"612"
"01:17";"612"
"01:18";"613"
"01:19";"614"
"01:20";"615"
"01:21";"616"
"01:22";"616"
"01:23";"617"
"01:24";"617"
"01:25";"618"
"01:26";"619"
"01:27";"620"
"01:28";"620"
"01:29";"621"
"01:30";"621"
"01:31";"622"
"01:32";"623"
"01:33";"624"
"01:34";"624"
"01:35";"625"
"01:36";"625"
"01:37";"626"
"01:38";"627"
"01:39";"627"
"01:40";"628"
"01:41";"628"
"01:42";"629"
"01:43";"629"
"01:44";"630"
"01:45";"631"
"01:46";"631"
"01:47";"632"
"01:48";"632"
"01:49";"633"
"01:50";"633"
"01:51";"634"
"01:52";"635"
"01:53";"636"
"01:54";"636"
"01:55";"636"
"01:56";"637"
"01:57";"638"
"01:58";"638"
"01:59";"640"
"02:00";"640"
"02:01";"640"
"02:02";"641"
"02:03";"642"
"02:04";"643"
"02:05";"643"
"02:06";"643"
"02:07";"644"
"02:08";"644"
"02:09";"645"
"02:10";"645"
"02:11";"646"
"02:12";"646"
"02:13";"647"
"02:14";"647"
"02:15";"648"
"02:16";"648"
"02:17";"649"
"02:18";"649"
"02:19";"650"
"02:20";"651"
"02:21";"652"
"02:22";"652"
"02:23";"652"
"02:24";"653"
"02:25";"653"
"02:26";"654"
"02:27";"654"
"02:28";"654"
"02:29";"655"
"02:30";"655"
"02:31";"656"
"02:32";"656"
"02:33";"656"
"02:34";"656"
"02:35";"657"
"02:36";"656"
"02:37";"656"
"02:38";"656"
"02:39";"657"
"02:40";"657"
"02:41";"657"
"02:42";"658"
"02:43";"658"
"02:44";"658"
"02:45";"659"
"02:46";"659"
"02:47";"659"
"02:48";"659"
"02:49";"659"
"02:50";"659"
"02:51";"659"
"02:52";"659"
"02:53";"659"
"02:54";"660"
"02:55";"660"
"02:56";"660"
"02:57";"660"
"02:58";"660"
"02:59";"660"
"03:00";"660"
"03:01";"660"
"03:02";"660"
"03:03";"660"
"03:04";"660"
"03:05";"660"
"03:06";"660"
"03:07";"660"
"03:08";"660"
"03:09";"660"
"03:10";"660"
"03:11";"660"
"03:12";"660"
"03:13";"660"
"03:14";"659"
"03:15";"660"
"03:16";"659"
"03:17";"658"
"03:18";"658"
"03:19";"658"
"03:20";"658"
"03:21";"657"
"03:22";"657"
"03:23";"656"
"03:24";"656"
"03:25";"656"
"03:26";"656"
"03:27";"656"
"03:28";"655"
"03:29";"655"
"03:30";"654"
"03:31";"654"
"03:32";"654"
"03:33";"653"
"03:34";"653"
"03:35";"652"
"03:36";"652"
"03:37";"651"
"03:38";"650"
"03:39";"650"
"03:40";"650"
"03:41";"649"
"03:42";"648"
"03:43";"648"
"03:44";"648"
"03:45";"647"
"03:46";"647"
"03:47";"646"
"03:48";"646"
"03:49";"646"
"03:50";"645"
"03:51";"645"
"03:52";"644"
"03:53";"644"
"03:54";"644"
"03:55";"643"
"03:56";"643"
"03:57";"642"
"03:58";"641"
"03:59";"640"
"04:00";"640"
"04:01";"639"
"04:02";"639"
"04:03";"638"
"04:04";"638"
"04:05";"637"
"04:06";"636"
"04:07";"635"
"04:08";"635"
"04:09";"634"
"04:10";"633"
"04:11";"632"
"04:12";"632"
"04:13";"631"
"04:14";"630"
"04:15";"630"
"04:16";"629"
"04:17";"628"
"04:18";"628"
"04:19";"627"
"04:20";"626"
"04:21";"625"
"04:22";"624"
"04:23";"623"
"04:24";"622"
"04:25";"622"
"04:26";"620"
"04:27";"620"
"04:28";"619"
"04:29";"619"
"04:30";"618"
"04:31";"617"
"04:32";"616"
"04:33";"616"
"04:34";"615"
"04:35";"615"
"04:36";"613"
"04:37";"612"
"04:38";"611"
"04:39";"611"
"04:40";"610"
"04:41";"609"
"04:42";"608"
"04:43";"608"
"04:44";"607"
"04:45";"605"
"04:46";"605"
"04:47";"604"
"04:48";"603"
"04:49";"603"
"04:50";"602"
"04:51";"601"
"04:52";"600"
"04:53";"598"
"04:54";"598"
"04:55";"597"
"04:56";"596"
"04:57";"595"
"04:58";"595"
"04:59";"595"
"05:00";"594"
"05:01";"593"
"05:02";"592"
"05:03";"591"
"05:04";"590"
"05:05";"589"
"05:06";"588"
"05:07";"588"
"05:08";"587"
"05:09";"586"
"05:10";"585"
"05:11";"584"
"05:12";"583"
"05:13";"582"
"05:14";"581"
"05:15";"580"
"05:16";"579"
"05:17";"579"
"05:18";"578"
"05:19";"577"
"05:20";"576"
"05:21";"575"
"05:22";"574"
"05:23";"573"
"05:24";"572"
"05:25";"571"
"05:26";"570"
"05:27";"570"
"05:28";"568"
"05:29";"568"
"05:30";"567"
"05:31";"566"
"05:32";"565"
"05:33";"564"
"05:34";"563"
"05:35";"562"
"05:36";"561"
"05:37";"560"
"05:38";"559"
"05:39";"557"
"05:40";"556"
"05:41";"555"
"05:42";"554"
"05:43";"553"
"05:44";"552"
"05:45";"552"
"05:46";"552"
"05:47";"550"
"05:48";"549"
"05:49";"549"
"05:50";"548"
"05:51";"547"
"05:52";"547"
"05:53";"546"
"05:54";"544"
"05:55";"544"
"05:56";"542"
"05:57";"541"
"05:58";"540"
"05:59";"540"
"06:00";"538"
"06:01";"537"
"06:02";"536"
"06:03";"536"
"06:04";"535"
"06:05";"534"
"06:06";"533"
"06:07";"533"
"06:08";"532"
"06:09";"530"
"06:10";"530"
"06:11";"528"
"06:12";"528"
"06:13";"527"
"06:14";"526"
"06:15";"525"
"06:16";"524"
"06:17";"523"
"06:18";"522"
"06:19";"521"
"06:20";"520"
"06:21";"519"
"06:22";"519"
"06:23";"518"
"06:24";"516"
"06:25";"516"
"06:26";"516"
"06:27";"515"
"06:28";"514"
"06:29";"513"
"06:30";"512"
"06:31";"511"
"06:32";"510"
"06:33";"510"
"06:34";"509"
"06:35";"508"
"06:36";"508"
"06:37";"506"
"06:38";"506"
"06:39";"505"
"06:40";"504"
"06:41";"504"
"06:42";"503"
"06:43";"502"
"06:44";"501"
"06:45";"500"
"06:46";"499"
"06:47";"498"
"06:48";"497"
"06:49";"496"
"06:50";"495"
"06:51";"494"
"06:52";"493"
"06:53";"492"
"06:54";"491"
"06:55";"491"
"06:56";"489"
"06:57";"489"
"06:58";"488"
"06:59";"488"
"07:00";"488"
"07:01";"487"
"07:02";"486"
"07:03";"486"
"07:04";"485"
"07:05";"485"
"07:06";"484"
"07:07";"483"
"07:08";"483"
"07:09";"482"
"07:10";"480"
"07:11";"481"
"07:12";"479"
"07:13";"479"
"07:14";"478"
"07:15";"477"
"07:16";"476"
"07:17";"475"
"07:18";"475"
"07:19";"474"
"07:20";"474"
"07:21";"473"
"07:22";"472"
"07:23";"471"
"07:24";"470"
"07:25";"469"
"07:26";"468"
"07:27";"468"
"07:28";"467"
"07:29";"467"
"07:30";"466"
"07:31";"465"
"07:32";"464"
"07:33";"464"
"07:34";"463"
"07:35";"462"
"07:36";"461"
"07:37";"460"
"07:38";"460"
"07:39";"459"
"07:40";"459"
"07:41";"458"
"07:42";"457"
"07:43";"456"
"07:44";"456"
"07:45";"455"
"07:46";"455"
"07:47";"454"
"07:48";"453"
"07:49";"453"
"07:50";"453"
"07:51";"452"
"07:52";"451"
"07:53";"450"
"07:54";"449"
"07:55";"449"
"07:56";"448"
"07:57";"447"
"07:58";"447"
"07:59";"447"
"08:00";"446"
"08:01";"446"
"08:02";"445"
"08:03";"445"
"08:04";"444"
"08:05";"444"
"08:06";"443"
"08:07";"442"
"08:08";"442"
"08:09";"441"
"08:10";"440"
"08:11";"441"
"08:12";"440"
"08:13";"440"
"08:14";"439"
"08:15";"438"
"08:16";"438"
"08:17";"438"
"08:18";"437"
"08:19";"437"
"08:20";"437"
"08:21";"436"
"08:22";"435"
"08:23";"435"
"08:24";"434"
"08:25";"433"
"08:26";"432"
"08:27";"432"
"08:28";"432"
"08:29";"431"
"08:30";"430"
"08:31";"430"
"08:32";"429"
"08:33";"428"
"08:34";"429"
"08:35";"428"
"08:36";"428"
"08:37";"427"
"08:38";"427"
"08:39";"427"
"08:40";"427"
"08:41";"427"
"08:42";"427"
"08:43";"427"
"08:44";"427"
"08:45";"427"
"08:46";"427"
"08:47";"427"
"08:48";"427"
"08:49";"427"
"08:50";"427"
"08:51";"427"
"08:52";"427"
"08:53";"427"
"08:54";"427"
"08:55";"427"
"08:56";"426"
"08:57";"426"
"08:58";"426"
"08:59";"426"
"09:00";"426"
"09:01";"426"
"09:02";"426"
"09:03";"427"
"09:04";"427"
"09:05";"427"
"09:06";"427"
"09:07";"427"
"09:08";"427"
"09:09";"428"
"09:10";"428"
"09:11";"428"
"09:12";"428"
"09:13";"428"
"09:14";"428"
"09:15";"428"
"09:16";"428"
"09:17";"429"
"09:18";"429"
"09:19";"430"
"09:20";"430"
"09:21";"430"
"09:22";"430"
"09:23";"431"
"09:24";"431"
"09:25";"432"
"09:26";"432"
"09:27";"432"
"09:28";"432"
"09:29";"433"
"09:30";"432"
"09:31";"432"
"09:32";"432"
"09:33";"432"
"09:34";"432"
"09:35";"433"
"09:36";"432"
"09:37";"432"
"09:38";"433"
"09:39";"433"
"09:40";"434"
"09:41";"434"
"09:42";"434"
"09:43";"435"
"09:44";"435"
"09:45";"436"
"09:46";"437"
"09:47";"437"
"09:48";"438"
"09:49";"439"
"09:50";"440"
"09:51";"441"
"09:52";"441"
"09:53";"442"
"09:54";"442"
"09:55";"443"
"09:56";"443"
"09:57";"444"
"09:58";"444"
"09:59";"445"
"10:00";"445"
"10:01";"446"
"10:02";"446"
"10:03";"447"
"10:04";"448"
"10:05";"448"
"10:06";"449"
"10:07";"450"
"10:08";"450"
"10:09";"451"
"10:10";"452"
"10:11";"453"
"10:12";"454"
"10:13";"455"
"10:14";"456"
"10:15";"457"
"10:16";"458"
"10:17";"459"
"10:18";"460"
"10:19";"461"
"10:20";"462"
"10:21";"463"
"10:22";"464"
"10:23";"464"
"10:24";"465"
"10:25";"466"
"10:26";"467"
"10:27";"468"
"10:28";"469"
"10:29";"470"
"10:30";"470"
"10:31";"471"
"10:32";"472"
"10:33";"473"
"10:34";"474"
"10:35";"476"
"10:36";"477"
"10:37";"478"
"10:38";"479"
"10:39";"481"
"10:40";"482"
"10:41";"483"
"10:42";"484"
"10:43";"486"
"10:44";"487"
"10:45";"488"
"10:46";"489"
"10:47";"491"
"10:48";"492"
"10:49";"493"
"10:50";"495"
"10:51";"496"
"10:52";"498"
"10:53";"499"
"10:54";"500"
"10:55";"500"
"10:56";"501"
"10:57";"502"
"10:58";"503"
"10:59";"504"
"11:00";"505"
"11:01";"507"
"11:02";"508"
"11:03";"509"
"11:04";"511"
"11:05";"513"
"11:06";"514"
"11:07";"515"
"11:08";"516"
"11:09";"517"
"11:10";"518"
"11:11";"519"
"11:12";"520"
"11:13";"520"
"11:14";"521"
"11:15";"523"
"11:16";"524"
"11:17";"525"
"11:18";"525"
"11:19";"527"
"11:20";"528"
"11:21";"529"
"11:22";"530"
"11:23";"531"
"11:24";"532"
"11:25";"532"
"11:26";"533"
"11:27";"534"
"11:28";"535"
"11:29";"536"
"11:30";"536"
"11:31";"537"
"11:32";"539"
"11:33";"540"
"11:34";"540"
"11:35";"541"
"11:36";"542"
"11:37";"543"
"11:38";"544"
"11:39";"544"
"11:40";"544"
"11:41";"546"
"11:42";"547"
"11:43";"548"
"11:44";"548"
"11:45";"549"
"11:46";"550"
"11:47";"551"
"11:48";"552"
"11:49";"552"
"11:50";"553"
"11:51";"554"
"11:52";"555"
"11:53";"556"
"11:54";"557"
"11:55";"558"
"11:56";"559"
"11:57";"559"
"11:58";"561"
"11:59";"561"
"12:00";"561"
"12:01";"563"
"12:02";"563"
"12:03";"564"
"12:04";"565"
"12:05";"566"
"12:06";"567"
"12:07";"568"
"12:08";"569"
"12:09";"570"
"12:10";"571"
"12:11";"571"
"12:12";"572"
"12:13";"573"
"12:14";"573"
"12:15";"574"
"12:16";"576"
"12:17";"576"
"12:18";"577"
"12:19";"578"
"12:20";"579"
"12:21";"580"
"12:22";"580"
"12:23";"581"
"12:24";"582"
"12:25";"583"
"12:26";"584"
"12:27";"584"
"12:28";"585"
"12:29";"586"
"12:30";"586"
"12:31";"587"
"12:32";"588"
"12:33";"588"
"12:34";"589"
"12:35";"590"
"12:36";"590"
"12:37";"591"
"12:38";"591"
"12:39";"592"
"12:40";"592"
"12:41";"593"
"12:42";"593"
"12:43";"594"
"12:44";"595"
"12:45";"595"
"12:46";"596"
"12:47";"597"
"12:48";"599"
"12:49";"600"
"12:50";"600"
"12:51";"601"
"12:52";"602"
"12:53";"602"
"12:54";"603"
"12:55";"603"
"12:56";"604"
"12:57";"605"
"12:58";"605"
"12:59";"606"
"13:00";"607"
"13:01";"608"
"13:02";"608"
"13:03";"609"
"13:04";"610"
"13:05";"611"
"13:06";"611"
"13:07";"612"
"13:08";"613"
"13:09";"615"
"13:10";"615"
"13:11";"615"
"13:12";"616"
"13:13";"616"
"13:14";"617"
"13:15";"618"
"13:16";"619"
"13:17";"619"
"13:18";"620"
"13:19";"620"
"13:20";"620"
"13:21";"620"
"13:22";"621"
"13:23";"622"
"13:24";"622"
"13:25";"623"
"13:26";"623"
"13:27";"623"
"13:28";"624"
"13:29";"624"
"13:30";"624"
"13:31";"624"
"13:32";"625"
"13:33";"625"
"13:34";"626"
"13:35";"627"
"13:36";"627"
"13:37";"628"
"13:38";"628"
"13:39";"628"
"13:40";"629"
"13:41";"630"
"13:42";"630"
"13:43";"631"
"13:44";"632"
"13:45";"632"
"13:46";"632"
"13:47";"633"
"13:48";"634"
"13:49";"634"
"13:50";"635"
"13:51";"635"
"13:52";"636"
"13:53";"636"
"13:54";"637"
"13:55";"638"
"13:56";"638"
"13:57";"639"
"13:58";"638"
"13:59";"639"
"14:00";"639"
"14:01";"639"
"14:02";"639"
"14:03";"639"
"14:04";"639"
"14:05";"639"
"14:06";"639"
"14:07";"640"
"14:08";"640"
"14:09";"640"
"14:10";"640"
"14:11";"640"
"14:12";"640"
"14:13";"641"
"14:14";"642"
"14:15";"642"
"14:16";"642"
"14:17";"643"
"14:18";"643"
"14:19";"643"
"14:20";"643"
"14:21";"643"
"14:22";"644"
"14:23";"643"
"14:24";"644"
"14:25";"645"
"14:26";"644"
"14:27";"645"
"14:28";"645"
"14:29";"645"
"14:30";"646"
"14:31";"646"
"14:32";"647"
"14:33";"647"
"14:34";"647"
"14:35";"648"
"14:36";"647"
"14:37";"647"
"14:38";"647"
"14:39";"647"
"14:40";"647"
"14:41";"646"
"14:42";"646"
"14:43";"646"
"14:44";"647"
"14:45";"647"
"14:46";"647"
"14:47";"647"
"14:48";"647"
"14:49";"648"
"14:50";"647"
"14:51";"647"
"14:52";"647"
"14:53";"647"
"14:54";"647"
"14:55";"647"
"14:56";"647"
"14:57";"647"
"14:58";"647"
"14:59";"647"
"15:00";"647"
"15:01";"647"
"15:02";"647"
"15:03";"648"
"15:04";"648"
"15:05";"648"
"15:06";"647"
"15:07";"647"
"15:08";"647"
"15:09";"646"
"15:10";"646"
"15:11";"645"
"15:12";"645"
"15:13";"645"
"15:14";"645"
"15:15";"645"
"15:16";"645"
"15:17";"645"
"15:18";"645"
"15:19";"645"
"15:20";"645"
"15:21";"644"
"15:22";"644"
"15:23";"644"
"15:24";"643"
"15:25";"644"
"15:26";"643"
"15:27";"643"
"15:28";"643"
"15:29";"642"
"15:30";"642"
"15:31";"641"
"15:32";"641"
"15:33";"641"
"15:34";"640"
"15:35";"640"
"15:36";"640"
"15:37";"640"
"15:38";"639"
"15:39";"639"
"15:40";"639"
"15:41";"639"
"15:42";"639"
"15:43";"638"
"15:44";"638"
"15:45";"637"
"15:46";"636"
"15:47";"636"
"15:48";"635"
"15:49";"635"
"15:50";"635"
"15:51";"635"
"15:52";"635"
"15:53";"634"
"15:54";"634"
"15:55";"633"
"15:56";"633"
"15:57";"632"
"15:58";"632"
"15:59";"631"
"16:00";"631"
"16:01";"630"
"16:02";"630"
"16:03";"630"
"16:04";"630"
"16:05";"630"
"16:06";"629"
"16:07";"629"
"16:08";"628"
"16:09";"628"
"16:10";"628"
"16:11";"628"
"16:12";"627"
"16:13";"627"
"16:14";"627"
"16:15";"626"
"16:16";"626"
"16:17";"625"
"16:18";"624"
"16:19";"624"
"16:20";"624"
"16:21";"623"
"16:22";"623"
"16:23";"622"
"16:24";"622"
"16:25";"621"
"16:26";"620"
"16:27";"620"
"16:28";"619"
"16:29";"619"
"16:30";"618"
"16:31";"618"
"16:32";"617"
"16:33";"616"
"16:34";"616"
"16:35";"615"
"16:36";"615"
"16:37";"614"
"16:38";"613"
"16:39";"613"
"16:40";"612"
"16:41";"611"
"16:42";"611"
"16:43";"611"
"16:44";"610"
"16:45";"610"
"16:46";"609"
"16:47";"608"
"16:48";"608"
"16:49";"607"
"16:50";"607"
"16:51";"606"
"16:52";"606"
"16:53";"605"
"16:54";"604"
"16:55";"604"
"16:56";"603"
"16:57";"602"
"16:58";"601"
"16:59";"600"
"17:00";"599"
"17:01";"599"
"17:02";"599"
"17:03";"598"
"17:04";"597"
"17:05";"596"
"17:06";"595"
"17:07";"595"
"17:08";"593"
"17:09";"593"
"17:10";"592"
"17:11";"591"
"17:12";"590"
"17:13";"590"
"17:14";"588"
"17:15";"588"
"17:16";"588"
"17:17";"586"
"17:18";"586"
"17:19";"585"
"17:20";"584"
"17:21";"584"
"17:22";"583"
"17:23";"582"
"17:24";"581"
"17:25";"580"
"17:26";"580"
"17:27";"579"
"17:28";"577"
"17:29";"577"
"17:30";"576"
"17:31";"575"
"17:32";"574"
"17:33";"573"
"17:34";"572"
"17:35";"572"
"17:36";"571"
"17:37";"570"
"17:38";"569"
"17:39";"569"
"17:40";"568"
"17:41";"567"
"17:42";"566"
"17:43";"565"
"17:44";"564"
"17:45";"564"
"17:46";"563"
"17:47";"562"
"17:48";"561"
"17:49";"560"
"17:50";"559"
"17:51";"558"
"17:52";"557"
"17:53";"556"
"17:54";"555"
"17:55";"554"
"17:56";"553"
"17:57";"552"
"17:58";"552"
"17:59";"551"
"18:00";"550"
"18:01";"550"
"18:02";"548"
"18:03";"548"
"18:04";"547"
"18:05";"547"
"18:06";"546"
"18:07";"545"
"18:08";"544"
"18:09";"544"
"18:10";"543"
"18:11";"542"
"18:12";"541"
"18:13";"540"
"18:14";"540"
"18:15";"539"
"18:16";"538"
"18:17";"537"
"18:18";"536"
"18:19";"536"
"18:20";"534"
"18:21";"534"
"18:22";"533"
"18:23";"532"
"18:24";"531"
"18:25";"530"
"18:26";"529"
"18:27";"528"
"18:28";"528"
"18:29";"527"
"18:30";"526"
"18:31";"525"
"18:32";"524"
"18:33";"524"
"18:34";"523"
"18:35";"522"
"18:36";"521"
"18:37";"520"
"18:38";"520"
"18:39";"518"
"18:40";"517"
"18:41";"516"
"18:42";"516"
"18:43";"515"
"18:44";"514"
"18:45";"513"
"18:46";"513"
"18:47";"512"
"18:48";"512"
"18:49";"510"
"18:50";"509"
"18:51";"508"
"18:52";"508"
"18:53";"507"
"18:54";"506"
"18:55";"505"
"18:56";"504"
"18:57";"504"
"18:58";"503"
"18:59";"502"
"19:00";"502"
"19:01";"501"
"19:02";"500"
"19:03";"500"
"19:04";"499"
"19:05";"498"
"19:06";"497"
"19:07";"496"
"19:08";"496"
"19:09";"494"
"19:10";"494"
"19:11";"493"
"19:12";"492"
"19:13";"490"
"19:14";"490"
"19:15";"489"
"19:16";"488"
"19:17";"488"
"19:18";"487"
"19:19";"485"
"19:20";"484"
"19:21";"484"
"19:22";"482"
"19:23";"482"
"19:24";"481"
"19:25";"481"
"19:26";"480"
"19:27";"479"
"19:28";"478"
"19:29";"477"
"19:30";"477"
"19:31";"476"
"19:32";"475"
"19:33";"475"
"19:34";"473"
"19:35";"472"
"19:36";"472"
"19:37";"471"
"19:38";"470"
"19:39";"470"
"19:40";"469"
"19:41";"468"
"19:42";"467"
"19:43";"466"
"19:44";"465"
"19:45";"464"
"19:46";"464"
"19:47";"463"
"19:48";"462"
"19:49";"461"
"19:50";"460"
"19:51";"459"
"19:52";"459"
"19:53";"458"
"19:54";"456"
"19:55";"456"
"19:56";"456"
"19:57";"455"
"19:58";"454"
"19:59";"454"
"20:00";"453"
"20:01";"452"
"20:02";"452"
"20:03";"451"
"20:04";"450"
"20:05";"450"
"20:06";"449"
"20:07";"448"
"20:08";"447"
"20:09";"447"
"20:10";"446"
"20:11";"445"
"20:12";"445"
"20:13";"444"
"20:14";"444"
"20:15";"443"
"20:16";"443"
"20:17";"442"
"20:18";"441"
"20:19";"441"
"20:20";"441"
"20:21";"440"
"20:22";"439"
"20:23";"438"
"20:24";"437"
"20:25";"437"
"20:26";"437"
"20:27";"436"
"20:28";"436"
"20:29";"435"
"20:30";"435"
"20:31";"434"
"20:32";"433"
"20:33";"433"
"20:34";"432"
"20:35";"432"
"20:36";"431"
"20:37";"431"
"20:38";"430"
"20:39";"430"
"20:40";"429"
"20:41";"429"
"20:42";"428"
"20:43";"428"
"20:44";"427"
"20:45";"426"
"20:46";"426"
"20:47";"425"
"20:48";"425"
"20:49";"424"
"20:50";"424"
"20:51";"423"
"20:52";"423"
"20:53";"422"
"20:54";"422"
"20:55";"421"
"20:56";"421"
"20:57";"420"
"20:58";"420"
"20:59";"420"
"21:00";"420"
"21:01";"420"
"21:02";"420"
"21:03";"420"
"21:04";"419"
"21:05";"419"
"21:06";"419"
"21:07";"419"
"21:08";"419"
"21:09";"418"
"21:10";"418"
"21:11";"418"
"21:12";"418"
"21:13";"418"
"21:14";"418"
"21:15";"418"
"21:16";"418"
"21:17";"417"
"21:18";"417"
"21:19";"417"
"21:20";"416"
"21:21";"416"
"21:22";"416"
"21:23";"416"
"21:24";"415"
"21:25";"415"
"21:26";"415"
"21:27";"415"
"21:28";"415"
"21:29";"415"
"21:30";"415"
"21:31";"415"
"21:32";"415"
"21:33";"415"
"21:34";"415"
"21:35";"415"
"21:36";"415"
"21:37";"415"
"21:38";"415"
"21:39";"415"
"21:40";"416"
"21:41";"416"
"21:42";"416"
"21:43";"417"
"21:44";"417"
"21:45";"417"
"21:46";"417"
"21:47";"418"
"21:48";"418"
"21:49";"418"
"21:50";"418"
"21:51";"419"
"21:52";"419"
"21:53";"420"
"21:54";"420"
"21:55";"420"
"21:56";"420"
"21:57";"420"
"21:58";"421"
"21:59";"422"
"22:00";"422"
"22:01";"423"
"22:02";"423"
"22:03";"424"
"22:04";"424"
"22:05";"424"
"22:06";"424"
"22:07";"425"
"22:08";"425"
"22:09";"427"
"22:10";"427"
"22:11";"428"
"22:12";"428"
"22:13";"428"
"22:14";"430"
"22:15";"430"
"22:16";"431"
"22:17";"432"
"22:18";"432"
"22:19";"432"
"22:20";"432"
"22:21";"432"
"22:22";"434"
"22:23";"433"
"22:24";"434"
"22:25";"434"
"22:26";"435"
"22:27";"436"
"22:28";"436"
"22:29";"436"
"22:30";"437"
"22:31";"438"
"22:32";"439"
"22:33";"439"
"22:34";"440"
"22:35";"441"
"22:36";"442"
"22:37";"443"
"22:38";"445"
"22:39";"445"
"22:40";"446"
"22:41";"447"
"22:42";"448"
"22:43";"449"
"22:44";"450"
"22:45";"451"
"22:46";"452"
"22:47";"453"
"22:48";"454"
"22:49";"455"
"22:50";"456"
"22:51";"458"
"22:52";"459"
"22:53";"460"
"22:54";"460"
"22:55";"461"
"22:56";"462"
"22:57";"463"
"22:58";"464"
"22:59";"464"
"23:00";"466"
"23:01";"467"
"23:02";"468"
"23:03";"469"
"23:04";"470"
"23:05";"470"
"23:06";"472"
"23:07";"473"
"23:08";"474"
"23:09";"475"
"23:10";"476"
"23:11";"478"
"23:12";"479"
"23:13";"480"
"23:14";"482"
"23:15";"483"
"23:16";"484"
"23:17";"485"
"23:18";"487"
"23:19";"488"
"23:20";"489"
"23:21";"490"
"23:22";"491"
"23:23";"493"
"23:24";"493"
"23:25";"494"
"23:26";"495"
"23:27";"496"
"23:28";"497"
"23:29";"499"
"23:30";"500"
"23:31";"501"
"23:32";"502"
"23:33";"503"
"23:34";"504"
"23:35";"504"
"23:36";"506"
"23:37";"507"
"23:38";"508"
"23:39";"510"
"23:40";"511"
"23:41";"512"
"23:42";"513"
"23:43";"514"
"23:44";"515"
"23:45";"516"
"23:46";"517"
"23:47";"518"
"23:48";"519"
"23:49";"520"
"23:50";"520"
"23:51";"521"
"23:52";"522"
"23:53";"523"
"23:54";"524"
"23:55";"524"
"23:56";"525"
"23:57";"526"
"23:58";"526"
"23:59";"528"
"24:00";"528"
