"05.10.2022";"Wilhelmshaven";"JADE";"WANGEROOGE WEST ";"9420040";"W_O";"cm";"XXX,XXX";"XX.XX.XXXX";"XX:XX";"PNP";"-5,05"
"00:01";"451"
"00:02";"451"
"00:03";"451"
"00:04";"451"
"00:05";"451"
"00:06";"452"
"00:07";"452"
"00:08";"452"
"00:09";"451"
"00:10";"451"
"00:11";"452"
"00:12";"451"
"00:13";"452"
"00:14";"453"
"00:15";"453"
"00:16";"454"
"00:17";"455"
"00:18";"455"
"00:19";"455"
"00:20";"457"
"00:21";"455"
"00:22";"455"
"00:23";"455"
"00:24";"457"
"00:25";"455"
"00:26";"455"
"00:27";"455"
"00:28";"455"
"00:29";"457"
"00:30";"457"
"00:31";"458"
"00:32";"455"
"00:33";"455"
"00:34";"455"
"00:35";"458"
"00:36";"457"
"00:37";"457"
"00:38";"458"
"00:39";"458"
"00:40";"458"
"00:41";"460"
"00:42";"461"
"00:43";"460"
"00:44";"461"
"00:45";"461"
"00:46";"461"
"00:47";"461"
"00:48";"461"
"00:49";"460"
"00:50";"461"
"00:51";"462"
"00:52";"462"
"00:53";"462"
"00:54";"462"
"00:55";"462"
"00:56";"464"
"00:57";"462"
"00:58";"462"
"00:59";"462"
"01:00";"464"
"01:01";"464"
"01:02";"464"
"01:03";"465"
"01:04";"466"
"01:05";"467"
"01:06";"468"
"01:07";"469"
"01:08";"468"
"01:09";"469"
"01:10";"471"
"01:11";"472"
"01:12";"472"
"01:13";"472"
"01:14";"472"
"01:15";"472"
"01:16";"472"
"01:17";"472"
"01:18";"474"
"01:19";"472"
"01:20";"474"
"01:21";"475"
"01:22";"475"
"01:23";"476"
"01:24";"477"
"01:25";"477"
"01:26";"478"
"01:27";"478"
"01:28";"479"
"01:29";"481"
"01:30";"479"
"01:31";"481"
"01:32";"482"
"01:33";"482"
"01:34";"484"
"01:35";"485"
"01:36";"485"
"01:37";"485"
"01:38";"486"
"01:39";"486"
"01:40";"488"
"01:41";"488"
"01:42";"489"
"01:43";"491"
"01:44";"492"
"01:45";"492"
"01:46";"492"
"01:47";"493"
"01:48";"494"
"01:49";"496"
"01:50";"495"
"01:51";"496"
"01:52";"498"
"01:53";"499"
"01:54";"500"
"01:55";"501"
"01:56";"502"
"01:57";"502"
"01:58";"503"
"01:59";"503"
"02:00";"503"
"02:01";"505"
"02:02";"506"
"02:03";"507"
"02:04";"508"
"02:05";"508"
"02:06";"509"
"02:07";"509"
"02:08";"509"
"02:09";"510"
"02:10";"512"
"02:11";"513"
"02:12";"513"
"02:13";"515"
"02:14";"516"
"02:15";"517"
"02:16";"517"
"02:17";"517"
"02:18";"518"
"02:19";"519"
"02:20";"520"
"02:21";"520"
"02:22";"523"
"02:23";"523"
"02:24";"524"
"02:25";"524"
"02:26";"526"
"02:27";"526"
"02:28";"527"
"02:29";"527"
"02:30";"529"
"02:31";"530"
"02:32";"530"
"02:33";"530"
"02:34";"532"
"02:35";"532"
"02:36";"533"
"02:37";"534"
"02:38";"534"
"02:39";"534"
"02:40";"536"
"02:41";"537"
"02:42";"539"
"02:43";"539"
"02:44";"540"
"02:45";"540"
"02:46";"540"
"02:47";"541"
"02:48";"541"
"02:49";"542"
"02:50";"544"
"02:51";"544"
"02:52";"544"
"02:53";"546"
"02:54";"547"
"02:55";"547"
"02:56";"548"
"02:57";"548"
"02:58";"549"
"02:59";"550"
"03:00";"551"
"03:01";"551"
"03:02";"551"
"03:03";"554"
"03:04";"553"
"03:05";"554"
"03:06";"554"
"03:07";"557"
"03:08";"558"
"03:09";"558"
"03:10";"558"
"03:11";"558"
"03:12";"560"
"03:13";"561"
"03:14";"561"
"03:15";"564"
"03:16";"564"
"03:17";"564"
"03:18";"564"
"03:19";"565"
"03:20";"567"
"03:21";"567"
"03:22";"570"
"03:23";"568"
"03:24";"571"
"03:25";"570"
"03:26";"571"
"03:27";"571"
"03:28";"572"
"03:29";"573"
"03:30";"574"
"03:31";"575"
"03:32";"575"
"03:33";"575"
"03:34";"577"
"03:35";"578"
"03:36";"578"
"03:37";"578"
"03:38";"579"
"03:39";"580"
"03:40";"582"
"03:41";"582"
"03:42";"584"
"03:43";"585"
"03:44";"585"
"03:45";"587"
"03:46";"588"
"03:47";"588"
"03:48";"588"
"03:49";"589"
"03:50";"590"
"03:51";"591"
"03:52";"591"
"03:53";"592"
"03:54";"592"
"03:55";"592"
"03:56";"594"
"03:57";"595"
"03:58";"596"
"03:59";"597"
"04:00";"598"
"04:01";"599"
"04:02";"599"
"04:03";"601"
"04:04";"601"
"04:05";"602"
"04:06";"602"
"04:07";"603"
"04:08";"604"
"04:09";"603"
"04:10";"605"
"04:11";"605"
"04:12";"606"
"04:13";"606"
"04:14";"608"
"04:15";"608"
"04:16";"608"
"04:17";"610"
"04:18";"609"
"04:19";"610"
"04:20";"611"
"04:21";"611"
"04:22";"612"
"04:23";"612"
"04:24";"613"
"04:25";"614"
"04:26";"616"
"04:27";"616"
"04:28";"619"
"04:29";"619"
"04:30";"619"
"04:31";"619"
"04:32";"619"
"04:33";"621"
"04:34";"622"
"04:35";"622"
"04:36";"621"
"04:37";"623"
"04:38";"623"
"04:39";"626"
"04:40";"626"
"04:41";"626"
"04:42";"626"
"04:43";"626"
"04:44";"627"
"04:45";"626"
"04:46";"629"
"04:47";"629"
"04:48";"630"
"04:49";"630"
"04:50";"632"
"04:51";"631"
"04:52";"632"
"04:53";"633"
"04:54";"633"
"04:55";"635"
"04:56";"636"
"04:57";"636"
"04:58";"637"
"04:59";"636"
"05:00";"636"
"05:01";"636"
"05:02";"637"
"05:03";"639"
"05:04";"638"
"05:05";"638"
"05:06";"639"
"05:07";"639"
"05:08";"640"
"05:09";"642"
"05:10";"643"
"05:11";"642"
"05:12";"642"
"05:13";"642"
"05:14";"643"
"05:15";"643"
"05:16";"645"
"05:17";"645"
"05:18";"646"
"05:19";"645"
"05:20";"645"
"05:21";"646"
"05:22";"646"
"05:23";"646"
"05:24";"646"
"05:25";"647"
"05:26";"647"
"05:27";"647"
"05:28";"650"
"05:29";"648"
"05:30";"647"
"05:31";"648"
"05:32";"648"
"05:33";"648"
"05:34";"650"
"05:35";"651"
"05:36";"651"
"05:37";"652"
"05:38";"652"
"05:39";"652"
"05:40";"654"
"05:41";"653"
"05:42";"653"
"05:43";"653"
"05:44";"653"
"05:45";"652"
"05:46";"652"
"05:47";"654"
"05:48";"654"
"05:49";"654"
"05:50";"654"
"05:51";"654"
"05:52";"656"
"05:53";"656"
"05:54";"656"
"05:55";"657"
"05:56";"657"
"05:57";"657"
"05:58";"657"
"05:59";"657"
"06:00";"657"
"06:01";"657"
"06:02";"657"
"06:03";"657"
"06:04";"657"
"06:05";"657"
"06:06";"656"
"06:07";"656"
"06:08";"654"
"06:09";"656"
"06:10";"654"
"06:11";"656"
"06:12";"657"
"06:13";"656"
"06:14";"654"
"06:15";"655"
"06:16";"656"
"06:17";"656"
"06:18";"657"
"06:19";"660"
"06:20";"659"
"06:21";"657"
"06:22";"656"
"06:23";"657"
"06:24";"656"
"06:25";"657"
"06:26";"656"
"06:27";"655"
"06:28";"654"
"06:29";"656"
"06:30";"657"
"06:31";"655"
"06:32";"656"
"06:33";"657"
"06:34";"656"
"06:35";"655"
"06:36";"656"
"06:37";"657"
"06:38";"657"
"06:39";"657"
"06:40";"656"
"06:41";"657"
"06:42";"657"
"06:43";"657"
"06:44";"657"
"06:45";"657"
"06:46";"655"
"06:47";"655"
"06:48";"656"
"06:49";"654"
"06:50";"654"
"06:51";"654"
"06:52";"653"
"06:53";"654"
"06:54";"655"
"06:55";"654"
"06:56";"654"
"06:57";"654"
"06:58";"653"
"06:59";"653"
"07:00";"652"
"07:01";"653"
"07:02";"653"
"07:03";"653"
"07:04";"653"
"07:05";"653"
"07:06";"653"
"07:07";"652"
"07:08";"650"
"07:09";"651"
"07:10";"650"
"07:11";"650"
"07:12";"650"
"07:13";"649"
"07:14";"650"
"07:15";"650"
"07:16";"650"
"07:17";"650"
"07:18";"648"
"07:19";"648"
"07:20";"650"
"07:21";"650"
"07:22";"650"
"07:23";"648"
"07:24";"650"
"07:25";"647"
"07:26";"647"
"07:27";"647"
"07:28";"647"
"07:29";"646"
"07:30";"646"
"07:31";"645"
"07:32";"646"
"07:33";"644"
"07:34";"645"
"07:35";"644"
"07:36";"644"
"07:37";"643"
"07:38";"643"
"07:39";"643"
"07:40";"643"
"07:41";"642"
"07:42";"640"
"07:43";"640"
"07:44";"637"
"07:45";"639"
"07:46";"637"
"07:47";"637"
"07:48";"637"
"07:49";"636"
"07:50";"636"
"07:51";"635"
"07:52";"636"
"07:53";"635"
"07:54";"633"
"07:55";"633"
"07:56";"632"
"07:57";"632"
"07:58";"632"
"07:59";"632"
"08:00";"632"
"08:01";"632"
"08:02";"630"
"08:03";"630"
"08:04";"629"
"08:05";"630"
"08:06";"629"
"08:07";"626"
"08:08";"626"
"08:09";"626"
"08:10";"626"
"08:11";"626"
"08:12";"627"
"08:13";"626"
"08:14";"625"
"08:15";"623"
"08:16";"623"
"08:17";"623"
"08:18";"623"
"08:19";"622"
"08:20";"621"
"08:21";"621"
"08:22";"620"
"08:23";"619"
"08:24";"619"
"08:25";"616"
"08:26";"616"
"08:27";"615"
"08:28";"614"
"08:29";"614"
"08:30";"614"
"08:31";"613"
"08:32";"612"
"08:33";"612"
"08:34";"612"
"08:35";"609"
"08:36";"609"
"08:37";"608"
"08:38";"608"
"08:39";"608"
"08:40";"608"
"08:41";"606"
"08:42";"605"
"08:43";"604"
"08:44";"602"
"08:45";"603"
"08:46";"603"
"08:47";"602"
"08:48";"601"
"08:49";"599"
"08:50";"599"
"08:51";"598"
"08:52";"597"
"08:53";"597"
"08:54";"595"
"08:55";"595"
"08:56";"595"
"08:57";"596"
"08:58";"594"
"08:59";"592"
"09:00";"592"
"09:01";"592"
"09:02";"590"
"09:03";"590"
"09:04";"589"
"09:05";"589"
"09:06";"588"
"09:07";"588"
"09:08";"587"
"09:09";"588"
"09:10";"585"
"09:11";"584"
"09:12";"584"
"09:13";"582"
"09:14";"582"
"09:15";"582"
"09:16";"580"
"09:17";"581"
"09:18";"581"
"09:19";"579"
"09:20";"579"
"09:21";"578"
"09:22";"576"
"09:23";"577"
"09:24";"573"
"09:25";"574"
"09:26";"573"
"09:27";"572"
"09:28";"571"
"09:29";"571"
"09:30";"568"
"09:31";"570"
"09:32";"567"
"09:33";"566"
"09:34";"567"
"09:35";"564"
"09:36";"565"
"09:37";"563"
"09:38";"563"
"09:39";"561"
"09:40";"560"
"09:41";"560"
"09:42";"558"
"09:43";"558"
"09:44";"558"
"09:45";"557"
"09:46";"557"
"09:47";"555"
"09:48";"555"
"09:49";"554"
"09:50";"554"
"09:51";"552"
"09:52";"551"
"09:53";"551"
"09:54";"551"
"09:55";"549"
"09:56";"548"
"09:57";"547"
"09:58";"547"
"09:59";"547"
"10:00";"544"
"10:01";"544"
"10:02";"543"
"10:03";"542"
"10:04";"541"
"10:05";"540"
"10:06";"540"
"10:07";"540"
"10:08";"537"
"10:09";"537"
"10:10";"537"
"10:11";"537"
"10:12";"536"
"10:13";"536"
"10:14";"536"
"10:15";"534"
"10:16";"534"
"10:17";"534"
"10:18";"532"
"10:19";"532"
"10:20";"532"
"10:21";"531"
"10:22";"530"
"10:23";"530"
"10:24";"527"
"10:25";"527"
"10:26";"526"
"10:27";"525"
"10:28";"523"
"10:29";"523"
"10:30";"523"
"10:31";"522"
"10:32";"522"
"10:33";"520"
"10:34";"518"
"10:35";"517"
"10:36";"518"
"10:37";"516"
"10:38";"516"
"10:39";"516"
"10:40";"515"
"10:41";"514"
"10:42";"513"
"10:43";"512"
"10:44";"510"
"10:45";"510"
"10:46";"510"
"10:47";"510"
"10:48";"509"
"10:49";"507"
"10:50";"507"
"10:51";"507"
"10:52";"507"
"10:53";"506"
"10:54";"505"
"10:55";"503"
"10:56";"503"
"10:57";"502"
"10:58";"501"
"10:59";"501"
"11:00";"499"
"11:01";"499"
"11:02";"499"
"11:03";"499"
"11:04";"498"
"11:05";"496"
"11:06";"496"
"11:07";"495"
"11:08";"495"
"11:09";"495"
"11:10";"493"
"11:11";"492"
"11:12";"492"
"11:13";"491"
"11:14";"489"
"11:15";"488"
"11:16";"488"
"11:17";"486"
"11:18";"486"
"11:19";"485"
"11:20";"485"
"11:21";"482"
"11:22";"482"
"11:23";"482"
"11:24";"481"
"11:25";"482"
"11:26";"479"
"11:27";"479"
"11:28";"479"
"11:29";"478"
"11:30";"478"
"11:31";"477"
"11:32";"476"
"11:33";"476"
"11:34";"475"
"11:35";"476"
"11:36";"475"
"11:37";"475"
"11:38";"474"
"11:39";"474"
"11:40";"472"
"11:41";"472"
"11:42";"472"
"11:43";"472"
"11:44";"470"
"11:45";"469"
"11:46";"469"
"11:47";"468"
"11:48";"468"
"11:49";"468"
"11:50";"467"
"11:51";"467"
"11:52";"465"
"11:53";"464"
"11:54";"462"
"11:55";"464"
"11:56";"462"
"11:57";"462"
"11:58";"461"
"11:59";"460"
"12:00";"461"
"12:01";"458"
"12:02";"458"
"12:03";"458"
"12:04";"458"
"12:05";"458"
"12:06";"458"
"12:07";"457"
"12:08";"455"
"12:09";"455"
"12:10";"455"
"12:11";"455"
"12:12";"455"
"12:13";"455"
"12:14";"454"
"12:15";"453"
"12:16";"454"
"12:17";"453"
"12:18";"453"
"12:19";"452"
"12:20";"452"
"12:21";"452"
"12:22";"453"
"12:23";"452"
"12:24";"451"
"12:25";"452"
"12:26";"452"
"12:27";"450"
"12:28";"450"
"12:29";"448"
"12:30";"448"
"12:31";"448"
"12:32";"448"
"12:33";"448"
"12:34";"447"
"12:35";"447"
"12:36";"446"
"12:37";"445"
"12:38";"445"
"12:39";"444"
"12:40";"445"
"12:41";"444"
"12:42";"444"
"12:43";"444"
"12:44";"443"
"12:45";"442"
"12:46";"443"
"12:47";"443"
"12:48";"444"
"12:49";"443"
"12:50";"442"
"12:51";"443"
"12:52";"443"
"12:53";"443"
"12:54";"444"
"12:55";"444"
"12:56";"442"
"12:57";"441"
"12:58";"441"
"12:59";"442"
"13:00";"441"
"13:01";"440"
"13:02";"440"
"13:03";"440"
"13:04";"440"
"13:05";"438"
"13:06";"438"
"13:07";"438"
"13:08";"438"
"13:09";"438"
"13:10";"437"
"13:11";"437"
"13:12";"438"
"13:13";"438"
"13:14";"438"
"13:15";"440"
"13:16";"438"
"13:17";"440"
"13:18";"440"
"13:19";"440"
"13:20";"440"
"13:21";"440"
"13:22";"440"
"13:23";"441"
"13:24";"441"
"13:25";"441"
"13:26";"441"
"13:27";"443"
"13:28";"441"
"13:29";"441"
"13:30";"441"
"13:31";"441"
"13:32";"440"
"13:33";"441"
"13:34";"441"
"13:35";"441"
"13:36";"441"
"13:37";"440"
"13:38";"440"
"13:39";"440"
"13:40";"440"
"13:41";"441"
"13:42";"440"
"13:43";"441"
"13:44";"441"
"13:45";"441"
"13:46";"441"
"13:47";"441"
"13:48";"443"
"13:49";"443"
"13:50";"444"
"13:51";"444"
"13:52";"444"
"13:53";"445"
"13:54";"445"
"13:55";"445"
"13:56";"445"
"13:57";"445"
"13:58";"445"
"13:59";"446"
"14:00";"447"
"14:01";"447"
"14:02";"447"
"14:03";"448"
"14:04";"448"
"14:05";"448"
"14:06";"448"
"14:07";"448"
"14:08";"448"
"14:09";"448"
"14:10";"450"
"14:11";"451"
"14:12";"451"
"14:13";"452"
"14:14";"453"
"14:15";"453"
"14:16";"453"
"14:17";"454"
"14:18";"455"
"14:19";"455"
"14:20";"455"
"14:21";"455"
"14:22";"455"
"14:23";"455"
"14:24";"455"
"14:25";"455"
"14:26";"457"
"14:27";"458"
"14:28";"458"
"14:29";"458"
"14:30";"458"
"14:31";"458"
"14:32";"458"
"14:33";"458"
"14:34";"458"
"14:35";"461"
"14:36";"462"
"14:37";"462"
"14:38";"462"
"14:39";"462"
"14:40";"464"
"14:41";"465"
"14:42";"464"
"14:43";"467"
"14:44";"467"
"14:45";"467"
"14:46";"469"
"14:47";"468"
"14:48";"468"
"14:49";"469"
"14:50";"470"
"14:51";"469"
"14:52";"470"
"14:53";"472"
"14:54";"471"
"14:55";"472"
"14:56";"472"
"14:57";"475"
"14:58";"475"
"14:59";"475"
"15:00";"476"
"15:01";"475"
"15:02";"477"
"15:03";"477"
"15:04";"477"
"15:05";"479"
"15:06";"479"
"15:07";"479"
"15:08";"479"
"15:09";"481"
"15:10";"482"
"15:11";"482"
"15:12";"482"
"15:13";"482"
"15:14";"482"
"15:15";"484"
"15:16";"485"
"15:17";"486"
"15:18";"488"
"15:19";"488"
"15:20";"488"
"15:21";"490"
"15:22";"490"
"15:23";"491"
"15:24";"492"
"15:25";"493"
"15:26";"494"
"15:27";"494"
"15:28";"495"
"15:29";"496"
"15:30";"496"
"15:31";"496"
"15:32";"498"
"15:33";"496"
"15:34";"499"
"15:35";"499"
"15:36";"500"
"15:37";"502"
"15:38";"503"
"15:39";"503"
"15:40";"505"
"15:41";"506"
"15:42";"506"
"15:43";"506"
"15:44";"506"
"15:45";"507"
"15:46";"507"
"15:47";"510"
"15:48";"510"
"15:49";"510"
"15:50";"512"
"15:51";"512"
"15:52";"512"
"15:53";"512"
"15:54";"515"
"15:55";"516"
"15:56";"516"
"15:57";"517"
"15:58";"517"
"15:59";"516"
"16:00";"518"
"16:01";"520"
"16:02";"519"
"16:03";"522"
"16:04";"520"
"16:05";"522"
"16:06";"523"
"16:07";"523"
"16:08";"524"
"16:09";"525"
"16:10";"525"
"16:11";"526"
"16:12";"526"
"16:13";"526"
"16:14";"527"
"16:15";"529"
"16:16";"529"
"16:17";"530"
"16:18";"530"
"16:19";"530"
"16:20";"531"
"16:21";"533"
"16:22";"533"
"16:23";"534"
"16:24";"536"
"16:25";"536"
"16:26";"537"
"16:27";"537"
"16:28";"537"
"16:29";"537"
"16:30";"538"
"16:31";"540"
"16:32";"540"
"16:33";"540"
"16:34";"541"
"16:35";"542"
"16:36";"542"
"16:37";"543"
"16:38";"544"
"16:39";"544"
"16:40";"546"
"16:41";"547"
"16:42";"547"
"16:43";"548"
"16:44";"548"
"16:45";"549"
"16:46";"550"
"16:47";"551"
"16:48";"551"
"16:49";"551"
"16:50";"551"
"16:51";"554"
"16:52";"554"
"16:53";"554"
"16:54";"554"
"16:55";"555"
"16:56";"556"
"16:57";"556"
"16:58";"558"
"16:59";"558"
"17:00";"560"
"17:01";"560"
"17:02";"560"
"17:03";"561"
"17:04";"561"
"17:05";"561"
"17:06";"563"
"17:07";"564"
"17:08";"564"
"17:09";"564"
"17:10";"565"
"17:11";"565"
"17:12";"566"
"17:13";"566"
"17:14";"568"
"17:15";"568"
"17:16";"570"
"17:17";"568"
"17:18";"568"
"17:19";"570"
"17:20";"571"
"17:21";"572"
"17:22";"572"
"17:23";"573"
"17:24";"573"
"17:25";"574"
"17:26";"574"
"17:27";"574"
"17:28";"575"
"17:29";"577"
"17:30";"575"
"17:31";"576"
"17:32";"578"
"17:33";"578"
"17:34";"580"
"17:35";"579"
"17:36";"579"
"17:37";"581"
"17:38";"581"
"17:39";"581"
"17:40";"582"
"17:41";"582"
"17:42";"582"
"17:43";"584"
"17:44";"584"
"17:45";"585"
"17:46";"585"
"17:47";"587"
"17:48";"588"
"17:49";"588"
"17:50";"588"
"17:51";"588"
"17:52";"589"
"17:53";"590"
"17:54";"590"
"17:55";"590"
"17:56";"594"
"17:57";"594"
"17:58";"591"
"17:59";"592"
"18:00";"592"
"18:01";"594"
"18:02";"595"
"18:03";"594"
"18:04";"596"
"18:05";"596"
"18:06";"596"
"18:07";"599"
"18:08";"598"
"18:09";"599"
"18:10";"602"
"18:11";"600"
"18:12";"601"
"18:13";"600"
"18:14";"602"
"18:15";"603"
"18:16";"604"
"18:17";"606"
"18:18";"605"
"18:19";"604"
"18:20";"605"
"18:21";"606"
"18:22";"608"
"18:23";"605"
"18:24";"606"
"18:25";"606"
"18:26";"606"
"18:27";"606"
"18:28";"608"
"18:29";"609"
"18:30";"608"
"18:31";"609"
"18:32";"609"
"18:33";"609"
"18:34";"609"
"18:35";"609"
"18:36";"609"
"18:37";"612"
"18:38";"611"
"18:39";"612"
"18:40";"612"
"18:41";"612"
"18:42";"612"
"18:43";"612"
"18:44";"613"
"18:45";"614"
"18:46";"612"
"18:47";"614"
"18:48";"615"
"18:49";"613"
"18:50";"615"
"18:51";"614"
"18:52";"616"
"18:53";"615"
"18:54";"616"
"18:55";"616"
"18:56";"616"
"18:57";"616"
"18:58";"616"
"18:59";"618"
"19:00";"619"
"19:01";"619"
"19:02";"618"
"19:03";"619"
"19:04";"620"
"19:05";"619"
"19:06";"619"
"19:07";"620"
"19:08";"619"
"19:09";"621"
"19:10";"621"
"19:11";"619"
"19:12";"621"
"19:13";"622"
"19:14";"622"
"19:15";"623"
"19:16";"621"
"19:17";"623"
"19:18";"622"
"19:19";"623"
"19:20";"621"
"19:21";"620"
"19:22";"622"
"19:23";"623"
"19:24";"623"
"19:25";"622"
"19:26";"623"
"19:27";"623"
"19:28";"623"
"19:29";"623"
"19:30";"623"
"19:31";"623"
"19:32";"625"
"19:33";"623"
"19:34";"625"
"19:35";"624"
"19:36";"626"
"19:37";"626"
"19:38";"624"
"19:39";"625"
"19:40";"626"
"19:41";"625"
"19:42";"626"
"19:43";"626"
"19:44";"626"
"19:45";"625"
"19:46";"626"
"19:47";"624"
"19:48";"625"
"19:49";"626"
"19:50";"626"
"19:51";"626"
"19:52";"625"
"19:53";"623"
"19:54";"626"
"19:55";"626"
"19:56";"626"
"19:57";"626"
"19:58";"626"
"19:59";"627"
"20:00";"624"
"20:01";"626"
"20:02";"626"
"20:03";"626"
"20:04";"626"
"20:05";"626"
"20:06";"627"
"20:07";"626"
"20:08";"626"
"20:09";"626"
"20:10";"626"
"20:11";"626"
"20:12";"626"
"20:13";"626"
"20:14";"626"
"20:15";"623"
"20:16";"622"
"20:17";"625"
"20:18";"623"
"20:19";"623"
"20:20";"623"
"20:21";"623"
"20:22";"624"
"20:23";"624"
"20:24";"623"
"20:25";"624"
"20:26";"624"
"20:27";"623"
"20:28";"625"
"20:29";"625"
"20:30";"625"
"20:31";"625"
"20:32";"626"
"20:33";"623"
"20:34";"623"
"20:35";"623"
"20:36";"623"
"20:37";"622"
"20:38";"622"
"20:39";"623"
"20:40";"623"
"20:41";"621"
"20:42";"622"
"20:43";"622"
"20:44";"622"
"20:45";"620"
"20:46";"621"
"20:47";"623"
"20:48";"622"
"20:49";"622"
"20:50";"620"
"20:51";"622"
"20:52";"620"
"20:53";"619"
"20:54";"622"
"20:55";"622"
"20:56";"621"
"20:57";"619"
"20:58";"619"
"20:59";"619"
"21:00";"619"
"21:01";"618"
"21:02";"618"
"21:03";"619"
"21:04";"616"
"21:05";"616"
"21:06";"615"
"21:07";"616"
"21:08";"615"
"21:09";"615"
"21:10";"615"
"21:11";"614"
"21:12";"613"
"21:13";"613"
"21:14";"614"
"21:15";"612"
"21:16";"613"
"21:17";"613"
"21:18";"611"
"21:19";"612"
"21:20";"611"
"21:21";"610"
"21:22";"610"
"21:23";"609"
"21:24";"609"
"21:25";"609"
"21:26";"608"
"21:27";"608"
"21:28";"608"
"21:29";"606"
"21:30";"606"
"21:31";"606"
"21:32";"606"
"21:33";"605"
"21:34";"604"
"21:35";"603"
"21:36";"602"
"21:37";"602"
"21:38";"602"
"21:39";"602"
"21:40";"600"
"21:41";"599"
"21:42";"601"
"21:43";"599"
"21:44";"599"
"21:45";"599"
"21:46";"598"
"21:47";"599"
"21:48";"598"
"21:49";"599"
"21:50";"599"
"21:51";"597"
"21:52";"596"
"21:53";"592"
"21:54";"591"
"21:55";"589"
"21:56";"589"
"21:57";"588"
"21:58";"588"
"21:59";"585"
"22:00";"587"
"22:01";"584"
"22:02";"582"
"22:03";"582"
"22:04";"582"
"22:05";"582"
"22:06";"582"
"22:07";"582"
"22:08";"582"
"22:09";"582"
"22:10";"582"
"22:11";"582"
"22:12";"581"
"22:13";"582"
"22:14";"581"
"22:15";"581"
"22:16";"579"
"22:17";"578"
"22:18";"577"
"22:19";"575"
"22:20";"575"
"22:21";"575"
"22:22";"574"
"22:23";"574"
"22:24";"573"
"22:25";"572"
"22:26";"572"
"22:27";"572"
"22:28";"570"
"22:29";"568"
"22:30";"568"
"22:31";"567"
"22:32";"566"
"22:33";"564"
"22:34";"564"
"22:35";"561"
"22:36";"561"
"22:37";"560"
"22:38";"560"
"22:39";"558"
"22:40";"558"
"22:41";"557"
"22:42";"558"
"22:43";"557"
"22:44";"557"
"22:45";"557"
"22:46";"556"
"22:47";"556"
"22:48";"556"
"22:49";"556"
"22:50";"556"
"22:51";"554"
"22:52";"554"
"22:53";"554"
"22:54";"551"
"22:55";"551"
"22:56";"551"
"22:57";"550"
"22:58";"550"
"22:59";"549"
"23:00";"548"
"23:01";"548"
"23:02";"548"
"23:03";"548"
"23:04";"547"
"23:05";"548"
"23:06";"547"
"23:07";"547"
"23:08";"544"
"23:09";"544"
"23:10";"543"
"23:11";"543"
"23:12";"542"
"23:13";"541"
"23:14";"541"
"23:15";"540"
"23:16";"540"
"23:17";"540"
"23:18";"539"
"23:19";"539"
"23:20";"538"
"23:21";"537"
"23:22";"538"
"23:23";"536"
"23:24";"537"
"23:25";"537"
"23:26";"536"
"23:27";"536"
"23:28";"536"
"23:29";"534"
"23:30";"534"
"23:31";"533"
"23:32";"534"
"23:33";"533"
"23:34";"531"
"23:35";"531"
"23:36";"531"
"23:37";"530"
"23:38";"530"
"23:39";"530"
"23:40";"530"
"23:41";"530"
"23:42";"530"
"23:43";"530"
"23:44";"530"
"23:45";"530"
"23:46";"530"
"23:47";"527"
"23:48";"527"
"23:49";"529"
"23:50";"527"
"23:51";"527"
"23:52";"526"
"23:53";"525"
"23:54";"525"
"23:55";"524"
"23:56";"523"
"23:57";"523"
"23:58";"523"
"23:59";"522"
"24:00";"522"
