"16.10.2022";"Wilhelmshaven";"JADE";"WANGEROOGE WEST ";"9420040";"W_O";"cm";"XXX,XXX";"XX.XX.XXXX";"XX:XX";"PNP";"-5,05"
"00:01";"544"
"00:02";"547"
"00:03";"547"
"00:04";"548"
"00:05";"549"
"00:06";"549"
"00:07";"550"
"00:08";"551"
"00:09";"551"
"00:10";"553"
"00:11";"554"
"00:12";"556"
"00:13";"555"
"00:14";"557"
"00:15";"556"
"00:16";"558"
"00:17";"560"
"00:18";"560"
"00:19";"558"
"00:20";"561"
"00:21";"561"
"00:22";"562"
"00:23";"564"
"00:24";"563"
"00:25";"564"
"00:26";"565"
"00:27";"565"
"00:28";"567"
"00:29";"567"
"00:30";"568"
"00:31";"570"
"00:32";"571"
"00:33";"571"
"00:34";"572"
"00:35";"571"
"00:36";"573"
"00:37";"574"
"00:38";"575"
"00:39";"575"
"00:40";"577"
"00:41";"578"
"00:42";"578"
"00:43";"578"
"00:44";"579"
"00:45";"580"
"00:46";"582"
"00:47";"582"
"00:48";"582"
"00:49";"584"
"00:50";"584"
"00:51";"585"
"00:52";"587"
"00:53";"588"
"00:54";"588"
"00:55";"588"
"00:56";"589"
"00:57";"591"
"00:58";"591"
"00:59";"592"
"01:00";"594"
"01:01";"594"
"01:02";"595"
"01:03";"595"
"01:04";"596"
"01:05";"597"
"01:06";"598"
"01:07";"599"
"01:08";"599"
"01:09";"599"
"01:10";"602"
"01:11";"602"
"01:12";"605"
"01:13";"603"
"01:14";"604"
"01:15";"606"
"01:16";"606"
"01:17";"606"
"01:18";"608"
"01:19";"608"
"01:20";"609"
"01:21";"609"
"01:22";"611"
"01:23";"611"
"01:24";"612"
"01:25";"612"
"01:26";"613"
"01:27";"615"
"01:28";"615"
"01:29";"616"
"01:30";"616"
"01:31";"616"
"01:32";"618"
"01:33";"619"
"01:34";"619"
"01:35";"620"
"01:36";"620"
"01:37";"621"
"01:38";"622"
"01:39";"623"
"01:40";"624"
"01:41";"623"
"01:42";"625"
"01:43";"626"
"01:44";"626"
"01:45";"628"
"01:46";"629"
"01:47";"629"
"01:48";"629"
"01:49";"630"
"01:50";"630"
"01:51";"632"
"01:52";"632"
"01:53";"632"
"01:54";"633"
"01:55";"633"
"01:56";"633"
"01:57";"635"
"01:58";"636"
"01:59";"636"
"02:00";"637"
"02:01";"637"
"02:02";"637"
"02:03";"638"
"02:04";"640"
"02:05";"639"
"02:06";"640"
"02:07";"640"
"02:08";"640"
"02:09";"643"
"02:10";"643"
"02:11";"643"
"02:12";"644"
"02:13";"643"
"02:14";"645"
"02:15";"646"
"02:16";"646"
"02:17";"646"
"02:18";"647"
"02:19";"647"
"02:20";"648"
"02:21";"648"
"02:22";"649"
"02:23";"650"
"02:24";"650"
"02:25";"650"
"02:26";"648"
"02:27";"647"
"02:28";"650"
"02:29";"650"
"02:30";"653"
"02:31";"652"
"02:32";"650"
"02:33";"653"
"02:34";"654"
"02:35";"654"
"02:36";"654"
"02:37";"654"
"02:38";"654"
"02:39";"656"
"02:40";"654"
"02:41";"656"
"02:42";"654"
"02:43";"656"
"02:44";"656"
"02:45";"656"
"02:46";"656"
"02:47";"657"
"02:48";"656"
"02:49";"656"
"02:50";"656"
"02:51";"656"
"02:52";"656"
"02:53";"657"
"02:54";"657"
"02:55";"656"
"02:56";"657"
"02:57";"656"
"02:58";"659"
"02:59";"657"
"03:00";"657"
"03:01";"659"
"03:02";"657"
"03:03";"657"
"03:04";"659"
"03:05";"657"
"03:06";"659"
"03:07";"657"
"03:08";"657"
"03:09";"656"
"03:10";"657"
"03:11";"657"
"03:12";"657"
"03:13";"659"
"03:14";"657"
"03:15";"657"
"03:16";"657"
"03:17";"659"
"03:18";"660"
"03:19";"657"
"03:20";"657"
"03:21";"657"
"03:22";"657"
"03:23";"657"
"03:24";"657"
"03:25";"657"
"03:26";"657"
"03:27";"656"
"03:28";"656"
"03:29";"656"
"03:30";"654"
"03:31";"655"
"03:32";"654"
"03:33";"655"
"03:34";"654"
"03:35";"656"
"03:36";"654"
"03:37";"654"
"03:38";"652"
"03:39";"653"
"03:40";"653"
"03:41";"653"
"03:42";"651"
"03:43";"651"
"03:44";"651"
"03:45";"651"
"03:46";"651"
"03:47";"651"
"03:48";"650"
"03:49";"650"
"03:50";"649"
"03:51";"647"
"03:52";"647"
"03:53";"647"
"03:54";"647"
"03:55";"646"
"03:56";"646"
"03:57";"646"
"03:58";"646"
"03:59";"646"
"04:00";"646"
"04:01";"644"
"04:02";"645"
"04:03";"645"
"04:04";"643"
"04:05";"645"
"04:06";"643"
"04:07";"643"
"04:08";"643"
"04:09";"642"
"04:10";"642"
"04:11";"640"
"04:12";"640"
"04:13";"640"
"04:14";"638"
"04:15";"636"
"04:16";"637"
"04:17";"636"
"04:18";"636"
"04:19";"636"
"04:20";"636"
"04:21";"635"
"04:22";"635"
"04:23";"633"
"04:24";"633"
"04:25";"633"
"04:26";"632"
"04:27";"632"
"04:28";"630"
"04:29";"630"
"04:30";"630"
"04:31";"630"
"04:32";"629"
"04:33";"628"
"04:34";"627"
"04:35";"626"
"04:36";"626"
"04:37";"626"
"04:38";"624"
"04:39";"623"
"04:40";"623"
"04:41";"622"
"04:42";"620"
"04:43";"620"
"04:44";"620"
"04:45";"619"
"04:46";"619"
"04:47";"618"
"04:48";"616"
"04:49";"616"
"04:50";"615"
"04:51";"614"
"04:52";"613"
"04:53";"613"
"04:54";"612"
"04:55";"611"
"04:56";"611"
"04:57";"609"
"04:58";"609"
"04:59";"608"
"05:00";"606"
"05:01";"606"
"05:02";"606"
"05:03";"605"
"05:04";"604"
"05:05";"603"
"05:06";"602"
"05:07";"601"
"05:08";"602"
"05:09";"599"
"05:10";"599"
"05:11";"598"
"05:12";"596"
"05:13";"596"
"05:14";"595"
"05:15";"595"
"05:16";"594"
"05:17";"592"
"05:18";"592"
"05:19";"590"
"05:20";"591"
"05:21";"589"
"05:22";"588"
"05:23";"588"
"05:24";"585"
"05:25";"584"
"05:26";"584"
"05:27";"584"
"05:28";"582"
"05:29";"581"
"05:30";"580"
"05:31";"579"
"05:32";"578"
"05:33";"578"
"05:34";"578"
"05:35";"575"
"05:36";"575"
"05:37";"574"
"05:38";"571"
"05:39";"571"
"05:40";"571"
"05:41";"570"
"05:42";"568"
"05:43";"568"
"05:44";"567"
"05:45";"566"
"05:46";"564"
"05:47";"564"
"05:48";"563"
"05:49";"563"
"05:50";"561"
"05:51";"561"
"05:52";"558"
"05:53";"558"
"05:54";"557"
"05:55";"556"
"05:56";"556"
"05:57";"555"
"05:58";"554"
"05:59";"554"
"06:00";"553"
"06:01";"551"
"06:02";"549"
"06:03";"549"
"06:04";"548"
"06:05";"547"
"06:06";"547"
"06:07";"544"
"06:08";"544"
"06:09";"543"
"06:10";"542"
"06:11";"540"
"06:12";"540"
"06:13";"540"
"06:14";"539"
"06:15";"538"
"06:16";"536"
"06:17";"536"
"06:18";"536"
"06:19";"533"
"06:20";"532"
"06:21";"532"
"06:22";"530"
"06:23";"530"
"06:24";"529"
"06:25";"527"
"06:26";"527"
"06:27";"526"
"06:28";"525"
"06:29";"525"
"06:30";"524"
"06:31";"523"
"06:32";"522"
"06:33";"522"
"06:34";"520"
"06:35";"519"
"06:36";"518"
"06:37";"517"
"06:38";"516"
"06:39";"516"
"06:40";"515"
"06:41";"515"
"06:42";"513"
"06:43";"513"
"06:44";"512"
"06:45";"510"
"06:46";"510"
"06:47";"508"
"06:48";"508"
"06:49";"506"
"06:50";"506"
"06:51";"506"
"06:52";"503"
"06:53";"503"
"06:54";"502"
"06:55";"502"
"06:56";"500"
"06:57";"499"
"06:58";"498"
"06:59";"496"
"07:00";"496"
"07:01";"495"
"07:02";"494"
"07:03";"493"
"07:04";"493"
"07:05";"493"
"07:06";"492"
"07:07";"491"
"07:08";"490"
"07:09";"489"
"07:10";"488"
"07:11";"488"
"07:12";"488"
"07:13";"488"
"07:14";"486"
"07:15";"486"
"07:16";"485"
"07:17";"484"
"07:18";"482"
"07:19";"482"
"07:20";"482"
"07:21";"481"
"07:22";"479"
"07:23";"479"
"07:24";"479"
"07:25";"477"
"07:26";"475"
"07:27";"475"
"07:28";"475"
"07:29";"474"
"07:30";"472"
"07:31";"472"
"07:32";"472"
"07:33";"470"
"07:34";"469"
"07:35";"469"
"07:36";"468"
"07:37";"469"
"07:38";"467"
"07:39";"466"
"07:40";"465"
"07:41";"465"
"07:42";"464"
"07:43";"462"
"07:44";"462"
"07:45";"462"
"07:46";"461"
"07:47";"459"
"07:48";"458"
"07:49";"458"
"07:50";"457"
"07:51";"457"
"07:52";"455"
"07:53";"454"
"07:54";"455"
"07:55";"454"
"07:56";"453"
"07:57";"452"
"07:58";"452"
"07:59";"451"
"08:00";"451"
"08:01";"451"
"08:02";"450"
"08:03";"448"
"08:04";"447"
"08:05";"448"
"08:06";"447"
"08:07";"446"
"08:08";"445"
"08:09";"444"
"08:10";"444"
"08:11";"444"
"08:12";"443"
"08:13";"441"
"08:14";"440"
"08:15";"440"
"08:16";"440"
"08:17";"438"
"08:18";"438"
"08:19";"438"
"08:20";"438"
"08:21";"437"
"08:22";"437"
"08:23";"436"
"08:24";"434"
"08:25";"434"
"08:26";"434"
"08:27";"434"
"08:28";"434"
"08:29";"434"
"08:30";"433"
"08:31";"433"
"08:32";"431"
"08:33";"431"
"08:34";"431"
"08:35";"430"
"08:36";"428"
"08:37";"429"
"08:38";"428"
"08:39";"427"
"08:40";"427"
"08:41";"427"
"08:42";"426"
"08:43";"424"
"08:44";"426"
"08:45";"424"
"08:46";"424"
"08:47";"424"
"08:48";"424"
"08:49";"424"
"08:50";"423"
"08:51";"423"
"08:52";"423"
"08:53";"424"
"08:54";"423"
"08:55";"424"
"08:56";"424"
"08:57";"424"
"08:58";"424"
"08:59";"424"
"09:00";"424"
"09:01";"424"
"09:02";"424"
"09:03";"423"
"09:04";"422"
"09:05";"423"
"09:06";"423"
"09:07";"423"
"09:08";"421"
"09:09";"422"
"09:10";"422"
"09:11";"421"
"09:12";"421"
"09:13";"422"
"09:14";"423"
"09:15";"423"
"09:16";"424"
"09:17";"423"
"09:18";"424"
"09:19";"424"
"09:20";"424"
"09:21";"424"
"09:22";"426"
"09:23";"426"
"09:24";"426"
"09:25";"426"
"09:26";"426"
"09:27";"426"
"09:28";"426"
"09:29";"424"
"09:30";"424"
"09:31";"426"
"09:32";"426"
"09:33";"424"
"09:34";"426"
"09:35";"427"
"09:36";"427"
"09:37";"427"
"09:38";"427"
"09:39";"427"
"09:40";"427"
"09:41";"428"
"09:42";"428"
"09:43";"428"
"09:44";"428"
"09:45";"429"
"09:46";"429"
"09:47";"430"
"09:48";"430"
"09:49";"429"
"09:50";"430"
"09:51";"429"
"09:52";"430"
"09:53";"431"
"09:54";"431"
"09:55";"433"
"09:56";"434"
"09:57";"434"
"09:58";"434"
"09:59";"434"
"10:00";"434"
"10:01";"434"
"10:02";"437"
"10:03";"436"
"10:04";"438"
"10:05";"438"
"10:06";"438"
"10:07";"438"
"10:08";"440"
"10:09";"440"
"10:10";"441"
"10:11";"440"
"10:12";"441"
"10:13";"442"
"10:14";"442"
"10:15";"442"
"10:16";"443"
"10:17";"444"
"10:18";"444"
"10:19";"445"
"10:20";"445"
"10:21";"448"
"10:22";"448"
"10:23";"448"
"10:24";"450"
"10:25";"450"
"10:26";"451"
"10:27";"451"
"10:28";"453"
"10:29";"454"
"10:30";"455"
"10:31";"455"
"10:32";"457"
"10:33";"458"
"10:34";"458"
"10:35";"458"
"10:36";"458"
"10:37";"460"
"10:38";"461"
"10:39";"462"
"10:40";"462"
"10:41";"464"
"10:42";"464"
"10:43";"465"
"10:44";"465"
"10:45";"468"
"10:46";"469"
"10:47";"469"
"10:48";"470"
"10:49";"472"
"10:50";"472"
"10:51";"475"
"10:52";"475"
"10:53";"476"
"10:54";"478"
"10:55";"479"
"10:56";"482"
"10:57";"482"
"10:58";"484"
"10:59";"485"
"11:00";"486"
"11:01";"486"
"11:02";"488"
"11:03";"489"
"11:04";"489"
"11:05";"492"
"11:06";"492"
"11:07";"493"
"11:08";"495"
"11:09";"496"
"11:10";"498"
"11:11";"499"
"11:12";"500"
"11:13";"501"
"11:14";"503"
"11:15";"503"
"11:16";"503"
"11:17";"506"
"11:18";"506"
"11:19";"508"
"11:20";"510"
"11:21";"510"
"11:22";"513"
"11:23";"513"
"11:24";"515"
"11:25";"516"
"11:26";"516"
"11:27";"517"
"11:28";"518"
"11:29";"519"
"11:30";"520"
"11:31";"522"
"11:32";"523"
"11:33";"524"
"11:34";"524"
"11:35";"525"
"11:36";"526"
"11:37";"527"
"11:38";"527"
"11:39";"528"
"11:40";"530"
"11:41";"533"
"11:42";"533"
"11:43";"534"
"11:44";"536"
"11:45";"534"
"11:46";"536"
"11:47";"537"
"11:48";"538"
"11:49";"539"
"11:50";"540"
"11:51";"541"
"11:52";"542"
"11:53";"544"
"11:54";"544"
"11:55";"546"
"11:56";"546"
"11:57";"547"
"11:58";"548"
"11:59";"550"
"12:00";"550"
"12:01";"551"
"12:02";"551"
"12:03";"553"
"12:04";"554"
"12:05";"554"
"12:06";"555"
"12:07";"557"
"12:08";"557"
"12:09";"558"
"12:10";"558"
"12:11";"561"
"12:12";"561"
"12:13";"561"
"12:14";"563"
"12:15";"563"
"12:16";"564"
"12:17";"566"
"12:18";"564"
"12:19";"566"
"12:20";"567"
"12:21";"567"
"12:22";"571"
"12:23";"570"
"12:24";"571"
"12:25";"572"
"12:26";"573"
"12:27";"573"
"12:28";"574"
"12:29";"575"
"12:30";"578"
"12:31";"578"
"12:32";"578"
"12:33";"578"
"12:34";"579"
"12:35";"582"
"12:36";"581"
"12:37";"582"
"12:38";"584"
"12:39";"584"
"12:40";"584"
"12:41";"584"
"12:42";"585"
"12:43";"585"
"12:44";"587"
"12:45";"588"
"12:46";"588"
"12:47";"588"
"12:48";"589"
"12:49";"591"
"12:50";"591"
"12:51";"592"
"12:52";"592"
"12:53";"592"
"12:54";"595"
"12:55";"595"
"12:56";"597"
"12:57";"598"
"12:58";"599"
"12:59";"601"
"13:00";"599"
"13:01";"602"
"13:02";"602"
"13:03";"602"
"13:04";"603"
"13:05";"604"
"13:06";"606"
"13:07";"606"
"13:08";"606"
"13:09";"608"
"13:10";"608"
"13:11";"608"
"13:12";"608"
"13:13";"609"
"13:14";"609"
"13:15";"612"
"13:16";"612"
"13:17";"612"
"13:18";"615"
"13:19";"613"
"13:20";"614"
"13:21";"615"
"13:22";"616"
"13:23";"616"
"13:24";"616"
"13:25";"616"
"13:26";"619"
"13:27";"618"
"13:28";"618"
"13:29";"619"
"13:30";"620"
"13:31";"620"
"13:32";"620"
"13:33";"621"
"13:34";"623"
"13:35";"622"
"13:36";"623"
"13:37";"623"
"13:38";"623"
"13:39";"624"
"13:40";"626"
"13:41";"626"
"13:42";"626"
"13:43";"627"
"13:44";"628"
"13:45";"627"
"13:46";"629"
"13:47";"630"
"13:48";"630"
"13:49";"632"
"13:50";"630"
"13:51";"632"
"13:52";"633"
"13:53";"633"
"13:54";"633"
"13:55";"633"
"13:56";"635"
"13:57";"635"
"13:58";"636"
"13:59";"636"
"14:00";"635"
"14:01";"636"
"14:02";"636"
"14:03";"637"
"14:04";"638"
"14:05";"636"
"14:06";"637"
"14:07";"636"
"14:08";"639"
"14:09";"640"
"14:10";"640"
"14:11";"640"
"14:12";"639"
"14:13";"640"
"14:14";"640"
"14:15";"640"
"14:16";"640"
"14:17";"640"
"14:18";"640"
"14:19";"642"
"14:20";"642"
"14:21";"642"
"14:22";"642"
"14:23";"642"
"14:24";"642"
"14:25";"642"
"14:26";"643"
"14:27";"643"
"14:28";"643"
"14:29";"644"
"14:30";"643"
"14:31";"644"
"14:32";"643"
"14:33";"643"
"14:34";"645"
"14:35";"644"
"14:36";"645"
"14:37";"644"
"14:38";"645"
"14:39";"645"
"14:40";"644"
"14:41";"646"
"14:42";"646"
"14:43";"645"
"14:44";"645"
"14:45";"645"
"14:46";"646"
"14:47";"647"
"14:48";"647"
"14:49";"647"
"14:50";"647"
"14:51";"645"
"14:52";"646"
"14:53";"645"
"14:54";"647"
"14:55";"647"
"14:56";"647"
"14:57";"647"
"14:58";"646"
"14:59";"645"
"15:00";"646"
"15:01";"647"
"15:02";"646"
"15:03";"645"
"15:04";"646"
"15:05";"645"
"15:06";"645"
"15:07";"645"
"15:08";"647"
"15:09";"646"
"15:10";"646"
"15:11";"645"
"15:12";"644"
"15:13";"646"
"15:14";"644"
"15:15";"644"
"15:16";"644"
"15:17";"643"
"15:18";"644"
"15:19";"644"
"15:20";"643"
"15:21";"644"
"15:22";"643"
"15:23";"643"
"15:24";"643"
"15:25";"643"
"15:26";"643"
"15:27";"643"
"15:28";"642"
"15:29";"642"
"15:30";"643"
"15:31";"643"
"15:32";"643"
"15:33";"643"
"15:34";"642"
"15:35";"642"
"15:36";"642"
"15:37";"642"
"15:38";"642"
"15:39";"642"
"15:40";"640"
"15:41";"639"
"15:42";"640"
"15:43";"639"
"15:44";"640"
"15:45";"640"
"15:46";"640"
"15:47";"639"
"15:48";"639"
"15:49";"639"
"15:50";"638"
"15:51";"639"
"15:52";"638"
"15:53";"637"
"15:54";"637"
"15:55";"637"
"15:56";"637"
"15:57";"637"
"15:58";"636"
"15:59";"636"
"16:00";"636"
"16:01";"633"
"16:02";"633"
"16:03";"633"
"16:04";"635"
"16:05";"633"
"16:06";"635"
"16:07";"633"
"16:08";"633"
"16:09";"633"
"16:10";"635"
"16:11";"635"
"16:12";"633"
"16:13";"633"
"16:14";"631"
"16:15";"632"
"16:16";"632"
"16:17";"632"
"16:18";"633"
"16:19";"630"
"16:20";"630"
"16:21";"630"
"16:22";"629"
"16:23";"628"
"16:24";"627"
"16:25";"626"
"16:26";"627"
"16:27";"626"
"16:28";"627"
"16:29";"626"
"16:30";"626"
"16:31";"626"
"16:32";"623"
"16:33";"623"
"16:34";"XXX,XXX"
"16:35";"622"
"16:36";"623"
"16:37";"621"
"16:38";"621"
"16:39";"621"
"16:40";"620"
"16:41";"622"
"16:42";"620"
"16:43";"619"
"16:44";"618"
"16:45";"618"
"16:46";"619"
"16:47";"616"
"16:48";"615"
"16:49";"616"
"16:50";"613"
"16:51";"615"
"16:52";"612"
"16:53";"612"
"16:54";"612"
"16:55";"611"
"16:56";"612"
"16:57";"611"
"16:58";"608"
"16:59";"611"
"17:00";"608"
"17:01";"609"
"17:02";"606"
"17:03";"606"
"17:04";"606"
"17:05";"606"
"17:06";"606"
"17:07";"606"
"17:08";"604"
"17:09";"604"
"17:10";"602"
"17:11";"602"
"17:12";"603"
"17:13";"600"
"17:14";"600"
"17:15";"599"
"17:16";"597"
"17:17";"598"
"17:18";"596"
"17:19";"596"
"17:20";"596"
"17:21";"594"
"17:22";"594"
"17:23";"592"
"17:24";"591"
"17:25";"591"
"17:26";"588"
"17:27";"589"
"17:28";"588"
"17:29";"585"
"17:30";"588"
"17:31";"585"
"17:32";"584"
"17:33";"585"
"17:34";"582"
"17:35";"582"
"17:36";"582"
"17:37";"579"
"17:38";"582"
"17:39";"579"
"17:40";"578"
"17:41";"578"
"17:42";"575"
"17:43";"578"
"17:44";"575"
"17:45";"574"
"17:46";"575"
"17:47";"571"
"17:48";"571"
"17:49";"571"
"17:50";"567"
"17:51";"570"
"17:52";"568"
"17:53";"565"
"17:54";"567"
"17:55";"564"
"17:56";"564"
"17:57";"564"
"17:58";"561"
"17:59";"561"
"18:00";"561"
"18:01";"558"
"18:02";"560"
"18:03";"558"
"18:04";"557"
"18:05";"557"
"18:06";"555"
"18:07";"554"
"18:08";"555"
"18:09";"553"
"18:10";"551"
"18:11";"553"
"18:12";"550"
"18:13";"550"
"18:14";"548"
"18:15";"548"
"18:16";"547"
"18:17";"546"
"18:18";"544"
"18:19";"544"
"18:20";"543"
"18:21";"542"
"18:22";"541"
"18:23";"540"
"18:24";"540"
"18:25";"540"
"18:26";"538"
"18:27";"537"
"18:28";"536"
"18:29";"534"
"18:30";"534"
"18:31";"534"
"18:32";"533"
"18:33";"531"
"18:34";"531"
"18:35";"530"
"18:36";"530"
"18:37";"530"
"18:38";"529"
"18:39";"527"
"18:40";"527"
"18:41";"525"
"18:42";"525"
"18:43";"523"
"18:44";"522"
"18:45";"522"
"18:46";"520"
"18:47";"520"
"18:48";"520"
"18:49";"517"
"18:50";"516"
"18:51";"517"
"18:52";"515"
"18:53";"513"
"18:54";"516"
"18:55";"512"
"18:56";"512"
"18:57";"513"
"18:58";"510"
"18:59";"510"
"19:00";"510"
"19:01";"507"
"19:02";"508"
"19:03";"507"
"19:04";"505"
"19:05";"505"
"19:06";"505"
"19:07";"503"
"19:08";"503"
"19:09";"502"
"19:10";"500"
"19:11";"499"
"19:12";"500"
"19:13";"499"
"19:14";"496"
"19:15";"498"
"19:16";"494"
"19:17";"493"
"19:18";"494"
"19:19";"493"
"19:20";"491"
"19:21";"492"
"19:22";"492"
"19:23";"488"
"19:24";"489"
"19:25";"488"
"19:26";"486"
"19:27";"486"
"19:28";"486"
"19:29";"484"
"19:30";"484"
"19:31";"484"
"19:32";"482"
"19:33";"482"
"19:34";"482"
"19:35";"479"
"19:36";"478"
"19:37";"479"
"19:38";"478"
"19:39";"476"
"19:40";"475"
"19:41";"475"
"19:42";"472"
"19:43";"474"
"19:44";"472"
"19:45";"471"
"19:46";"470"
"19:47";"469"
"19:48";"468"
"19:49";"468"
"19:50";"468"
"19:51";"465"
"19:52";"464"
"19:53";"464"
"19:54";"464"
"19:55";"462"
"19:56";"462"
"19:57";"461"
"19:58";"460"
"19:59";"458"
"20:00";"458"
"20:01";"458"
"20:02";"457"
"20:03";"457"
"20:04";"455"
"20:05";"455"
"20:06";"454"
"20:07";"454"
"20:08";"453"
"20:09";"451"
"20:10";"451"
"20:11";"451"
"20:12";"448"
"20:13";"448"
"20:14";"448"
"20:15";"447"
"20:16";"446"
"20:17";"445"
"20:18";"445"
"20:19";"444"
"20:20";"444"
"20:21";"444"
"20:22";"441"
"20:23";"440"
"20:24";"440"
"20:25";"440"
"20:26";"438"
"20:27";"438"
"20:28";"438"
"20:29";"437"
"20:30";"436"
"20:31";"434"
"20:32";"434"
"20:33";"434"
"20:34";"434"
"20:35";"434"
"20:36";"433"
"20:37";"433"
"20:38";"431"
"20:39";"430"
"20:40";"430"
"20:41";"429"
"20:42";"429"
"20:43";"427"
"20:44";"427"
"20:45";"427"
"20:46";"427"
"20:47";"426"
"20:48";"426"
"20:49";"424"
"20:50";"424"
"20:51";"423"
"20:52";"424"
"20:53";"423"
"20:54";"422"
"20:55";"422"
"20:56";"421"
"20:57";"420"
"20:58";"420"
"20:59";"420"
"21:00";"420"
"21:01";"419"
"21:02";"419"
"21:03";"418"
"21:04";"418"
"21:05";"417"
"21:06";"417"
"21:07";"417"
"21:08";"416"
"21:09";"417"
"21:10";"416"
"21:11";"417"
"21:12";"416"
"21:13";"416"
"21:14";"416"
"21:15";"416"
"21:16";"414"
"21:17";"414"
"21:18";"414"
"21:19";"414"
"21:20";"414"
"21:21";"414"
"21:22";"413"
"21:23";"414"
"21:24";"413"
"21:25";"412"
"21:26";"412"
"21:27";"413"
"21:28";"412"
"21:29";"412"
"21:30";"410"
"21:31";"412"
"21:32";"412"
"21:33";"410"
"21:34";"412"
"21:35";"413"
"21:36";"410"
"21:37";"410"
"21:38";"410"
"21:39";"410"
"21:40";"410"
"21:41";"410"
"21:42";"410"
"21:43";"410"
"21:44";"410"
"21:45";"410"
"21:46";"410"
"21:47";"410"
"21:48";"412"
"21:49";"412"
"21:50";"410"
"21:51";"410"
"21:52";"413"
"21:53";"413"
"21:54";"413"
"21:55";"412"
"21:56";"413"
"21:57";"413"
"21:58";"412"
"21:59";"413"
"22:00";"414"
"22:01";"414"
"22:02";"414"
"22:03";"414"
"22:04";"414"
"22:05";"416"
"22:06";"416"
"22:07";"416"
"22:08";"416"
"22:09";"417"
"22:10";"417"
"22:11";"417"
"22:12";"418"
"22:13";"417"
"22:14";"418"
"22:15";"420"
"22:16";"420"
"22:17";"420"
"22:18";"421"
"22:19";"420"
"22:20";"422"
"22:21";"421"
"22:22";"422"
"22:23";"423"
"22:24";"423"
"22:25";"423"
"22:26";"424"
"22:27";"424"
"22:28";"424"
"22:29";"424"
"22:30";"426"
"22:31";"424"
"22:32";"424"
"22:33";"427"
"22:34";"426"
"22:35";"427"
"22:36";"427"
"22:37";"428"
"22:38";"429"
"22:39";"428"
"22:40";"431"
"22:41";"431"
"22:42";"431"
"22:43";"434"
"22:44";"434"
"22:45";"434"
"22:46";"436"
"22:47";"437"
"22:48";"437"
"22:49";"438"
"22:50";"440"
"22:51";"440"
"22:52";"440"
"22:53";"441"
"22:54";"441"
"22:55";"443"
"22:56";"444"
"22:57";"444"
"22:58";"445"
"22:59";"446"
"23:00";"447"
"23:01";"448"
"23:02";"448"
"23:03";"450"
"23:04";"451"
"23:05";"451"
"23:06";"453"
"23:07";"454"
"23:08";"454"
"23:09";"455"
"23:10";"457"
"23:11";"458"
"23:12";"458"
"23:13";"460"
"23:14";"462"
"23:15";"462"
"23:16";"464"
"23:17";"464"
"23:18";"465"
"23:19";"467"
"23:20";"468"
"23:21";"470"
"23:22";"470"
"23:23";"471"
"23:24";"472"
"23:25";"472"
"23:26";"475"
"23:27";"475"
"23:28";"476"
"23:29";"478"
"23:30";"479"
"23:31";"479"
"23:32";"482"
"23:33";"482"
"23:34";"484"
"23:35";"484"
"23:36";"486"
"23:37";"488"
"23:38";"488"
"23:39";"489"
"23:40";"491"
"23:41";"493"
"23:42";"493"
"23:43";"495"
"23:44";"496"
"23:45";"498"
"23:46";"499"
"23:47";"499"
"23:48";"499"
"23:49";"502"
"23:50";"503"
"23:51";"503"
"23:52";"505"
"23:53";"506"
"23:54";"507"
"23:55";"509"
"23:56";"509"
"23:57";"510"
"23:58";"512"
"23:59";"512"
"24:00";"512"
