"23.05.2022";"Wilhelmshaven";"JADE";"WANGEROOGE WEST ";"9420040";"W_O";"cm";"XXX,XXX";"XX.XX.XXXX";"XX:XX";"PNP";"-5,05"
"00:01";"349"
"00:02";"348"
"00:03";"349"
"00:04";"349"
"00:05";"351"
"00:06";"352"
"00:07";"352"
"00:08";"352"
"00:09";"354"
"00:10";"355"
"00:11";"355"
"00:12";"356"
"00:13";"356"
"00:14";"358"
"00:15";"358"
"00:16";"359"
"00:17";"359"
"00:18";"359"
"00:19";"361"
"00:20";"362"
"00:21";"362"
"00:22";"364"
"00:23";"364"
"00:24";"365"
"00:25";"366"
"00:26";"368"
"00:27";"369"
"00:28";"370"
"00:29";"370"
"00:30";"372"
"00:31";"372"
"00:32";"373"
"00:33";"374"
"00:34";"375"
"00:35";"375"
"00:36";"376"
"00:37";"378"
"00:38";"379"
"00:39";"379"
"00:40";"380"
"00:41";"381"
"00:42";"382"
"00:43";"384"
"00:44";"386"
"00:45";"386"
"00:46";"388"
"00:47";"389"
"00:48";"392"
"00:49";"392"
"00:50";"393"
"00:51";"395"
"00:52";"396"
"00:53";"398"
"00:54";"399"
"00:55";"400"
"00:56";"402"
"00:57";"403"
"00:58";"404"
"00:59";"405"
"01:00";"407"
"01:01";"407"
"01:02";"408"
"01:03";"410"
"01:04";"412"
"01:05";"413"
"01:06";"414"
"01:07";"414"
"01:08";"417"
"01:09";"417"
"01:10";"419"
"01:11";"420"
"01:12";"421"
"01:13";"423"
"01:14";"424"
"01:15";"426"
"01:16";"427"
"01:17";"428"
"01:18";"430"
"01:19";"431"
"01:20";"434"
"01:21";"434"
"01:22";"437"
"01:23";"438"
"01:24";"440"
"01:25";"440"
"01:26";"441"
"01:27";"443"
"01:28";"444"
"01:29";"445"
"01:30";"446"
"01:31";"448"
"01:32";"448"
"01:33";"450"
"01:34";"451"
"01:35";"452"
"01:36";"454"
"01:37";"455"
"01:38";"455"
"01:39";"458"
"01:40";"458"
"01:41";"458"
"01:42";"460"
"01:43";"462"
"01:44";"464"
"01:45";"464"
"01:46";"464"
"01:47";"465"
"01:48";"467"
"01:49";"468"
"01:50";"468"
"01:51";"469"
"01:52";"470"
"01:53";"471"
"01:54";"472"
"01:55";"474"
"01:56";"475"
"01:57";"475"
"01:58";"477"
"01:59";"478"
"02:00";"479"
"02:01";"479"
"02:02";"482"
"02:03";"482"
"02:04";"482"
"02:05";"482"
"02:06";"484"
"02:07";"486"
"02:08";"486"
"02:09";"488"
"02:10";"488"
"02:11";"489"
"02:12";"489"
"02:13";"491"
"02:14";"492"
"02:15";"492"
"02:16";"493"
"02:17";"495"
"02:18";"495"
"02:19";"496"
"02:20";"496"
"02:21";"498"
"02:22";"499"
"02:23";"499"
"02:24";"500"
"02:25";"501"
"02:26";"502"
"02:27";"503"
"02:28";"503"
"02:29";"503"
"02:30";"506"
"02:31";"506"
"02:32";"507"
"02:33";"508"
"02:34";"509"
"02:35";"509"
"02:36";"510"
"02:37";"512"
"02:38";"512"
"02:39";"513"
"02:40";"513"
"02:41";"515"
"02:42";"516"
"02:43";"517"
"02:44";"517"
"02:45";"518"
"02:46";"520"
"02:47";"520"
"02:48";"522"
"02:49";"523"
"02:50";"523"
"02:51";"524"
"02:52";"524"
"02:53";"524"
"02:54";"526"
"02:55";"527"
"02:56";"527"
"02:57";"529"
"02:58";"530"
"02:59";"530"
"03:00";"530"
"03:01";"532"
"03:02";"532"
"03:03";"534"
"03:04";"534"
"03:05";"536"
"03:06";"536"
"03:07";"536"
"03:08";"538"
"03:09";"539"
"03:10";"539"
"03:11";"540"
"03:12";"542"
"03:13";"542"
"03:14";"544"
"03:15";"544"
"03:16";"544"
"03:17";"546"
"03:18";"547"
"03:19";"547"
"03:20";"548"
"03:21";"549"
"03:22";"550"
"03:23";"550"
"03:24";"550"
"03:25";"551"
"03:26";"553"
"03:27";"554"
"03:28";"554"
"03:29";"555"
"03:30";"555"
"03:31";"557"
"03:32";"557"
"03:33";"557"
"03:34";"558"
"03:35";"558"
"03:36";"558"
"03:37";"560"
"03:38";"561"
"03:39";"563"
"03:40";"563"
"03:41";"563"
"03:42";"564"
"03:43";"565"
"03:44";"566"
"03:45";"565"
"03:46";"567"
"03:47";"568"
"03:48";"568"
"03:49";"570"
"03:50";"571"
"03:51";"572"
"03:52";"571"
"03:53";"573"
"03:54";"573"
"03:55";"574"
"03:56";"574"
"03:57";"575"
"03:58";"576"
"03:59";"578"
"04:00";"577"
"04:01";"578"
"04:02";"578"
"04:03";"579"
"04:04";"580"
"04:05";"580"
"04:06";"581"
"04:07";"582"
"04:08";"584"
"04:09";"584"
"04:10";"585"
"04:11";"585"
"04:12";"587"
"04:13";"585"
"04:14";"588"
"04:15";"588"
"04:16";"588"
"04:17";"589"
"04:18";"590"
"04:19";"590"
"04:20";"591"
"04:21";"592"
"04:22";"592"
"04:23";"594"
"04:24";"594"
"04:25";"595"
"04:26";"595"
"04:27";"595"
"04:28";"596"
"04:29";"597"
"04:30";"597"
"04:31";"598"
"04:32";"599"
"04:33";"598"
"04:34";"599"
"04:35";"599"
"04:36";"599"
"04:37";"602"
"04:38";"601"
"04:39";"602"
"04:40";"603"
"04:41";"602"
"04:42";"603"
"04:43";"604"
"04:44";"603"
"04:45";"604"
"04:46";"605"
"04:47";"606"
"04:48";"606"
"04:49";"606"
"04:50";"608"
"04:51";"608"
"04:52";"608"
"04:53";"608"
"04:54";"608"
"04:55";"608"
"04:56";"609"
"04:57";"609"
"04:58";"609"
"04:59";"611"
"05:00";"609"
"05:01";"611"
"05:02";"611"
"05:03";"609"
"05:04";"612"
"05:05";"612"
"05:06";"612"
"05:07";"613"
"05:08";"613"
"05:09";"613"
"05:10";"613"
"05:11";"613"
"05:12";"614"
"05:13";"614"
"05:14";"614"
"05:15";"615"
"05:16";"614"
"05:17";"614"
"05:18";"614"
"05:19";"614"
"05:20";"616"
"05:21";"615"
"05:22";"614"
"05:23";"614"
"05:24";"615"
"05:25";"615"
"05:26";"615"
"05:27";"615"
"05:28";"616"
"05:29";"614"
"05:30";"615"
"05:31";"615"
"05:32";"614"
"05:33";"615"
"05:34";"615"
"05:35";"614"
"05:36";"615"
"05:37";"614"
"05:38";"614"
"05:39";"614"
"05:40";"612"
"05:41";"612"
"05:42";"613"
"05:43";"612"
"05:44";"612"
"05:45";"612"
"05:46";"612"
"05:47";"611"
"05:48";"612"
"05:49";"612"
"05:50";"609"
"05:51";"611"
"05:52";"609"
"05:53";"609"
"05:54";"609"
"05:55";"608"
"05:56";"608"
"05:57";"609"
"05:58";"608"
"05:59";"608"
"06:00";"608"
"06:01";"608"
"06:02";"605"
"06:03";"606"
"06:04";"606"
"06:05";"605"
"06:06";"605"
"06:07";"604"
"06:08";"604"
"06:09";"603"
"06:10";"602"
"06:11";"602"
"06:12";"599"
"06:13";"600"
"06:14";"601"
"06:15";"598"
"06:16";"598"
"06:17";"599"
"06:18";"596"
"06:19";"596"
"06:20";"595"
"06:21";"595"
"06:22";"594"
"06:23";"592"
"06:24";"592"
"06:25";"592"
"06:26";"592"
"06:27";"590"
"06:28";"591"
"06:29";"589"
"06:30";"588"
"06:31";"587"
"06:32";"587"
"06:33";"585"
"06:34";"584"
"06:35";"584"
"06:36";"584"
"06:37";"584"
"06:38";"584"
"06:39";"579"
"06:40";"578"
"06:41";"579"
"06:42";"578"
"06:43";"575"
"06:44";"575"
"06:45";"575"
"06:46";"575"
"06:47";"573"
"06:48";"572"
"06:49";"571"
"06:50";"572"
"06:51";"571"
"06:52";"570"
"06:53";"568"
"06:54";"568"
"06:55";"568"
"06:56";"567"
"06:57";"567"
"06:58";"564"
"06:59";"564"
"07:00";"563"
"07:01";"562"
"07:02";"561"
"07:03";"560"
"07:04";"560"
"07:05";"560"
"07:06";"558"
"07:07";"558"
"07:08";"558"
"07:09";"556"
"07:10";"555"
"07:11";"554"
"07:12";"551"
"07:13";"551"
"07:14";"551"
"07:15";"551"
"07:16";"548"
"07:17";"549"
"07:18";"548"
"07:19";"546"
"07:20";"546"
"07:21";"544"
"07:22";"544"
"07:23";"543"
"07:24";"540"
"07:25";"541"
"07:26";"540"
"07:27";"538"
"07:28";"537"
"07:29";"538"
"07:30";"536"
"07:31";"536"
"07:32";"534"
"07:33";"532"
"07:34";"533"
"07:35";"532"
"07:36";"530"
"07:37";"530"
"07:38";"529"
"07:39";"527"
"07:40";"527"
"07:41";"526"
"07:42";"525"
"07:43";"524"
"07:44";"523"
"07:45";"522"
"07:46";"522"
"07:47";"520"
"07:48";"519"
"07:49";"518"
"07:50";"516"
"07:51";"516"
"07:52";"516"
"07:53";"515"
"07:54";"513"
"07:55";"512"
"07:56";"512"
"07:57";"510"
"07:58";"510"
"07:59";"509"
"08:00";"508"
"08:01";"507"
"08:02";"506"
"08:03";"505"
"08:04";"503"
"08:05";"503"
"08:06";"502"
"08:07";"501"
"08:08";"500"
"08:09";"500"
"08:10";"498"
"08:11";"498"
"08:12";"496"
"08:13";"495"
"08:14";"494"
"08:15";"493"
"08:16";"492"
"08:17";"492"
"08:18";"491"
"08:19";"489"
"08:20";"488"
"08:21";"486"
"08:22";"488"
"08:23";"486"
"08:24";"485"
"08:25";"484"
"08:26";"482"
"08:27";"482"
"08:28";"481"
"08:29";"480"
"08:30";"478"
"08:31";"479"
"08:32";"476"
"08:33";"477"
"08:34";"477"
"08:35";"474"
"08:36";"474"
"08:37";"474"
"08:38";"472"
"08:39";"472"
"08:40";"471"
"08:41";"470"
"08:42";"468"
"08:43";"468"
"08:44";"468"
"08:45";"465"
"08:46";"465"
"08:47";"465"
"08:48";"464"
"08:49";"462"
"08:50";"462"
"08:51";"462"
"08:52";"458"
"08:53";"460"
"08:54";"458"
"08:55";"458"
"08:56";"455"
"08:57";"455"
"08:58";"455"
"08:59";"453"
"09:00";"453"
"09:01";"452"
"09:02";"451"
"09:03";"451"
"09:04";"450"
"09:05";"448"
"09:06";"447"
"09:07";"446"
"09:08";"445"
"09:09";"444"
"09:10";"444"
"09:11";"443"
"09:12";"443"
"09:13";"441"
"09:14";"440"
"09:15";"440"
"09:16";"438"
"09:17";"438"
"09:18";"438"
"09:19";"436"
"09:20";"434"
"09:21";"434"
"09:22";"434"
"09:23";"433"
"09:24";"431"
"09:25";"430"
"09:26";"430"
"09:27";"428"
"09:28";"428"
"09:29";"427"
"09:30";"427"
"09:31";"426"
"09:32";"424"
"09:33";"423"
"09:34";"423"
"09:35";"421"
"09:36";"421"
"09:37";"421"
"09:38";"419"
"09:39";"419"
"09:40";"418"
"09:41";"417"
"09:42";"416"
"09:43";"416"
"09:44";"416"
"09:45";"414"
"09:46";"414"
"09:47";"410"
"09:48";"412"
"09:49";"410"
"09:50";"410"
"09:51";"410"
"09:52";"407"
"09:53";"407"
"09:54";"407"
"09:55";"407"
"09:56";"405"
"09:57";"405"
"09:58";"404"
"09:59";"404"
"10:00";"403"
"10:01";"403"
"10:02";"403"
"10:03";"402"
"10:04";"400"
"10:05";"400"
"10:06";"400"
"10:07";"400"
"10:08";"399"
"10:09";"396"
"10:10";"397"
"10:11";"396"
"10:12";"396"
"10:13";"395"
"10:14";"394"
"10:15";"393"
"10:16";"392"
"10:17";"392"
"10:18";"392"
"10:19";"392"
"10:20";"390"
"10:21";"390"
"10:22";"390"
"10:23";"390"
"10:24";"390"
"10:25";"389"
"10:26";"389"
"10:27";"388"
"10:28";"386"
"10:29";"388"
"10:30";"386"
"10:31";"386"
"10:32";"386"
"10:33";"386"
"10:34";"386"
"10:35";"386"
"10:36";"386"
"10:37";"386"
"10:38";"385"
"10:39";"383"
"10:40";"383"
"10:41";"383"
"10:42";"383"
"10:43";"382"
"10:44";"382"
"10:45";"382"
"10:46";"381"
"10:47";"380"
"10:48";"380"
"10:49";"379"
"10:50";"379"
"10:51";"379"
"10:52";"379"
"10:53";"379"
"10:54";"379"
"10:55";"379"
"10:56";"379"
"10:57";"379"
"10:58";"379"
"10:59";"378"
"11:00";"376"
"11:01";"378"
"11:02";"378"
"11:03";"379"
"11:04";"379"
"11:05";"378"
"11:06";"378"
"11:07";"378"
"11:08";"378"
"11:09";"378"
"11:10";"376"
"11:11";"378"
"11:12";"378"
"11:13";"378"
"11:14";"378"
"11:15";"378"
"11:16";"376"
"11:17";"376"
"11:18";"378"
"11:19";"375"
"11:20";"376"
"11:21";"376"
"11:22";"376"
"11:23";"376"
"11:24";"376"
"11:25";"376"
"11:26";"376"
"11:27";"376"
"11:28";"376"
"11:29";"376"
"11:30";"376"
"11:31";"376"
"11:32";"376"
"11:33";"378"
"11:34";"376"
"11:35";"376"
"11:36";"378"
"11:37";"376"
"11:38";"378"
"11:39";"376"
"11:40";"379"
"11:41";"378"
"11:42";"378"
"11:43";"379"
"11:44";"378"
"11:45";"376"
"11:46";"378"
"11:47";"378"
"11:48";"379"
"11:49";"379"
"11:50";"379"
"11:51";"379"
"11:52";"379"
"11:53";"380"
"11:54";"380"
"11:55";"381"
"11:56";"380"
"11:57";"380"
"11:58";"381"
"11:59";"382"
"12:00";"382"
"12:01";"382"
"12:02";"382"
"12:03";"382"
"12:04";"382"
"12:05";"383"
"12:06";"383"
"12:07";"383"
"12:08";"383"
"12:09";"383"
"12:10";"385"
"12:11";"386"
"12:12";"385"
"12:13";"386"
"12:14";"386"
"12:15";"386"
"12:16";"386"
"12:17";"386"
"12:18";"386"
"12:19";"388"
"12:20";"388"
"12:21";"389"
"12:22";"389"
"12:23";"389"
"12:24";"390"
"12:25";"390"
"12:26";"392"
"12:27";"392"
"12:28";"392"
"12:29";"393"
"12:30";"393"
"12:31";"393"
"12:32";"395"
"12:33";"396"
"12:34";"397"
"12:35";"398"
"12:36";"398"
"12:37";"399"
"12:38";"400"
"12:39";"402"
"12:40";"403"
"12:41";"403"
"12:42";"404"
"12:43";"405"
"12:44";"406"
"12:45";"407"
"12:46";"407"
"12:47";"407"
"12:48";"409"
"12:49";"410"
"12:50";"410"
"12:51";"410"
"12:52";"412"
"12:53";"413"
"12:54";"414"
"12:55";"416"
"12:56";"417"
"12:57";"419"
"12:58";"419"
"12:59";"420"
"13:00";"422"
"13:01";"423"
"13:02";"426"
"13:03";"427"
"13:04";"427"
"13:05";"429"
"13:06";"430"
"13:07";"431"
"13:08";"433"
"13:09";"434"
"13:10";"434"
"13:11";"437"
"13:12";"438"
"13:13";"438"
"13:14";"441"
"13:15";"441"
"13:16";"443"
"13:17";"443"
"13:18";"444"
"13:19";"445"
"13:20";"447"
"13:21";"448"
"13:22";"451"
"13:23";"451"
"13:24";"454"
"13:25";"455"
"13:26";"455"
"13:27";"458"
"13:28";"458"
"13:29";"460"
"13:30";"461"
"13:31";"462"
"13:32";"464"
"13:33";"465"
"13:34";"465"
"13:35";"468"
"13:36";"469"
"13:37";"471"
"13:38";"472"
"13:39";"472"
"13:40";"475"
"13:41";"475"
"13:42";"477"
"13:43";"478"
"13:44";"479"
"13:45";"481"
"13:46";"482"
"13:47";"482"
"13:48";"484"
"13:49";"485"
"13:50";"486"
"13:51";"488"
"13:52";"489"
"13:53";"489"
"13:54";"491"
"13:55";"492"
"13:56";"493"
"13:57";"494"
"13:58";"495"
"13:59";"496"
"14:00";"498"
"14:01";"498"
"14:02";"499"
"14:03";"499"
"14:04";"501"
"14:05";"503"
"14:06";"503"
"14:07";"506"
"14:08";"506"
"14:09";"507"
"14:10";"509"
"14:11";"510"
"14:12";"510"
"14:13";"512"
"14:14";"512"
"14:15";"513"
"14:16";"513"
"14:17";"516"
"14:18";"516"
"14:19";"516"
"14:20";"518"
"14:21";"519"
"14:22";"520"
"14:23";"520"
"14:24";"523"
"14:25";"524"
"14:26";"525"
"14:27";"526"
"14:28";"527"
"14:29";"528"
"14:30";"530"
"14:31";"530"
"14:32";"531"
"14:33";"532"
"14:34";"533"
"14:35";"534"
"14:36";"534"
"14:37";"536"
"14:38";"536"
"14:39";"537"
"14:40";"537"
"14:41";"539"
"14:42";"540"
"14:43";"540"
"14:44";"542"
"14:45";"543"
"14:46";"544"
"14:47";"544"
"14:48";"546"
"14:49";"547"
"14:50";"547"
"14:51";"548"
"14:52";"549"
"14:53";"550"
"14:54";"551"
"14:55";"553"
"14:56";"553"
"14:57";"554"
"14:58";"554"
"14:59";"555"
"15:00";"557"
"15:01";"558"
"15:02";"558"
"15:03";"560"
"15:04";"560"
"15:05";"561"
"15:06";"561"
"15:07";"564"
"15:08";"564"
"15:09";"565"
"15:10";"566"
"15:11";"567"
"15:12";"568"
"15:13";"568"
"15:14";"570"
"15:15";"571"
"15:16";"572"
"15:17";"573"
"15:18";"574"
"15:19";"575"
"15:20";"575"
"15:21";"576"
"15:22";"578"
"15:23";"578"
"15:24";"580"
"15:25";"580"
"15:26";"581"
"15:27";"582"
"15:28";"584"
"15:29";"585"
"15:30";"585"
"15:31";"587"
"15:32";"587"
"15:33";"588"
"15:34";"589"
"15:35";"590"
"15:36";"591"
"15:37";"592"
"15:38";"592"
"15:39";"594"
"15:40";"595"
"15:41";"597"
"15:42";"597"
"15:43";"598"
"15:44";"599"
"15:45";"599"
"15:46";"600"
"15:47";"601"
"15:48";"602"
"15:49";"604"
"15:50";"605"
"15:51";"605"
"15:52";"606"
"15:53";"606"
"15:54";"608"
"15:55";"609"
"15:56";"611"
"15:57";"612"
"15:58";"612"
"15:59";"612"
"16:00";"614"
"16:01";"615"
"16:02";"616"
"16:03";"616"
"16:04";"616"
"16:05";"619"
"16:06";"619"
"16:07";"620"
"16:08";"620"
"16:09";"621"
"16:10";"623"
"16:11";"623"
"16:12";"624"
"16:13";"625"
"16:14";"626"
"16:15";"626"
"16:16";"627"
"16:17";"629"
"16:18";"629"
"16:19";"630"
"16:20";"630"
"16:21";"632"
"16:22";"633"
"16:23";"633"
"16:24";"633"
"16:25";"636"
"16:26";"636"
"16:27";"636"
"16:28";"638"
"16:29";"638"
"16:30";"639"
"16:31";"639"
"16:32";"640"
"16:33";"640"
"16:34";"642"
"16:35";"643"
"16:36";"643"
"16:37";"643"
"16:38";"644"
"16:39";"644"
"16:40";"646"
"16:41";"647"
"16:42";"647"
"16:43";"648"
"16:44";"648"
"16:45";"647"
"16:46";"648"
"16:47";"649"
"16:48";"651"
"16:49";"651"
"16:50";"651"
"16:51";"652"
"16:52";"652"
"16:53";"654"
"16:54";"654"
"16:55";"653"
"16:56";"654"
"16:57";"654"
"16:58";"655"
"16:59";"654"
"17:00";"655"
"17:01";"656"
"17:02";"656"
"17:03";"657"
"17:04";"656"
"17:05";"657"
"17:06";"657"
"17:07";"657"
"17:08";"657"
"17:09";"657"
"17:10";"657"
"17:11";"659"
"17:12";"657"
"17:13";"659"
"17:14";"659"
"17:15";"660"
"17:16";"660"
"17:17";"660"
"17:18";"660"
"17:19";"660"
"17:20";"660"
"17:21";"660"
"17:22";"661"
"17:23";"660"
"17:24";"661"
"17:25";"660"
"17:26";"661"
"17:27";"661"
"17:28";"661"
"17:29";"661"
"17:30";"661"
"17:31";"661"
"17:32";"662"
"17:33";"662"
"17:34";"662"
"17:35";"662"
"17:36";"662"
"17:37";"662"
"17:38";"661"
"17:39";"661"
"17:40";"662"
"17:41";"662"
"17:42";"662"
"17:43";"662"
"17:44";"661"
"17:45";"660"
"17:46";"660"
"17:47";"661"
"17:48";"661"
"17:49";"660"
"17:50";"660"
"17:51";"660"
"17:52";"659"
"17:53";"657"
"17:54";"659"
"17:55";"657"
"17:56";"657"
"17:57";"657"
"17:58";"657"
"17:59";"657"
"18:00";"657"
"18:01";"657"
"18:02";"656"
"18:03";"657"
"18:04";"656"
"18:05";"656"
"18:06";"655"
"18:07";"655"
"18:08";"653"
"18:09";"654"
"18:10";"653"
"18:11";"652"
"18:12";"652"
"18:13";"654"
"18:14";"652"
"18:15";"652"
"18:16";"651"
"18:17";"651"
"18:18";"649"
"18:19";"649"
"18:20";"650"
"18:21";"649"
"18:22";"648"
"18:23";"648"
"18:24";"647"
"18:25";"647"
"18:26";"647"
"18:27";"647"
"18:28";"646"
"18:29";"645"
"18:30";"645"
"18:31";"643"
"18:32";"643"
"18:33";"643"
"18:34";"643"
"18:35";"640"
"18:36";"640"
"18:37";"639"
"18:38";"638"
"18:39";"639"
"18:40";"636"
"18:41";"636"
"18:42";"636"
"18:43";"636"
"18:44";"635"
"18:45";"635"
"18:46";"633"
"18:47";"633"
"18:48";"632"
"18:49";"632"
"18:50";"631"
"18:51";"630"
"18:52";"630"
"18:53";"629"
"18:54";"630"
"18:55";"628"
"18:56";"628"
"18:57";"626"
"18:58";"625"
"18:59";"624"
"19:00";"623"
"19:01";"623"
"19:02";"622"
"19:03";"621"
"19:04";"619"
"19:05";"619"
"19:06";"619"
"19:07";"619"
"19:08";"618"
"19:09";"616"
"19:10";"616"
"19:11";"614"
"19:12";"614"
"19:13";"613"
"19:14";"612"
"19:15";"612"
"19:16";"612"
"19:17";"609"
"19:18";"609"
"19:19";"608"
"19:20";"608"
"19:21";"607"
"19:22";"606"
"19:23";"605"
"19:24";"602"
"19:25";"603"
"19:26";"602"
"19:27";"600"
"19:28";"600"
"19:29";"599"
"19:30";"597"
"19:31";"596"
"19:32";"598"
"19:33";"596"
"19:34";"595"
"19:35";"595"
"19:36";"592"
"19:37";"592"
"19:38";"592"
"19:39";"589"
"19:40";"589"
"19:41";"588"
"19:42";"587"
"19:43";"585"
"19:44";"584"
"19:45";"585"
"19:46";"582"
"19:47";"582"
"19:48";"582"
"19:49";"580"
"19:50";"579"
"19:51";"578"
"19:52";"576"
"19:53";"576"
"19:54";"574"
"19:55";"574"
"19:56";"573"
"19:57";"571"
"19:58";"571"
"19:59";"571"
"20:00";"568"
"20:01";"568"
"20:02";"567"
"20:03";"564"
"20:04";"565"
"20:05";"564"
"20:06";"564"
"20:07";"561"
"20:08";"561"
"20:09";"560"
"20:10";"559"
"20:11";"558"
"20:12";"557"
"20:13";"556"
"20:14";"555"
"20:15";"555"
"20:16";"554"
"20:17";"551"
"20:18";"551"
"20:19";"550"
"20:20";"548"
"20:21";"547"
"20:22";"546"
"20:23";"546"
"20:24";"544"
"20:25";"543"
"20:26";"543"
"20:27";"541"
"20:28";"540"
"20:29";"540"
"20:30";"537"
"20:31";"XXX,XXX"
"20:32";"537"
"20:33";"535"
"20:34";"536"
"20:35";"534"
"20:36";"532"
"20:37";"531"
"20:38";"530"
"20:39";"528"
"20:40";"527"
"20:41";"527"
"20:42";"525"
"20:43";"524"
"20:44";"523"
"20:45";"523"
"20:46";"520"
"20:47";"520"
"20:48";"519"
"20:49";"517"
"20:50";"517"
"20:51";"516"
"20:52";"515"
"20:53";"513"
"20:54";"512"
"20:55";"510"
"20:56";"510"
"20:57";"509"
"20:58";"508"
"20:59";"508"
"21:00";"506"
"21:01";"506"
"21:02";"505"
"21:03";"502"
"21:04";"502"
"21:05";"501"
"21:06";"500"
"21:07";"499"
"21:08";"498"
"21:09";"496"
"21:10";"495"
"21:11";"494"
"21:12";"493"
"21:13";"492"
"21:14";"492"
"21:15";"489"
"21:16";"489"
"21:17";"488"
"21:18";"486"
"21:19";"486"
"21:20";"485"
"21:21";"484"
"21:22";"482"
"21:23";"482"
"21:24";"482"
"21:25";"479"
"21:26";"478"
"21:27";"478"
"21:28";"477"
"21:29";"477"
"21:30";"475"
"21:31";"474"
"21:32";"472"
"21:33";"472"
"21:34";"471"
"21:35";"470"
"21:36";"469"
"21:37";"468"
"21:38";"465"
"21:39";"465"
"21:40";"464"
"21:41";"464"
"21:42";"462"
"21:43";"462"
"21:44";"461"
"21:45";"458"
"21:46";"458"
"21:47";"458"
"21:48";"455"
"21:49";"455"
"21:50";"454"
"21:51";"453"
"21:52";"453"
"21:53";"451"
"21:54";"451"
"21:55";"450"
"21:56";"448"
"21:57";"447"
"21:58";"445"
"21:59";"444"
"22:00";"444"
"22:01";"441"
"22:02";"441"
"22:03";"441"
"22:04";"440"
"22:05";"438"
"22:06";"437"
"22:07";"437"
"22:08";"434"
"22:09";"432"
"22:10";"433"
"22:11";"431"
"22:12";"431"
"22:13";"430"
"22:14";"428"
"22:15";"427"
"22:16";"427"
"22:17";"426"
"22:18";"424"
"22:19";"424"
"22:20";"423"
"22:21";"422"
"22:22";"421"
"22:23";"419"
"22:24";"420"
"22:25";"419"
"22:26";"417"
"22:27";"416"
"22:28";"416"
"22:29";"414"
"22:30";"413"
"22:31";"413"
"22:32";"410"
"22:33";"410"
"22:34";"410"
"22:35";"409"
"22:36";"409"
"22:37";"407"
"22:38";"407"
"22:39";"406"
"22:40";"405"
"22:41";"403"
"22:42";"403"
"22:43";"402"
"22:44";"402"
"22:45";"400"
"22:46";"400"
"22:47";"398"
"22:48";"398"
"22:49";"396"
"22:50";"393"
"22:51";"393"
"22:52";"393"
"22:53";"392"
"22:54";"392"
"22:55";"392"
"22:56";"390"
"22:57";"389"
"22:58";"389"
"22:59";"389"
"23:00";"388"
"23:01";"386"
"23:02";"386"
"23:03";"386"
"23:04";"385"
"23:05";"385"
"23:06";"383"
"23:07";"382"
"23:08";"381"
"23:09";"380"
"23:10";"379"
"23:11";"378"
"23:12";"378"
"23:13";"376"
"23:14";"376"
"23:15";"376"
"23:16";"376"
"23:17";"375"
"23:18";"375"
"23:19";"375"
"23:20";"375"
"23:21";"374"
"23:22";"374"
"23:23";"373"
"23:24";"373"
"23:25";"372"
"23:26";"372"
"23:27";"372"
"23:28";"373"
"23:29";"372"
"23:30";"372"
"23:31";"372"
"23:32";"372"
"23:33";"373"
"23:34";"372"
"23:35";"372"
"23:36";"372"
"23:37";"372"
"23:38";"373"
"23:39";"373"
"23:40";"372"
"23:41";"372"
"23:42";"370"
"23:43";"370"
"23:44";"371"
"23:45";"370"
"23:46";"369"
"23:47";"371"
"23:48";"369"
"23:49";"369"
"23:50";"369"
"23:51";"370"
"23:52";"369"
"23:53";"370"
"23:54";"371"
"23:55";"371"
"23:56";"371"
"23:57";"370"
"23:58";"371"
"23:59";"369"
"24:00";"369"
