"23.09.2022";"Emden";"NORDSEE";"SPIEKEROOG";"9410010";"W_O";"cm";"XXX,XXX";"XX.XX.XXXX";"XX:XX";"PNP";"-5,08"
"00:01";"551"
"00:02";"550"
"00:03";"549"
"00:04";"548"
"00:05";"548"
"00:06";"547"
"00:07";"546"
"00:08";"545"
"00:09";"544"
"00:10";"543"
"00:11";"542"
"00:12";"542"
"00:13";"541"
"00:14";"540"
"00:15";"539"
"00:16";"538"
"00:17";"537"
"00:18";"537"
"00:19";"536"
"00:20";"534"
"00:21";"533"
"00:22";"532"
"00:23";"531"
"00:24";"531"
"00:25";"530"
"00:26";"529"
"00:27";"527"
"00:28";"527"
"00:29";"526"
"00:30";"524"
"00:31";"524"
"00:32";"523"
"00:33";"522"
"00:34";"521"
"00:35";"520"
"00:36";"520"
"00:37";"519"
"00:38";"518"
"00:39";"517"
"00:40";"516"
"00:41";"516"
"00:42";"514"
"00:43";"514"
"00:44";"513"
"00:45";"512"
"00:46";"512"
"00:47";"510"
"00:48";"509"
"00:49";"508"
"00:50";"508"
"00:51";"507"
"00:52";"505"
"00:53";"504"
"00:54";"504"
"00:55";"503"
"00:56";"502"
"00:57";"501"
"00:58";"501"
"00:59";"500"
"01:00";"499"
"01:01";"498"
"01:02";"497"
"01:03";"496"
"01:04";"495"
"01:05";"495"
"01:06";"494"
"01:07";"493"
"01:08";"492"
"01:09";"492"
"01:10";"490"
"01:11";"489"
"01:12";"489"
"01:13";"488"
"01:14";"487"
"01:15";"486"
"01:16";"485"
"01:17";"484"
"01:18";"483"
"01:19";"483"
"01:20";"482"
"01:21";"481"
"01:22";"480"
"01:23";"480"
"01:24";"478"
"01:25";"477"
"01:26";"476"
"01:27";"475"
"01:28";"475"
"01:29";"474"
"01:30";"473"
"01:31";"473"
"01:32";"472"
"01:33";"471"
"01:34";"470"
"01:35";"469"
"01:36";"468"
"01:37";"467"
"01:38";"467"
"01:39";"466"
"01:40";"465"
"01:41";"464"
"01:42";"463"
"01:43";"462"
"01:44";"461"
"01:45";"460"
"01:46";"460"
"01:47";"458"
"01:48";"458"
"01:49";"457"
"01:50";"457"
"01:51";"456"
"01:52";"456"
"01:53";"454"
"01:54";"454"
"01:55";"453"
"01:56";"452"
"01:57";"451"
"01:58";"450"
"01:59";"449"
"02:00";"449"
"02:01";"448"
"02:02";"447"
"02:03";"447"
"02:04";"446"
"02:05";"445"
"02:06";"445"
"02:07";"445"
"02:08";"444"
"02:09";"443"
"02:10";"443"
"02:11";"441"
"02:12";"441"
"02:13";"440"
"02:14";"440"
"02:15";"438"
"02:16";"438"
"02:17";"436"
"02:18";"436"
"02:19";"436"
"02:20";"435"
"02:21";"434"
"02:22";"433"
"02:23";"432"
"02:24";"432"
"02:25";"432"
"02:26";"431"
"02:27";"430"
"02:28";"428"
"02:29";"428"
"02:30";"428"
"02:31";"428"
"02:32";"427"
"02:33";"426"
"02:34";"425"
"02:35";"424"
"02:36";"424"
"02:37";"424"
"02:38";"423"
"02:39";"422"
"02:40";"421"
"02:41";"421"
"02:42";"420"
"02:43";"420"
"02:44";"419"
"02:45";"418"
"02:46";"417"
"02:47";"417"
"02:48";"417"
"02:49";"416"
"02:50";"415"
"02:51";"414"
"02:52";"414"
"02:53";"413"
"02:54";"413"
"02:55";"412"
"02:56";"411"
"02:57";"411"
"02:58";"410"
"02:59";"410"
"03:00";"409"
"03:01";"409"
"03:02";"408"
"03:03";"408"
"03:04";"407"
"03:05";"407"
"03:06";"406"
"03:07";"405"
"03:08";"404"
"03:09";"404"
"03:10";"404"
"03:11";"404"
"03:12";"404"
"03:13";"403"
"03:14";"403"
"03:15";"402"
"03:16";"402"
"03:17";"401"
"03:18";"401"
"03:19";"401"
"03:20";"401"
"03:21";"400"
"03:22";"400"
"03:23";"400"
"03:24";"400"
"03:25";"398"
"03:26";"399"
"03:27";"398"
"03:28";"398"
"03:29";"398"
"03:30";"397"
"03:31";"397"
"03:32";"397"
"03:33";"397"
"03:34";"396"
"03:35";"396"
"03:36";"396"
"03:37";"396"
"03:38";"396"
"03:39";"396"
"03:40";"396"
"03:41";"396"
"03:42";"396"
"03:43";"396"
"03:44";"396"
"03:45";"396"
"03:46";"396"
"03:47";"396"
"03:48";"396"
"03:49";"396"
"03:50";"396"
"03:51";"396"
"03:52";"396"
"03:53";"395"
"03:54";"395"
"03:55";"396"
"03:56";"396"
"03:57";"396"
"03:58";"396"
"03:59";"396"
"04:00";"396"
"04:01";"396"
"04:02";"396"
"04:03";"396"
"04:04";"396"
"04:05";"397"
"04:06";"396"
"04:07";"397"
"04:08";"396"
"04:09";"396"
"04:10";"397"
"04:11";"397"
"04:12";"397"
"04:13";"397"
"04:14";"398"
"04:15";"398"
"04:16";"398"
"04:17";"398"
"04:18";"398"
"04:19";"399"
"04:20";"399"
"04:21";"399"
"04:22";"399"
"04:23";"400"
"04:24";"400"
"04:25";"400"
"04:26";"400"
"04:27";"400"
"04:28";"401"
"04:29";"401"
"04:30";"401"
"04:31";"401"
"04:32";"401"
"04:33";"401"
"04:34";"402"
"04:35";"402"
"04:36";"402"
"04:37";"403"
"04:38";"403"
"04:39";"404"
"04:40";"404"
"04:41";"404"
"04:42";"404"
"04:43";"405"
"04:44";"405"
"04:45";"406"
"04:46";"406"
"04:47";"407"
"04:48";"407"
"04:49";"408"
"04:50";"408"
"04:51";"408"
"04:52";"409"
"04:53";"409"
"04:54";"409"
"04:55";"409"
"04:56";"409"
"04:57";"410"
"04:58";"410"
"04:59";"410"
"05:00";"411"
"05:01";"412"
"05:02";"412"
"05:03";"413"
"05:04";"413"
"05:05";"413"
"05:06";"414"
"05:07";"415"
"05:08";"415"
"05:09";"416"
"05:10";"417"
"05:11";"417"
"05:12";"418"
"05:13";"419"
"05:14";"420"
"05:15";"420"
"05:16";"420"
"05:17";"422"
"05:18";"422"
"05:19";"424"
"05:20";"425"
"05:21";"425"
"05:22";"427"
"05:23";"427"
"05:24";"428"
"05:25";"429"
"05:26";"430"
"05:27";"430"
"05:28";"432"
"05:29";"432"
"05:30";"432"
"05:31";"434"
"05:32";"435"
"05:33";"436"
"05:34";"437"
"05:35";"438"
"05:36";"439"
"05:37";"441"
"05:38";"442"
"05:39";"444"
"05:40";"445"
"05:41";"446"
"05:42";"448"
"05:43";"449"
"05:44";"450"
"05:45";"452"
"05:46";"452"
"05:47";"454"
"05:48";"455"
"05:49";"457"
"05:50";"458"
"05:51";"459"
"05:52";"460"
"05:53";"461"
"05:54";"462"
"05:55";"464"
"05:56";"465"
"05:57";"466"
"05:58";"468"
"05:59";"469"
"06:00";"471"
"06:01";"472"
"06:02";"474"
"06:03";"475"
"06:04";"477"
"06:05";"478"
"06:06";"479"
"06:07";"480"
"06:08";"481"
"06:09";"483"
"06:10";"484"
"06:11";"485"
"06:12";"487"
"06:13";"488"
"06:14";"489"
"06:15";"490"
"06:16";"491"
"06:17";"492"
"06:18";"493"
"06:19";"494"
"06:20";"496"
"06:21";"496"
"06:22";"497"
"06:23";"499"
"06:24";"500"
"06:25";"501"
"06:26";"503"
"06:27";"504"
"06:28";"505"
"06:29";"506"
"06:30";"508"
"06:31";"508"
"06:32";"510"
"06:33";"511"
"06:34";"512"
"06:35";"513"
"06:36";"514"
"06:37";"515"
"06:38";"516"
"06:39";"516"
"06:40";"518"
"06:41";"518"
"06:42";"519"
"06:43";"520"
"06:44";"520"
"06:45";"521"
"06:46";"523"
"06:47";"524"
"06:48";"524"
"06:49";"525"
"06:50";"526"
"06:51";"527"
"06:52";"528"
"06:53";"529"
"06:54";"530"
"06:55";"531"
"06:56";"532"
"06:57";"533"
"06:58";"533"
"06:59";"534"
"07:00";"535"
"07:01";"535"
"07:02";"536"
"07:03";"537"
"07:04";"538"
"07:05";"539"
"07:06";"540"
"07:07";"540"
"07:08";"542"
"07:09";"542"
"07:10";"544"
"07:11";"544"
"07:12";"544"
"07:13";"545"
"07:14";"546"
"07:15";"547"
"07:16";"548"
"07:17";"548"
"07:18";"548"
"07:19";"550"
"07:20";"550"
"07:21";"551"
"07:22";"551"
"07:23";"552"
"07:24";"553"
"07:25";"554"
"07:26";"555"
"07:27";"555"
"07:28";"557"
"07:29";"557"
"07:30";"559"
"07:31";"560"
"07:32";"561"
"07:33";"561"
"07:34";"562"
"07:35";"563"
"07:36";"564"
"07:37";"565"
"07:38";"566"
"07:39";"567"
"07:40";"568"
"07:41";"569"
"07:42";"569"
"07:43";"570"
"07:44";"571"
"07:45";"571"
"07:46";"572"
"07:47";"572"
"07:48";"574"
"07:49";"575"
"07:50";"576"
"07:51";"576"
"07:52";"577"
"07:53";"578"
"07:54";"580"
"07:55";"580"
"07:56";"581"
"07:57";"582"
"07:58";"583"
"07:59";"584"
"08:00";"585"
"08:01";"586"
"08:02";"587"
"08:03";"588"
"08:04";"589"
"08:05";"589"
"08:06";"590"
"08:07";"591"
"08:08";"592"
"08:09";"592"
"08:10";"593"
"08:11";"594"
"08:12";"595"
"08:13";"595"
"08:14";"596"
"08:15";"597"
"08:16";"598"
"08:17";"599"
"08:18";"599"
"08:19";"600"
"08:20";"601"
"08:21";"602"
"08:22";"603"
"08:23";"603"
"08:24";"604"
"08:25";"606"
"08:26";"607"
"08:27";"607"
"08:28";"608"
"08:29";"609"
"08:30";"610"
"08:31";"611"
"08:32";"612"
"08:33";"612"
"08:34";"613"
"08:35";"614"
"08:36";"615"
"08:37";"616"
"08:38";"617"
"08:39";"617"
"08:40";"618"
"08:41";"619"
"08:42";"620"
"08:43";"620"
"08:44";"621"
"08:45";"623"
"08:46";"623"
"08:47";"624"
"08:48";"624"
"08:49";"625"
"08:50";"626"
"08:51";"627"
"08:52";"628"
"08:53";"628"
"08:54";"628"
"08:55";"629"
"08:56";"630"
"08:57";"630"
"08:58";"630"
"08:59";"632"
"09:00";"632"
"09:01";"633"
"09:02";"634"
"09:03";"635"
"09:04";"635"
"09:05";"635"
"09:06";"636"
"09:07";"637"
"09:08";"638"
"09:09";"638"
"09:10";"639"
"09:11";"639"
"09:12";"640"
"09:13";"641"
"09:14";"641"
"09:15";"642"
"09:16";"643"
"09:17";"643"
"09:18";"644"
"09:19";"645"
"09:20";"645"
"09:21";"646"
"09:22";"647"
"09:23";"648"
"09:24";"648"
"09:25";"648"
"09:26";"649"
"09:27";"650"
"09:28";"650"
"09:29";"651"
"09:30";"651"
"09:31";"651"
"09:32";"652"
"09:33";"652"
"09:34";"652"
"09:35";"653"
"09:36";"653"
"09:37";"654"
"09:38";"654"
"09:39";"654"
"09:40";"655"
"09:41";"655"
"09:42";"656"
"09:43";"656"
"09:44";"656"
"09:45";"656"
"09:46";"656"
"09:47";"657"
"09:48";"657"
"09:49";"657"
"09:50";"657"
"09:51";"658"
"09:52";"658"
"09:53";"659"
"09:54";"659"
"09:55";"659"
"09:56";"659"
"09:57";"660"
"09:58";"660"
"09:59";"659"
"10:00";"660"
"10:01";"660"
"10:02";"660"
"10:03";"660"
"10:04";"660"
"10:05";"660"
"10:06";"660"
"10:07";"660"
"10:08";"660"
"10:09";"660"
"10:10";"660"
"10:11";"660"
"10:12";"660"
"10:13";"660"
"10:14";"660"
"10:15";"660"
"10:16";"660"
"10:17";"660"
"10:18";"660"
"10:19";"660"
"10:20";"659"
"10:21";"659"
"10:22";"659"
"10:23";"658"
"10:24";"658"
"10:25";"658"
"10:26";"657"
"10:27";"657"
"10:28";"657"
"10:29";"656"
"10:30";"656"
"10:31";"656"
"10:32";"656"
"10:33";"656"
"10:34";"655"
"10:35";"655"
"10:36";"654"
"10:37";"654"
"10:38";"653"
"10:39";"652"
"10:40";"652"
"10:41";"652"
"10:42";"651"
"10:43";"652"
"10:44";"651"
"10:45";"650"
"10:46";"649"
"10:47";"649"
"10:48";"648"
"10:49";"648"
"10:50";"647"
"10:51";"647"
"10:52";"646"
"10:53";"646"
"10:54";"645"
"10:55";"644"
"10:56";"644"
"10:57";"644"
"10:58";"642"
"10:59";"642"
"11:00";"642"
"11:01";"641"
"11:02";"641"
"11:03";"640"
"11:04";"639"
"11:05";"638"
"11:06";"638"
"11:07";"637"
"11:08";"637"
"11:09";"636"
"11:10";"635"
"11:11";"634"
"11:12";"634"
"11:13";"633"
"11:14";"632"
"11:15";"632"
"11:16";"631"
"11:17";"630"
"11:18";"629"
"11:19";"629"
"11:20";"628"
"11:21";"628"
"11:22";"627"
"11:23";"626"
"11:24";"625"
"11:25";"624"
"11:26";"623"
"11:27";"623"
"11:28";"621"
"11:29";"621"
"11:30";"620"
"11:31";"619"
"11:32";"619"
"11:33";"618"
"11:34";"616"
"11:35";"616"
"11:36";"615"
"11:37";"615"
"11:38";"613"
"11:39";"612"
"11:40";"611"
"11:41";"611"
"11:42";"610"
"11:43";"609"
"11:44";"609"
"11:45";"607"
"11:46";"607"
"11:47";"605"
"11:48";"604"
"11:49";"603"
"11:50";"602"
"11:51";"601"
"11:52";"601"
"11:53";"600"
"11:54";"599"
"11:55";"598"
"11:56";"597"
"11:57";"596"
"11:58";"595"
"11:59";"594"
"12:00";"594"
"12:01";"593"
"12:02";"592"
"12:03";"591"
"12:04";"590"
"12:05";"589"
"12:06";"588"
"12:07";"587"
"12:08";"586"
"12:09";"585"
"12:10";"584"
"12:11";"584"
"12:12";"583"
"12:13";"582"
"12:14";"580"
"12:15";"580"
"12:16";"579"
"12:17";"578"
"12:18";"576"
"12:19";"576"
"12:20";"575"
"12:21";"573"
"12:22";"572"
"12:23";"572"
"12:24";"571"
"12:25";"570"
"12:26";"569"
"12:27";"568"
"12:28";"567"
"12:29";"567"
"12:30";"566"
"12:31";"564"
"12:32";"564"
"12:33";"563"
"12:34";"562"
"12:35";"561"
"12:36";"559"
"12:37";"558"
"12:38";"557"
"12:39";"556"
"12:40";"555"
"12:41";"554"
"12:42";"553"
"12:43";"552"
"12:44";"552"
"12:45";"550"
"12:46";"549"
"12:47";"548"
"12:48";"547"
"12:49";"546"
"12:50";"545"
"12:51";"544"
"12:52";"543"
"12:53";"541"
"12:54";"541"
"12:55";"540"
"12:56";"539"
"12:57";"538"
"12:58";"537"
"12:59";"536"
"13:00";"535"
"13:01";"534"
"13:02";"533"
"13:03";"531"
"13:04";"530"
"13:05";"530"
"13:06";"528"
"13:07";"526"
"13:08";"526"
"13:09";"525"
"13:10";"524"
"13:11";"523"
"13:12";"522"
"13:13";"521"
"13:14";"520"
"13:15";"519"
"13:16";"518"
"13:17";"516"
"13:18";"516"
"13:19";"515"
"13:20";"513"
"13:21";"512"
"13:22";"512"
"13:23";"510"
"13:24";"509"
"13:25";"508"
"13:26";"507"
"13:27";"506"
"13:28";"505"
"13:29";"504"
"13:30";"504"
"13:31";"502"
"13:32";"501"
"13:33";"500"
"13:34";"500"
"13:35";"498"
"13:36";"497"
"13:37";"496"
"13:38";"495"
"13:39";"494"
"13:40";"493"
"13:41";"492"
"13:42";"491"
"13:43";"490"
"13:44";"489"
"13:45";"488"
"13:46";"487"
"13:47";"486"
"13:48";"485"
"13:49";"484"
"13:50";"483"
"13:51";"482"
"13:52";"482"
"13:53";"481"
"13:54";"480"
"13:55";"479"
"13:56";"478"
"13:57";"477"
"13:58";"476"
"13:59";"475"
"14:00";"474"
"14:01";"473"
"14:02";"472"
"14:03";"471"
"14:04";"470"
"14:05";"469"
"14:06";"468"
"14:07";"468"
"14:08";"467"
"14:09";"465"
"14:10";"464"
"14:11";"463"
"14:12";"462"
"14:13";"461"
"14:14";"460"
"14:15";"460"
"14:16";"459"
"14:17";"458"
"14:18";"458"
"14:19";"456"
"14:20";"455"
"14:21";"454"
"14:22";"454"
"14:23";"452"
"14:24";"452"
"14:25";"450"
"14:26";"450"
"14:27";"449"
"14:28";"448"
"14:29";"447"
"14:30";"446"
"14:31";"445"
"14:32";"445"
"14:33";"444"
"14:34";"444"
"14:35";"442"
"14:36";"442"
"14:37";"441"
"14:38";"441"
"14:39";"439"
"14:40";"438"
"14:41";"436"
"14:42";"436"
"14:43";"435"
"14:44";"434"
"14:45";"432"
"14:46";"432"
"14:47";"431"
"14:48";"431"
"14:49";"430"
"14:50";"429"
"14:51";"428"
"14:52";"428"
"14:53";"426"
"14:54";"425"
"14:55";"424"
"14:56";"424"
"14:57";"423"
"14:58";"423"
"14:59";"422"
"15:00";"421"
"15:01";"420"
"15:02";"419"
"15:03";"418"
"15:04";"417"
"15:05";"417"
"15:06";"416"
"15:07";"414"
"15:08";"414"
"15:09";"413"
"15:10";"413"
"15:11";"412"
"15:12";"411"
"15:13";"410"
"15:14";"409"
"15:15";"409"
"15:16";"408"
"15:17";"406"
"15:18";"406"
"15:19";"405"
"15:20";"404"
"15:21";"404"
"15:22";"403"
"15:23";"403"
"15:24";"402"
"15:25";"401"
"15:26";"401"
"15:27";"400"
"15:28";"399"
"15:29";"399"
"15:30";"399"
"15:31";"398"
"15:32";"397"
"15:33";"397"
"15:34";"397"
"15:35";"396"
"15:36";"396"
"15:37";"395"
"15:38";"394"
"15:39";"393"
"15:40";"393"
"15:41";"392"
"15:42";"392"
"15:43";"391"
"15:44";"391"
"15:45";"390"
"15:46";"389"
"15:47";"389"
"15:48";"388"
"15:49";"388"
"15:50";"387"
"15:51";"387"
"15:52";"386"
"15:53";"386"
"15:54";"385"
"15:55";"385"
"15:56";"384"
"15:57";"384"
"15:58";"384"
"15:59";"384"
"16:00";"383"
"16:01";"383"
"16:02";"383"
"16:03";"382"
"16:04";"382"
"16:05";"382"
"16:06";"382"
"16:07";"382"
"16:08";"380"
"16:09";"380"
"16:10";"380"
"16:11";"380"
"16:12";"380"
"16:13";"380"
"16:14";"380"
"16:15";"380"
"16:16";"379"
"16:17";"379"
"16:18";"379"
"16:19";"379"
"16:20";"379"
"16:21";"379"
"16:22";"379"
"16:23";"379"
"16:24";"379"
"16:25";"379"
"16:26";"379"
"16:27";"379"
"16:28";"379"
"16:29";"379"
"16:30";"379"
"16:31";"379"
"16:32";"379"
"16:33";"379"
"16:34";"379"
"16:35";"379"
"16:36";"380"
"16:37";"379"
"16:38";"380"
"16:39";"380"
"16:40";"380"
"16:41";"380"
"16:42";"380"
"16:43";"380"
"16:44";"380"
"16:45";"381"
"16:46";"380"
"16:47";"380"
"16:48";"380"
"16:49";"381"
"16:50";"380"
"16:51";"380"
"16:52";"381"
"16:53";"380"
"16:54";"382"
"16:55";"382"
"16:56";"382"
"16:57";"382"
"16:58";"382"
"16:59";"382"
"17:00";"382"
"17:01";"382"
"17:02";"382"
"17:03";"382"
"17:04";"383"
"17:05";"383"
"17:06";"384"
"17:07";"383"
"17:08";"384"
"17:09";"385"
"17:10";"384"
"17:11";"385"
"17:12";"385"
"17:13";"385"
"17:14";"386"
"17:15";"386"
"17:16";"387"
"17:17";"387"
"17:18";"388"
"17:19";"388"
"17:20";"388"
"17:21";"389"
"17:22";"389"
"17:23";"389"
"17:24";"389"
"17:25";"390"
"17:26";"391"
"17:27";"391"
"17:28";"392"
"17:29";"392"
"17:30";"392"
"17:31";"393"
"17:32";"393"
"17:33";"394"
"17:34";"394"
"17:35";"395"
"17:36";"396"
"17:37";"396"
"17:38";"397"
"17:39";"397"
"17:40";"398"
"17:41";"398"
"17:42";"400"
"17:43";"401"
"17:44";"401"
"17:45";"402"
"17:46";"403"
"17:47";"404"
"17:48";"405"
"17:49";"406"
"17:50";"407"
"17:51";"408"
"17:52";"409"
"17:53";"410"
"17:54";"411"
"17:55";"412"
"17:56";"413"
"17:57";"414"
"17:58";"415"
"17:59";"417"
"18:00";"418"
"18:01";"419"
"18:02";"420"
"18:03";"421"
"18:04";"423"
"18:05";"424"
"18:06";"425"
"18:07";"427"
"18:08";"428"
"18:09";"429"
"18:10";"431"
"18:11";"432"
"18:12";"433"
"18:13";"435"
"18:14";"436"
"18:15";"437"
"18:16";"438"
"18:17";"440"
"18:18";"442"
"18:19";"443"
"18:20";"444"
"18:21";"445"
"18:22";"447"
"18:23";"448"
"18:24";"450"
"18:25";"451"
"18:26";"453"
"18:27";"454"
"18:28";"456"
"18:29";"458"
"18:30";"458"
"18:31";"460"
"18:32";"461"
"18:33";"463"
"18:34";"464"
"18:35";"465"
"18:36";"467"
"18:37";"468"
"18:38";"468"
"18:39";"470"
"18:40";"471"
"18:41";"473"
"18:42";"474"
"18:43";"475"
"18:44";"476"
"18:45";"477"
"18:46";"478"
"18:47";"480"
"18:48";"481"
"18:49";"482"
"18:50";"483"
"18:51";"484"
"18:52";"485"
"18:53";"486"
"18:54";"488"
"18:55";"489"
"18:56";"489"
"18:57";"491"
"18:58";"492"
"18:59";"493"
"19:00";"494"
"19:01";"495"
"19:02";"496"
"19:03";"498"
"19:04";"499"
"19:05";"500"
"19:06";"500"
"19:07";"502"
"19:08";"502"
"19:09";"504"
"19:10";"504"
"19:11";"506"
"19:12";"507"
"19:13";"508"
"19:14";"508"
"19:15";"509"
"19:16";"511"
"19:17";"512"
"19:18";"512"
"19:19";"514"
"19:20";"515"
"19:21";"516"
"19:22";"516"
"19:23";"517"
"19:24";"518"
"19:25";"519"
"19:26";"520"
"19:27";"520"
"19:28";"522"
"19:29";"523"
"19:30";"524"
"19:31";"524"
"19:32";"525"
"19:33";"526"
"19:34";"527"
"19:35";"528"
"19:36";"528"
"19:37";"529"
"19:38";"530"
"19:39";"532"
"19:40";"533"
"19:41";"533"
"19:42";"534"
"19:43";"534"
"19:44";"535"
"19:45";"536"
"19:46";"537"
"19:47";"537"
"19:48";"538"
"19:49";"539"
"19:50";"540"
"19:51";"541"
"19:52";"542"
"19:53";"542"
"19:54";"543"
"19:55";"544"
"19:56";"545"
"19:57";"546"
"19:58";"547"
"19:59";"548"
"20:00";"548"
"20:01";"549"
"20:02";"549"
"20:03";"551"
"20:04";"551"
"20:05";"552"
"20:06";"552"
"20:07";"553"
"20:08";"554"
"20:09";"555"
"20:10";"555"
"20:11";"556"
"20:12";"557"
"20:13";"558"
"20:14";"559"
"20:15";"559"
"20:16";"560"
"20:17";"561"
"20:18";"562"
"20:19";"563"
"20:20";"564"
"20:21";"564"
"20:22";"565"
"20:23";"566"
"20:24";"567"
"20:25";"568"
"20:26";"568"
"20:27";"569"
"20:28";"570"
"20:29";"571"
"20:30";"572"
"20:31";"572"
"20:32";"573"
"20:33";"574"
"20:34";"575"
"20:35";"576"
"20:36";"576"
"20:37";"577"
"20:38";"578"
"20:39";"579"
"20:40";"580"
"20:41";"581"
"20:42";"581"
"20:43";"582"
"20:44";"584"
"20:45";"584"
"20:46";"585"
"20:47";"586"
"20:48";"587"
"20:49";"588"
"20:50";"588"
"20:51";"588"
"20:52";"589"
"20:53";"590"
"20:54";"591"
"20:55";"592"
"20:56";"592"
"20:57";"593"
"20:58";"594"
"20:59";"595"
"21:00";"595"
"21:01";"596"
"21:02";"597"
"21:03";"598"
"21:04";"599"
"21:05";"599"
"21:06";"599"
"21:07";"601"
"21:08";"601"
"21:09";"602"
"21:10";"603"
"21:11";"603"
"21:12";"604"
"21:13";"605"
"21:14";"606"
"21:15";"607"
"21:16";"607"
"21:17";"608"
"21:18";"609"
"21:19";"610"
"21:20";"610"
"21:21";"611"
"21:22";"612"
"21:23";"612"
"21:24";"613"
"21:25";"614"
"21:26";"615"
"21:27";"615"
"21:28";"616"
"21:29";"616"
"21:30";"617"
"21:31";"618"
"21:32";"619"
"21:33";"620"
"21:34";"620"
"21:35";"620"
"21:36";"620"
"21:37";"621"
"21:38";"622"
"21:39";"623"
"21:40";"623"
"21:41";"624"
"21:42";"624"
"21:43";"624"
"21:44";"625"
"21:45";"626"
"21:46";"626"
"21:47";"627"
"21:48";"628"
"21:49";"628"
"21:50";"628"
"21:51";"629"
"21:52";"630"
"21:53";"630"
"21:54";"631"
"21:55";"631"
"21:56";"632"
"21:57";"632"
"21:58";"633"
"21:59";"633"
"22:00";"634"
"22:01";"635"
"22:02";"635"
"22:03";"635"
"22:04";"636"
"22:05";"636"
"22:06";"637"
"22:07";"637"
"22:08";"638"
"22:09";"638"
"22:10";"638"
"22:11";"639"
"22:12";"639"
"22:13";"639"
"22:14";"640"
"22:15";"640"
"22:16";"641"
"22:17";"641"
"22:18";"642"
"22:19";"642"
"22:20";"643"
"22:21";"643"
"22:22";"643"
"22:23";"643"
"22:24";"643"
"22:25";"643"
"22:26";"643"
"22:27";"644"
"22:28";"644"
"22:29";"644"
"22:30";"644"
"22:31";"644"
"22:32";"644"
"22:33";"645"
"22:34";"645"
"22:35";"645"
"22:36";"645"
"22:37";"645"
"22:38";"645"
"22:39";"645"
"22:40";"645"
"22:41";"645"
"22:42";"645"
"22:43";"645"
"22:44";"645"
"22:45";"645"
"22:46";"645"
"22:47";"645"
"22:48";"645"
"22:49";"645"
"22:50";"645"
"22:51";"644"
"22:52";"644"
"22:53";"644"
"22:54";"644"
"22:55";"644"
"22:56";"644"
"22:57";"643"
"22:58";"643"
"22:59";"643"
"23:00";"643"
"23:01";"643"
"23:02";"642"
"23:03";"643"
"23:04";"642"
"23:05";"642"
"23:06";"641"
"23:07";"641"
"23:08";"640"
"23:09";"640"
"23:10";"640"
"23:11";"639"
"23:12";"638"
"23:13";"639"
"23:14";"638"
"23:15";"638"
"23:16";"637"
"23:17";"636"
"23:18";"636"
"23:19";"635"
"23:20";"635"
"23:21";"634"
"23:22";"633"
"23:23";"633"
"23:24";"632"
"23:25";"632"
"23:26";"632"
"23:27";"631"
"23:28";"630"
"23:29";"630"
"23:30";"628"
"23:31";"628"
"23:32";"628"
"23:33";"627"
"23:34";"625"
"23:35";"625"
"23:36";"624"
"23:37";"623"
"23:38";"623"
"23:39";"622"
"23:40";"621"
"23:41";"620"
"23:42";"620"
"23:43";"619"
"23:44";"618"
"23:45";"617"
"23:46";"616"
"23:47";"616"
"23:48";"615"
"23:49";"613"
"23:50";"612"
"23:51";"611"
"23:52";"611"
"23:53";"610"
"23:54";"609"
"23:55";"608"
"23:56";"607"
"23:57";"607"
"23:58";"605"
"23:59";"604"
"24:00";"603"
