"22.09.2022";"Emden";"NORDSEE";"SPIEKEROOG";"9410010";"W_O";"cm";"XXX,XXX";"XX.XX.XXXX";"XX:XX";"PNP";"-5,08"
"00:01";"492"
"00:02";"492"
"00:03";"490"
"00:04";"489"
"00:05";"489"
"00:06";"488"
"00:07";"488"
"00:08";"487"
"00:09";"486"
"00:10";"485"
"00:11";"484"
"00:12";"483"
"00:13";"482"
"00:14";"482"
"00:15";"481"
"00:16";"480"
"00:17";"480"
"00:18";"479"
"00:19";"478"
"00:20";"477"
"00:21";"476"
"00:22";"475"
"00:23";"474"
"00:24";"474"
"00:25";"473"
"00:26";"472"
"00:27";"472"
"00:28";"470"
"00:29";"470"
"00:30";"469"
"00:31";"468"
"00:32";"468"
"00:33";"467"
"00:34";"465"
"00:35";"465"
"00:36";"464"
"00:37";"464"
"00:38";"463"
"00:39";"463"
"00:40";"462"
"00:41";"461"
"00:42";"460"
"00:43";"460"
"00:44";"459"
"00:45";"458"
"00:46";"457"
"00:47";"456"
"00:48";"456"
"00:49";"455"
"00:50";"454"
"00:51";"454"
"00:52";"453"
"00:53";"452"
"00:54";"451"
"00:55";"450"
"00:56";"450"
"00:57";"448"
"00:58";"448"
"00:59";"448"
"01:00";"447"
"01:01";"446"
"01:02";"445"
"01:03";"444"
"01:04";"444"
"01:05";"443"
"01:06";"442"
"01:07";"441"
"01:08";"441"
"01:09";"440"
"01:10";"439"
"01:11";"439"
"01:12";"438"
"01:13";"437"
"01:14";"437"
"01:15";"436"
"01:16";"436"
"01:17";"435"
"01:18";"435"
"01:19";"434"
"01:20";"433"
"01:21";"433"
"01:22";"432"
"01:23";"432"
"01:24";"431"
"01:25";"431"
"01:26";"429"
"01:27";"428"
"01:28";"428"
"01:29";"428"
"01:30";"428"
"01:31";"427"
"01:32";"426"
"01:33";"425"
"01:34";"424"
"01:35";"424"
"01:36";"423"
"01:37";"422"
"01:38";"421"
"01:39";"420"
"01:40";"420"
"01:41";"420"
"01:42";"419"
"01:43";"418"
"01:44";"417"
"01:45";"417"
"01:46";"416"
"01:47";"416"
"01:48";"415"
"01:49";"415"
"01:50";"414"
"01:51";"413"
"01:52";"413"
"01:53";"413"
"01:54";"413"
"01:55";"412"
"01:56";"411"
"01:57";"410"
"01:58";"410"
"01:59";"409"
"02:00";"409"
"02:01";"409"
"02:02";"408"
"02:03";"408"
"02:04";"407"
"02:05";"406"
"02:06";"406"
"02:07";"406"
"02:08";"405"
"02:09";"405"
"02:10";"405"
"02:11";"404"
"02:12";"404"
"02:13";"403"
"02:14";"403"
"02:15";"402"
"02:16";"402"
"02:17";"401"
"02:18";"401"
"02:19";"401"
"02:20";"401"
"02:21";"401"
"02:22";"400"
"02:23";"400"
"02:24";"400"
"02:25";"400"
"02:26";"399"
"02:27";"399"
"02:28";"399"
"02:29";"399"
"02:30";"398"
"02:31";"398"
"02:32";"398"
"02:33";"398"
"02:34";"398"
"02:35";"397"
"02:36";"398"
"02:37";"397"
"02:38";"397"
"02:39";"397"
"02:40";"397"
"02:41";"397"
"02:42";"397"
"02:43";"397"
"02:44";"397"
"02:45";"397"
"02:46";"397"
"02:47";"397"
"02:48";"397"
"02:49";"397"
"02:50";"397"
"02:51";"397"
"02:52";"397"
"02:53";"397"
"02:54";"397"
"02:55";"397"
"02:56";"397"
"02:57";"397"
"02:58";"398"
"02:59";"397"
"03:00";"397"
"03:01";"398"
"03:02";"398"
"03:03";"398"
"03:04";"398"
"03:05";"398"
"03:06";"398"
"03:07";"398"
"03:08";"398"
"03:09";"398"
"03:10";"399"
"03:11";"399"
"03:12";"399"
"03:13";"399"
"03:14";"399"
"03:15";"400"
"03:16";"400"
"03:17";"400"
"03:18";"400"
"03:19";"400"
"03:20";"401"
"03:21";"401"
"03:22";"401"
"03:23";"400"
"03:24";"401"
"03:25";"401"
"03:26";"401"
"03:27";"402"
"03:28";"402"
"03:29";"402"
"03:30";"403"
"03:31";"403"
"03:32";"403"
"03:33";"404"
"03:34";"404"
"03:35";"404"
"03:36";"404"
"03:37";"404"
"03:38";"405"
"03:39";"405"
"03:40";"405"
"03:41";"405"
"03:42";"406"
"03:43";"406"
"03:44";"406"
"03:45";"406"
"03:46";"407"
"03:47";"407"
"03:48";"407"
"03:49";"408"
"03:50";"408"
"03:51";"409"
"03:52";"409"
"03:53";"409"
"03:54";"410"
"03:55";"409"
"03:56";"409"
"03:57";"410"
"03:58";"411"
"03:59";"411"
"04:00";"412"
"04:01";"413"
"04:02";"413"
"04:03";"413"
"04:04";"413"
"04:05";"413"
"04:06";"414"
"04:07";"414"
"04:08";"415"
"04:09";"416"
"04:10";"416"
"04:11";"417"
"04:12";"417"
"04:13";"417"
"04:14";"418"
"04:15";"418"
"04:16";"419"
"04:17";"420"
"04:18";"420"
"04:19";"420"
"04:20";"420"
"04:21";"421"
"04:22";"422"
"04:23";"423"
"04:24";"424"
"04:25";"424"
"04:26";"424"
"04:27";"425"
"04:28";"426"
"04:29";"427"
"04:30";"428"
"04:31";"428"
"04:32";"429"
"04:33";"430"
"04:34";"431"
"04:35";"432"
"04:36";"432"
"04:37";"433"
"04:38";"434"
"04:39";"435"
"04:40";"436"
"04:41";"437"
"04:42";"438"
"04:43";"438"
"04:44";"439"
"04:45";"440"
"04:46";"441"
"04:47";"442"
"04:48";"443"
"04:49";"444"
"04:50";"445"
"04:51";"446"
"04:52";"447"
"04:53";"448"
"04:54";"449"
"04:55";"449"
"04:56";"451"
"04:57";"452"
"04:58";"453"
"04:59";"454"
"05:00";"455"
"05:01";"456"
"05:02";"457"
"05:03";"458"
"05:04";"459"
"05:05";"460"
"05:06";"461"
"05:07";"463"
"05:08";"464"
"05:09";"465"
"05:10";"466"
"05:11";"467"
"05:12";"468"
"05:13";"470"
"05:14";"471"
"05:15";"472"
"05:16";"473"
"05:17";"474"
"05:18";"475"
"05:19";"476"
"05:20";"478"
"05:21";"478"
"05:22";"479"
"05:23";"481"
"05:24";"482"
"05:25";"483"
"05:26";"484"
"05:27";"485"
"05:28";"486"
"05:29";"487"
"05:30";"488"
"05:31";"489"
"05:32";"490"
"05:33";"490"
"05:34";"492"
"05:35";"492"
"05:36";"493"
"05:37";"494"
"05:38";"495"
"05:39";"496"
"05:40";"496"
"05:41";"498"
"05:42";"499"
"05:43";"500"
"05:44";"500"
"05:45";"502"
"05:46";"503"
"05:47";"504"
"05:48";"504"
"05:49";"505"
"05:50";"506"
"05:51";"507"
"05:52";"508"
"05:53";"508"
"05:54";"510"
"05:55";"511"
"05:56";"512"
"05:57";"513"
"05:58";"513"
"05:59";"514"
"06:00";"515"
"06:01";"516"
"06:02";"517"
"06:03";"518"
"06:04";"519"
"06:05";"520"
"06:06";"520"
"06:07";"521"
"06:08";"522"
"06:09";"523"
"06:10";"523"
"06:11";"525"
"06:12";"526"
"06:13";"526"
"06:14";"527"
"06:15";"528"
"06:16";"529"
"06:17";"530"
"06:18";"532"
"06:19";"532"
"06:20";"532"
"06:21";"533"
"06:22";"534"
"06:23";"535"
"06:24";"535"
"06:25";"536"
"06:26";"537"
"06:27";"538"
"06:28";"539"
"06:29";"539"
"06:30";"540"
"06:31";"541"
"06:32";"541"
"06:33";"542"
"06:34";"543"
"06:35";"544"
"06:36";"544"
"06:37";"545"
"06:38";"546"
"06:39";"547"
"06:40";"547"
"06:41";"548"
"06:42";"549"
"06:43";"550"
"06:44";"550"
"06:45";"551"
"06:46";"552"
"06:47";"552"
"06:48";"553"
"06:49";"554"
"06:50";"554"
"06:51";"555"
"06:52";"556"
"06:53";"557"
"06:54";"558"
"06:55";"559"
"06:56";"559"
"06:57";"560"
"06:58";"561"
"06:59";"562"
"07:00";"563"
"07:01";"563"
"07:02";"565"
"07:03";"566"
"07:04";"566"
"07:05";"567"
"07:06";"568"
"07:07";"569"
"07:08";"569"
"07:09";"570"
"07:10";"571"
"07:11";"572"
"07:12";"572"
"07:13";"573"
"07:14";"574"
"07:15";"575"
"07:16";"576"
"07:17";"576"
"07:18";"577"
"07:19";"578"
"07:20";"578"
"07:21";"580"
"07:22";"580"
"07:23";"580"
"07:24";"582"
"07:25";"583"
"07:26";"583"
"07:27";"584"
"07:28";"585"
"07:29";"585"
"07:30";"587"
"07:31";"588"
"07:32";"588"
"07:33";"589"
"07:34";"590"
"07:35";"591"
"07:36";"591"
"07:37";"592"
"07:38";"592"
"07:39";"593"
"07:40";"594"
"07:41";"595"
"07:42";"595"
"07:43";"596"
"07:44";"596"
"07:45";"597"
"07:46";"598"
"07:47";"599"
"07:48";"599"
"07:49";"600"
"07:50";"601"
"07:51";"602"
"07:52";"603"
"07:53";"603"
"07:54";"604"
"07:55";"605"
"07:56";"606"
"07:57";"607"
"07:58";"607"
"07:59";"608"
"08:00";"608"
"08:01";"609"
"08:02";"610"
"08:03";"610"
"08:04";"611"
"08:05";"612"
"08:06";"612"
"08:07";"612"
"08:08";"613"
"08:09";"614"
"08:10";"615"
"08:11";"615"
"08:12";"616"
"08:13";"616"
"08:14";"617"
"08:15";"618"
"08:16";"618"
"08:17";"619"
"08:18";"620"
"08:19";"620"
"08:20";"620"
"08:21";"621"
"08:22";"622"
"08:23";"622"
"08:24";"623"
"08:25";"624"
"08:26";"624"
"08:27";"625"
"08:28";"625"
"08:29";"626"
"08:30";"626"
"08:31";"627"
"08:32";"628"
"08:33";"628"
"08:34";"628"
"08:35";"629"
"08:36";"629"
"08:37";"630"
"08:38";"630"
"08:39";"630"
"08:40";"631"
"08:41";"632"
"08:42";"632"
"08:43";"632"
"08:44";"632"
"08:45";"633"
"08:46";"633"
"08:47";"633"
"08:48";"634"
"08:49";"634"
"08:50";"634"
"08:51";"635"
"08:52";"635"
"08:53";"635"
"08:54";"635"
"08:55";"635"
"08:56";"635"
"08:57";"636"
"08:58";"636"
"08:59";"636"
"09:00";"637"
"09:01";"637"
"09:02";"637"
"09:03";"637"
"09:04";"637"
"09:05";"638"
"09:06";"638"
"09:07";"638"
"09:08";"638"
"09:09";"638"
"09:10";"638"
"09:11";"638"
"09:12";"637"
"09:13";"637"
"09:14";"637"
"09:15";"637"
"09:16";"637"
"09:17";"637"
"09:18";"637"
"09:19";"637"
"09:20";"637"
"09:21";"637"
"09:22";"637"
"09:23";"637"
"09:24";"637"
"09:25";"637"
"09:26";"637"
"09:27";"636"
"09:28";"636"
"09:29";"636"
"09:30";"636"
"09:31";"636"
"09:32";"635"
"09:33";"635"
"09:34";"635"
"09:35";"635"
"09:36";"634"
"09:37";"634"
"09:38";"634"
"09:39";"633"
"09:40";"633"
"09:41";"632"
"09:42";"632"
"09:43";"632"
"09:44";"631"
"09:45";"632"
"09:46";"630"
"09:47";"630"
"09:48";"630"
"09:49";"629"
"09:50";"629"
"09:51";"628"
"09:52";"628"
"09:53";"628"
"09:54";"627"
"09:55";"626"
"09:56";"626"
"09:57";"625"
"09:58";"625"
"09:59";"624"
"10:00";"624"
"10:01";"623"
"10:02";"622"
"10:03";"621"
"10:04";"620"
"10:05";"620"
"10:06";"619"
"10:07";"619"
"10:08";"618"
"10:09";"618"
"10:10";"617"
"10:11";"616"
"10:12";"616"
"10:13";"615"
"10:14";"615"
"10:15";"614"
"10:16";"613"
"10:17";"612"
"10:18";"612"
"10:19";"611"
"10:20";"610"
"10:21";"609"
"10:22";"608"
"10:23";"608"
"10:24";"607"
"10:25";"606"
"10:26";"606"
"10:27";"605"
"10:28";"604"
"10:29";"603"
"10:30";"602"
"10:31";"603"
"10:32";"602"
"10:33";"601"
"10:34";"600"
"10:35";"599"
"10:36";"599"
"10:37";"598"
"10:38";"597"
"10:39";"596"
"10:40";"595"
"10:41";"595"
"10:42";"594"
"10:43";"593"
"10:44";"592"
"10:45";"592"
"10:46";"591"
"10:47";"591"
"10:48";"590"
"10:49";"589"
"10:50";"588"
"10:51";"588"
"10:52";"587"
"10:53";"586"
"10:54";"585"
"10:55";"585"
"10:56";"584"
"10:57";"584"
"10:58";"583"
"10:59";"582"
"11:00";"582"
"11:01";"581"
"11:02";"580"
"11:03";"579"
"11:04";"578"
"11:05";"577"
"11:06";"576"
"11:07";"576"
"11:08";"575"
"11:09";"575"
"11:10";"573"
"11:11";"572"
"11:12";"572"
"11:13";"571"
"11:14";"570"
"11:15";"569"
"11:16";"568"
"11:17";"568"
"11:18";"567"
"11:19";"566"
"11:20";"565"
"11:21";"564"
"11:22";"563"
"11:23";"562"
"11:24";"562"
"11:25";"561"
"11:26";"559"
"11:27";"559"
"11:28";"558"
"11:29";"556"
"11:30";"555"
"11:31";"556"
"11:32";"554"
"11:33";"553"
"11:34";"553"
"11:35";"552"
"11:36";"551"
"11:37";"551"
"11:38";"549"
"11:39";"548"
"11:40";"548"
"11:41";"547"
"11:42";"546"
"11:43";"545"
"11:44";"544"
"11:45";"543"
"11:46";"542"
"11:47";"541"
"11:48";"540"
"11:49";"539"
"11:50";"538"
"11:51";"537"
"11:52";"536"
"11:53";"535"
"11:54";"534"
"11:55";"533"
"11:56";"532"
"11:57";"531"
"11:58";"530"
"11:59";"529"
"12:00";"528"
"12:01";"527"
"12:02";"526"
"12:03";"525"
"12:04";"524"
"12:05";"524"
"12:06";"523"
"12:07";"522"
"12:08";"521"
"12:09";"520"
"12:10";"520"
"12:11";"518"
"12:12";"518"
"12:13";"518"
"12:14";"517"
"12:15";"516"
"12:16";"515"
"12:17";"514"
"12:18";"513"
"12:19";"512"
"12:20";"511"
"12:21";"509"
"12:22";"508"
"12:23";"508"
"12:24";"507"
"12:25";"506"
"12:26";"505"
"12:27";"504"
"12:28";"503"
"12:29";"502"
"12:30";"501"
"12:31";"500"
"12:32";"500"
"12:33";"498"
"12:34";"497"
"12:35";"496"
"12:36";"496"
"12:37";"494"
"12:38";"493"
"12:39";"492"
"12:40";"491"
"12:41";"490"
"12:42";"489"
"12:43";"488"
"12:44";"488"
"12:45";"486"
"12:46";"485"
"12:47";"485"
"12:48";"484"
"12:49";"483"
"12:50";"482"
"12:51";"481"
"12:52";"480"
"12:53";"478"
"12:54";"478"
"12:55";"477"
"12:56";"476"
"12:57";"475"
"12:58";"474"
"12:59";"473"
"13:00";"473"
"13:01";"472"
"13:02";"472"
"13:03";"471"
"13:04";"470"
"13:05";"468"
"13:06";"468"
"13:07";"467"
"13:08";"466"
"13:09";"465"
"13:10";"464"
"13:11";"463"
"13:12";"462"
"13:13";"461"
"13:14";"460"
"13:15";"460"
"13:16";"458"
"13:17";"458"
"13:18";"456"
"13:19";"456"
"13:20";"455"
"13:21";"454"
"13:22";"454"
"13:23";"453"
"13:24";"452"
"13:25";"451"
"13:26";"450"
"13:27";"450"
"13:28";"449"
"13:29";"449"
"13:30";"447"
"13:31";"446"
"13:32";"445"
"13:33";"444"
"13:34";"443"
"13:35";"442"
"13:36";"442"
"13:37";"441"
"13:38";"441"
"13:39";"440"
"13:40";"439"
"13:41";"438"
"13:42";"438"
"13:43";"437"
"13:44";"436"
"13:45";"436"
"13:46";"435"
"13:47";"434"
"13:48";"433"
"13:49";"432"
"13:50";"431"
"13:51";"430"
"13:52";"429"
"13:53";"428"
"13:54";"428"
"13:55";"427"
"13:56";"425"
"13:57";"424"
"13:58";"423"
"13:59";"422"
"14:00";"421"
"14:01";"420"
"14:02";"420"
"14:03";"418"
"14:04";"418"
"14:05";"417"
"14:06";"417"
"14:07";"415"
"14:08";"414"
"14:09";"414"
"14:10";"413"
"14:11";"411"
"14:12";"410"
"14:13";"410"
"14:14";"409"
"14:15";"409"
"14:16";"408"
"14:17";"407"
"14:18";"407"
"14:19";"406"
"14:20";"405"
"14:21";"405"
"14:22";"404"
"14:23";"403"
"14:24";"402"
"14:25";"401"
"14:26";"401"
"14:27";"401"
"14:28";"400"
"14:29";"400"
"14:30";"399"
"14:31";"398"
"14:32";"398"
"14:33";"397"
"14:34";"396"
"14:35";"396"
"14:36";"395"
"14:37";"394"
"14:38";"393"
"14:39";"393"
"14:40";"392"
"14:41";"392"
"14:42";"390"
"14:43";"389"
"14:44";"389"
"14:45";"388"
"14:46";"388"
"14:47";"388"
"14:48";"387"
"14:49";"386"
"14:50";"386"
"14:51";"385"
"14:52";"385"
"14:53";"384"
"14:54";"384"
"14:55";"383"
"14:56";"383"
"14:57";"382"
"14:58";"382"
"14:59";"382"
"15:00";"381"
"15:01";"380"
"15:02";"380"
"15:03";"380"
"15:04";"380"
"15:05";"379"
"15:06";"379"
"15:07";"379"
"15:08";"378"
"15:09";"378"
"15:10";"378"
"15:11";"378"
"15:12";"378"
"15:13";"378"
"15:14";"378"
"15:15";"377"
"15:16";"377"
"15:17";"377"
"15:18";"377"
"15:19";"377"
"15:20";"377"
"15:21";"377"
"15:22";"377"
"15:23";"377"
"15:24";"377"
"15:25";"376"
"15:26";"376"
"15:27";"376"
"15:28";"377"
"15:29";"377"
"15:30";"377"
"15:31";"377"
"15:32";"377"
"15:33";"377"
"15:34";"377"
"15:35";"377"
"15:36";"377"
"15:37";"377"
"15:38";"378"
"15:39";"378"
"15:40";"378"
"15:41";"378"
"15:42";"377"
"15:43";"377"
"15:44";"377"
"15:45";"377"
"15:46";"377"
"15:47";"377"
"15:48";"377"
"15:49";"377"
"15:50";"377"
"15:51";"377"
"15:52";"377"
"15:53";"377"
"15:54";"378"
"15:55";"378"
"15:56";"378"
"15:57";"378"
"15:58";"378"
"15:59";"378"
"16:00";"378"
"16:01";"378"
"16:02";"378"
"16:03";"378"
"16:04";"378"
"16:05";"378"
"16:06";"378"
"16:07";"378"
"16:08";"378"
"16:09";"378"
"16:10";"378"
"16:11";"379"
"16:12";"379"
"16:13";"380"
"16:14";"380"
"16:15";"380"
"16:16";"380"
"16:17";"380"
"16:18";"381"
"16:19";"382"
"16:20";"382"
"16:21";"382"
"16:22";"382"
"16:23";"382"
"16:24";"382"
"16:25";"382"
"16:26";"382"
"16:27";"382"
"16:28";"383"
"16:29";"383"
"16:30";"383"
"16:31";"384"
"16:32";"384"
"16:33";"384"
"16:34";"384"
"16:35";"384"
"16:36";"385"
"16:37";"385"
"16:38";"384"
"16:39";"385"
"16:40";"386"
"16:41";"386"
"16:42";"387"
"16:43";"387"
"16:44";"387"
"16:45";"388"
"16:46";"388"
"16:47";"389"
"16:48";"389"
"16:49";"390"
"16:50";"391"
"16:51";"392"
"16:52";"393"
"16:53";"393"
"16:54";"394"
"16:55";"395"
"16:56";"396"
"16:57";"397"
"16:58";"397"
"16:59";"399"
"17:00";"399"
"17:01";"400"
"17:02";"401"
"17:03";"402"
"17:04";"402"
"17:05";"403"
"17:06";"405"
"17:07";"405"
"17:08";"406"
"17:09";"406"
"17:10";"408"
"17:11";"408"
"17:12";"409"
"17:13";"410"
"17:14";"410"
"17:15";"411"
"17:16";"412"
"17:17";"413"
"17:18";"413"
"17:19";"414"
"17:20";"415"
"17:21";"416"
"17:22";"417"
"17:23";"418"
"17:24";"419"
"17:25";"420"
"17:26";"421"
"17:27";"422"
"17:28";"423"
"17:29";"424"
"17:30";"425"
"17:31";"427"
"17:32";"428"
"17:33";"429"
"17:34";"431"
"17:35";"432"
"17:36";"433"
"17:37";"435"
"17:38";"437"
"17:39";"438"
"17:40";"439"
"17:41";"440"
"17:42";"442"
"17:43";"443"
"17:44";"444"
"17:45";"446"
"17:46";"447"
"17:47";"448"
"17:48";"450"
"17:49";"451"
"17:50";"452"
"17:51";"454"
"17:52";"455"
"17:53";"456"
"17:54";"458"
"17:55";"459"
"17:56";"460"
"17:57";"461"
"17:58";"462"
"17:59";"464"
"18:00";"464"
"18:01";"466"
"18:02";"467"
"18:03";"468"
"18:04";"468"
"18:05";"470"
"18:06";"471"
"18:07";"472"
"18:08";"473"
"18:09";"474"
"18:10";"475"
"18:11";"476"
"18:12";"477"
"18:13";"478"
"18:14";"480"
"18:15";"481"
"18:16";"481"
"18:17";"482"
"18:18";"483"
"18:19";"485"
"18:20";"485"
"18:21";"487"
"18:22";"488"
"18:23";"489"
"18:24";"489"
"18:25";"490"
"18:26";"491"
"18:27";"493"
"18:28";"493"
"18:29";"495"
"18:30";"496"
"18:31";"496"
"18:32";"498"
"18:33";"499"
"18:34";"500"
"18:35";"500"
"18:36";"501"
"18:37";"502"
"18:38";"503"
"18:39";"504"
"18:40";"504"
"18:41";"505"
"18:42";"506"
"18:43";"507"
"18:44";"508"
"18:45";"508"
"18:46";"509"
"18:47";"510"
"18:48";"511"
"18:49";"512"
"18:50";"512"
"18:51";"513"
"18:52";"515"
"18:53";"516"
"18:54";"516"
"18:55";"517"
"18:56";"518"
"18:57";"519"
"18:58";"520"
"18:59";"520"
"19:00";"521"
"19:01";"522"
"19:02";"523"
"19:03";"524"
"19:04";"525"
"19:05";"525"
"19:06";"526"
"19:07";"527"
"19:08";"528"
"19:09";"529"
"19:10";"529"
"19:11";"530"
"19:12";"531"
"19:13";"532"
"19:14";"533"
"19:15";"533"
"19:16";"534"
"19:17";"535"
"19:18";"536"
"19:19";"536"
"19:20";"537"
"19:21";"537"
"19:22";"538"
"19:23";"539"
"19:24";"540"
"19:25";"541"
"19:26";"542"
"19:27";"543"
"19:28";"544"
"19:29";"544"
"19:30";"545"
"19:31";"546"
"19:32";"547"
"19:33";"547"
"19:34";"548"
"19:35";"548"
"19:36";"549"
"19:37";"550"
"19:38";"551"
"19:39";"552"
"19:40";"552"
"19:41";"552"
"19:42";"553"
"19:43";"554"
"19:44";"555"
"19:45";"555"
"19:46";"556"
"19:47";"557"
"19:48";"557"
"19:49";"559"
"19:50";"559"
"19:51";"560"
"19:52";"561"
"19:53";"562"
"19:54";"563"
"19:55";"563"
"19:56";"564"
"19:57";"564"
"19:58";"565"
"19:59";"566"
"20:00";"567"
"20:01";"568"
"20:02";"568"
"20:03";"569"
"20:04";"570"
"20:05";"571"
"20:06";"572"
"20:07";"572"
"20:08";"573"
"20:09";"573"
"20:10";"574"
"20:11";"575"
"20:12";"576"
"20:13";"576"
"20:14";"576"
"20:15";"577"
"20:16";"578"
"20:17";"579"
"20:18";"580"
"20:19";"580"
"20:20";"581"
"20:21";"582"
"20:22";"583"
"20:23";"584"
"20:24";"584"
"20:25";"584"
"20:26";"586"
"20:27";"586"
"20:28";"587"
"20:29";"588"
"20:30";"588"
"20:31";"589"
"20:32";"590"
"20:33";"591"
"20:34";"592"
"20:35";"592"
"20:36";"592"
"20:37";"593"
"20:38";"594"
"20:39";"595"
"20:40";"595"
"20:41";"596"
"20:42";"597"
"20:43";"597"
"20:44";"598"
"20:45";"599"
"20:46";"599"
"20:47";"600"
"20:48";"600"
"20:49";"601"
"20:50";"602"
"20:51";"602"
"20:52";"603"
"20:53";"603"
"20:54";"604"
"20:55";"605"
"20:56";"605"
"20:57";"606"
"20:58";"607"
"20:59";"607"
"21:00";"608"
"21:01";"608"
"21:02";"609"
"21:03";"610"
"21:04";"610"
"21:05";"611"
"21:06";"611"
"21:07";"612"
"21:08";"612"
"21:09";"613"
"21:10";"614"
"21:11";"614"
"21:12";"615"
"21:13";"615"
"21:14";"616"
"21:15";"616"
"21:16";"616"
"21:17";"617"
"21:18";"617"
"21:19";"617"
"21:20";"618"
"21:21";"619"
"21:22";"619"
"21:23";"619"
"21:24";"620"
"21:25";"620"
"21:26";"620"
"21:27";"621"
"21:28";"621"
"21:29";"622"
"21:30";"622"
"21:31";"623"
"21:32";"623"
"21:33";"623"
"21:34";"624"
"21:35";"624"
"21:36";"624"
"21:37";"624"
"21:38";"625"
"21:39";"625"
"21:40";"625"
"21:41";"626"
"21:42";"625"
"21:43";"626"
"21:44";"626"
"21:45";"626"
"21:46";"626"
"21:47";"627"
"21:48";"627"
"21:49";"627"
"21:50";"627"
"21:51";"627"
"21:52";"627"
"21:53";"627"
"21:54";"628"
"21:55";"628"
"21:56";"628"
"21:57";"628"
"21:58";"628"
"21:59";"628"
"22:00";"628"
"22:01";"628"
"22:02";"627"
"22:03";"627"
"22:04";"627"
"22:05";"627"
"22:06";"627"
"22:07";"627"
"22:08";"626"
"22:09";"626"
"22:10";"626"
"22:11";"626"
"22:12";"626"
"22:13";"626"
"22:14";"625"
"22:15";"625"
"22:16";"625"
"22:17";"624"
"22:18";"624"
"22:19";"624"
"22:20";"623"
"22:21";"623"
"22:22";"623"
"22:23";"622"
"22:24";"622"
"22:25";"621"
"22:26";"620"
"22:27";"620"
"22:28";"620"
"22:29";"619"
"22:30";"619"
"22:31";"619"
"22:32";"618"
"22:33";"618"
"22:34";"617"
"22:35";"616"
"22:36";"616"
"22:37";"616"
"22:38";"616"
"22:39";"615"
"22:40";"614"
"22:41";"613"
"22:42";"613"
"22:43";"612"
"22:44";"611"
"22:45";"611"
"22:46";"610"
"22:47";"610"
"22:48";"609"
"22:49";"608"
"22:50";"607"
"22:51";"607"
"22:52";"607"
"22:53";"606"
"22:54";"605"
"22:55";"604"
"22:56";"604"
"22:57";"603"
"22:58";"603"
"22:59";"602"
"23:00";"600"
"23:01";"599"
"23:02";"599"
"23:03";"598"
"23:04";"598"
"23:05";"597"
"23:06";"596"
"23:07";"595"
"23:08";"595"
"23:09";"594"
"23:10";"594"
"23:11";"593"
"23:12";"592"
"23:13";"591"
"23:14";"590"
"23:15";"590"
"23:16";"589"
"23:17";"588"
"23:18";"587"
"23:19";"586"
"23:20";"585"
"23:21";"584"
"23:22";"584"
"23:23";"583"
"23:24";"582"
"23:25";"581"
"23:26";"581"
"23:27";"580"
"23:28";"579"
"23:29";"578"
"23:30";"577"
"23:31";"576"
"23:32";"576"
"23:33";"575"
"23:34";"574"
"23:35";"573"
"23:36";"572"
"23:37";"572"
"23:38";"571"
"23:39";"569"
"23:40";"569"
"23:41";"567"
"23:42";"567"
"23:43";"566"
"23:44";"565"
"23:45";"564"
"23:46";"564"
"23:47";"563"
"23:48";"562"
"23:49";"561"
"23:50";"560"
"23:51";"559"
"23:52";"558"
"23:53";"557"
"23:54";"556"
"23:55";"555"
"23:56";"554"
"23:57";"554"
"23:58";"553"
"23:59";"552"
"24:00";"552"
