"04.10.2022";"Emden";"NORDSEE";"LANGEOOG";"9390010";"W_O";"cm";"XXX,XXX";"XX.XX.XXXX";"XX:XX";"PNP";"-5,04"
"00:01";"431"
"00:02";"432"
"00:03";"431"
"00:04";"433"
"00:05";"434"
"00:06";"435"
"00:07";"435"
"00:08";"436"
"00:09";"436"
"00:10";"437"
"00:11";"438"
"00:12";"439"
"00:13";"439"
"00:14";"441"
"00:15";"442"
"00:16";"443"
"00:17";"444"
"00:18";"445"
"00:19";"446"
"00:20";"446"
"00:21";"447"
"00:22";"448"
"00:23";"448"
"00:24";"449"
"00:25";"451"
"00:26";"452"
"00:27";"453"
"00:28";"454"
"00:29";"455"
"00:30";"456"
"00:31";"458"
"00:32";"459"
"00:33";"460"
"00:34";"462"
"00:35";"463"
"00:36";"465"
"00:37";"467"
"00:38";"468"
"00:39";"469"
"00:40";"471"
"00:41";"472"
"00:42";"473"
"00:43";"474"
"00:44";"475"
"00:45";"476"
"00:46";"477"
"00:47";"477"
"00:48";"479"
"00:49";"480"
"00:50";"480"
"00:51";"481"
"00:52";"482"
"00:53";"483"
"00:54";"484"
"00:55";"485"
"00:56";"486"
"00:57";"487"
"00:58";"488"
"00:59";"489"
"01:00";"490"
"01:01";"490"
"01:02";"490"
"01:03";"491"
"01:04";"492"
"01:05";"493"
"01:06";"494"
"01:07";"495"
"01:08";"497"
"01:09";"498"
"01:10";"498"
"01:11";"499"
"01:12";"501"
"01:13";"502"
"01:14";"503"
"01:15";"504"
"01:16";"505"
"01:17";"506"
"01:18";"507"
"01:19";"507"
"01:20";"508"
"01:21";"509"
"01:22";"510"
"01:23";"510"
"01:24";"510"
"01:25";"510"
"01:26";"511"
"01:27";"512"
"01:28";"513"
"01:29";"513"
"01:30";"513"
"01:31";"514"
"01:32";"515"
"01:33";"515"
"01:34";"516"
"01:35";"517"
"01:36";"518"
"01:37";"517"
"01:38";"519"
"01:39";"519"
"01:40";"520"
"01:41";"522"
"01:42";"522"
"01:43";"523"
"01:44";"524"
"01:45";"524"
"01:46";"525"
"01:47";"525"
"01:48";"526"
"01:49";"527"
"01:50";"528"
"01:51";"528"
"01:52";"529"
"01:53";"530"
"01:54";"530"
"01:55";"531"
"01:56";"532"
"01:57";"533"
"01:58";"534"
"01:59";"534"
"02:00";"535"
"02:01";"535"
"02:02";"536"
"02:03";"537"
"02:04";"538"
"02:05";"538"
"02:06";"539"
"02:07";"540"
"02:08";"540"
"02:09";"541"
"02:10";"541"
"02:11";"542"
"02:12";"542"
"02:13";"543"
"02:14";"543"
"02:15";"544"
"02:16";"545"
"02:17";"545"
"02:18";"546"
"02:19";"546"
"02:20";"547"
"02:21";"547"
"02:22";"548"
"02:23";"548"
"02:24";"550"
"02:25";"550"
"02:26";"550"
"02:27";"552"
"02:28";"552"
"02:29";"552"
"02:30";"553"
"02:31";"554"
"02:32";"554"
"02:33";"555"
"02:34";"555"
"02:35";"556"
"02:36";"557"
"02:37";"557"
"02:38";"558"
"02:39";"559"
"02:40";"559"
"02:41";"560"
"02:42";"560"
"02:43";"561"
"02:44";"562"
"02:45";"563"
"02:46";"563"
"02:47";"564"
"02:48";"565"
"02:49";"565"
"02:50";"566"
"02:51";"567"
"02:52";"567"
"02:53";"568"
"02:54";"569"
"02:55";"569"
"02:56";"570"
"02:57";"570"
"02:58";"571"
"02:59";"572"
"03:00";"573"
"03:01";"573"
"03:02";"574"
"03:03";"575"
"03:04";"576"
"03:05";"576"
"03:06";"577"
"03:07";"577"
"03:08";"578"
"03:09";"578"
"03:10";"579"
"03:11";"580"
"03:12";"580"
"03:13";"581"
"03:14";"581"
"03:15";"581"
"03:16";"582"
"03:17";"583"
"03:18";"583"
"03:19";"583"
"03:20";"584"
"03:21";"585"
"03:22";"586"
"03:23";"586"
"03:24";"587"
"03:25";"588"
"03:26";"588"
"03:27";"589"
"03:28";"589"
"03:29";"590"
"03:30";"590"
"03:31";"592"
"03:32";"592"
"03:33";"592"
"03:34";"593"
"03:35";"594"
"03:36";"595"
"03:37";"596"
"03:38";"596"
"03:39";"596"
"03:40";"597"
"03:41";"598"
"03:42";"598"
"03:43";"599"
"03:44";"599"
"03:45";"599"
"03:46";"600"
"03:47";"600"
"03:48";"600"
"03:49";"600"
"03:50";"601"
"03:51";"602"
"03:52";"602"
"03:53";"603"
"03:54";"604"
"03:55";"604"
"03:56";"605"
"03:57";"606"
"03:58";"607"
"03:59";"607"
"04:00";"607"
"04:01";"608"
"04:02";"608"
"04:03";"608"
"04:04";"608"
"04:05";"609"
"04:06";"609"
"04:07";"609"
"04:08";"609"
"04:09";"610"
"04:10";"610"
"04:11";"610"
"04:12";"611"
"04:13";"611"
"04:14";"612"
"04:15";"612"
"04:16";"613"
"04:17";"614"
"04:18";"615"
"04:19";"615"
"04:20";"616"
"04:21";"615"
"04:22";"616"
"04:23";"616"
"04:24";"616"
"04:25";"616"
"04:26";"616"
"04:27";"616"
"04:28";"616"
"04:29";"616"
"04:30";"616"
"04:31";"616"
"04:32";"616"
"04:33";"616"
"04:34";"617"
"04:35";"617"
"04:36";"617"
"04:37";"618"
"04:38";"618"
"04:39";"618"
"04:40";"619"
"04:41";"620"
"04:42";"620"
"04:43";"620"
"04:44";"620"
"04:45";"620"
"04:46";"620"
"04:47";"621"
"04:48";"620"
"04:49";"620"
"04:50";"621"
"04:51";"621"
"04:52";"621"
"04:53";"621"
"04:54";"621"
"04:55";"620"
"04:56";"620"
"04:57";"619"
"04:58";"620"
"04:59";"619"
"05:00";"619"
"05:01";"619"
"05:02";"618"
"05:03";"618"
"05:04";"618"
"05:05";"618"
"05:06";"617"
"05:07";"617"
"05:08";"617"
"05:09";"617"
"05:10";"617"
"05:11";"617"
"05:12";"617"
"05:13";"617"
"05:14";"617"
"05:15";"616"
"05:16";"617"
"05:17";"616"
"05:18";"616"
"05:19";"616"
"05:20";"616"
"05:21";"616"
"05:22";"616"
"05:23";"615"
"05:24";"615"
"05:25";"614"
"05:26";"614"
"05:27";"613"
"05:28";"612"
"05:29";"612"
"05:30";"612"
"05:31";"611"
"05:32";"611"
"05:33";"610"
"05:34";"610"
"05:35";"609"
"05:36";"609"
"05:37";"608"
"05:38";"608"
"05:39";"607"
"05:40";"606"
"05:41";"605"
"05:42";"604"
"05:43";"604"
"05:44";"603"
"05:45";"602"
"05:46";"602"
"05:47";"601"
"05:48";"601"
"05:49";"600"
"05:50";"600"
"05:51";"600"
"05:52";"599"
"05:53";"599"
"05:54";"598"
"05:55";"597"
"05:56";"597"
"05:57";"596"
"05:58";"595"
"05:59";"595"
"06:00";"594"
"06:01";"593"
"06:02";"593"
"06:03";"592"
"06:04";"592"
"06:05";"591"
"06:06";"590"
"06:07";"589"
"06:08";"588"
"06:09";"588"
"06:10";"587"
"06:11";"586"
"06:12";"585"
"06:13";"585"
"06:14";"584"
"06:15";"584"
"06:16";"582"
"06:17";"580"
"06:18";"580"
"06:19";"579"
"06:20";"579"
"06:21";"578"
"06:22";"577"
"06:23";"575"
"06:24";"574"
"06:25";"573"
"06:26";"573"
"06:27";"572"
"06:28";"570"
"06:29";"569"
"06:30";"569"
"06:31";"569"
"06:32";"568"
"06:33";"568"
"06:34";"567"
"06:35";"566"
"06:36";"565"
"06:37";"565"
"06:38";"564"
"06:39";"563"
"06:40";"562"
"06:41";"561"
"06:42";"560"
"06:43";"559"
"06:44";"558"
"06:45";"557"
"06:46";"556"
"06:47";"556"
"06:48";"555"
"06:49";"554"
"06:50";"553"
"06:51";"552"
"06:52";"552"
"06:53";"551"
"06:54";"548"
"06:55";"548"
"06:56";"547"
"06:57";"547"
"06:58";"546"
"06:59";"545"
"07:00";"544"
"07:01";"543"
"07:02";"542"
"07:03";"541"
"07:04";"540"
"07:05";"539"
"07:06";"538"
"07:07";"538"
"07:08";"538"
"07:09";"536"
"07:10";"535"
"07:11";"534"
"07:12";"534"
"07:13";"533"
"07:14";"531"
"07:15";"530"
"07:16";"529"
"07:17";"528"
"07:18";"527"
"07:19";"526"
"07:20";"525"
"07:21";"525"
"07:22";"523"
"07:23";"522"
"07:24";"522"
"07:25";"522"
"07:26";"520"
"07:27";"519"
"07:28";"518"
"07:29";"517"
"07:30";"516"
"07:31";"515"
"07:32";"515"
"07:33";"514"
"07:34";"512"
"07:35";"512"
"07:36";"511"
"07:37";"510"
"07:38";"510"
"07:39";"508"
"07:40";"507"
"07:41";"506"
"07:42";"505"
"07:43";"505"
"07:44";"503"
"07:45";"502"
"07:46";"501"
"07:47";"500"
"07:48";"499"
"07:49";"498"
"07:50";"498"
"07:51";"496"
"07:52";"495"
"07:53";"493"
"07:54";"492"
"07:55";"491"
"07:56";"490"
"07:57";"489"
"07:58";"488"
"07:59";"487"
"08:00";"487"
"08:01";"486"
"08:02";"486"
"08:03";"484"
"08:04";"484"
"08:05";"483"
"08:06";"481"
"08:07";"480"
"08:08";"479"
"08:09";"478"
"08:10";"477"
"08:11";"476"
"08:12";"476"
"08:13";"474"
"08:14";"474"
"08:15";"474"
"08:16";"472"
"08:17";"472"
"08:18";"471"
"08:19";"470"
"08:20";"470"
"08:21";"468"
"08:22";"467"
"08:23";"466"
"08:24";"465"
"08:25";"463"
"08:26";"463"
"08:27";"461"
"08:28";"461"
"08:29";"460"
"08:30";"460"
"08:31";"459"
"08:32";"459"
"08:33";"459"
"08:34";"458"
"08:35";"458"
"08:36";"457"
"08:37";"454"
"08:38";"454"
"08:39";"454"
"08:40";"452"
"08:41";"451"
"08:42";"449"
"08:43";"449"
"08:44";"448"
"08:45";"448"
"08:46";"447"
"08:47";"446"
"08:48";"446"
"08:49";"445"
"08:50";"445"
"08:51";"444"
"08:52";"443"
"08:53";"443"
"08:54";"442"
"08:55";"440"
"08:56";"439"
"08:57";"439"
"08:58";"438"
"08:59";"436"
"09:00";"435"
"09:01";"435"
"09:02";"433"
"09:03";"433"
"09:04";"433"
"09:05";"431"
"09:06";"431"
"09:07";"429"
"09:08";"429"
"09:09";"425"
"09:10";"427"
"09:11";"426"
"09:12";"425"
"09:13";"425"
"09:14";"423"
"09:15";"423"
"09:16";"423"
"09:17";"421"
"09:18";"422"
"09:19";"420"
"09:20";"420"
"09:21";"420"
"09:22";"420"
"09:23";"419"
"09:24";"418"
"09:25";"419"
"09:26";"419"
"09:27";"417"
"09:28";"416"
"09:29";"416"
"09:30";"414"
"09:31";"414"
"09:32";"413"
"09:33";"412"
"09:34";"412"
"09:35";"411"
"09:36";"410"
"09:37";"410"
"09:38";"409"
"09:39";"409"
"09:40";"408"
"09:41";"408"
"09:42";"407"
"09:43";"407"
"09:44";"407"
"09:45";"406"
"09:46";"406"
"09:47";"404"
"09:48";"404"
"09:49";"404"
"09:50";"403"
"09:51";"403"
"09:52";"402"
"09:53";"401"
"09:54";"401"
"09:55";"400"
"09:56";"400"
"09:57";"400"
"09:58";"398"
"09:59";"398"
"10:00";"398"
"10:01";"397"
"10:02";"397"
"10:03";"397"
"10:04";"396"
"10:05";"396"
"10:06";"396"
"10:07";"395"
"10:08";"394"
"10:09";"394"
"10:10";"393"
"10:11";"393"
"10:12";"393"
"10:13";"393"
"10:14";"392"
"10:15";"392"
"10:16";"391"
"10:17";"390"
"10:18";"390"
"10:19";"389"
"10:20";"389"
"10:21";"389"
"10:22";"388"
"10:23";"387"
"10:24";"387"
"10:25";"386"
"10:26";"386"
"10:27";"385"
"10:28";"385"
"10:29";"384"
"10:30";"384"
"10:31";"384"
"10:32";"385"
"10:33";"382"
"10:34";"384"
"10:35";"384"
"10:36";"383"
"10:37";"383"
"10:38";"383"
"10:39";"382"
"10:40";"383"
"10:41";"383"
"10:42";"382"
"10:43";"383"
"10:44";"384"
"10:45";"376"
"10:46";"383"
"10:47";"383"
"10:48";"382"
"10:49";"382"
"10:50";"382"
"10:51";"382"
"10:52";"382"
"10:53";"382"
"10:54";"381"
"10:55";"381"
"10:56";"380"
"10:57";"381"
"10:58";"379"
"10:59";"380"
"11:00";"380"
"11:01";"379"
"11:02";"378"
"11:03";"377"
"11:04";"378"
"11:05";"378"
"11:06";"378"
"11:07";"378"
"11:08";"378"
"11:09";"378"
"11:10";"379"
"11:11";"378"
"11:12";"378"
"11:13";"378"
"11:14";"378"
"11:15";"377"
"11:16";"378"
"11:17";"376"
"11:18";"378"
"11:19";"377"
"11:20";"379"
"11:21";"379"
"11:22";"378"
"11:23";"380"
"11:24";"378"
"11:25";"380"
"11:26";"378"
"11:27";"381"
"11:28";"380"
"11:29";"381"
"11:30";"381"
"11:31";"382"
"11:32";"382"
"11:33";"383"
"11:34";"383"
"11:35";"383"
"11:36";"385"
"11:37";"384"
"11:38";"385"
"11:39";"385"
"11:40";"385"
"11:41";"384"
"11:42";"384"
"11:43";"385"
"11:44";"385"
"11:45";"385"
"11:46";"384"
"11:47";"385"
"11:48";"385"
"11:49";"384"
"11:50";"385"
"11:51";"385"
"11:52";"385"
"11:53";"385"
"11:54";"386"
"11:55";"386"
"11:56";"386"
"11:57";"387"
"11:58";"386"
"11:59";"388"
"12:00";"388"
"12:01";"389"
"12:02";"389"
"12:03";"389"
"12:04";"389"
"12:05";"389"
"12:06";"389"
"12:07";"389"
"12:08";"389"
"12:09";"390"
"12:10";"390"
"12:11";"390"
"12:12";"392"
"12:13";"391"
"12:14";"392"
"12:15";"393"
"12:16";"393"
"12:17";"394"
"12:18";"396"
"12:19";"396"
"12:20";"396"
"12:21";"397"
"12:22";"397"
"12:23";"397"
"12:24";"398"
"12:25";"398"
"12:26";"400"
"12:27";"400"
"12:28";"401"
"12:29";"401"
"12:30";"402"
"12:31";"403"
"12:32";"403"
"12:33";"404"
"12:34";"404"
"12:35";"405"
"12:36";"406"
"12:37";"407"
"12:38";"408"
"12:39";"408"
"12:40";"410"
"12:41";"411"
"12:42";"412"
"12:43";"413"
"12:44";"414"
"12:45";"415"
"12:46";"416"
"12:47";"416"
"12:48";"417"
"12:49";"418"
"12:50";"419"
"12:51";"420"
"12:52";"421"
"12:53";"421"
"12:54";"422"
"12:55";"423"
"12:56";"423"
"12:57";"424"
"12:58";"424"
"12:59";"426"
"13:00";"427"
"13:01";"427"
"13:02";"429"
"13:03";"430"
"13:04";"431"
"13:05";"432"
"13:06";"434"
"13:07";"435"
"13:08";"436"
"13:09";"437"
"13:10";"438"
"13:11";"440"
"13:12";"440"
"13:13";"441"
"13:14";"442"
"13:15";"443"
"13:16";"441"
"13:17";"444"
"13:18";"444"
"13:19";"445"
"13:20";"448"
"13:21";"448"
"13:22";"448"
"13:23";"451"
"13:24";"452"
"13:25";"451"
"13:26";"453"
"13:27";"455"
"13:28";"455"
"13:29";"455"
"13:30";"456"
"13:31";"457"
"13:32";"458"
"13:33";"459"
"13:34";"460"
"13:35";"460"
"13:36";"461"
"13:37";"462"
"13:38";"462"
"13:39";"463"
"13:40";"463"
"13:41";"466"
"13:42";"467"
"13:43";"468"
"13:44";"470"
"13:45";"470"
"13:46";"472"
"13:47";"473"
"13:48";"474"
"13:49";"475"
"13:50";"476"
"13:51";"478"
"13:52";"479"
"13:53";"479"
"13:54";"480"
"13:55";"480"
"13:56";"481"
"13:57";"482"
"13:58";"483"
"13:59";"483"
"14:00";"484"
"14:01";"486"
"14:02";"486"
"14:03";"487"
"14:04";"488"
"14:05";"488"
"14:06";"489"
"14:07";"490"
"14:08";"490"
"14:09";"491"
"14:10";"492"
"14:11";"493"
"14:12";"494"
"14:13";"494"
"14:14";"495"
"14:15";"496"
"14:16";"497"
"14:17";"498"
"14:18";"498"
"14:19";"499"
"14:20";"500"
"14:21";"501"
"14:22";"502"
"14:23";"502"
"14:24";"503"
"14:25";"504"
"14:26";"505"
"14:27";"506"
"14:28";"506"
"14:29";"508"
"14:30";"509"
"14:31";"509"
"14:32";"510"
"14:33";"510"
"14:34";"511"
"14:35";"512"
"14:36";"512"
"14:37";"513"
"14:38";"513"
"14:39";"513"
"14:40";"514"
"14:41";"516"
"14:42";"515"
"14:43";"516"
"14:44";"516"
"14:45";"516"
"14:46";"517"
"14:47";"517"
"14:48";"518"
"14:49";"519"
"14:50";"520"
"14:51";"521"
"14:52";"520"
"14:53";"522"
"14:54";"522"
"14:55";"523"
"14:56";"524"
"14:57";"524"
"14:58";"524"
"14:59";"525"
"15:00";"526"
"15:01";"527"
"15:02";"527"
"15:03";"528"
"15:04";"529"
"15:05";"529"
"15:06";"530"
"15:07";"531"
"15:08";"531"
"15:09";"532"
"15:10";"532"
"15:11";"534"
"15:12";"534"
"15:13";"534"
"15:14";"535"
"15:15";"535"
"15:16";"536"
"15:17";"536"
"15:18";"538"
"15:19";"538"
"15:20";"536"
"15:21";"539"
"15:22";"540"
"15:23";"540"
"15:24";"541"
"15:25";"542"
"15:26";"542"
"15:27";"543"
"15:28";"544"
"15:29";"544"
"15:30";"545"
"15:31";"544"
"15:32";"546"
"15:33";"546"
"15:34";"547"
"15:35";"548"
"15:36";"548"
"15:37";"548"
"15:38";"550"
"15:39";"550"
"15:40";"551"
"15:41";"551"
"15:42";"552"
"15:43";"552"
"15:44";"553"
"15:45";"553"
"15:46";"554"
"15:47";"554"
"15:48";"555"
"15:49";"556"
"15:50";"556"
"15:51";"557"
"15:52";"558"
"15:53";"559"
"15:54";"560"
"15:55";"560"
"15:56";"560"
"15:57";"561"
"15:58";"562"
"15:59";"563"
"16:00";"563"
"16:01";"563"
"16:02";"564"
"16:03";"565"
"16:04";"564"
"16:05";"565"
"16:06";"565"
"16:07";"565"
"16:08";"566"
"16:09";"567"
"16:10";"568"
"16:11";"568"
"16:12";"569"
"16:13";"569"
"16:14";"570"
"16:15";"572"
"16:16";"572"
"16:17";"572"
"16:18";"573"
"16:19";"574"
"16:20";"574"
"16:21";"576"
"16:22";"577"
"16:23";"576"
"16:24";"577"
"16:25";"578"
"16:26";"579"
"16:27";"579"
"16:28";"580"
"16:29";"580"
"16:30";"581"
"16:31";"581"
"16:32";"582"
"16:33";"582"
"16:34";"583"
"16:35";"583"
"16:36";"583"
"16:37";"583"
"16:38";"585"
"16:39";"585"
"16:40";"585"
"16:41";"585"
"16:42";"586"
"16:43";"587"
"16:44";"588"
"16:45";"588"
"16:46";"588"
"16:47";"589"
"16:48";"590"
"16:49";"590"
"16:50";"591"
"16:51";"591"
"16:52";"590"
"16:53";"592"
"16:54";"592"
"16:55";"592"
"16:56";"593"
"16:57";"594"
"16:58";"594"
"16:59";"595"
"17:00";"596"
"17:01";"596"
"17:02";"596"
"17:03";"596"
"17:04";"597"
"17:05";"596"
"17:06";"599"
"17:07";"599"
"17:08";"600"
"17:09";"600"
"17:10";"601"
"17:11";"601"
"17:12";"602"
"17:13";"602"
"17:14";"602"
"17:15";"603"
"17:16";"603"
"17:17";"602"
"17:18";"603"
"17:19";"603"
"17:20";"603"
"17:21";"603"
"17:22";"603"
"17:23";"604"
"17:24";"604"
"17:25";"604"
"17:26";"604"
"17:27";"604"
"17:28";"605"
"17:29";"606"
"17:30";"606"
"17:31";"606"
"17:32";"607"
"17:33";"608"
"17:34";"608"
"17:35";"609"
"17:36";"609"
"17:37";"609"
"17:38";"609"
"17:39";"610"
"17:40";"610"
"17:41";"610"
"17:42";"611"
"17:43";"611"
"17:44";"610"
"17:45";"610"
"17:46";"610"
"17:47";"609"
"17:48";"609"
"17:49";"608"
"17:50";"608"
"17:51";"609"
"17:52";"609"
"17:53";"609"
"17:54";"609"
"17:55";"609"
"17:56";"609"
"17:57";"609"
"17:58";"609"
"17:59";"610"
"18:00";"610"
"18:01";"609"
"18:02";"609"
"18:03";"608"
"18:04";"608"
"18:05";"608"
"18:06";"607"
"18:07";"607"
"18:08";"607"
"18:09";"607"
"18:10";"606"
"18:11";"606"
"18:12";"606"
"18:13";"606"
"18:14";"606"
"18:15";"606"
"18:16";"606"
"18:17";"606"
"18:18";"606"
"18:19";"606"
"18:20";"605"
"18:21";"605"
"18:22";"604"
"18:23";"604"
"18:24";"603"
"18:25";"602"
"18:26";"602"
"18:27";"602"
"18:28";"601"
"18:29";"601"
"18:30";"600"
"18:31";"600"
"18:32";"600"
"18:33";"599"
"18:34";"599"
"18:35";"598"
"18:36";"599"
"18:37";"598"
"18:38";"598"
"18:39";"597"
"18:40";"596"
"18:41";"596"
"18:42";"595"
"18:43";"594"
"18:44";"593"
"18:45";"593"
"18:46";"592"
"18:47";"592"
"18:48";"591"
"18:49";"590"
"18:50";"590"
"18:51";"590"
"18:52";"589"
"18:53";"588"
"18:54";"588"
"18:55";"587"
"18:56";"587"
"18:57";"586"
"18:58";"585"
"18:59";"585"
"19:00";"585"
"19:01";"584"
"19:02";"584"
"19:03";"583"
"19:04";"583"
"19:05";"582"
"19:06";"582"
"19:07";"581"
"19:08";"581"
"19:09";"581"
"19:10";"580"
"19:11";"580"
"19:12";"578"
"19:13";"578"
"19:14";"577"
"19:15";"576"
"19:16";"576"
"19:17";"575"
"19:18";"574"
"19:19";"573"
"19:20";"573"
"19:21";"572"
"19:22";"571"
"19:23";"570"
"19:24";"570"
"19:25";"569"
"19:26";"569"
"19:27";"568"
"19:28";"568"
"19:29";"568"
"19:30";"567"
"19:31";"567"
"19:32";"566"
"19:33";"565"
"19:34";"565"
"19:35";"564"
"19:36";"564"
"19:37";"563"
"19:38";"562"
"19:39";"561"
"19:40";"560"
"19:41";"560"
"19:42";"559"
"19:43";"559"
"19:44";"557"
"19:45";"557"
"19:46";"556"
"19:47";"556"
"19:48";"556"
"19:49";"555"
"19:50";"555"
"19:51";"553"
"19:52";"552"
"19:53";"552"
"19:54";"552"
"19:55";"551"
"19:56";"550"
"19:57";"549"
"19:58";"550"
"19:59";"548"
"20:00";"548"
"20:01";"547"
"20:02";"547"
"20:03";"546"
"20:04";"546"
"20:05";"546"
"20:06";"545"
"20:07";"544"
"20:08";"544"
"20:09";"543"
"20:10";"543"
"20:11";"542"
"20:12";"541"
"20:13";"541"
"20:14";"541"
"20:15";"540"
"20:16";"540"
"20:17";"539"
"20:18";"538"
"20:19";"538"
"20:20";"538"
"20:21";"537"
"20:22";"536"
"20:23";"536"
"20:24";"534"
"20:25";"534"
"20:26";"534"
"20:27";"533"
"20:28";"532"
"20:29";"531"
"20:30";"531"
"20:31";"530"
"20:32";"529"
"20:33";"529"
"20:34";"528"
"20:35";"527"
"20:36";"526"
"20:37";"526"
"20:38";"525"
"20:39";"524"
"20:40";"524"
"20:41";"524"
"20:42";"523"
"20:43";"523"
"20:44";"523"
"20:45";"522"
"20:46";"522"
"20:47";"521"
"20:48";"522"
"20:49";"521"
"20:50";"520"
"20:51";"519"
"20:52";"519"
"20:53";"518"
"20:54";"517"
"20:55";"517"
"20:56";"516"
"20:57";"516"
"20:58";"515"
"20:59";"514"
"21:00";"514"
"21:01";"513"
"21:02";"513"
"21:03";"512"
"21:04";"510"
"21:05";"510"
"21:06";"509"
"21:07";"507"
"21:08";"506"
"21:09";"506"
"21:10";"506"
"21:11";"505"
"21:12";"504"
"21:13";"504"
"21:14";"503"
"21:15";"503"
"21:16";"502"
"21:17";"502"
"21:18";"502"
"21:19";"502"
"21:20";"502"
"21:21";"502"
"21:22";"502"
"21:23";"502"
"21:24";"502"
"21:25";"501"
"21:26";"501"
"21:27";"500"
"21:28";"500"
"21:29";"500"
"21:30";"499"
"21:31";"499"
"21:32";"498"
"21:33";"498"
"21:34";"498"
"21:35";"497"
"21:36";"496"
"21:37";"496"
"21:38";"494"
"21:39";"494"
"21:40";"493"
"21:41";"492"
"21:42";"491"
"21:43";"491"
"21:44";"490"
"21:45";"490"
"21:46";"490"
"21:47";"489"
"21:48";"489"
"21:49";"489"
"21:50";"488"
"21:51";"488"
"21:52";"488"
"21:53";"487"
"21:54";"487"
"21:55";"487"
"21:56";"486"
"21:57";"486"
"21:58";"485"
"21:59";"485"
"22:00";"484"
"22:01";"484"
"22:02";"484"
"22:03";"482"
"22:04";"482"
"22:05";"483"
"22:06";"482"
"22:07";"481"
"22:08";"480"
"22:09";"479"
"22:10";"478"
"22:11";"478"
"22:12";"477"
"22:13";"477"
"22:14";"475"
"22:15";"475"
"22:16";"475"
"22:17";"475"
"22:18";"475"
"22:19";"474"
"22:20";"474"
"22:21";"475"
"22:22";"476"
"22:23";"475"
"22:24";"475"
"22:25";"475"
"22:26";"474"
"22:27";"473"
"22:28";"472"
"22:29";"472"
"22:30";"471"
"22:31";"471"
"22:32";"470"
"22:33";"469"
"22:34";"469"
"22:35";"468"
"22:36";"467"
"22:37";"467"
"22:38";"467"
"22:39";"467"
"22:40";"467"
"22:41";"466"
"22:42";"466"
"22:43";"466"
"22:44";"466"
"22:45";"465"
"22:46";"464"
"22:47";"464"
"22:48";"463"
"22:49";"463"
"22:50";"462"
"22:51";"462"
"22:52";"461"
"22:53";"461"
"22:54";"460"
"22:55";"461"
"22:56";"460"
"22:57";"460"
"22:58";"460"
"22:59";"459"
"23:00";"459"
"23:01";"459"
"23:02";"458"
"23:03";"458"
"23:04";"458"
"23:05";"458"
"23:06";"457"
"23:07";"456"
"23:08";"455"
"23:09";"455"
"23:10";"455"
"23:11";"455"
"23:12";"455"
"23:13";"455"
"23:14";"454"
"23:15";"455"
"23:16";"455"
"23:17";"455"
"23:18";"455"
"23:19";"455"
"23:20";"455"
"23:21";"455"
"23:22";"455"
"23:23";"455"
"23:24";"455"
"23:25";"454"
"23:26";"454"
"23:27";"454"
"23:28";"454"
"23:29";"454"
"23:30";"454"
"23:31";"454"
"23:32";"454"
"23:33";"454"
"23:34";"454"
"23:35";"454"
"23:36";"454"
"23:37";"454"
"23:38";"454"
"23:39";"454"
"23:40";"455"
"23:41";"455"
"23:42";"455"
"23:43";"455"
"23:44";"456"
"23:45";"456"
"23:46";"456"
"23:47";"455"
"23:48";"455"
"23:49";"455"
"23:50";"454"
"23:51";"454"
"23:52";"453"
"23:53";"452"
"23:54";"452"
"23:55";"451"
"23:56";"451"
"23:57";"451"
"23:58";"451"
"23:59";"452"
"24:00";"452"
