"27.09.2022";"Wilhelmshaven";"JADE";"WANGEROOGE WEST ";"9420040";"W_O";"cm";"XXX,XXX";"XX.XX.XXXX";"XX:XX";"PNP";"-5,05"
"00:01";"701"
"00:02";"701"
"00:03";"702"
"00:04";"701"
"00:05";"701"
"00:06";"702"
"00:07";"702"
"00:08";"702"
"00:09";"704"
"00:10";"703"
"00:11";"704"
"00:12";"704"
"00:13";"705"
"00:14";"705"
"00:15";"705"
"00:16";"704"
"00:17";"705"
"00:18";"705"
"00:19";"705"
"00:20";"705"
"00:21";"705"
"00:22";"705"
"00:23";"705"
"00:24";"705"
"00:25";"705"
"00:26";"705"
"00:27";"705"
"00:28";"707"
"00:29";"705"
"00:30";"705"
"00:31";"705"
"00:32";"705"
"00:33";"705"
"00:34";"705"
"00:35";"705"
"00:36";"704"
"00:37";"705"
"00:38";"705"
"00:39";"704"
"00:40";"704"
"00:41";"704"
"00:42";"704"
"00:43";"704"
"00:44";"704"
"00:45";"702"
"00:46";"702"
"00:47";"702"
"00:48";"701"
"00:49";"704"
"00:50";"702"
"00:51";"701"
"00:52";"701"
"00:53";"701"
"00:54";"701"
"00:55";"701"
"00:56";"701"
"00:57";"700"
"00:58";"700"
"00:59";"699"
"01:00";"700"
"01:01";"700"
"01:02";"698"
"01:03";"698"
"01:04";"698"
"01:05";"698"
"01:06";"698"
"01:07";"698"
"01:08";"698"
"01:09";"698"
"01:10";"696"
"01:11";"696"
"01:12";"696"
"01:13";"696"
"01:14";"695"
"01:15";"695"
"01:16";"694"
"01:17";"693"
"01:18";"692"
"01:19";"692"
"01:20";"692"
"01:21";"690"
"01:22";"690"
"01:23";"688"
"01:24";"688"
"01:25";"687"
"01:26";"686"
"01:27";"686"
"01:28";"685"
"01:29";"684"
"01:30";"684"
"01:31";"683"
"01:32";"681"
"01:33";"681"
"01:34";"680"
"01:35";"680"
"01:36";"680"
"01:37";"678"
"01:38";"678"
"01:39";"677"
"01:40";"677"
"01:41";"675"
"01:42";"674"
"01:43";"672"
"01:44";"674"
"01:45";"671"
"01:46";"670"
"01:47";"670"
"01:48";"669"
"01:49";"667"
"01:50";"667"
"01:51";"667"
"01:52";"664"
"01:53";"664"
"01:54";"663"
"01:55";"662"
"01:56";"661"
"01:57";"661"
"01:58";"660"
"01:59";"659"
"02:00";"658"
"02:01";"656"
"02:02";"654"
"02:03";"654"
"02:04";"654"
"02:05";"652"
"02:06";"650"
"02:07";"650"
"02:08";"650"
"02:09";"649"
"02:10";"647"
"02:11";"647"
"02:12";"645"
"02:13";"644"
"02:14";"643"
"02:15";"642"
"02:16";"640"
"02:17";"640"
"02:18";"638"
"02:19";"637"
"02:20";"636"
"02:21";"636"
"02:22";"635"
"02:23";"633"
"02:24";"633"
"02:25";"632"
"02:26";"630"
"02:27";"630"
"02:28";"628"
"02:29";"627"
"02:30";"626"
"02:31";"626"
"02:32";"625"
"02:33";"623"
"02:34";"621"
"02:35";"621"
"02:36";"620"
"02:37";"620"
"02:38";"618"
"02:39";"616"
"02:40";"616"
"02:41";"614"
"02:42";"613"
"02:43";"612"
"02:44";"611"
"02:45";"610"
"02:46";"608"
"02:47";"608"
"02:48";"608"
"02:49";"606"
"02:50";"605"
"02:51";"604"
"02:52";"602"
"02:53";"602"
"02:54";"599"
"02:55";"599"
"02:56";"599"
"02:57";"598"
"02:58";"596"
"02:59";"595"
"03:00";"594"
"03:01";"592"
"03:02";"592"
"03:03";"590"
"03:04";"589"
"03:05";"588"
"03:06";"587"
"03:07";"587"
"03:08";"585"
"03:09";"584"
"03:10";"584"
"03:11";"581"
"03:12";"581"
"03:13";"579"
"03:14";"578"
"03:15";"577"
"03:16";"575"
"03:17";"575"
"03:18";"574"
"03:19";"572"
"03:20";"572"
"03:21";"571"
"03:22";"568"
"03:23";"568"
"03:24";"566"
"03:25";"566"
"03:26";"565"
"03:27";"564"
"03:28";"563"
"03:29";"563"
"03:30";"561"
"03:31";"560"
"03:32";"560"
"03:33";"558"
"03:34";"558"
"03:35";"556"
"03:36";"555"
"03:37";"554"
"03:38";"554"
"03:39";"551"
"03:40";"551"
"03:41";"551"
"03:42";"549"
"03:43";"548"
"03:44";"548"
"03:45";"548"
"03:46";"546"
"03:47";"546"
"03:48";"544"
"03:49";"542"
"03:50";"542"
"03:51";"540"
"03:52";"540"
"03:53";"538"
"03:54";"537"
"03:55";"536"
"03:56";"534"
"03:57";"534"
"03:58";"533"
"03:59";"531"
"04:00";"530"
"04:01";"530"
"04:02";"529"
"04:03";"527"
"04:04";"527"
"04:05";"525"
"04:06";"524"
"04:07";"523"
"04:08";"523"
"04:09";"523"
"04:10";"520"
"04:11";"520"
"04:12";"518"
"04:13";"518"
"04:14";"517"
"04:15";"516"
"04:16";"515"
"04:17";"514"
"04:18";"512"
"04:19";"512"
"04:20";"512"
"04:21";"510"
"04:22";"510"
"04:23";"510"
"04:24";"509"
"04:25";"508"
"04:26";"508"
"04:27";"506"
"04:28";"506"
"04:29";"506"
"04:30";"503"
"04:31";"503"
"04:32";"501"
"04:33";"500"
"04:34";"499"
"04:35";"499"
"04:36";"498"
"04:37";"498"
"04:38";"496"
"04:39";"494"
"04:40";"494"
"04:41";"493"
"04:42";"493"
"04:43";"492"
"04:44";"492"
"04:45";"491"
"04:46";"491"
"04:47";"489"
"04:48";"489"
"04:49";"489"
"04:50";"488"
"04:51";"486"
"04:52";"486"
"04:53";"486"
"04:54";"485"
"04:55";"484"
"04:56";"484"
"04:57";"482"
"04:58";"482"
"04:59";"482"
"05:00";"482"
"05:01";"479"
"05:02";"479"
"05:03";"478"
"05:04";"477"
"05:05";"476"
"05:06";"475"
"05:07";"475"
"05:08";"474"
"05:09";"474"
"05:10";"472"
"05:11";"472"
"05:12";"472"
"05:13";"469"
"05:14";"470"
"05:15";"469"
"05:16";"468"
"05:17";"468"
"05:18";"466"
"05:19";"465"
"05:20";"465"
"05:21";"464"
"05:22";"464"
"05:23";"464"
"05:24";"462"
"05:25";"462"
"05:26";"461"
"05:27";"458"
"05:28";"458"
"05:29";"458"
"05:30";"458"
"05:31";"457"
"05:32";"457"
"05:33";"455"
"05:34";"455"
"05:35";"454"
"05:36";"454"
"05:37";"453"
"05:38";"452"
"05:39";"452"
"05:40";"451"
"05:41";"450"
"05:42";"448"
"05:43";"450"
"05:44";"448"
"05:45";"446"
"05:46";"448"
"05:47";"445"
"05:48";"445"
"05:49";"444"
"05:50";"443"
"05:51";"442"
"05:52";"441"
"05:53";"441"
"05:54";"440"
"05:55";"441"
"05:56";"440"
"05:57";"438"
"05:58";"438"
"05:59";"437"
"06:00";"437"
"06:01";"436"
"06:02";"435"
"06:03";"434"
"06:04";"434"
"06:05";"434"
"06:06";"434"
"06:07";"431"
"06:08";"431"
"06:09";"433"
"06:10";"431"
"06:11";"431"
"06:12";"431"
"06:13";"431"
"06:14";"430"
"06:15";"430"
"06:16";"428"
"06:17";"427"
"06:18";"428"
"06:19";"427"
"06:20";"426"
"06:21";"426"
"06:22";"426"
"06:23";"424"
"06:24";"424"
"06:25";"424"
"06:26";"423"
"06:27";"422"
"06:28";"421"
"06:29";"421"
"06:30";"420"
"06:31";"419"
"06:32";"419"
"06:33";"419"
"06:34";"418"
"06:35";"418"
"06:36";"418"
"06:37";"417"
"06:38";"417"
"06:39";"417"
"06:40";"417"
"06:41";"416"
"06:42";"416"
"06:43";"417"
"06:44";"416"
"06:45";"417"
"06:46";"417"
"06:47";"418"
"06:48";"417"
"06:49";"416"
"06:50";"417"
"06:51";"417"
"06:52";"416"
"06:53";"416"
"06:54";"416"
"06:55";"416"
"06:56";"414"
"06:57";"414"
"06:58";"414"
"06:59";"414"
"07:00";"414"
"07:01";"414"
"07:02";"414"
"07:03";"412"
"07:04";"413"
"07:05";"414"
"07:06";"414"
"07:07";"414"
"07:08";"414"
"07:09";"414"
"07:10";"416"
"07:11";"416"
"07:12";"416"
"07:13";"417"
"07:14";"417"
"07:15";"417"
"07:16";"417"
"07:17";"419"
"07:18";"420"
"07:19";"419"
"07:20";"420"
"07:21";"421"
"07:22";"420"
"07:23";"420"
"07:24";"420"
"07:25";"421"
"07:26";"420"
"07:27";"422"
"07:28";"421"
"07:29";"422"
"07:30";"424"
"07:31";"423"
"07:32";"423"
"07:33";"423"
"07:34";"424"
"07:35";"424"
"07:36";"427"
"07:37";"427"
"07:38";"427"
"07:39";"428"
"07:40";"430"
"07:41";"431"
"07:42";"431"
"07:43";"431"
"07:44";"433"
"07:45";"434"
"07:46";"434"
"07:47";"434"
"07:48";"434"
"07:49";"436"
"07:50";"438"
"07:51";"438"
"07:52";"440"
"07:53";"441"
"07:54";"442"
"07:55";"442"
"07:56";"444"
"07:57";"444"
"07:58";"445"
"07:59";"445"
"08:00";"447"
"08:01";"448"
"08:02";"451"
"08:03";"451"
"08:04";"452"
"08:05";"453"
"08:06";"455"
"08:07";"457"
"08:08";"458"
"08:09";"458"
"08:10";"458"
"08:11";"460"
"08:12";"462"
"08:13";"462"
"08:14";"464"
"08:15";"465"
"08:16";"466"
"08:17";"469"
"08:18";"469"
"08:19";"470"
"08:20";"472"
"08:21";"475"
"08:22";"476"
"08:23";"478"
"08:24";"479"
"08:25";"481"
"08:26";"482"
"08:27";"484"
"08:28";"485"
"08:29";"486"
"08:30";"488"
"08:31";"489"
"08:32";"491"
"08:33";"492"
"08:34";"492"
"08:35";"495"
"08:36";"496"
"08:37";"498"
"08:38";"499"
"08:39";"501"
"08:40";"501"
"08:41";"503"
"08:42";"506"
"08:43";"507"
"08:44";"509"
"08:45";"510"
"08:46";"512"
"08:47";"513"
"08:48";"514"
"08:49";"516"
"08:50";"517"
"08:51";"518"
"08:52";"520"
"08:53";"522"
"08:54";"523"
"08:55";"525"
"08:56";"527"
"08:57";"526"
"08:58";"529"
"08:59";"530"
"09:00";"531"
"09:01";"534"
"09:02";"534"
"09:03";"536"
"09:04";"536"
"09:05";"537"
"09:06";"539"
"09:07";"540"
"09:08";"540"
"09:09";"543"
"09:10";"544"
"09:11";"544"
"09:12";"546"
"09:13";"546"
"09:14";"547"
"09:15";"550"
"09:16";"550"
"09:17";"551"
"09:18";"553"
"09:19";"553"
"09:20";"555"
"09:21";"556"
"09:22";"556"
"09:23";"558"
"09:24";"558"
"09:25";"559"
"09:26";"561"
"09:27";"561"
"09:28";"564"
"09:29";"565"
"09:30";"565"
"09:31";"567"
"09:32";"567"
"09:33";"568"
"09:34";"568"
"09:35";"572"
"09:36";"571"
"09:37";"572"
"09:38";"575"
"09:39";"575"
"09:40";"575"
"09:41";"578"
"09:42";"579"
"09:43";"580"
"09:44";"582"
"09:45";"581"
"09:46";"582"
"09:47";"584"
"09:48";"584"
"09:49";"585"
"09:50";"588"
"09:51";"588"
"09:52";"589"
"09:53";"590"
"09:54";"592"
"09:55";"592"
"09:56";"595"
"09:57";"596"
"09:58";"595"
"09:59";"599"
"10:00";"599"
"10:01";"602"
"10:02";"603"
"10:03";"602"
"10:04";"605"
"10:05";"606"
"10:06";"606"
"10:07";"608"
"10:08";"608"
"10:09";"609"
"10:10";"614"
"10:11";"613"
"10:12";"615"
"10:13";"615"
"10:14";"615"
"10:15";"618"
"10:16";"619"
"10:17";"620"
"10:18";"623"
"10:19";"621"
"10:20";"625"
"10:21";"626"
"10:22";"626"
"10:23";"629"
"10:24";"628"
"10:25";"632"
"10:26";"630"
"10:27";"633"
"10:28";"633"
"10:29";"635"
"10:30";"636"
"10:31";"636"
"10:32";"637"
"10:33";"639"
"10:34";"642"
"10:35";"642"
"10:36";"643"
"10:37";"645"
"10:38";"646"
"10:39";"647"
"10:40";"648"
"10:41";"650"
"10:42";"652"
"10:43";"652"
"10:44";"654"
"10:45";"654"
"10:46";"655"
"10:47";"656"
"10:48";"657"
"10:49";"660"
"10:50";"661"
"10:51";"661"
"10:52";"660"
"10:53";"664"
"10:54";"664"
"10:55";"667"
"10:56";"667"
"10:57";"668"
"10:58";"669"
"10:59";"669"
"11:00";"670"
"11:01";"670"
"11:02";"671"
"11:03";"671"
"11:04";"674"
"11:05";"675"
"11:06";"675"
"11:07";"676"
"11:08";"677"
"11:09";"678"
"11:10";"678"
"11:11";"680"
"11:12";"681"
"11:13";"681"
"11:14";"681"
"11:15";"684"
"11:16";"684"
"11:17";"684"
"11:18";"685"
"11:19";"687"
"11:20";"687"
"11:21";"686"
"11:22";"688"
"11:23";"690"
"11:24";"690"
"11:25";"691"
"11:26";"692"
"11:27";"691"
"11:28";"692"
"11:29";"694"
"11:30";"694"
"11:31";"694"
"11:32";"696"
"11:33";"695"
"11:34";"696"
"11:35";"698"
"11:36";"698"
"11:37";"699"
"11:38";"699"
"11:39";"700"
"11:40";"700"
"11:41";"701"
"11:42";"701"
"11:43";"701"
"11:44";"701"
"11:45";"702"
"11:46";"705"
"11:47";"705"
"11:48";"704"
"11:49";"705"
"11:50";"707"
"11:51";"707"
"11:52";"705"
"11:53";"708"
"11:54";"709"
"11:55";"709"
"11:56";"709"
"11:57";"710"
"11:58";"709"
"11:59";"710"
"12:00";"711"
"12:01";"712"
"12:02";"711"
"12:03";"712"
"12:04";"712"
"12:05";"712"
"12:06";"715"
"12:07";"715"
"12:08";"715"
"12:09";"715"
"12:10";"716"
"12:11";"717"
"12:12";"716"
"12:13";"717"
"12:14";"718"
"12:15";"715"
"12:16";"718"
"12:17";"718"
"12:18";"718"
"12:19";"719"
"12:20";"719"
"12:21";"719"
"12:22";"718"
"12:23";"719"
"12:24";"719"
"12:25";"719"
"12:26";"719"
"12:27";"719"
"12:28";"719"
"12:29";"721"
"12:30";"722"
"12:31";"719"
"12:32";"722"
"12:33";"721"
"12:34";"719"
"12:35";"722"
"12:36";"722"
"12:37";"722"
"12:38";"723"
"12:39";"722"
"12:40";"721"
"12:41";"723"
"12:42";"724"
"12:43";"721"
"12:44";"722"
"12:45";"722"
"12:46";"721"
"12:47";"721"
"12:48";"721"
"12:49";"719"
"12:50";"719"
"12:51";"718"
"12:52";"719"
"12:53";"721"
"12:54";"719"
"12:55";"719"
"12:56";"718"
"12:57";"718"
"12:58";"719"
"12:59";"719"
"13:00";"718"
"13:01";"718"
"13:02";"718"
"13:03";"718"
"13:04";"717"
"13:05";"716"
"13:06";"715"
"13:07";"715"
"13:08";"715"
"13:09";"715"
"13:10";"714"
"13:11";"712"
"13:12";"714"
"13:13";"712"
"13:14";"711"
"13:15";"711"
"13:16";"711"
"13:17";"711"
"13:18";"711"
"13:19";"711"
"13:20";"708"
"13:21";"708"
"13:22";"708"
"13:23";"708"
"13:24";"708"
"13:25";"705"
"13:26";"705"
"13:27";"703"
"13:28";"704"
"13:29";"704"
"13:30";"702"
"13:31";"701"
"13:32";"701"
"13:33";"700"
"13:34";"700"
"13:35";"700"
"13:36";"698"
"13:37";"698"
"13:38";"695"
"13:39";"694"
"13:40";"694"
"13:41";"694"
"13:42";"692"
"13:43";"692"
"13:44";"691"
"13:45";"690"
"13:46";"690"
"13:47";"687"
"13:48";"687"
"13:49";"685"
"13:50";"686"
"13:51";"684"
"13:52";"684"
"13:53";"683"
"13:54";"681"
"13:55";"680"
"13:56";"679"
"13:57";"680"
"13:58";"678"
"13:59";"676"
"14:00";"676"
"14:01";"674"
"14:02";"674"
"14:03";"674"
"14:04";"672"
"14:05";"670"
"14:06";"670"
"14:07";"669"
"14:08";"669"
"14:09";"667"
"14:10";"667"
"14:11";"664"
"14:12";"663"
"14:13";"663"
"14:14";"663"
"14:15";"662"
"14:16";"660"
"14:17";"660"
"14:18";"659"
"14:19";"657"
"14:20";"657"
"14:21";"654"
"14:22";"654"
"14:23";"652"
"14:24";"650"
"14:25";"650"
"14:26";"650"
"14:27";"650"
"14:28";"647"
"14:29";"646"
"14:30";"644"
"14:31";"643"
"14:32";"642"
"14:33";"642"
"14:34";"643"
"14:35";"640"
"14:36";"637"
"14:37";"636"
"14:38";"636"
"14:39";"636"
"14:40";"635"
"14:41";"633"
"14:42";"632"
"14:43";"630"
"14:44";"630"
"14:45";"628"
"14:46";"628"
"14:47";"626"
"14:48";"623"
"14:49";"625"
"14:50";"622"
"14:51";"620"
"14:52";"620"
"14:53";"618"
"14:54";"618"
"14:55";"614"
"14:56";"613"
"14:57";"613"
"14:58";"609"
"14:59";"611"
"15:00";"608"
"15:01";"607"
"15:02";"606"
"15:03";"605"
"15:04";"605"
"15:05";"602"
"15:06";"600"
"15:07";"600"
"15:08";"597"
"15:09";"598"
"15:10";"595"
"15:11";"594"
"15:12";"595"
"15:13";"591"
"15:14";"591"
"15:15";"590"
"15:16";"587"
"15:17";"588"
"15:18";"585"
"15:19";"584"
"15:20";"584"
"15:21";"582"
"15:22";"582"
"15:23";"580"
"15:24";"576"
"15:25";"578"
"15:26";"575"
"15:27";"575"
"15:28";"574"
"15:29";"571"
"15:30";"571"
"15:31";"568"
"15:32";"567"
"15:33";"568"
"15:34";"564"
"15:35";"563"
"15:36";"563"
"15:37";"560"
"15:38";"560"
"15:39";"560"
"15:40";"557"
"15:41";"556"
"15:42";"554"
"15:43";"553"
"15:44";"551"
"15:45";"551"
"15:46";"550"
"15:47";"549"
"15:48";"547"
"15:49";"547"
"15:50";"544"
"15:51";"543"
"15:52";"542"
"15:53";"542"
"15:54";"540"
"15:55";"540"
"15:56";"537"
"15:57";"536"
"15:58";"536"
"15:59";"534"
"16:00";"533"
"16:01";"533"
"16:02";"531"
"16:03";"529"
"16:04";"527"
"16:05";"527"
"16:06";"525"
"16:07";"524"
"16:08";"523"
"16:09";"522"
"16:10";"520"
"16:11";"518"
"16:12";"516"
"16:13";"516"
"16:14";"516"
"16:15";"514"
"16:16";"512"
"16:17";"512"
"16:18";"510"
"16:19";"509"
"16:20";"508"
"16:21";"507"
"16:22";"506"
"16:23";"506"
"16:24";"505"
"16:25";"503"
"16:26";"502"
"16:27";"500"
"16:28";"500"
"16:29";"498"
"16:30";"496"
"16:31";"496"
"16:32";"495"
"16:33";"494"
"16:34";"493"
"16:35";"492"
"16:36";"489"
"16:37";"490"
"16:38";"489"
"16:39";"488"
"16:40";"488"
"16:41";"486"
"16:42";"482"
"16:43";"484"
"16:44";"482"
"16:45";"481"
"16:46";"481"
"16:47";"479"
"16:48";"477"
"16:49";"477"
"16:50";"475"
"16:51";"475"
"16:52";"474"
"16:53";"472"
"16:54";"471"
"16:55";"470"
"16:56";"469"
"16:57";"468"
"16:58";"467"
"16:59";"467"
"17:00";"465"
"17:01";"465"
"17:02";"464"
"17:03";"462"
"17:04";"461"
"17:05";"460"
"17:06";"458"
"17:07";"459"
"17:08";"458"
"17:09";"458"
"17:10";"457"
"17:11";"455"
"17:12";"454"
"17:13";"453"
"17:14";"451"
"17:15";"450"
"17:16";"450"
"17:17";"448"
"17:18";"448"
"17:19";"447"
"17:20";"445"
"17:21";"444"
"17:22";"444"
"17:23";"443"
"17:24";"442"
"17:25";"440"
"17:26";"440"
"17:27";"438"
"17:28";"438"
"17:29";"437"
"17:30";"436"
"17:31";"434"
"17:32";"434"
"17:33";"434"
"17:34";"431"
"17:35";"431"
"17:36";"430"
"17:37";"429"
"17:38";"427"
"17:39";"427"
"17:40";"426"
"17:41";"424"
"17:42";"423"
"17:43";"422"
"17:44";"422"
"17:45";"420"
"17:46";"420"
"17:47";"420"
"17:48";"417"
"17:49";"417"
"17:50";"416"
"17:51";"416"
"17:52";"414"
"17:53";"413"
"17:54";"413"
"17:55";"412"
"17:56";"410"
"17:57";"410"
"17:58";"410"
"17:59";"409"
"18:00";"407"
"18:01";"407"
"18:02";"405"
"18:03";"403"
"18:04";"403"
"18:05";"403"
"18:06";"400"
"18:07";"400"
"18:08";"399"
"18:09";"398"
"18:10";"397"
"18:11";"396"
"18:12";"396"
"18:13";"395"
"18:14";"394"
"18:15";"394"
"18:16";"393"
"18:17";"392"
"18:18";"390"
"18:19";"390"
"18:20";"390"
"18:21";"388"
"18:22";"386"
"18:23";"388"
"18:24";"386"
"18:25";"386"
"18:26";"385"
"18:27";"385"
"18:28";"383"
"18:29";"382"
"18:30";"382"
"18:31";"381"
"18:32";"381"
"18:33";"380"
"18:34";"380"
"18:35";"379"
"18:36";"379"
"18:37";"378"
"18:38";"379"
"18:39";"378"
"18:40";"376"
"18:41";"376"
"18:42";"376"
"18:43";"376"
"18:44";"374"
"18:45";"373"
"18:46";"373"
"18:47";"374"
"18:48";"373"
"18:49";"372"
"18:50";"373"
"18:51";"372"
"18:52";"372"
"18:53";"371"
"18:54";"371"
"18:55";"371"
"18:56";"370"
"18:57";"368"
"18:58";"368"
"18:59";"369"
"19:00";"369"
"19:01";"368"
"19:02";"368"
"19:03";"368"
"19:04";"368"
"19:05";"368"
"19:06";"368"
"19:07";"368"
"19:08";"368"
"19:09";"368"
"19:10";"368"
"19:11";"368"
"19:12";"369"
"19:13";"368"
"19:14";"368"
"19:15";"368"
"19:16";"368"
"19:17";"368"
"19:18";"368"
"19:19";"368"
"19:20";"368"
"19:21";"368"
"19:22";"368"
"19:23";"368"
"19:24";"368"
"19:25";"368"
"19:26";"369"
"19:27";"368"
"19:28";"369"
"19:29";"370"
"19:30";"370"
"19:31";"371"
"19:32";"372"
"19:33";"371"
"19:34";"371"
"19:35";"372"
"19:36";"373"
"19:37";"372"
"19:38";"373"
"19:39";"372"
"19:40";"373"
"19:41";"372"
"19:42";"372"
"19:43";"372"
"19:44";"372"
"19:45";"373"
"19:46";"373"
"19:47";"373"
"19:48";"374"
"19:49";"373"
"19:50";"376"
"19:51";"376"
"19:52";"376"
"19:53";"378"
"19:54";"379"
"19:55";"379"
"19:56";"379"
"19:57";"382"
"19:58";"380"
"19:59";"381"
"20:00";"382"
"20:01";"382"
"20:02";"382"
"20:03";"382"
"20:04";"383"
"20:05";"383"
"20:06";"385"
"20:07";"386"
"20:08";"386"
"20:09";"387"
"20:10";"388"
"20:11";"389"
"20:12";"392"
"20:13";"392"
"20:14";"392"
"20:15";"393"
"20:16";"395"
"20:17";"396"
"20:18";"397"
"20:19";"397"
"20:20";"397"
"20:21";"400"
"20:22";"400"
"20:23";"400"
"20:24";"403"
"20:25";"403"
"20:26";"403"
"20:27";"405"
"20:28";"406"
"20:29";"407"
"20:30";"409"
"20:31";"410"
"20:32";"410"
"20:33";"412"
"20:34";"413"
"20:35";"416"
"20:36";"417"
"20:37";"417"
"20:38";"420"
"20:39";"422"
"20:40";"423"
"20:41";"424"
"20:42";"427"
"20:43";"429"
"20:44";"430"
"20:45";"433"
"20:46";"434"
"20:47";"436"
"20:48";"437"
"20:49";"440"
"20:50";"440"
"20:51";"441"
"20:52";"444"
"20:53";"446"
"20:54";"447"
"20:55";"448"
"20:56";"451"
"20:57";"452"
"20:58";"455"
"20:59";"455"
"21:00";"458"
"21:01";"460"
"21:02";"461"
"21:03";"464"
"21:04";"464"
"21:05";"466"
"21:06";"468"
"21:07";"469"
"21:08";"472"
"21:09";"472"
"21:10";"475"
"21:11";"476"
"21:12";"479"
"21:13";"479"
"21:14";"482"
"21:15";"482"
"21:16";"484"
"21:17";"486"
"21:18";"486"
"21:19";"489"
"21:20";"489"
"21:21";"492"
"21:22";"492"
"21:23";"493"
"21:24";"496"
"21:25";"496"
"21:26";"499"
"21:27";"500"
"21:28";"501"
"21:29";"503"
"21:30";"503"
"21:31";"505"
"21:32";"506"
"21:33";"507"
"21:34";"510"
"21:35";"510"
"21:36";"512"
"21:37";"512"
"21:38";"513"
"21:39";"513"
"21:40";"516"
"21:41";"516"
"21:42";"518"
"21:43";"519"
"21:44";"520"
"21:45";"522"
"21:46";"522"
"21:47";"523"
"21:48";"523"
"21:49";"524"
"21:50";"526"
"21:51";"527"
"21:52";"527"
"21:53";"530"
"21:54";"531"
"21:55";"532"
"21:56";"533"
"21:57";"534"
"21:58";"534"
"21:59";"536"
"22:00";"536"
"22:01";"537"
"22:02";"540"
"22:03";"540"
"22:04";"542"
"22:05";"543"
"22:06";"543"
"22:07";"544"
"22:08";"544"
"22:09";"546"
"22:10";"548"
"22:11";"548"
"22:12";"549"
"22:13";"551"
"22:14";"551"
"22:15";"551"
"22:16";"554"
"22:17";"554"
"22:18";"555"
"22:19";"557"
"22:20";"557"
"22:21";"558"
"22:22";"560"
"22:23";"558"
"22:24";"561"
"22:25";"561"
"22:26";"561"
"22:27";"565"
"22:28";"566"
"22:29";"566"
"22:30";"568"
"22:31";"567"
"22:32";"570"
"22:33";"571"
"22:34";"570"
"22:35";"573"
"22:36";"573"
"22:37";"573"
"22:38";"577"
"22:39";"575"
"22:40";"578"
"22:41";"578"
"22:42";"578"
"22:43";"582"
"22:44";"582"
"22:45";"582"
"22:46";"585"
"22:47";"582"
"22:48";"585"
"22:49";"587"
"22:50";"585"
"22:51";"589"
"22:52";"589"
"22:53";"590"
"22:54";"595"
"22:55";"591"
"22:56";"592"
"22:57";"595"
"22:58";"596"
"22:59";"599"
"23:00";"597"
"23:01";"598"
"23:02";"601"
"23:03";"599"
"23:04";"603"
"23:05";"604"
"23:06";"605"
"23:07";"606"
"23:08";"606"
"23:09";"608"
"23:10";"608"
"23:11";"608"
"23:12";"612"
"23:13";"611"
"23:14";"612"
"23:15";"614"
"23:16";"614"
"23:17";"616"
"23:18";"618"
"23:19";"616"
"23:20";"619"
"23:21";"619"
"23:22";"621"
"23:23";"622"
"23:24";"620"
"23:25";"623"
"23:26";"625"
"23:27";"626"
"23:28";"626"
"23:29";"626"
"23:30";"629"
"23:31";"629"
"23:32";"629"
"23:33";"630"
"23:34";"630"
"23:35";"633"
"23:36";"632"
"23:37";"633"
"23:38";"636"
"23:39";"636"
"23:40";"636"
"23:41";"638"
"23:42";"639"
"23:43";"640"
"23:44";"640"
"23:45";"643"
"23:46";"642"
"23:47";"643"
"23:48";"646"
"23:49";"645"
"23:50";"647"
"23:51";"646"
"23:52";"647"
"23:53";"648"
"23:54";"650"
"23:55";"649"
"23:56";"652"
"23:57";"651"
"23:58";"651"
"23:59";"654"
"24:00";"654"
