
File name: .\001_20220526T092433_A.DBD

DTDT #1 start: 0x8 size: 0x19cc

HDR1 start: 0x10 size: 0x48
Job:         SPIEK
Schedule:    A  "SP"
Serial num:  110970
Timezone:    none
SHA-1:       0e7a723a820a307ea17834b4e89046612409585f

DHDR start: 0x60 size: 0x290
Oldest record:      0x0
Newest record:      0x40
Bytes/record:       0x5a
DataPoints/record:  0x8
Channel map:
   0: VEXT  name:"ext_voltage"  units:"V"  fmt:"F1"  prefix:0x0810
   1: 1*V  name:"E14_E9_raw"  units:"mV"  fmt:"F7"  prefix:0x0810
   2: 1+V  name:"E12_E9_raw"  units:"mV"  fmt:"F7"  prefix:0x0810
   3: 1-V  name:"E2_E9_raw"  units:"mV"  fmt:"F7"  prefix:0x0810
   4: 3*V  name:"E14_E9_filter"  units:"mV"  fmt:"F7"  prefix:0x0810
   5: 3+V  name:"E12_E9_filter"  units:"mV"  fmt:"F7"  prefix:0x0810
   6: 3-V  name:"E2_E9_filter"  units:"mV"  fmt:"F7"  prefix:0x0810
   7: 2PT385  name:"Temp"  units:"degC"  fmt:"F7"  prefix:0x0810

DATA start: 0x2f8 size: 0x16dc
2022/05/25 22:30:00.0068, 12.5, 16.4677620, -4.8050232, 9.4790421, -13.3523636, -10.3757477, -16.6585846, 15.0237265
2022/05/25 22:40:00.0020, 12.5, 17.5005341, -3.5839767, 9.8025322, -13.4689865, -12.6454086, -17.7757034, 15.0276527
2022/05/25 22:50:00.0018, 12.5, -81.6737747, -3.5292816, 10.0529633, -14.2554245, -17.4532318, -17.8584671, 15.0223103
2022/05/25 23:00:00.0068, 12.5, 17.2603035, -3.4331970, 10.2882690, -15.0273361, -19.5005646, -18.4228897, 15.0298853
2022/05/25 23:10:00.0021, 12.5, 17.0903168, -3.4017181, 10.3732529, -15.6527176, -20.4739914, -19.2392197, 15.0362911
2022/05/25 23:20:00.0018, 12.5, 16.9389000, -3.5326767, 10.4489098, -16.0242996, -21.2859879, -19.8353043, 15.0470448
2022/05/25 23:30:00.0020, 12.5, 17.1044884, -3.4647675, 10.6250381, -16.3384171, -21.6092758, -19.8119354, 15.0491953
2022/05/25 23:40:00.0098, 12.5, 17.0363808, -3.6625366, 10.5644760, -16.7096710, -22.0292892, -20.0309753, 15.0513773
2022/05/25 23:50:00.0018, 12.5, 17.2278671, -3.6397629, 10.5599594, -16.6240158, -22.8658524, -20.2881165, 15.0502691
2022/05/26 00:00:00.0101, 12.5, 17.1215057, -3.5189438, 10.5480804, -16.6686020, -23.0089569, -20.3462143, 15.0535135
2022/05/26 00:10:00.0018, 12.5, 17.2010727, -3.7227249, 10.4542313, -16.8365555, -23.6818390, -20.4524841, 15.0610571
2022/05/26 00:20:00.0039, 12.5, 17.0894966, -3.6244812, 10.5119743, -16.7807083, -24.6110764, -20.4605331, 15.0621328
2022/05/26 00:30:00.0018, 12.5, -93.0202255, -3.9210663, 10.2182503, -16.5059509, -25.4008713, -19.9569702, 15.0345135
2022/05/26 00:40:00.0067, 12.5, -41.6624985, -3.7153320, 10.3733330, -16.2258224, -25.9249573, -19.6441498, 15.0345135
2022/05/26 00:50:00.0038, 12.4, 17.1245880, -3.7229385, 10.4804878, -16.2576447, -26.1623611, -19.0899048, 15.0334377
2022/05/26 01:00:00.0111, 12.5, 17.4819145, -3.8847046, 10.4763756, -16.4053574, -26.4715805, -18.9533081, 15.0420246
2022/05/26 01:10:00.0135, 12.5, -52.0172348, -3.5547333, 10.3257217, -16.7003021, -27.0083313, -19.1062393, 15.0431013
2022/05/26 01:20:00.0035, 12.5, -85.1743393, -3.9385300, 10.2680740, -17.1143417, -27.8929520, -19.3876419, 15.0398417
2022/05/26 01:30:00.0033, 12.5, -60.7801743, -4.1040497, 10.2254677, -17.6171188, -28.6584930, -19.3719711, 15.0441608
2022/05/26 01:40:00.0017, 12.5, 17.4123268, -3.5397568, 10.3758392, -17.8687897, -27.9431000, -19.4926376, 15.0441608
2022/05/26 01:50:00.0018, 12.4, 17.4232140, -3.9315338, 10.2412453, -17.8190536, -27.9831161, -19.3023224, 15.0484934
2022/05/26 02:00:00.0034, 12.5, 17.5825119, -3.9411774, 10.1766167, -17.6395340, -28.1898880, -18.5495071, 15.0506296
2022/05/26 02:10:00.0021, 12.5, -21.8495178, -3.8866348, 10.0820770, -18.2364426, -28.2717590, -18.8147507, 15.0474186
2022/05/26 02:20:00.0021, 12.4, -29.2834930, -3.8756943, 9.9454079, -17.8599319, -27.5951157, -18.9113388, 15.0495682
2022/05/26 02:30:00.0026, 12.5, -32.5093536, -3.8723373, 9.9070435, -17.5820694, -27.2600861, -20.0371017, 15.0441608
2022/05/26 02:40:00.0020, 12.4, -19.2015762, -5.1269836, 9.7542915, -17.6075897, -27.4473038, -21.3130646, 15.0463428
2022/05/26 02:50:00.0157, 12.4, -8.4456863, -5.0646896, 9.6426926, -17.4321442, -27.3491211, -22.0204849, 15.0377073
2022/05/26 03:00:00.0038, 12.5, -1.7895126, -3.9172440, 9.5563011, -17.4782410, -27.3733902, -22.4135208, 15.0441608
2022/05/26 03:10:00.0020, 12.4, -32.2565994, -4.4835129, 9.4929199, -17.6467819, -27.6390915, -22.6739883, 15.0312881
2022/05/26 03:20:00.0031, 12.5, -31.6210709, -4.4264832, 9.4229279, -17.6092453, -27.8891449, -22.8739624, 15.0355568
2022/05/26 03:30:00.0059, 12.4, -28.8629532, -4.2277603, 9.3839645, -17.7277069, -27.9278259, -22.9668579, 15.0387669
2022/05/26 03:40:00.0017, 12.5, -94.5871201, -5.9206238, 9.2111320, -17.8497009, -28.8443069, -23.0779190, 15.0366640
2022/05/26 03:50:00.0054, 12.5, 18.4002266, -4.2755203, 9.4042397, -17.7070007, -29.5905380, -23.2301941, 15.0355568
2022/05/26 04:00:00.0037, 12.5, -53.2495346, -4.9520645, 9.1030388, -17.7146072, -29.4518585, -23.3473206, 15.0441608
2022/05/26 04:10:00.0038, 12.4, -118.5509262, -4.5808563, 9.0417137, -17.7260513, -29.5317535, -23.4465485, 15.0377073
2022/05/26 04:20:00.0129, 12.5, 22.6708641, -4.7511673, 9.0115433, -17.9759827, -29.4305496, -23.5763092, 15.0398417
2022/05/26 04:30:00.0150, 12.5, 0.9087372, -4.0176163, 9.0146027, -18.1147385, -28.5260925, -23.6245117, 15.0355568
2022/05/26 04:40:00.0018, 12.4, 43.1227188, -4.1223984, 9.0473633, -18.0482254, -27.5835953, -23.5435791, 15.0290871
2022/05/26 04:50:00.0018, 12.4, 28.3372154, -3.8208389, 9.0648689, -17.9220657, -26.0853882, -23.2985535, 15.0183325
2022/05/26 05:00:00.0021, 12.4, 163.6958313, -4.0102997, 8.9913483, -17.9621124, -25.4136505, -23.3421783, 15.0129395
2022/05/26 05:10:00.0020, 12.4, 50.2537003, -3.8555984, 8.9863892, -18.0264587, -25.0769196, -23.4188919, 15.0086718
2022/05/26 05:20:00.0040, 12.4, 62.6625137, -3.8638687, 8.9397850, -18.1429825, -24.8976517, -23.5193710, 15.0164919
2022/05/26 05:30:00.0081, 12.4, 76.2645035, -3.8868332, 8.9352684, -18.3106537, -24.9656754, -23.6352997, 15.0207767
2022/05/26 05:40:00.0034, 12.4, 102.5226212, -3.9837570, 8.9059448, -18.3737488, -24.9626236, -23.6807404, 15.0197668
2022/05/26 05:50:00.0033, 12.4, 124.9422379, -3.8707962, 8.8586998, -18.4496689, -24.9115372, -23.7022476, 15.0164919
2022/05/26 06:00:00.0028, 12.5, 131.6206360, -4.0368729, 8.8276024, -18.5070801, -25.0632553, -23.7839966, 15.0100222
2022/05/26 06:10:00.0021, 12.4, 128.4664001, -4.1233521, 8.7970581, -18.5850754, -25.4027863, -23.8481598, 15.0132666
2022/05/26 06:20:00.0045, 12.4, 112.7150650, -4.0098953, 8.7902107, -18.8148499, -25.6084900, -23.9370956, 15.0153847
2022/05/26 06:30:00.0046, 12.4, 103.7996597, -3.9815292, 8.7088318, -19.0661926, -25.8431473, -24.0098038, 15.0153847
2022/05/26 06:40:00.0082, 12.4, 88.7599258, -3.9771347, 8.6568718, -19.2565613, -25.8819733, -24.1392670, 15.0122242
2022/05/26 06:50:00.0066, 12.4, 92.9899673, -4.0464630, 8.6245346, -19.4350662, -26.1687317, -24.2125549, 15.0164919
2022/05/26 07:00:00.0018, 12.4, 85.8756485, -4.0359726, 8.6042480, -19.6570053, -26.6979675, -24.3118515, 15.0272789
2022/05/26 07:10:00.0021, 12.4, 73.4998550, -4.1444016, 8.5344009, -19.9648361, -27.1488113, -24.2966690, 15.0283213
2022/05/26 07:20:00.0146, 12.4, 61.9914932, -4.1184235, 8.5403481, -20.0674973, -27.4139175, -24.3817062, 15.0369406
2022/05/26 07:30:00.0084, 12.4, 64.0498276, -4.0194244, 8.5096245, -20.0410080, -27.5942535, -24.5117111, 14.9948540
2022/05/26 07:40:00.0021, 12.4, 122.5937119, -3.9876404, 8.3098450, -20.0521011, -28.0605774, -24.4677734, 14.9959612
2022/05/26 07:50:00.0020, 12.4, 69.6215286, -4.0725327, 8.3268700, -20.1870499, -28.9345932, -24.3198929, 14.9927034
2022/05/26 08:00:00.0045, 12.4, 58.5737991, -4.0384750, 8.2606239, -20.1163177, -29.7124634, -24.1629105, 14.9937773
2022/05/26 08:10:00.0018, 12.4, 49.9254227, -4.0740585, 8.1652069, -20.1410141, -31.2150955, -23.7483597, 15.0077581
2022/05/26 08:20:00.0018, 12.4, 43.3765106, -4.0793991, 8.1203384, -20.0285950, -32.6469803, -23.3822098, 14.9881725
2022/05/26 08:30:00.0033, 12.4, 38.8878632, -4.1142120, 8.0612602, -20.0612564, -32.6689453, -23.4770279, 14.9946089
2022/05/26 08:40:00.0122, 12.4, 41.4680634, -3.9899063, 8.0813866, -20.1026306, -32.1640167, -23.7989655, 15.0021696
2022/05/26 08:50:00.0020, 12.4, 38.5076752, -4.1049194, 8.1173630, -19.9628372, -31.8095551, -23.9588165, 15.0043211
2022/05/26 09:00:00.0137, 12.4, 32.2957001, -4.0751495, 8.0852470, -19.7470322, -30.0223694, -23.9639206, 14.9989271
2022/05/26 09:10:00.0020, 12.4, 5.3113251, -4.0205917, 8.0226707, -19.5688629, -28.6847458, -23.9332199, 14.9828119
