"Timestamp","TZ","ext_voltage (V)","E3_E8 (mV)","E3_E4 (mV)","Temperatur_mV (degC)"
2022/07/26 12:50:00.000,n,12.22252,21.119046,5.22567,20.420686
2022/07/26 12:55:00.002,n,12.22252,20.77359,5.087372,20.41328
2022/07/26 13:00:00.001,n,12.22252,27.882058,4.98362,20.407804
2022/07/26 13:05:00.001,n,12.22252,24.094388,5.181175,20.397454
2022/07/26 13:10:00.015,n,12.22252,23.896954,5.156883,20.413698
2022/07/26 13:15:00.000,n,12.22252,24.445434,5.249481,20.432052
2022/07/26 13:20:00.014,n,12.36978,26.770912,5.008293,20.412988
2022/07/26 13:25:00.006,n,12.22252,27.302578,5.158562,20.411116
2022/07/26 13:30:00.015,n,12.36978,29.539162,4.997544,20.409524
2022/07/26 13:35:00.010,n,12.36978,25.572406,5.174393,20.397176
2022/07/26 13:40:00.000,n,12.22252,25.738288,4.985688,20.403268
2022/07/26 13:45:00.005,n,12.22252,23.840386,5.082894,20.397418
2022/07/26 13:50:00.000,n,12.22252,29.960166,5.008423,20.387222
2022/07/26 13:55:00.014,n,12.36978,24.619064,5.189621,20.374816
2022/07/26 14:00:00.003,n,12.22252,27.695888,5.080513,20.384852
2022/07/26 14:05:00.007,n,12.22252,22.893192,5.16243,20.384896
2022/07/26 14:10:00.006,n,12.36978,27.488244,5.159477,20.392454
2022/07/26 14:15:00.008,n,12.22252,25.022976,5.061402,20.397862
2022/07/26 14:20:00.005,n,12.36978,22.023986,5.266228,20.416272
2022/07/26 14:25:00.000,n,12.22252,26.017384,5.011994,20.442446
2022/07/26 14:30:00.002,n,12.22252,25.399724,5.094399,20.505964
2022/07/26 14:35:00.000,n,12.36978,25.524734,5.09346,20.486086
2022/07/26 14:40:00.014,n,12.36978,18.523594,5.222054,20.413846
2022/07/26 14:45:00.006,n,12.22252,23.282512,5.151947,20.424976
2022/07/26 14:50:00.013,n,12.36978,19.817478,5.277611,20.42575
2022/07/26 14:55:00.001,n,12.22252,23.295128,5.305008,20.431626
2022/07/26 15:00:00.008,n,12.36978,21.40694,5.107743,20.450844
2022/07/26 15:05:00.000,n,12.36978,25.559014,5.261185,20.440228
2022/07/26 15:10:00.000,n,12.22252,27.81052,5.126053,20.43011
2022/07/26 15:15:00.013,n,12.22252,3226.6552,5.087364,20.414572
2022/07/26 15:25:00.000,n,12.517038,18.309994,5.251152,20.415906
2022/07/26 15:30:00.005,n,12.22252,20.996082,5.213471,20.45438
2022/07/26 15:35:00.010,n,12.22252,24.245518,5.111359,20.484736
2022/07/26 15:40:00.000,n,12.22252,23.219078,5.060219,20.500654
2022/07/26 15:45:00.011,n,12.517038,22.012482,5.054901,20.518478
2022/07/26 15:50:00.000,n,12.36978,23.783786,5.016197,20.525676
2022/07/26 15:55:00.005,n,12.36978,23.397366,5.006684,20.539006
2022/07/26 16:00:00.014,n,12.36978,22.143718,5.133324,20.551872
2022/07/26 16:05:00.000,n,12.517038,17.97116,5.253388,20.562438
2022/07/26 16:10:00.007,n,12.36978,21.0205,5.146614,20.579432
2022/07/26 16:15:00.000,n,12.36978,17.2948,5.169617,20.581728
2022/07/26 16:20:00.018,n,12.517038,22.172612,5.082375,20.58773
2022/07/26 16:25:00.006,n,12.517038,21.827808,5.08934,20.596428
2022/07/26 16:30:00.004,n,12.517038,22.117404,5.064743,20.590016
2022/07/26 16:35:00.005,n,12.36978,19.226178,5.122414,20.597416
2022/07/26 16:40:00.000,n,12.36978,16.780948,5.264725,20.592966
2022/07/26 16:45:00.012,n,12.36978,18.020112,5.166657,20.593112
2022/07/26 16:50:00.003,n,12.36978,24.68494,5.054055,20.605308
2022/07/26 16:55:00.014,n,12.36978,24.486896,5.021103,20.631678
2022/07/26 17:00:00.000,n,12.36978,23.49413,5.099938,20.624936
2022/07/26 17:05:00.005,n,12.36978,19.00924,5.225243,20.626054
2022/07/26 17:10:00.006,n,12.517038,14.426292,5.324402,20.616508
2022/07/26 17:15:00.017,n,12.36978,23.01878,5.091126,20.634984
2022/07/26 17:20:00.003,n,12.517038,23.42723,5.049713,20.635236
2022/07/26 17:25:00.003,n,12.517038,20.72556,5.095185,20.6485
2022/07/26 17:30:00.008,n,12.517038,20.070468,5.174179,20.64354
2022/07/26 17:35:00.005,n,12.517038,24.452752,5.016854,20.638086
2022/07/26 17:40:00.007,n,12.517038,17.73888,5.122826,20.633488
2022/07/26 17:45:00.006,n,12.517038,24.211884,5.179917,20.632194
2022/07/26 17:50:00.002,n,12.36978,19.853748,5.181565,20.60884
2022/07/26 17:55:00.000,n,12.36978,22.461154,5.018921,20.619454
2022/07/26 18:00:00.015,n,12.517038,19.090602,5.155998,20.629056
2022/07/26 18:05:00.004,n,12.36978,19.567082,5.171631,20.622564
2022/07/26 18:10:00.000,n,12.36978,25.891316,5.187737,20.617776
2022/07/26 18:15:00.000,n,12.517038,16.957032,5.34285,20.624314
2022/07/26 18:20:00.004,n,12.36978,24.101016,5.059258,20.617144
2022/07/26 18:25:00.013,n,12.517038,18.097668,5.029114,20.628954
2022/07/26 18:30:00.000,n,12.36978,18.375142,5.41626,20.620834
2022/07/26 18:35:00.017,n,12.36978,16.84261,5.12468,20.621232
2022/07/26 18:40:00.004,n,12.517038,24.484798,5.007912,20.62463
2022/07/26 18:45:00.013,n,12.517038,21.422246,5.080796,20.627734
2022/07/26 18:50:00.005,n,12.36978,22.749344,5.159401,20.621988
2022/07/26 18:55:00.003,n,12.36978,24.544254,5.100975,20.619552
2022/07/26 19:00:00.000,n,12.36978,21.392758,5.180229,20.616372
2022/07/26 19:05:00.000,n,12.36978,20.110054,5.111397,20.61934
2022/07/26 19:10:00.005,n,12.36978,18.144832,5.14518,20.607928
2022/07/26 19:15:00.005,n,12.36978,27.079074,4.927918,20.599028
2022/07/26 19:20:00.018,n,12.36978,24.735402,5.038689,20.59156
2022/07/26 19:25:00.003,n,12.36978,21.52695,5.189507,20.580874
2022/07/26 19:30:00.013,n,12.36978,17.578946,5.09478,20.570648
2022/07/26 19:35:00.012,n,12.36978,10.923428,5.093224,20.566284
2022/07/26 19:40:00.000,n,12.36978,24.4202,5.148377,20.55637
2022/07/26 19:45:00.012,n,12.36978,20.896348,5.090882,20.554942
2022/07/26 19:50:00.000,n,12.36978,23.73832,5.149613,20.567402
2022/07/26 19:55:00.006,n,12.36978,20.132732,5.044892,20.56031
2022/07/26 20:00:00.000,n,12.36978,20.004696,5.129875,20.543498
2022/07/26 20:05:00.013,n,12.36978,18.734012,5.028969,20.54282
2022/07/26 20:10:00.010,n,12.36978,19.468418,5.136765,20.530156
2022/07/26 20:15:00.015,n,12.36978,16.533028,5.124008,20.537106
2022/07/26 20:20:00.003,n,12.36978,25.253364,4.966774,20.531162
2022/07/26 20:25:00.001,n,12.36978,23.127274,5.046486,20.54536
2022/07/26 20:30:00.003,n,12.36978,16.330086,5.187401,20.525776
2022/07/26 20:35:00.000,n,12.36978,22.93097,5.000801,20.52335
2022/07/26 20:40:00.013,n,12.36978,21.780568,4.960556,20.523956
2022/07/26 20:45:00.000,n,12.22252,21.23146,5.163094,20.498738
2022/07/26 20:50:00.002,n,12.36978,19.795876,5.083969,20.513112
2022/07/26 20:55:00.000,n,12.36978,21.042084,5.052628,20.509614
2022/07/26 21:00:00.009,n,12.36978,22.229286,5.086609,20.515252
2022/07/26 21:05:00.010,n,12.36978,21.219806,5.174988,20.506964
2022/07/26 21:10:00.005,n,12.36978,24.520404,5.005013,20.504866
2022/07/26 21:15:00.012,n,12.22252,22.39508,5.045525,20.486722
2022/07/26 21:20:00.000,n,12.36978,23.016712,5.138855,20.53449
2022/07/26 21:25:00.004,n,12.36978,21.675938,5.176644,20.517066
2022/07/26 21:30:00.000,n,12.36978,22.879658,5.057442,20.513394
2022/07/26 21:35:00.005,n,12.22252,23.225602,5.032334,20.506912
2022/07/26 21:40:00.010,n,12.36978,22.200832,5.145706,20.5056
2022/07/26 21:45:00.019,n,12.36978,19.966392,4.94883,20.505684
2022/07/26 21:50:00.002,n,12.22252,14.34697,5.14917,20.508752
2022/07/26 21:55:00.000,n,12.22252,12.98821,5.225479,20.497926
2022/07/26 22:00:00.000,n,12.36978,18.604354,5.125229,20.520352
2022/07/26 22:05:00.001,n,12.22252,18.102916,5.071183,20.499602
2022/07/26 22:10:00.001,n,12.36978,24.036126,4.96888,20.535346
2022/07/26 22:15:00.006,n,12.36978,23.266182,4.907753,20.532496
2022/07/26 22:20:00.013,n,12.22252,21.919284,5.110138,20.517604
2022/07/26 22:25:00.000,n,12.22252,22.496192,5.231873,20.528216
2022/07/26 22:30:00.014,n,12.22252,23.032136,5.200234,20.520066
2022/07/26 22:35:00.003,n,12.36978,18.434406,5.19471,20.517962
2022/07/26 22:40:00.000,n,12.36978,17.032998,5.300537,20.506566
2022/07/26 22:45:00.001,n,12.22252,21.029586,5.240402,20.501408
2022/07/26 22:50:00.000,n,12.22252,16.42453,5.284424,20.507984
2022/07/26 22:55:00.005,n,12.36978,14.281484,5.281586,20.50756
2022/07/26 23:00:00.000,n,12.22252,15.469228,5.352265,20.492682
2022/07/26 23:05:00.012,n,12.22252,17.85128,5.193718,20.486236
2022/07/26 23:10:00.000,n,12.22252,19.464604,5.268952,20.475742
2022/07/26 23:15:00.009,n,12.22252,23.784976,5.179795,20.480266
2022/07/26 23:20:00.007,n,12.22252,19.45882,5.350273,20.458566
2022/07/26 23:25:00.000,n,12.22252,22.194602,5.38179,20.448276
2022/07/26 23:30:00.004,n,12.22252,18.602626,5.393364,20.456808
2022/07/26 23:35:00.001,n,12.22252,17.924594,5.419647,20.447124
2022/07/26 23:40:00.005,n,12.22252,24.478206,5.213364,20.447736
2022/07/26 23:45:00.008,n,12.36978,20.06702,5.26841,20.465106
2022/07/26 23:50:00.004,n,12.22252,18.752354,5.321961,20.43928
2022/07/26 23:55:00.002,n,12.36978,22.077968,5.325928,20.437974
2022/07/27 00:00:00.010,n,12.36978,20.959588,5.337563,20.436352
2022/07/27 00:05:00.003,n,12.22252,21.690266,5.394364,20.42022
2022/07/27 00:10:00.000,n,12.22252,18.4711,5.365334,20.401758
2022/07/27 00:15:00.003,n,12.22252,21.744118,5.325142,20.407732
2022/07/27 00:20:00.005,n,12.22252,20.867684,5.308487,20.436378
2022/07/27 00:25:00.011,n,12.22252,21.880466,5.299294,20.425132
2022/07/27 00:30:00.000,n,12.22252,24.671752,5.325562,20.42055
2022/07/27 00:35:00.002,n,12.22252,25.500896,5.236046,20.420254
2022/07/27 00:40:00.003,n,12.22252,21.28629,5.318413,20.431722
2022/07/27 00:45:00.005,n,12.36978,23.214508,5.317887,20.42193
2022/07/27 00:50:00.002,n,12.22252,21.68626,5.280136,20.42423
2022/07/27 00:55:00.000,n,12.22252,21.79501,5.345413,20.439424
2022/07/27 01:00:00.006,n,12.22252,21.882172,5.280854,20.428798
2022/07/27 01:05:00.000,n,12.36978,20.98592,5.248505,20.434284
2022/07/27 01:10:00.011,n,12.22252,23.699776,5.277382,20.436312
2022/07/27 01:15:00.000,n,12.22252,23.828698,5.308472,20.417876
2022/07/27 01:20:00.005,n,12.22252,19.041778,5.297997,20.41655
2022/07/27 01:25:00.005,n,12.36978,22.845928,5.357666,20.407738
2022/07/27 01:30:00.005,n,12.22252,20.953408,5.323723,20.401696
2022/07/27 01:35:00.007,n,12.22252,22.81073,5.273094,20.390752
2022/07/27 01:40:00.004,n,12.22252,18.663056,5.323494,20.393226
2022/07/27 01:45:00.007,n,12.22252,21.878154,5.295098,20.386888
2022/07/27 01:50:00.002,n,12.22252,20.243596,5.220185,20.380066
2022/07/27 01:55:00.016,n,12.22252,23.660972,5.294609,20.393178
2022/07/27 02:00:00.001,n,12.22252,21.25232,5.300347,20.377978
2022/07/27 02:05:00.012,n,12.22252,20.841358,5.270745,20.381044
2022/07/27 02:10:00.010,n,12.22252,23.299606,5.295502,20.390316
2022/07/27 02:15:00.014,n,12.22252,24.194118,5.29055,20.394132
2022/07/27 02:20:00.006,n,12.22252,21.647068,5.285874,20.368602
2022/07/27 02:25:00.005,n,12.22252,22.959294,5.27697,20.372396
2022/07/27 02:30:00.010,n,12.22252,20.727916,5.276322,20.376718
2022/07/27 02:35:00.000,n,12.22252,22.76434,5.269142,20.365024
2022/07/27 02:40:00.015,n,12.22252,24.179974,5.264084,20.349882
2022/07/27 02:45:00.000,n,12.22252,22.379852,5.258408,20.34444
2022/07/27 02:50:00.012,n,12.22252,20.612778,5.255951,20.355654
2022/07/27 02:55:00.007,n,12.22252,23.114284,5.315987,20.35264
2022/07/27 03:00:00.008,n,12.22252,23.180248,5.252526,20.34999
2022/07/27 03:05:00.000,n,12.22252,22.381504,5.259171,20.34386
2022/07/27 03:10:00.005,n,12.22252,21.722298,5.248009,20.338322
2022/07/27 03:15:00.010,n,12.22252,23.144622,5.258759,20.318356
2022/07/27 03:20:00.007,n,12.22252,21.266544,5.259323,20.318418
2022/07/27 03:25:00.005,n,12.36978,23.931228,5.249031,20.321332
2022/07/27 03:30:00.007,n,12.22252,23.100888,5.25309,20.31395
2022/07/27 03:35:00.017,n,12.22252,21.064586,5.24395,20.311746
2022/07/27 03:40:00.000,n,12.22252,22.220418,5.243263,20.291344
2022/07/27 03:45:00.011,n,12.22252,23.31334,5.23526,20.343098
2022/07/27 03:50:00.012,n,12.22252,25.95853,5.109741,20.30415
2022/07/27 03:55:00.000,n,12.22252,23.700184,5.223778,20.305774
2022/07/27 04:00:00.010,n,12.22252,24.235154,5.204438,20.304904
2022/07/27 04:05:00.006,n,12.22252,23.476468,5.226532,20.30634
2022/07/27 04:10:00.006,n,12.22252,24.192382,5.213295,20.287068
2022/07/27 04:15:00.000,n,12.22252,23.247284,5.259827,20.277726
2022/07/27 04:20:00.008,n,12.22252,24.027806,5.188019,20.266888
2022/07/27 04:25:00.000,n,12.22252,23.637382,5.168694,20.273898
2022/07/27 04:30:00.014,n,12.22252,22.299972,5.17363,20.260134
2022/07/27 04:35:00.005,n,12.22252,21.53841,5.219483,20.302474
2022/07/27 04:40:00.000,n,12.22252,18.31002,5.199539,20.281116
2022/07/27 04:45:00.000,n,12.22252,18.527356,5.224633,20.277854
2022/07/27 04:50:00.007,n,12.22252,21.825492,5.223519,20.262232
2022/07/27 04:55:00.004,n,12.22252,17.962364,5.315903,20.242884
2022/07/27 05:00:00.001,n,12.22252,24.248588,5.164124,20.244284
2022/07/27 05:05:00.005,n,12.22252,21.739646,5.225647,20.253234
2022/07/27 05:10:00.002,n,12.22252,16.966176,5.278542,20.243714
2022/07/27 05:15:00.018,n,12.22252,17.728912,5.286995,20.23313
2022/07/27 05:20:00.001,n,12.22252,23.23301,5.22863,20.227164
2022/07/27 05:25:00.003,n,12.22252,23.835178,5.168206,20.228882
2022/07/27 05:30:00.010,n,12.22252,17.95869,5.299256,20.208442
2022/07/27 05:35:00.000,n,12.22252,18.011868,5.262352,20.189744
2022/07/27 05:40:00.010,n,12.22252,21.772252,5.147599,20.19158
2022/07/27 05:45:00.001,n,12.22252,22.257026,5.200012,20.217046
2022/07/27 05:50:00.003,n,12.22252,21.621518,5.221787,20.205144
2022/07/27 05:55:00.005,n,12.22252,20.811318,5.265053,20.207634
2022/07/27 06:00:00.005,n,12.22252,20.50605,5.219956,20.197478
2022/07/27 06:05:00.007,n,12.22252,24.11877,5.103531,20.196678
2022/07/27 06:10:00.000,n,12.22252,17.930522,5.403206,20.196622
2022/07/27 06:15:00.006,n,12.22252,26.785542,5.007279,20.176008
2022/07/27 06:20:00.000,n,12.22252,20.865834,5.212479,20.184502
2022/07/27 06:25:00.005,n,12.22252,20.40855,5.200821,20.174482
2022/07/27 06:30:00.005,n,12.22252,20.272774,5.223252,20.161856
2022/07/27 06:35:00.005,n,12.22252,22.627254,5.115647,20.13235
2022/07/27 06:40:00.000,n,12.22252,21.355038,5.155197,20.123656
2022/07/27 06:45:00.010,n,12.22252,18.562362,5.171173,20.105704
2022/07/27 06:50:00.011,n,12.22252,22.396126,5.160286,20.10459
2022/07/27 06:55:00.000,n,12.22252,21.721432,5.135826,20.101046
2022/07/27 07:00:00.012,n,12.22252,20.340764,5.138413,20.10239
2022/07/27 07:05:00.000,n,12.22252,21.386006,5.16771,20.076536
2022/07/27 07:10:00.003,n,12.22252,17.511876,5.181923,20.08718
2022/07/27 07:15:00.002,n,12.22252,18.525138,5.207085,20.07711
2022/07/27 07:20:00.013,n,12.07526,22.147476,5.085549,20.093558
2022/07/27 07:25:00.000,n,12.22252,14.67844,5.283295,20.109016
2022/07/27 07:30:00.014,n,12.22252,17.460106,5.125763,20.109048
2022/07/27 07:35:00.001,n,12.22252,18.023174,5.093781,20.098708
2022/07/27 07:40:00.002,n,12.22252,18.533748,5.123261,20.099232
2022/07/27 07:45:00.000,n,12.22252,23.497986,5.038338,20.09452
2022/07/27 07:50:00.000,n,12.22252,20.512828,5.039139,20.078484
2022/07/27 07:55:00.013,n,12.22252,16.567582,5.032273,20.065486
2022/07/27 08:00:00.000,n,12.22252,23.85569,5.04628,20.06042
2022/07/27 08:05:00.016,n,12.22252,16.71191,5.078163,20.044156
2022/07/27 08:10:00.003,n,12.22252,15.77739,5.203263,20.02501
2022/07/27 08:15:00.007,n,12.22252,20.888572,5.084267,20.013576
2022/07/27 08:20:00.004,n,12.22252,17.317756,5.210259,20.012648
2022/07/27 08:25:00.000,n,12.22252,14.421418,5.059868,20.014186
2022/07/27 08:30:00.008,n,12.22252,18.563504,5.128823,20.001564
2022/07/27 08:35:00.000,n,12.22252,18.793132,5.132233,19.996144
2022/07/27 08:40:00.012,n,12.22252,19.444718,5.152512,19.990292
2022/07/27 08:45:00.006,n,12.22252,17.427646,5.169411,19.991378
2022/07/27 08:50:00.003,n,12.22252,21.707688,4.925408,19.985798
2022/07/27 08:55:00.002,n,12.22252,19.681632,4.905266,19.961252
2022/07/27 09:00:00.011,n,12.22252,13.92638,5.084702,19.96513
2022/07/27 09:05:00.009,n,12.22252,14.74498,5.058533,19.950558
2022/07/27 09:10:00.001,n,12.22252,14.22894,5.008995,19.937744
2022/07/27 09:15:00.005,n,12.22252,15.693368,5.078896,19.92897
2022/07/27 09:20:00.005,n,12.22252,18.865276,4.952187,19.915864
2022/07/27 09:25:00.005,n,12.22252,16.078976,5.102738,19.922474
2022/07/27 09:30:00.008,n,12.22252,16.445138,4.894783,19.909782
2022/07/27 09:35:00.002,n,12.22252,15.392368,4.961525,19.919032
2022/07/27 09:40:00.005,n,12.22252,16.394836,5.058403,19.925622
2022/07/27 09:45:00.017,n,12.22252,13.805256,5.069275,19.910946
2022/07/27 09:50:00.007,n,12.22252,12.952622,4.986214,19.922522
2022/07/27 09:55:00.001,n,12.22252,19.32819,4.91658,19.918212
2022/07/27 10:00:00.008,n,12.22252,20.03455,4.757195,19.924724
2022/07/27 10:05:00.000,n,12.22252,18.824082,4.898056,19.91859
2022/07/27 10:10:00.002,n,12.22252,19.04826,4.818062,19.911506
2022/07/27 10:15:00.000,n,12.22252,18.558274,4.905129,19.908134
2022/07/27 10:20:00.015,n,12.22252,21.677696,4.729637,19.891208
2022/07/27 10:25:00.010,n,12.22252,22.012966,4.801956,19.868742
2022/07/27 10:30:00.010,n,12.22252,13.378514,4.924164,19.833346
2022/07/27 10:35:00.000,n,12.22252,19.731072,4.741265,19.82385
2022/07/27 10:40:00.000,n,12.22252,17.783134,4.922089,19.74826
2022/07/27 10:45:00.009,n,12.22252,22.67638,4.740456,19.71478
2022/07/27 10:50:00.007,n,12.22252,16.041508,4.98497,19.741338
2022/07/27 10:55:00.005,n,12.22252,18.21423,4.897476,19.643738
2022/07/27 11:00:00.001,n,12.22252,23.76646,4.766426,19.655554
2022/07/27 11:05:00.004,n,12.22252,15.9572,4.94188,19.698744
2022/07/27 11:10:00.008,n,12.22252,19.605426,4.788773,19.625966
2022/07/27 11:15:00.008,n,12.22252,20.322788,4.764199,19.565318
2022/07/27 11:20:00.002,n,12.22252,12.528176,4.839806,19.549136
2022/07/27 11:25:00.000,n,12.22252,18.151794,4.813652,19.604362
2022/07/27 11:30:00.003,n,12.36978,18.724988,4.880684,19.63759
2022/07/27 11:35:00.000,n,12.22252,16.438244,4.814102,19.725258
2022/07/27 11:40:00.009,n,12.36978,20.193368,4.743958,19.66935
2022/07/27 11:45:00.000,n,12.22252,21.643856,4.803917,19.695742
2022/07/27 11:50:00.014,n,12.36978,15.83033,4.878433,19.712168
2022/07/27 11:55:00.001,n,12.36978,17.853726,4.869499,19.735018
2022/07/27 12:00:00.011,n,12.517038,13.098358,4.90017,19.729586
2022/07/27 12:05:00.010,n,12.36978,16.521684,4.935715,19.746078
2022/07/27 12:10:00.000,n,12.36978,21.000282,4.843994,19.842174
2022/07/27 12:15:00.007,n,12.517038,19.088478,4.91124,19.836808
2022/07/27 12:20:00.000,n,12.22252,19.518192,4.982407,19.832836