"09.10.2022";"Emden";"NORDSEE";"LANGEOOG";"9390010";"W_O";"cm";"XXX,XXX";"XX.XX.XXXX";"XX:XX";"PNP";"-5,04"
"00:01";"612"
"00:02";"611"
"00:03";"610"
"00:04";"609"
"00:05";"608"
"00:06";"608"
"00:07";"607"
"00:08";"606"
"00:09";"605"
"00:10";"604"
"00:11";"603"
"00:12";"601"
"00:13";"601"
"00:14";"600"
"00:15";"599"
"00:16";"598"
"00:17";"596"
"00:18";"596"
"00:19";"594"
"00:20";"593"
"00:21";"592"
"00:22";"591"
"00:23";"590"
"00:24";"588"
"00:25";"588"
"00:26";"586"
"00:27";"586"
"00:28";"584"
"00:29";"583"
"00:30";"582"
"00:31";"581"
"00:32";"579"
"00:33";"578"
"00:34";"578"
"00:35";"576"
"00:36";"575"
"00:37";"574"
"00:38";"573"
"00:39";"572"
"00:40";"571"
"00:41";"570"
"00:42";"569"
"00:43";"568"
"00:44";"567"
"00:45";"566"
"00:46";"565"
"00:47";"564"
"00:48";"563"
"00:49";"562"
"00:50";"561"
"00:51";"559"
"00:52";"559"
"00:53";"557"
"00:54";"556"
"00:55";"555"
"00:56";"554"
"00:57";"553"
"00:58";"552"
"00:59";"551"
"01:00";"550"
"01:01";"550"
"01:02";"547"
"01:03";"547"
"01:04";"546"
"01:05";"545"
"01:06";"543"
"01:07";"542"
"01:08";"541"
"01:09";"539"
"01:10";"539"
"01:11";"538"
"01:12";"537"
"01:13";"535"
"01:14";"534"
"01:15";"534"
"01:16";"532"
"01:17";"531"
"01:18";"530"
"01:19";"530"
"01:20";"529"
"01:21";"528"
"01:22";"527"
"01:23";"525"
"01:24";"525"
"01:25";"523"
"01:26";"522"
"01:27";"521"
"01:28";"520"
"01:29";"520"
"01:30";"518"
"01:31";"517"
"01:32";"516"
"01:33";"515"
"01:34";"514"
"01:35";"513"
"01:36";"512"
"01:37";"511"
"01:38";"510"
"01:39";"510"
"01:40";"509"
"01:41";"508"
"01:42";"506"
"01:43";"506"
"01:44";"505"
"01:45";"504"
"01:46";"502"
"01:47";"502"
"01:48";"501"
"01:49";"500"
"01:50";"499"
"01:51";"498"
"01:52";"497"
"01:53";"497"
"01:54";"495"
"01:55";"494"
"01:56";"493"
"01:57";"492"
"01:58";"491"
"01:59";"490"
"02:00";"490"
"02:01";"489"
"02:02";"488"
"02:03";"487"
"02:04";"486"
"02:05";"485"
"02:06";"484"
"02:07";"483"
"02:08";"483"
"02:09";"481"
"02:10";"480"
"02:11";"480"
"02:12";"479"
"02:13";"478"
"02:14";"477"
"02:15";"476"
"02:16";"475"
"02:17";"474"
"02:18";"473"
"02:19";"472"
"02:20";"471"
"02:21";"471"
"02:22";"470"
"02:23";"469"
"02:24";"468"
"02:25";"468"
"02:26";"467"
"02:27";"466"
"02:28";"465"
"02:29";"464"
"02:30";"463"
"02:31";"462"
"02:32";"461"
"02:33";"460"
"02:34";"459"
"02:35";"458"
"02:36";"458"
"02:37";"457"
"02:38";"456"
"02:39";"455"
"02:40";"455"
"02:41";"453"
"02:42";"453"
"02:43";"453"
"02:44";"452"
"02:45";"451"
"02:46";"449"
"02:47";"448"
"02:48";"448"
"02:49";"447"
"02:50";"446"
"02:51";"445"
"02:52";"444"
"02:53";"444"
"02:54";"443"
"02:55";"442"
"02:56";"441"
"02:57";"441"
"02:58";"440"
"02:59";"440"
"03:00";"439"
"03:01";"439"
"03:02";"438"
"03:03";"437"
"03:04";"436"
"03:05";"436"
"03:06";"435"
"03:07";"434"
"03:08";"433"
"03:09";"432"
"03:10";"432"
"03:11";"432"
"03:12";"431"
"03:13";"430"
"03:14";"429"
"03:15";"429"
"03:16";"428"
"03:17";"428"
"03:18";"427"
"03:19";"427"
"03:20";"426"
"03:21";"425"
"03:22";"424"
"03:23";"424"
"03:24";"423"
"03:25";"423"
"03:26";"422"
"03:27";"421"
"03:28";"421"
"03:29";"420"
"03:30";"420"
"03:31";"420"
"03:32";"419"
"03:33";"417"
"03:34";"417"
"03:35";"416"
"03:36";"416"
"03:37";"415"
"03:38";"414"
"03:39";"413"
"03:40";"413"
"03:41";"413"
"03:42";"412"
"03:43";"412"
"03:44";"412"
"03:45";"411"
"03:46";"411"
"03:47";"411"
"03:48";"410"
"03:49";"410"
"03:50";"409"
"03:51";"408"
"03:52";"408"
"03:53";"408"
"03:54";"407"
"03:55";"406"
"03:56";"406"
"03:57";"404"
"03:58";"404"
"03:59";"404"
"04:00";"404"
"04:01";"403"
"04:02";"402"
"04:03";"402"
"04:04";"401"
"04:05";"400"
"04:06";"400"
"04:07";"400"
"04:08";"399"
"04:09";"398"
"04:10";"397"
"04:11";"397"
"04:12";"396"
"04:13";"396"
"04:14";"395"
"04:15";"395"
"04:16";"395"
"04:17";"394"
"04:18";"394"
"04:19";"393"
"04:20";"393"
"04:21";"393"
"04:22";"393"
"04:23";"391"
"04:24";"392"
"04:25";"391"
"04:26";"391"
"04:27";"390"
"04:28";"390"
"04:29";"389"
"04:30";"388"
"04:31";"387"
"04:32";"387"
"04:33";"387"
"04:34";"386"
"04:35";"385"
"04:36";"385"
"04:37";"384"
"04:38";"383"
"04:39";"383"
"04:40";"383"
"04:41";"382"
"04:42";"382"
"04:43";"382"
"04:44";"382"
"04:45";"381"
"04:46";"381"
"04:47";"380"
"04:48";"380"
"04:49";"380"
"04:50";"379"
"04:51";"379"
"04:52";"378"
"04:53";"378"
"04:54";"378"
"04:55";"378"
"04:56";"377"
"04:57";"377"
"04:58";"376"
"04:59";"376"
"05:00";"376"
"05:01";"376"
"05:02";"375"
"05:03";"375"
"05:04";"374"
"05:05";"374"
"05:06";"373"
"05:07";"373"
"05:08";"373"
"05:09";"373"
"05:10";"373"
"05:11";"373"
"05:12";"373"
"05:13";"373"
"05:14";"373"
"05:15";"373"
"05:16";"372"
"05:17";"372"
"05:18";"372"
"05:19";"372"
"05:20";"372"
"05:21";"372"
"05:22";"372"
"05:23";"372"
"05:24";"373"
"05:25";"373"
"05:26";"372"
"05:27";"373"
"05:28";"373"
"05:29";"373"
"05:30";"373"
"05:31";"372"
"05:32";"373"
"05:33";"373"
"05:34";"373"
"05:35";"373"
"05:36";"373"
"05:37";"374"
"05:38";"374"
"05:39";"374"
"05:40";"374"
"05:41";"374"
"05:42";"374"
"05:43";"375"
"05:44";"376"
"05:45";"376"
"05:46";"376"
"05:47";"377"
"05:48";"377"
"05:49";"377"
"05:50";"378"
"05:51";"378"
"05:52";"378"
"05:53";"378"
"05:54";"378"
"05:55";"378"
"05:56";"379"
"05:57";"379"
"05:58";"380"
"05:59";"381"
"06:00";"381"
"06:01";"382"
"06:02";"382"
"06:03";"382"
"06:04";"382"
"06:05";"383"
"06:06";"384"
"06:07";"384"
"06:08";"385"
"06:09";"385"
"06:10";"386"
"06:11";"387"
"06:12";"388"
"06:13";"389"
"06:14";"389"
"06:15";"390"
"06:16";"390"
"06:17";"392"
"06:18";"392"
"06:19";"393"
"06:20";"394"
"06:21";"395"
"06:22";"396"
"06:23";"396"
"06:24";"398"
"06:25";"400"
"06:26";"401"
"06:27";"402"
"06:28";"403"
"06:29";"404"
"06:30";"405"
"06:31";"407"
"06:32";"408"
"06:33";"410"
"06:34";"411"
"06:35";"412"
"06:36";"414"
"06:37";"416"
"06:38";"417"
"06:39";"418"
"06:40";"420"
"06:41";"421"
"06:42";"422"
"06:43";"424"
"06:44";"426"
"06:45";"427"
"06:46";"429"
"06:47";"431"
"06:48";"433"
"06:49";"435"
"06:50";"436"
"06:51";"438"
"06:52";"440"
"06:53";"442"
"06:54";"443"
"06:55";"445"
"06:56";"447"
"06:57";"449"
"06:58";"452"
"06:59";"453"
"07:00";"455"
"07:01";"457"
"07:02";"458"
"07:03";"460"
"07:04";"462"
"07:05";"464"
"07:06";"466"
"07:07";"468"
"07:08";"470"
"07:09";"471"
"07:10";"473"
"07:11";"475"
"07:12";"476"
"07:13";"479"
"07:14";"480"
"07:15";"482"
"07:16";"484"
"07:17";"485"
"07:18";"487"
"07:19";"488"
"07:20";"490"
"07:21";"492"
"07:22";"493"
"07:23";"494"
"07:24";"495"
"07:25";"497"
"07:26";"498"
"07:27";"499"
"07:28";"500"
"07:29";"502"
"07:30";"503"
"07:31";"504"
"07:32";"505"
"07:33";"506"
"07:34";"507"
"07:35";"509"
"07:36";"510"
"07:37";"510"
"07:38";"511"
"07:39";"512"
"07:40";"514"
"07:41";"512"
"07:42";"516"
"07:43";"516"
"07:44";"518"
"07:45";"519"
"07:46";"519"
"07:47";"520"
"07:48";"521"
"07:49";"522"
"07:50";"523"
"07:51";"524"
"07:52";"524"
"07:53";"526"
"07:54";"527"
"07:55";"528"
"07:56";"528"
"07:57";"530"
"07:58";"530"
"07:59";"531"
"08:00";"532"
"08:01";"533"
"08:02";"534"
"08:03";"535"
"08:04";"536"
"08:05";"537"
"08:06";"537"
"08:07";"538"
"08:08";"539"
"08:09";"540"
"08:10";"542"
"08:11";"542"
"08:12";"542"
"08:13";"543"
"08:14";"544"
"08:15";"546"
"08:16";"546"
"08:17";"547"
"08:18";"548"
"08:19";"548"
"08:20";"549"
"08:21";"550"
"08:22";"550"
"08:23";"551"
"08:24";"552"
"08:25";"553"
"08:26";"553"
"08:27";"554"
"08:28";"555"
"08:29";"556"
"08:30";"557"
"08:31";"557"
"08:32";"558"
"08:33";"559"
"08:34";"560"
"08:35";"561"
"08:36";"562"
"08:37";"563"
"08:38";"563"
"08:39";"564"
"08:40";"565"
"08:41";"566"
"08:42";"566"
"08:43";"567"
"08:44";"569"
"08:45";"569"
"08:46";"570"
"08:47";"570"
"08:48";"572"
"08:49";"573"
"08:50";"573"
"08:51";"574"
"08:52";"574"
"08:53";"575"
"08:54";"576"
"08:55";"577"
"08:56";"578"
"08:57";"578"
"08:58";"579"
"08:59";"580"
"09:00";"581"
"09:01";"581"
"09:02";"582"
"09:03";"583"
"09:04";"584"
"09:05";"585"
"09:06";"586"
"09:07";"586"
"09:08";"586"
"09:09";"587"
"09:10";"588"
"09:11";"589"
"09:12";"590"
"09:13";"591"
"09:14";"592"
"09:15";"592"
"09:16";"593"
"09:17";"594"
"09:18";"593"
"09:19";"594"
"09:20";"595"
"09:21";"596"
"09:22";"597"
"09:23";"599"
"09:24";"599"
"09:25";"600"
"09:26";"601"
"09:27";"601"
"09:28";"602"
"09:29";"603"
"09:30";"604"
"09:31";"604"
"09:32";"605"
"09:33";"606"
"09:34";"607"
"09:35";"608"
"09:36";"609"
"09:37";"610"
"09:38";"611"
"09:39";"611"
"09:40";"613"
"09:41";"613"
"09:42";"614"
"09:43";"615"
"09:44";"616"
"09:45";"616"
"09:46";"616"
"09:47";"617"
"09:48";"618"
"09:49";"619"
"09:50";"620"
"09:51";"620"
"09:52";"620"
"09:53";"622"
"09:54";"622"
"09:55";"624"
"09:56";"624"
"09:57";"625"
"09:58";"626"
"09:59";"626"
"10:00";"628"
"10:01";"628"
"10:02";"628"
"10:03";"629"
"10:04";"630"
"10:05";"630"
"10:06";"631"
"10:07";"632"
"10:08";"632"
"10:09";"633"
"10:10";"633"
"10:11";"635"
"10:12";"635"
"10:13";"636"
"10:14";"637"
"10:15";"638"
"10:16";"639"
"10:17";"640"
"10:18";"640"
"10:19";"640"
"10:20";"640"
"10:21";"642"
"10:22";"642"
"10:23";"644"
"10:24";"644"
"10:25";"644"
"10:26";"645"
"10:27";"645"
"10:28";"645"
"10:29";"646"
"10:30";"647"
"10:31";"647"
"10:32";"648"
"10:33";"649"
"10:34";"649"
"10:35";"649"
"10:36";"650"
"10:37";"650"
"10:38";"651"
"10:39";"651"
"10:40";"651"
"10:41";"652"
"10:42";"652"
"10:43";"652"
"10:44";"653"
"10:45";"654"
"10:46";"654"
"10:47";"654"
"10:48";"655"
"10:49";"655"
"10:50";"655"
"10:51";"656"
"10:52";"656"
"10:53";"657"
"10:54";"657"
"10:55";"658"
"10:56";"658"
"10:57";"659"
"10:58";"659"
"10:59";"659"
"11:00";"659"
"11:01";"659"
"11:02";"660"
"11:03";"660"
"11:04";"660"
"11:05";"661"
"11:06";"661"
"11:07";"662"
"11:08";"662"
"11:09";"662"
"11:10";"662"
"11:11";"662"
"11:12";"662"
"11:13";"662"
"11:14";"662"
"11:15";"662"
"11:16";"661"
"11:17";"661"
"11:18";"660"
"11:19";"660"
"11:20";"660"
"11:21";"660"
"11:22";"660"
"11:23";"660"
"11:24";"660"
"11:25";"659"
"11:26";"659"
"11:27";"659"
"11:28";"659"
"11:29";"658"
"11:30";"658"
"11:31";"657"
"11:32";"657"
"11:33";"657"
"11:34";"656"
"11:35";"656"
"11:36";"655"
"11:37";"655"
"11:38";"655"
"11:39";"654"
"11:40";"654"
"11:41";"654"
"11:42";"653"
"11:43";"653"
"11:44";"652"
"11:45";"651"
"11:46";"651"
"11:47";"650"
"11:48";"650"
"11:49";"649"
"11:50";"648"
"11:51";"647"
"11:52";"646"
"11:53";"646"
"11:54";"645"
"11:55";"644"
"11:56";"644"
"11:57";"643"
"11:58";"643"
"11:59";"641"
"12:00";"640"
"12:01";"640"
"12:02";"638"
"12:03";"637"
"12:04";"637"
"12:05";"636"
"12:06";"635"
"12:07";"634"
"12:08";"633"
"12:09";"632"
"12:10";"631"
"12:11";"631"
"12:12";"629"
"12:13";"628"
"12:14";"628"
"12:15";"626"
"12:16";"625"
"12:17";"624"
"12:18";"623"
"12:19";"622"
"12:20";"621"
"12:21";"620"
"12:22";"619"
"12:23";"618"
"12:24";"617"
"12:25";"616"
"12:26";"614"
"12:27";"613"
"12:28";"612"
"12:29";"611"
"12:30";"610"
"12:31";"609"
"12:32";"608"
"12:33";"607"
"12:34";"606"
"12:35";"605"
"12:36";"604"
"12:37";"602"
"12:38";"601"
"12:39";"600"
"12:40";"599"
"12:41";"598"
"12:42";"596"
"12:43";"595"
"12:44";"594"
"12:45";"593"
"12:46";"592"
"12:47";"591"
"12:48";"590"
"12:49";"589"
"12:50";"588"
"12:51";"587"
"12:52";"586"
"12:53";"585"
"12:54";"584"
"12:55";"582"
"12:56";"581"
"12:57";"581"
"12:58";"579"
"12:59";"577"
"13:00";"576"
"13:01";"574"
"13:02";"574"
"13:03";"573"
"13:04";"572"
"13:05";"570"
"13:06";"569"
"13:07";"569"
"13:08";"568"
"13:09";"567"
"13:10";"566"
"13:11";"565"
"13:12";"563"
"13:13";"562"
"13:14";"561"
"13:15";"560"
"13:16";"559"
"13:17";"557"
"13:18";"556"
"13:19";"554"
"13:20";"553"
"13:21";"553"
"13:22";"551"
"13:23";"550"
"13:24";"549"
"13:25";"548"
"13:26";"546"
"13:27";"546"
"13:28";"544"
"13:29";"543"
"13:30";"542"
"13:31";"541"
"13:32";"540"
"13:33";"539"
"13:34";"538"
"13:35";"537"
"13:36";"535"
"13:37";"535"
"13:38";"533"
"13:39";"532"
"13:40";"531"
"13:41";"529"
"13:42";"528"
"13:43";"528"
"13:44";"527"
"13:45";"526"
"13:46";"525"
"13:47";"524"
"13:48";"522"
"13:49";"522"
"13:50";"520"
"13:51";"519"
"13:52";"517"
"13:53";"516"
"13:54";"515"
"13:55";"514"
"13:56";"513"
"13:57";"513"
"13:58";"511"
"13:59";"510"
"14:00";"509"
"14:01";"508"
"14:02";"506"
"14:03";"506"
"14:04";"505"
"14:05";"503"
"14:06";"502"
"14:07";"502"
"14:08";"500"
"14:09";"499"
"14:10";"497"
"14:11";"497"
"14:12";"496"
"14:13";"494"
"14:14";"494"
"14:15";"493"
"14:16";"491"
"14:17";"490"
"14:18";"490"
"14:19";"488"
"14:20";"487"
"14:21";"486"
"14:22";"484"
"14:23";"483"
"14:24";"483"
"14:25";"482"
"14:26";"480"
"14:27";"479"
"14:28";"479"
"14:29";"478"
"14:30";"477"
"14:31";"476"
"14:32";"475"
"14:33";"473"
"14:34";"472"
"14:35";"472"
"14:36";"470"
"14:37";"469"
"14:38";"468"
"14:39";"467"
"14:40";"466"
"14:41";"465"
"14:42";"463"
"14:43";"463"
"14:44";"462"
"14:45";"461"
"14:46";"460"
"14:47";"459"
"14:48";"458"
"14:49";"457"
"14:50";"455"
"14:51";"454"
"14:52";"452"
"14:53";"452"
"14:54";"451"
"14:55";"450"
"14:56";"448"
"14:57";"448"
"14:58";"447"
"14:59";"446"
"15:00";"445"
"15:01";"444"
"15:02";"443"
"15:03";"443"
"15:04";"441"
"15:05";"440"
"15:06";"440"
"15:07";"438"
"15:08";"437"
"15:09";"436"
"15:10";"435"
"15:11";"434"
"15:12";"432"
"15:13";"432"
"15:14";"431"
"15:15";"431"
"15:16";"429"
"15:17";"429"
"15:18";"428"
"15:19";"428"
"15:20";"426"
"15:21";"426"
"15:22";"424"
"15:23";"420"
"15:24";"423"
"15:25";"424"
"15:26";"420"
"15:27";"420"
"15:28";"420"
"15:29";"419"
"15:30";"419"
"15:31";"417"
"15:32";"416"
"15:33";"416"
"15:34";"416"
"15:35";"414"
"15:36";"412"
"15:37";"413"
"15:38";"412"
"15:39";"408"
"15:40";"410"
"15:41";"409"
"15:42";"408"
"15:43";"408"
"15:44";"406"
"15:45";"404"
"15:46";"404"
"15:47";"404"
"15:48";"404"
"15:49";"402"
"15:50";"401"
"15:51";"400"
"15:52";"400"
"15:53";"400"
"15:54";"399"
"15:55";"398"
"15:56";"398"
"15:57";"397"
"15:58";"396"
"15:59";"396"
"16:00";"395"
"16:01";"394"
"16:02";"393"
"16:03";"392"
"16:04";"392"
"16:05";"391"
"16:06";"391"
"16:07";"390"
"16:08";"389"
"16:09";"389"
"16:10";"387"
"16:11";"387"
"16:12";"386"
"16:13";"386"
"16:14";"385"
"16:15";"384"
"16:16";"383"
"16:17";"382"
"16:18";"382"
"16:19";"381"
"16:20";"380"
"16:21";"380"
"16:22";"379"
"16:23";"378"
"16:24";"377"
"16:25";"376"
"16:26";"376"
"16:27";"374"
"16:28";"374"
"16:29";"374"
"16:30";"373"
"16:31";"372"
"16:32";"372"
"16:33";"371"
"16:34";"371"
"16:35";"370"
"16:36";"369"
"16:37";"369"
"16:38";"368"
"16:39";"367"
"16:40";"366"
"16:41";"365"
"16:42";"364"
"16:43";"364"
"16:44";"363"
"16:45";"363"
"16:46";"362"
"16:47";"361"
"16:48";"361"
"16:49";"360"
"16:50";"359"
"16:51";"358"
"16:52";"359"
"16:53";"355"
"16:54";"353"
"16:55";"358"
"16:56";"356"
"16:57";"355"
"16:58";"353"
"16:59";"355"
"17:00";"353"
"17:01";"354"
"17:02";"350"
"17:03";"352"
"17:04";"351"
"17:05";"351"
"17:06";"349"
"17:07";"349"
"17:08";"349"
"17:09";"348"
"17:10";"349"
"17:11";"346"
"17:12";"346"
"17:13";"345"
"17:14";"346"
"17:15";"345"
"17:16";"346"
"17:17";"345"
"17:18";"346"
"17:19";"344"
"17:20";"345"
"17:21";"342"
"17:22";"342"
"17:23";"343"
"17:24";"343"
"17:25";"342"
"17:26";"341"
"17:27";"342"
"17:28";"341"
"17:29";"342"
"17:30";"341"
"17:31";"341"
"17:32";"341"
"17:33";"342"
"17:34";"340"
"17:35";"340"
"17:36";"340"
"17:37";"340"
"17:38";"339"
"17:39";"339"
"17:40";"339"
"17:41";"338"
"17:42";"338"
"17:43";"338"
"17:44";"338"
"17:45";"338"
"17:46";"338"
"17:47";"338"
"17:48";"338"
"17:49";"338"
"17:50";"338"
"17:51";"338"
"17:52";"337"
"17:53";"337"
"17:54";"337"
"17:55";"338"
"17:56";"338"
"17:57";"337"
"17:58";"337"
"17:59";"337"
"18:00";"336"
"18:01";"337"
"18:02";"336"
"18:03";"336"
"18:04";"336"
"18:05";"337"
"18:06";"337"
"18:07";"338"
"18:08";"338"
"18:09";"338"
"18:10";"338"
"18:11";"338"
"18:12";"338"
"18:13";"338"
"18:14";"339"
"18:15";"339"
"18:16";"339"
"18:17";"340"
"18:18";"340"
"18:19";"341"
"18:20";"341"
"18:21";"342"
"18:22";"342"
"18:23";"342"
"18:24";"343"
"18:25";"343"
"18:26";"343"
"18:27";"344"
"18:28";"345"
"18:29";"346"
"18:30";"346"
"18:31";"346"
"18:32";"347"
"18:33";"347"
"18:34";"348"
"18:35";"349"
"18:36";"349"
"18:37";"350"
"18:38";"350"
"18:39";"351"
"18:40";"351"
"18:41";"352"
"18:42";"353"
"18:43";"354"
"18:44";"354"
"18:45";"355"
"18:46";"356"
"18:47";"356"
"18:48";"358"
"18:49";"359"
"18:50";"360"
"18:51";"360"
"18:52";"361"
"18:53";"363"
"18:54";"364"
"18:55";"365"
"18:56";"366"
"18:57";"368"
"18:58";"368"
"18:59";"370"
"19:00";"372"
"19:01";"373"
"19:02";"374"
"19:03";"376"
"19:04";"378"
"19:05";"378"
"19:06";"380"
"19:07";"382"
"19:08";"384"
"19:09";"385"
"19:10";"387"
"19:11";"389"
"19:12";"391"
"19:13";"393"
"19:14";"394"
"19:15";"396"
"19:16";"398"
"19:17";"400"
"19:18";"401"
"19:19";"404"
"19:20";"406"
"19:21";"408"
"19:22";"410"
"19:23";"412"
"19:24";"413"
"19:25";"415"
"19:26";"417"
"19:27";"419"
"19:28";"421"
"19:29";"422"
"19:30";"424"
"19:31";"426"
"19:32";"427"
"19:33";"429"
"19:34";"431"
"19:35";"432"
"19:36";"434"
"19:37";"435"
"19:38";"437"
"19:39";"439"
"19:40";"440"
"19:41";"441"
"19:42";"444"
"19:43";"445"
"19:44";"447"
"19:45";"448"
"19:46";"449"
"19:47";"451"
"19:48";"453"
"19:49";"454"
"19:50";"455"
"19:51";"456"
"19:52";"457"
"19:53";"459"
"19:54";"460"
"19:55";"461"
"19:56";"463"
"19:57";"463"
"19:58";"465"
"19:59";"466"
"20:00";"467"
"20:01";"468"
"20:02";"470"
"20:03";"471"
"20:04";"472"
"20:05";"472"
"20:06";"474"
"20:07";"475"
"20:08";"475"
"20:09";"476"
"20:10";"477"
"20:11";"478"
"20:12";"479"
"20:13";"480"
"20:14";"481"
"20:15";"481"
"20:16";"482"
"20:17";"483"
"20:18";"484"
"20:19";"484"
"20:20";"485"
"20:21";"485"
"20:22";"486"
"20:23";"488"
"20:24";"488"
"20:25";"489"
"20:26";"489"
"20:27";"490"
"20:28";"490"
"20:29";"491"
"20:30";"492"
"20:31";"493"
"20:32";"493"
"20:33";"494"
"20:34";"494"
"20:35";"494"
"20:36";"495"
"20:37";"496"
"20:38";"497"
"20:39";"498"
"20:40";"498"
"20:41";"499"
"20:42";"500"
"20:43";"501"
"20:44";"502"
"20:45";"502"
"20:46";"503"
"20:47";"504"
"20:48";"505"
"20:49";"506"
"20:50";"506"
"20:51";"506"
"20:52";"507"
"20:53";"507"
"20:54";"508"
"20:55";"508"
"20:56";"509"
"20:57";"510"
"20:58";"510"
"20:59";"510"
"21:00";"510"
"21:01";"512"
"21:02";"512"
"21:03";"513"
"21:04";"514"
"21:05";"514"
"21:06";"514"
"21:07";"515"
"21:08";"516"
"21:09";"516"
"21:10";"517"
"21:11";"517"
"21:12";"518"
"21:13";"519"
"21:14";"519"
"21:15";"520"
"21:16";"520"
"21:17";"521"
"21:18";"522"
"21:19";"521"
"21:20";"523"
"21:21";"524"
"21:22";"525"
"21:23";"526"
"21:24";"526"
"21:25";"526"
"21:26";"527"
"21:27";"528"
"21:28";"528"
"21:29";"529"
"21:30";"529"
"21:31";"530"
"21:32";"530"
"21:33";"531"
"21:34";"531"
"21:35";"531"
"21:36";"532"
"21:37";"534"
"21:38";"534"
"21:39";"535"
"21:40";"536"
"21:41";"536"
"21:42";"537"
"21:43";"538"
"21:44";"538"
"21:45";"538"
"21:46";"539"
"21:47";"539"
"21:48";"540"
"21:49";"541"
"21:50";"542"
"21:51";"542"
"21:52";"542"
"21:53";"543"
"21:54";"544"
"21:55";"544"
"21:56";"544"
"21:57";"546"
"21:58";"546"
"21:59";"547"
"22:00";"548"
"22:01";"549"
"22:02";"549"
"22:03";"550"
"22:04";"550"
"22:05";"551"
"22:06";"552"
"22:07";"553"
"22:08";"553"
"22:09";"552"
"22:10";"554"
"22:11";"554"
"22:12";"555"
"22:13";"555"
"22:14";"556"
"22:15";"556"
"22:16";"557"
"22:17";"557"
"22:18";"558"
"22:19";"559"
"22:20";"560"
"22:21";"560"
"22:22";"561"
"22:23";"561"
"22:24";"562"
"22:25";"562"
"22:26";"563"
"22:27";"563"
"22:28";"564"
"22:29";"565"
"22:30";"565"
"22:31";"566"
"22:32";"567"
"22:33";"567"
"22:34";"568"
"22:35";"569"
"22:36";"569"
"22:37";"570"
"22:38";"570"
"22:39";"571"
"22:40";"573"
"22:41";"573"
"22:42";"573"
"22:43";"574"
"22:44";"574"
"22:45";"574"
"22:46";"576"
"22:47";"576"
"22:48";"577"
"22:49";"577"
"22:50";"577"
"22:51";"578"
"22:52";"578"
"22:53";"579"
"22:54";"579"
"22:55";"579"
"22:56";"581"
"22:57";"582"
"22:58";"582"
"22:59";"582"
"23:00";"583"
"23:01";"584"
"23:02";"585"
"23:03";"586"
"23:04";"585"
"23:05";"586"
"23:06";"587"
"23:07";"587"
"23:08";"588"
"23:09";"588"
"23:10";"589"
"23:11";"590"
"23:12";"590"
"23:13";"590"
"23:14";"591"
"23:15";"592"
"23:16";"592"
"23:17";"592"
"23:18";"593"
"23:19";"594"
"23:20";"594"
"23:21";"594"
"23:22";"594"
"23:23";"594"
"23:24";"595"
"23:25";"596"
"23:26";"596"
"23:27";"596"
"23:28";"596"
"23:29";"597"
"23:30";"597"
"23:31";"597"
"23:32";"598"
"23:33";"599"
"23:34";"599"
"23:35";"600"
"23:36";"600"
"23:37";"600"
"23:38";"600"
"23:39";"601"
"23:40";"601"
"23:41";"600"
"23:42";"601"
"23:43";"602"
"23:44";"602"
"23:45";"602"
"23:46";"602"
"23:47";"603"
"23:48";"603"
"23:49";"604"
"23:50";"604"
"23:51";"603"
"23:52";"604"
"23:53";"604"
"23:54";"604"
"23:55";"605"
"23:56";"604"
"23:57";"604"
"23:58";"604"
"23:59";"604"
"24:00";"604"
