module explore-BE

go 1.16

require (
	github.com/0xAX/notificator v0.0.0-20191016112426-3962a5ea8da1 // indirect
	github.com/appleboy/gin-jwt/v2 v2.6.4
	github.com/codegangsta/envy v0.0.0-20141216192214-4b78388c8ce4 // indirect
	github.com/codegangsta/gin v0.0.0-20171026143024-cafe2ce98974 // indirect
	github.com/gin-contrib/cors v1.3.1 // indirect
	github.com/gin-gonic/gin v1.7.1
	github.com/go-playground/validator/v10 v10.6.1 // indirect
	github.com/golang/protobuf v1.5.2 // indirect
	github.com/json-iterator/go v1.1.11 // indirect
	github.com/leodido/go-urn v1.2.1 // indirect
	github.com/mattn/go-shellwords v1.0.11 // indirect
	github.com/modern-go/concurrent v0.0.0-20180306012644-bacd9c7ef1dd // indirect
	github.com/modern-go/reflect2 v1.0.1 // indirect
	github.com/ugorji/go v1.2.6 // indirect
	golang.org/x/crypto v0.0.0-20210616213533-5ff15b29337e // indirect
	golang.org/x/text v0.3.6 // indirect
	gopkg.in/urfave/cli.v1 v1.20.0 // indirect
	gopkg.in/yaml.v2 v2.4.0 // indirect
	gorm.io/driver/mysql v1.1.0
	gorm.io/gorm v1.21.10
)
