{
  "iisSettings": {
    "windowsAuthentication": false,
    "anonymousAuthentication": true,
    "iisExpress": {
      "applicationUrl": "http://localhost:53096/",
      "sslPort": 0
    }
  },
  "profiles": {
    "IIS Express": {
      "commandName": "IISExpress",
      "launchBrowser": true,
      "launchUrl": "http://localhost:53096/",
      "environmentVariables": {
        "DATABASE_URL": "postgres://postgres:root@localhost:5432/icostarter",
        "AWS_SECRET_ACCESS_KEY": "W44Szdk68trNsApW3M8VJlM+8O5NSMWRx1GaU6jE",
        "AWS_ACCESS_KEY_ID": "AKIAJHOHPGNKD2MAAQOA",
        "ASPNETCORE_ENVIRONMENT": "Development"
      }
    },
    "IcoStarter": {
      "commandName": "Project",
      "launchBrowser": true,
      "environmentVariables": {
        "ASPNETCORE_ENVIRONMENT": "Development"
      },
      "applicationUrl": "http://localhost:53097/"
    }
  }
}