<?xml version="1.0" encoding="UTF-8" standalone="no"?>
<svg
   xmlns:dc="http://purl.org/dc/elements/1.1/"
   xmlns:cc="http://creativecommons.org/ns#"
   xmlns:rdf="http://www.w3.org/1999/02/22-rdf-syntax-ns#"
   xmlns:svg="http://www.w3.org/2000/svg"
   xmlns="http://www.w3.org/2000/svg"
   xmlns:sodipodi="http://sodipodi.sourceforge.net/DTD/sodipodi-0.dtd"
   xmlns:inkscape="http://www.inkscape.org/namespaces/inkscape"
   width="82.685"
   height="113.833"
   viewBox="0 0 82.685 113.833"
   version="1.1"
   id="svg16"
   sodipodi:docname="programes.svg"
   inkscape:version="0.92.4 (5da689c313, 2019-01-14)">
  <metadata
     id="metadata22">
    <rdf:RDF>
      <cc:Work
         rdf:about="">
        <dc:format>image/svg+xml</dc:format>
        <dc:type
           rdf:resource="http://purl.org/dc/dcmitype/StillImage" />
        <dc:title></dc:title>
      </cc:Work>
    </rdf:RDF>
  </metadata>
  <defs
     id="defs20">
    <style
       id="style884">.cls-1{fill:#404041;}</style>
  </defs>
  <sodipodi:namedview
     pagecolor="#ffffff"
     bordercolor="#666666"
     borderopacity="1"
     objecttolerance="10"
     gridtolerance="10"
     guidetolerance="10"
     inkscape:pageopacity="0"
     inkscape:pageshadow="2"
     inkscape:window-width="1920"
     inkscape:window-height="1025"
     id="namedview18"
     showgrid="false"
     inkscape:zoom="5.8639305"
     inkscape:cx="68.967701"
     inkscape:cy="49.735833"
     inkscape:window-x="0"
     inkscape:window-y="27"
     inkscape:window-maximized="1"
     inkscape:current-layer="svg16" />
  <g
     id="g841"
     transform="translate(-169.75545,-192.10529)">
    <circle
       id="circle839"
       r="7.3140001"
       cy="298.6127"
       cx="179.99017"
       style="fill:#64cc82" />
  </g>
  <g
     data-name="Layer 2"
     id="Layer_2"
     transform="matrix(2.6553322,0,0,2.6553322,0.71591612,0)"
     style="fill:#ffffff">
    <g
       data-name="Layer 1"
       id="Layer_1-2"
       style="fill:#ffffff">
      <path
         id="path890"
         d="M 11.35,0 H 2.16 A 2.16,2.16 0 0 0 0,2.16 v 9.19 a 2.17,2.17 0 0 0 2.16,2.17 h 9.19 a 2.17,2.17 0 0 0 2.17,-2.17 V 2.16 A 2.17,2.17 0 0 0 11.35,0 Z m 0.8,11.35 a 0.8,0.8 0 0 1 -0.8,0.8 H 2.16 A 0.79,0.79 0 0 1 1.37,11.35 V 2.16 A 0.79,0.79 0 0 1 2.16,1.37 h 9.19 a 0.79,0.79 0 0 1 0.8,0.79 z"
         class="cls-1"
         inkscape:connector-curvature="0"
         style="fill:#ffffff" />
      <path
         id="path892"
         d="M 11.35,16.93 H 2.16 A 2.17,2.17 0 0 0 0,19.1 v 9.19 a 2.16,2.16 0 0 0 2.16,2.16 h 9.19 a 2.17,2.17 0 0 0 2.17,-2.16 V 19.1 a 2.17,2.17 0 0 0 -2.17,-2.17 z m 0.8,11.36 a 0.79,0.79 0 0 1 -0.8,0.79 H 2.16 A 0.79,0.79 0 0 1 1.37,28.29 V 19.1 a 0.79,0.79 0 0 1 0.79,-0.8 h 9.19 a 0.8,0.8 0 0 1 0.8,0.8 z"
         class="cls-1"
         inkscape:connector-curvature="0"
         style="fill:#ffffff" />
      <path
         id="path894"
         d="m 28.43,0 h -9.19 a 2.16,2.16 0 0 0 -2.16,2.16 v 9.19 a 2.17,2.17 0 0 0 2.16,2.17 h 9.19 A 2.17,2.17 0 0 0 30.6,11.35 V 2.16 A 2.17,2.17 0 0 0 28.43,0 Z m 0.8,11.35 a 0.8,0.8 0 0 1 -0.8,0.8 h -9.19 a 0.8,0.8 0 0 1 -0.79,-0.8 V 2.16 a 0.79,0.79 0 0 1 0.79,-0.79 h 9.19 a 0.79,0.79 0 0 1 0.8,0.79 z"
         class="cls-1"
         inkscape:connector-curvature="0"
         style="fill:#ffffff" />
      <path
         id="path896"
         d="m 28.43,16.93 h -9.19 a 2.17,2.17 0 0 0 -2.16,2.17 v 9.19 a 2.16,2.16 0 0 0 2.16,2.16 h 9.19 A 2.17,2.17 0 0 0 30.6,28.29 V 19.1 a 2.17,2.17 0 0 0 -2.17,-2.17 z m 0.8,11.36 a 0.79,0.79 0 0 1 -0.8,0.79 H 19.24 A 0.79,0.79 0 0 1 18.45,28.29 V 19.1 a 0.8,0.8 0 0 1 0.79,-0.8 h 9.19 a 0.8,0.8 0 0 1 0.8,0.8 z"
         class="cls-1"
         inkscape:connector-curvature="0"
         style="fill:#ffffff" />
    </g>
  </g>
</svg>
