<?xml version="1.0" encoding="UTF-8" standalone="no"?>
<svg
   xmlns:dc="http://purl.org/dc/elements/1.1/"
   xmlns:cc="http://creativecommons.org/ns#"
   xmlns:rdf="http://www.w3.org/1999/02/22-rdf-syntax-ns#"
   xmlns:svg="http://www.w3.org/2000/svg"
   xmlns="http://www.w3.org/2000/svg"
   xmlns:sodipodi="http://sodipodi.sourceforge.net/DTD/sodipodi-0.dtd"
   xmlns:inkscape="http://www.inkscape.org/namespaces/inkscape"
   width="33.577"
   height="31.167"
   viewBox="0 0 33.577 31.167"
   version="1.1"
   id="svg6"
   sodipodi:docname="calendar.svg"
   inkscape:version="0.92.4 (5da689c313, 2019-01-14)">
  <metadata
     id="metadata12">
    <rdf:RDF>
      <cc:Work
         rdf:about="">
        <dc:format>image/svg+xml</dc:format>
        <dc:type
           rdf:resource="http://purl.org/dc/dcmitype/StillImage" />
      </cc:Work>
    </rdf:RDF>
  </metadata>
  <defs
     id="defs10" />
  <sodipodi:namedview
     pagecolor="#ffffff"
     bordercolor="#666666"
     borderopacity="1"
     objecttolerance="10"
     gridtolerance="10"
     guidetolerance="10"
     inkscape:pageopacity="0"
     inkscape:pageshadow="2"
     inkscape:window-width="1920"
     inkscape:window-height="1011"
     id="namedview8"
     showgrid="false"
     inkscape:zoom="2.6771457"
     inkscape:cx="-20.639245"
     inkscape:cy="77.937836"
     inkscape:window-x="0"
     inkscape:window-y="36"
     inkscape:window-maximized="1"
     inkscape:current-layer="svg6" />
  <g
     transform="translate(-925.982 -260.845)"
     id="g4">
    <path
       d="M957.736,263.768h-6.494v-2.239a.684.684,0,1,0-1.368,0v2.239H935.667v-2.239a.684.684,0,1,0-1.367,0v2.239H927.8a1.824,1.824,0,0,0-1.823,1.822v24.6a1.825,1.825,0,0,0,1.823,1.823h29.931a1.825,1.825,0,0,0,1.823-1.823v-24.6A1.824,1.824,0,0,0,957.736,263.768ZM927.8,265.135H934.3v2.411a.684.684,0,1,0,1.367,0v-2.411h14.207v2.411a.684.684,0,1,0,1.368,0v-2.411h6.494a.456.456,0,0,1,.456.455v3.633H927.349V265.59A.456.456,0,0,1,927.8,265.135Zm29.931,25.51H927.8a.456.456,0,0,1-.456-.456v-19.6h30.843v19.6A.456.456,0,0,1,957.736,290.645Z"
       id="path2"
       fill="#fff" />
  </g>
</svg>
