<?xml version="1.0" encoding="UTF-8" standalone="no"?>
<svg
   xmlns:dc="http://purl.org/dc/elements/1.1/"
   xmlns:cc="http://creativecommons.org/ns#"
   xmlns:rdf="http://www.w3.org/1999/02/22-rdf-syntax-ns#"
   xmlns:svg="http://www.w3.org/2000/svg"
   xmlns="http://www.w3.org/2000/svg"
   xmlns:sodipodi="http://sodipodi.sourceforge.net/DTD/sodipodi-0.dtd"
   xmlns:inkscape="http://www.inkscape.org/namespaces/inkscape"
   width="82.685"
   height="113.833"
   viewBox="0 0 82.685 113.833"
   version="1.1"
   id="svg16"
   sodipodi:docname="community.svg"
   inkscape:version="0.92.4 (5da689c313, 2019-01-14)">
  <metadata
     id="metadata22">
    <rdf:RDF>
      <cc:Work
         rdf:about="">
        <dc:format>image/svg+xml</dc:format>
        <dc:type
           rdf:resource="http://purl.org/dc/dcmitype/StillImage" />
        <dc:title></dc:title>
      </cc:Work>
    </rdf:RDF>
  </metadata>
  <defs
     id="defs20" />
  <sodipodi:namedview
     pagecolor="#ffffff"
     bordercolor="#666666"
     borderopacity="1"
     objecttolerance="10"
     gridtolerance="10"
     guidetolerance="10"
     inkscape:pageopacity="0"
     inkscape:pageshadow="2"
     inkscape:window-width="1920"
     inkscape:window-height="1025"
     id="namedview18"
     showgrid="false"
     inkscape:zoom="2.9319652"
     inkscape:cx="27.829581"
     inkscape:cy="69.644517"
     inkscape:window-x="0"
     inkscape:window-y="27"
     inkscape:window-maximized="1"
     inkscape:current-layer="g971" />
  <g
     transform="translate(34.08111,-194.517)"
     id="g14">
    <g
       transform="translate(66.534,194.517)"
       id="g10">
      <path
         d="m 527.071,332.959 c -22.8,0 -41.343,16.054 -41.343,35.786 a 31.445,31.445 0 0 0 1.739,10.3 l 9.339,32.229 a 1.652,1.652 0 0 0 1.254,1.162 1.74,1.74 0 0 0 0.334,0.034 1.652,1.652 0 0 0 1.276,-0.6 l 9.1,-11.022 a 46.857,46.857 0 0 0 18.3,3.685 c 22.8,0 41.343,-16.054 41.343,-35.786 0,-19.732 -18.545,-35.788 -41.342,-35.788 z m 0,68.261 a 43.321,43.321 0 0 1 -18.078,-3.9 1.658,1.658 0 0 0 -1.971,0.448 l -7.908,9.577 -8.477,-29.265 -0.027,-0.082 a 28.063,28.063 0 0 1 -1.571,-9.252 c 0,-17.906 17.061,-32.476 38.033,-32.476 20.972,0 38.028,14.568 38.028,32.475 0,17.907 -17.058,32.475 -38.029,32.475 z"
         transform="translate(-485.728,-332.959)"
         id="path2"
         inkscape:connector-curvature="0"
         style="fill:#fcfcfc" />
      <path
         d="m 506.257,345.221 a 5.961,5.961 0 1 0 5.961,5.962 5.967,5.967 0 0 0 -5.961,-5.962 z m 0,8.613 a 2.651,2.651 0 1 1 2.651,-2.651 2.654,2.654 0 0 1 -2.651,2.651 z"
         transform="translate(-465.021,-315.53)"
         id="path4"
         inkscape:connector-curvature="0"
         style="fill:#fcfcfc" />
      <path
         d="m 512.251,345.221 a 5.961,5.961 0 1 0 5.961,5.962 5.967,5.967 0 0 0 -5.961,-5.962 z m 0,8.613 a 2.651,2.651 0 1 1 2.651,-2.651 2.654,2.654 0 0 1 -2.651,2.651 z"
         transform="translate(-456.503,-315.53)"
         id="path6"
         inkscape:connector-curvature="0"
         style="fill:#fcfcfc" />
      <path
         d="m 500.352,345.221 a 5.961,5.961 0 1 0 5.961,5.962 5.967,5.967 0 0 0 -5.961,-5.962 z m 0,8.613 a 2.651,2.651 0 1 1 2.648,-2.652 2.654,2.654 0 0 1 -2.648,2.652 z"
         transform="translate(-473.414,-315.53)"
         id="path8"
         inkscape:connector-curvature="0"
         style="fill:#fcfcfc" />
    </g>
    <circle
       cx="7.3140001"
       cy="7.3140001"
       r="7.3140001"
       transform="translate(69.459,293.722)"
       id="circle12"
       style="fill:#64cc82" />
  </g>
  <g
     id="g933"
     transform="translate(138.78903,-194.517)"
     style="fill:#000000">
    <g
       id="g929"
       transform="translate(66.534,194.517)"
       style="fill:#000000">
      <path
         style="fill:#000000"
         inkscape:connector-curvature="0"
         id="path921"
         transform="translate(-485.728,-332.959)"
         d="m 527.071,332.959 c -22.8,0 -41.343,16.054 -41.343,35.786 a 31.445,31.445 0 0 0 1.739,10.3 l 9.339,32.229 a 1.652,1.652 0 0 0 1.254,1.162 1.74,1.74 0 0 0 0.334,0.034 1.652,1.652 0 0 0 1.276,-0.6 l 9.1,-11.022 a 46.857,46.857 0 0 0 18.3,3.685 c 22.8,0 41.343,-16.054 41.343,-35.786 0,-19.732 -18.545,-35.788 -41.342,-35.788 z m 0,68.261 a 43.321,43.321 0 0 1 -18.078,-3.9 1.658,1.658 0 0 0 -1.971,0.448 l -7.908,9.577 -8.477,-29.265 -0.027,-0.082 a 28.063,28.063 0 0 1 -1.571,-9.252 c 0,-17.906 17.061,-32.476 38.033,-32.476 20.972,0 38.028,14.568 38.028,32.475 0,17.907 -17.058,32.475 -38.029,32.475 z" />
      <path
         style="fill:#000000"
         inkscape:connector-curvature="0"
         id="path923"
         transform="translate(-465.021,-315.53)"
         d="m 506.257,345.221 a 5.961,5.961 0 1 0 5.961,5.962 5.967,5.967 0 0 0 -5.961,-5.962 z m 0,8.613 a 2.651,2.651 0 1 1 2.651,-2.651 2.654,2.654 0 0 1 -2.651,2.651 z" />
      <path
         style="fill:#000000"
         inkscape:connector-curvature="0"
         id="path925"
         transform="translate(-456.503,-315.53)"
         d="m 512.251,345.221 a 5.961,5.961 0 1 0 5.961,5.962 5.967,5.967 0 0 0 -5.961,-5.962 z m 0,8.613 a 2.651,2.651 0 1 1 2.651,-2.651 2.654,2.654 0 0 1 -2.651,2.651 z" />
      <path
         style="fill:#000000"
         inkscape:connector-curvature="0"
         id="path927"
         transform="translate(-473.414,-315.53)"
         d="m 500.352,345.221 a 5.961,5.961 0 1 0 5.961,5.962 5.967,5.967 0 0 0 -5.961,-5.962 z m 0,8.613 a 2.651,2.651 0 1 1 2.648,-2.652 2.654,2.654 0 0 1 -2.648,2.652 z" />
    </g>
    <circle
       style="fill:#000000"
       id="circle931"
       transform="translate(69.459,293.722)"
       r="7.3140001"
       cy="7.3140001"
       cx="7.3140001" />
  </g>
  <g
     transform="translate(-243.88944,-194.517)"
     id="g971">
    <g
       transform="translate(66.534,194.517)"
       id="g967">
      <path
         d="m 527.071,332.959 c -22.8,0 -41.343,16.054 -41.343,35.786 a 31.445,31.445 0 0 0 1.739,10.3 l 9.339,32.229 a 1.652,1.652 0 0 0 1.254,1.162 1.74,1.74 0 0 0 0.334,0.034 1.652,1.652 0 0 0 1.276,-0.6 l 9.1,-11.022 a 46.857,46.857 0 0 0 18.3,3.685 c 22.8,0 41.343,-16.054 41.343,-35.786 0,-19.732 -18.545,-35.788 -41.342,-35.788 z m 0,68.261 a 43.321,43.321 0 0 1 -18.078,-3.9 1.658,1.658 0 0 0 -1.971,0.448 l -7.908,9.577 -8.477,-29.265 -0.027,-0.082 a 28.063,28.063 0 0 1 -1.571,-9.252 c 0,-17.906 17.061,-32.476 38.033,-32.476 20.972,0 38.028,14.568 38.028,32.475 0,17.907 -17.058,32.475 -38.029,32.475 z"
         transform="translate(-485.728,-332.959)"
         id="path959"
         inkscape:connector-curvature="0"
         style="fill:#fcfcfc" />
      <path
         d="m 506.257,345.221 a 5.961,5.961 0 1 0 5.961,5.962 5.967,5.967 0 0 0 -5.961,-5.962 z m 0,8.613 a 2.651,2.651 0 1 1 2.651,-2.651 2.654,2.654 0 0 1 -2.651,2.651 z"
         transform="translate(-465.021,-315.53)"
         id="path961"
         inkscape:connector-curvature="0"
         style="fill:#fcfcfc" />
      <path
         d="m 512.251,345.221 a 5.961,5.961 0 1 0 5.961,5.962 5.967,5.967 0 0 0 -5.961,-5.962 z m 0,8.613 a 2.651,2.651 0 1 1 2.651,-2.651 2.654,2.654 0 0 1 -2.651,2.651 z"
         transform="translate(-456.503,-315.53)"
         id="path963"
         inkscape:connector-curvature="0"
         style="fill:#fcfcfc" />
      <path
         d="m 500.352,345.221 a 5.961,5.961 0 1 0 5.961,5.962 5.967,5.967 0 0 0 -5.961,-5.962 z m 0,8.613 a 2.651,2.651 0 1 1 2.648,-2.652 2.654,2.654 0 0 1 -2.648,2.652 z"
         transform="translate(-473.414,-315.53)"
         id="path965"
         inkscape:connector-curvature="0"
         style="fill:#fcfcfc" />
    </g>
    <circle
       cx="7.3140001"
       cy="7.3140001"
       r="7.3140001"
       id="circle969"
       style="fill:#64cc82"
       transform="translate(69.459,293.722)" />
    <g
       id="g1032">
      <g
         style="fill:#ffffff"
         id="g6"
         transform="matrix(0.81557063,0,0,0.81557063,188.83514,51.9912)">
        <path
           id="path2-7"
           d="m 164.777,238.146 -17.431,-10.264 a 2.789,2.789 0 0 1 -1.363,-2.389 v -0.678 a 2.692,2.692 0 0 1 1.109,-2.215 19.066,19.066 0 0 0 8.09,-15.57 v -10.395 c 0,-7.483 -4.784,-13 -13.128,-15.143 a 23.455,23.455 0 0 0 -11.81,0 17.874,17.874 0 0 0 -8.766,4.952 30.125,30.125 0 0 0 -4.138,-1.4 30.177,30.177 0 0 0 -15.216,0 c -10.677,2.749 -16.8,9.786 -16.8,19.31 v 13.662 a 24.463,24.463 0 0 0 10.276,19.894 4.319,4.319 0 0 1 1.829,3.5 v 0.849 a 4.29,4.29 0 0 1 -2.147,3.71 l -22.85,13.152 a 8.333,8.333 0 0 0 -4.168,7.2 v 6.934 a 5.084,5.084 0 0 0 5.079,5.076 h 72.687 a 5.092,5.092 0 0 0 5.076,-5.035 l 0.056,-6.568 a 8.331,8.331 0 0 0 -4.094,-7.235 l -10.432,-6.144 h 26.38 a 5.092,5.092 0 0 0 5.076,-5.035 l 0.035,-4.268 a 6.822,6.822 0 0 0 -3.35,-5.9 z m -17.647,28.566 -0.056,6.571 a 1.046,1.046 0 0 1 -1.044,1.035 H 73.343 a 1.044,1.044 0 0 1 -1.044,-1.044 v -6.934 a 4.286,4.286 0 0 1 2.144,-3.708 l 22.85,-13.152 a 8.328,8.328 0 0 0 4.168,-7.206 v -0.849 a 8.353,8.353 0 0 0 -3.522,-6.79 20.425,20.425 0 0 1 -8.583,-16.609 v -13.66 c 0,-9.8 7.492,-13.789 13.774,-15.4 a 26.1,26.1 0 0 1 13.208,-0.006 c 5.141,1.318 13.765,5.076 13.765,15.4 v 13.671 a 20.43,20.43 0 0 1 -8.58,16.609 8.356,8.356 0 0 0 -3.525,6.79 v 0.894 a 8.346,8.346 0 0 0 4.094,7.161 l 22.929,13.506 a 4.29,4.29 0 0 1 2.109,3.721 z m 16.93,-18.411 a 1.05,1.05 0 0 1 -1.044,1.035 H 129.79 l -5.651,-3.33 a 4.3,4.3 0 0 1 -2.109,-3.687 v -0.894 a 4.319,4.319 0 0 1 1.829,-3.5 24.455,24.455 0 0 0 10.276,-19.894 v -13.674 a 18.188,18.188 0 0 0 -8.922,-15.963 14.71,14.71 0 0 1 6.041,-2.995 19.461,19.461 0 0 1 9.8,0 c 4.607,1.183 10.1,4.094 10.1,11.238 v 10.392 a 15.037,15.037 0 0 1 -6.38,12.273 6.727,6.727 0 0 0 -2.823,5.513 v 0.678 a 6.839,6.839 0 0 0 3.351,5.864 l 17.432,10.264 a 2.782,2.782 0 0 1 1.365,2.413 z"
           inkscape:connector-curvature="0"
           style="fill:#ffffff" />
      </g>
      <circle
         style="fill:#64cc82"
         id="circle969-8"
         r="7.3140001"
         cy="301.02939"
         cx="254.12515" />
    </g>
  </g>
  <g
     style="fill:#000000"
     id="g977"
     transform="matrix(0.9947924,0,0,0.9947924,-197.94181,-192.96207)">
    <path
       id="path973"
       transform="translate(-345.046,64.699)"
       d="m 509.823,173.447 -17.431,-10.264 a 2.789,2.789 0 0 1 -1.363,-2.389 v -0.678 a 2.692,2.692 0 0 1 1.109,-2.215 19.066,19.066 0 0 0 8.09,-15.57 v -10.395 c 0,-7.483 -4.784,-13 -13.128,-15.143 a 23.455,23.455 0 0 0 -11.81,0 17.874,17.874 0 0 0 -8.766,4.952 30.125,30.125 0 0 0 -4.138,-1.4 30.177,30.177 0 0 0 -15.216,0 c -10.677,2.749 -16.8,9.786 -16.8,19.31 v 13.662 a 24.463,24.463 0 0 0 10.276,19.894 4.319,4.319 0 0 1 1.829,3.5 v 0.849 a 4.29,4.29 0 0 1 -2.147,3.71 l -22.85,13.152 a 8.333,8.333 0 0 0 -4.168,7.2 v 6.934 a 5.084,5.084 0 0 0 5.079,5.076 h 72.687 a 5.092,5.092 0 0 0 5.076,-5.035 l 0.056,-6.568 a 8.331,8.331 0 0 0 -4.094,-7.235 l -10.432,-6.144 h 26.38 a 5.092,5.092 0 0 0 5.076,-5.035 l 0.035,-4.268 a 6.822,6.822 0 0 0 -3.35,-5.9 z m -17.647,28.566 -0.056,6.571 a 1.046,1.046 0 0 1 -1.044,1.035 h -72.687 a 1.044,1.044 0 0 1 -1.044,-1.044 v -6.934 a 4.286,4.286 0 0 1 2.144,-3.708 l 22.85,-13.152 a 8.328,8.328 0 0 0 4.168,-7.206 v -0.849 a 8.353,8.353 0 0 0 -3.522,-6.79 20.425,20.425 0 0 1 -8.583,-16.609 v -13.66 c 0,-9.8 7.492,-13.789 13.774,-15.4 a 26.1,26.1 0 0 1 13.208,-0.006 c 5.141,1.318 13.765,5.076 13.765,15.4 v 13.671 a 20.43,20.43 0 0 1 -8.58,16.609 8.356,8.356 0 0 0 -3.525,6.79 v 0.894 a 8.346,8.346 0 0 0 4.094,7.161 l 22.929,13.506 a 4.29,4.29 0 0 1 2.109,3.721 z m 16.93,-18.411 a 1.05,1.05 0 0 1 -1.044,1.035 h -33.226 l -5.651,-3.33 a 4.3,4.3 0 0 1 -2.109,-3.687 v -0.894 a 4.319,4.319 0 0 1 1.829,-3.5 24.455,24.455 0 0 0 10.276,-19.894 v -13.674 a 18.188,18.188 0 0 0 -8.922,-15.963 14.71,14.71 0 0 1 6.041,-2.995 19.461,19.461 0 0 1 9.8,0 c 4.607,1.183 10.1,4.094 10.1,11.238 v 10.392 a 15.037,15.037 0 0 1 -6.38,12.273 6.727,6.727 0 0 0 -2.823,5.513 v 0.678 a 6.839,6.839 0 0 0 3.351,5.864 l 17.432,10.264 a 2.782,2.782 0 0 1 1.365,2.413 z"
       inkscape:connector-curvature="0"
       style="fill:#000000" />
    <circle
       id="circle975"
       transform="translate(68.264,293.722)"
       r="7.3140001"
       cy="7.3140001"
       cx="7.3140001"
       style="fill:#000000" />
  </g>
</svg>
