<?xml version="1.0" encoding="UTF-8" standalone="no"?>
<svg
   xmlns:dc="http://purl.org/dc/elements/1.1/"
   xmlns:cc="http://creativecommons.org/ns#"
   xmlns:rdf="http://www.w3.org/1999/02/22-rdf-syntax-ns#"
   xmlns:svg="http://www.w3.org/2000/svg"
   xmlns="http://www.w3.org/2000/svg"
   xmlns:sodipodi="http://sodipodi.sourceforge.net/DTD/sodipodi-0.dtd"
   xmlns:inkscape="http://www.inkscape.org/namespaces/inkscape"
   width="2262.889"
   height="1178.642"
   viewBox="0 0 2262.889 1178.642"
   version="1.1"
   id="svg99"
   sodipodi:docname="Mask Group 4.svg"
   inkscape:version="0.92.4 (5da689c313, 2019-01-14)">
  <metadata
     id="metadata103">
    <rdf:RDF>
      <cc:Work
         rdf:about="">
        <dc:format>image/svg+xml</dc:format>
        <dc:type
           rdf:resource="http://purl.org/dc/dcmitype/StillImage" />
      </cc:Work>
    </rdf:RDF>
  </metadata>
  <sodipodi:namedview
     pagecolor="#ffffff"
     bordercolor="#666666"
     borderopacity="1"
     objecttolerance="10"
     gridtolerance="10"
     guidetolerance="10"
     inkscape:pageopacity="0"
     inkscape:pageshadow="2"
     inkscape:window-width="1920"
     inkscape:window-height="1022"
     id="namedview101"
     showgrid="false"
     inkscape:zoom="0.1325739"
     inkscape:cx="301.71852"
     inkscape:cy="589.32098"
     inkscape:window-x="0"
     inkscape:window-y="27"
     inkscape:window-maximized="1"
     inkscape:current-layer="svg99" />
  <defs
     id="defs5">
    <clipPath
       id="a">
      <path
         d="M-76.006,1770.449,2051.077,2373.83v575.261S-211.812,2409.05-211.812,2385.571-76.006,1770.449-76.006,1770.449Z"
         transform="translate(-3606 2704)"
         fill="#1d1d1d"
         stroke="#707070"
         stroke-width="1"
         id="path2" />
    </clipPath>
  </defs>
  <g
     transform="translate(3817.812 -4474.449)"
     clip-path="url(#a)"
     id="g97">
    <path
       d="M1453.777,3409.332,35.17,1698.311,1514.134,40.876,2932.756,1751.9,1453.777,3409.332M1514.881,0,5.96,1690.966,0,1697.66,1453.041,3450.212,2961.95,1759.245l5.96-6.7L1514.881,0"
       transform="matrix(0.259, 0.966, -0.966, 0.259, -272.365, 3013.115)"
       id="path7"
       fill="#64cc82" />
    <path
       d="M1520.963,3570.457,33.86,1776.825,1584.257,39.373,3071.363,1833l-1550.4,1737.455M1584.962,0,5.748,1769.754,0,1776.208,1520.269,3609.831,3099.484,1840.076l5.748-6.454L1584.962,0"
       transform="matrix(0.259, 0.966, -0.966, 0.259, -213.044, 2926.143)"
       id="path9"
       fill="#64cc82" />
    <path
       d="M1588.176,3731.6,32.567,1855.358,1654.349,37.855,3209.962,1914.1,1588.176,3731.6M1655.048,0,5.539,1848.56,0,1854.755l1587.477,1914.7L3236.986,1920.9l5.539-6.2L1655.048,0"
       transform="matrix(0.259, 0.966, -0.966, 0.259, -153.714, 2839.177)"
       id="path11"
       fill="#64cc82" />
    <path
       d="M1655.347,3892.729,31.266,1933.865,1724.476,36.338,3348.57,1995.2,1655.347,3892.729M1725.129,0,5.3,1927.333,0,1933.277,1654.7,3929.068,3374.535,2001.735l5.3-5.948L1725.129,0"
       transform="matrix(0.259, 0.966, -0.966, 0.259, -94.4, 2752.208)"
       id="path13"
       fill="#64cc82" />
    <path
       d="M1722.557,4053.859,29.948,2012.379,1794.588,34.831l1692.6,2041.484L1722.557,4053.859M1795.206,0,5.088,2006.125,0,2011.833,1712.13,4076.887l9.808,11.8L3512.057,2082.57l5.08-5.711L1805,11.807,1795.206,0"
       transform="matrix(0.259, 0.966, -0.966, 0.259, -35.076, 2665.235)"
       id="path15"
       fill="#64cc82" />
    <path
       d="M1789.758,4214.985,28.651,2090.889,1864.708,33.314l1761.1,2124.092L1789.758,4214.985M1865.308,0,4.868,2084.908,0,2090.362,1779.782,4237l9.372,11.291L3649.582,2163.386l4.868-5.449L1874.668,11.29,1865.308,0"
       transform="matrix(0.259, 0.966, -0.966, 0.259, 24.237, 2578.262)"
       id="path17"
       fill="#64cc82" />
    <path
       d="M1856.94,4376.133,27.353,2169.418,1934.808,31.8,3764.383,2238.525,1856.94,4376.133M1935.365,0,4.644,2163.7,0,2168.913,1856.386,4407.929,3787.1,2244.233l4.644-5.209L1935.365,0"
       transform="matrix(0.259, 0.966, -0.966, 0.259, 83.572, 2491.299)"
       id="path19"
       fill="#64cc82" />
    <path
       d="M1924.138,4537.254,26.056,2247.925,2004.919,30.279,3903,2319.615,1924.138,4537.254M2005.466,0,4.431,2242.484,0,2247.446,1915.085,4557.28l8.505,10.264L3924.626,2325.056l4.431-4.958L2013.972,10.26,2005.466,0"
       transform="matrix(0.259, 0.966, -0.966, 0.259, 142.885, 2404.329)"
       id="path21"
       fill="#64cc82" />
    <path
       d="M1991.325,4698.394,24.751,2326.45,2075.051,28.772,4041.624,2400.72l-2050.3,2297.674M2075.564,0,0,2325.986,1982.737,4717.413l8.074,9.754L4066.375,2401.184,2083.638,9.754,2075.564,0"
       transform="matrix(0.259, 0.966, -0.966, 0.259, 202.209, 2317.352)"
       id="path23"
       fill="#64cc82" />
    <path
       d="M2058.51,4859.516,23.43,2404.946,2145.138,27.254,4180.231,2481.817,2058.51,4859.516M2145.633,0,3.976,2400.055,0,2404.519,2050.382,4877.538l7.646,9.233,2141.66-2400.063,3.973-4.46L2153.28,9.237,2145.633,0"
       transform="matrix(0.259, 0.966, -0.966, 0.259, 261.525, 2230.394)"
       id="path25"
       fill="#64cc82" />
    <path
       d="M2125.708,5020.646,22.121,2483.471,2215.239,25.744,4318.815,2562.922,2125.708,5020.646M2215.714,0,3.76,2478.843,0,2483.06,2118.018,5037.667l7.215,8.727L4337.188,2567.546l3.759-4.216L2222.93,8.723,2215.714,0"
       transform="matrix(0.259, 0.966, -0.966, 0.259, 320.849, 2143.434)"
       id="path27"
       fill="#64cc82" />
    <path
       d="M2192.917,5181.786,20.834,2561.985,2285.361,24.223l2172.072,2619.8L2192.917,5181.786M2285.8,0,3.536,2557.638,0,2561.607l2185.677,2636.2,6.807,8.2,2282.26-2557.632,3.54-3.969L2285.8,0"
       transform="matrix(0.259, 0.966, -0.966, 0.259, 380.171, 2056.45)"
       id="path29"
       fill="#64cc82" />
    <path
       d="M2260.116,5342.919,19.541,2640.5,2355.481,22.709,4596.056,2725.125,2260.116,5342.919M2355.889,0,3.316,2636.415,0,2640.136l2253.325,2717.8,6.368,7.7L4612.27,2729.209l3.327-3.721L2362.272,7.7,2355.889,0"
       transform="matrix(0.259, 0.966, -0.966, 0.259, 439.487, 1969.475)"
       id="path31"
       fill="#64cc82" />
    <path
       d="M2327.314,5504.052,18.232,2719.021,2425.593,21.2,4734.664,2806.234,2327.314,5504.052M2425.974,0,3.092,2715.2,0,2718.677l2320.984,2799.39,5.952,7.187L4749.814,2810.048l3.092-3.471L2431.91,7.187,2425.974,0"
       transform="matrix(0.259, 0.966, -0.966, 0.259, 498.812, 1882.503)"
       id="path33"
       fill="#64cc82" />
    <path
       d="M2394.515,5665.185,1588.4,4692.9,16.95,2797.531,2495.708,19.678,4873.263,2887.327,2394.515,5665.185M2496.067,0,2.9,2794,0,2797.217,2388.632,5678.191l5.524,6.664,2493.172-2793.99,2.9-3.223L2501.591,6.67,2496.067,0"
       transform="matrix(0.259, 0.966, -0.966, 0.259, 558.124, 1795.53)"
       id="path35"
       fill="#64cc82" />
    <path
       d="M2461.713,5826.31,15.629,2876.042,2565.8,18.167,5011.881,2968.432,2461.713,5826.31M2566.125,0,0,2875.753,2461.373,5844.485,5027.5,2968.716,2566.125,0"
       transform="matrix(0.259, 0.966, -0.966, 0.259, 617.448, 1708.569)"
       id="path37"
       fill="#64cc82" />
    <path
       d="M2528.884,5987.445,14.32,2954.563l2621.6-2937.9L5150.488,3049.551l-2621.6,2937.894M2636.218,0,2.436,2951.573,0,2954.3,2528.6,6004.115,5162.388,3052.538l2.436-2.732L2636.218,0"
       transform="matrix(0.259, 0.966, -0.966, 0.259, 676.776, 1621.595)"
       id="path39"
       fill="#64cc82" />
    <path
       d="M2596.1,6148.587,13.038,3033.082,2706.016,15.139l2583.06,3115.5L2596.1,6148.587M2706.292,0,2.212,3030.368,0,3032.842,2595.825,6163.724,5299.9,3133.358l2.212-2.477L2706.292,0"
       transform="matrix(0.259, 0.966, -0.966, 0.259, 736.096, 1534.632)"
       id="path41"
       fill="#64cc82" />
    <path
       d="M2663.279,6309.713,11.729,3111.6,2776.144,13.632,5427.694,3211.738,2663.279,6309.713M2776.385,0,1.988,3109.141,0,3111.378,2663.038,6323.341l2774.4-3109.148,1.988-2.23L2776.385,0"
       transform="matrix(0.259, 0.966, -0.966, 0.259, 795.417, 1447.661)"
       id="path43"
       fill="#64cc82" />
    <path
       d="M2730.5,6470.846,10.442,3190.11,2846.243,12.115l2720.07,3280.732-2835.813,3178M2846.474,0,1.776,3187.936,0,3189.919,2726.88,6478.857l3.4,4.1L5574.969,3295.028l1.775-1.986L2849.875,4.1l-3.4-4.1"
       transform="matrix(0.259, 0.966, -0.966, 0.259, 854.734, 1360.678)"
       id="path45"
       fill="#64cc82" />
    <path
       d="M2797.675,6631.979,9.11,3268.628,2916.367,10.6,5704.935,3373.952,2797.675,6631.979M2916.544,0,1.552,3266.72,0,3268.459,2797.5,6642.573,5712.49,3375.852l1.552-1.732L2916.544,0"
       transform="matrix(0.259, 0.966, -0.966, 0.259, 914.058, 1273.717)"
       id="path47"
       fill="#64cc82" />
    <path
       d="M2864.877,6793.124,7.816,3347.142,2986.451,9.084,5843.524,3455.057,2864.877,6793.124M2986.617,0,1.332,3345.512,0,3347,2862.165,6799.126l2.554,3.081,2985.29-3345.516,1.328-1.5L2989.171,3.08,2986.617,0"
       transform="matrix(0.259, 0.966, -0.966, 0.259, 973.385, 1186.752)"
       id="path49"
       fill="#64cc82" />
    <path
       d="M2932.071,6954.248,6.519,3425.66,3056.575,7.573,5982.13,3536.161,2932.071,6954.248M3056.722,0,1.1,3424.3,0,3425.537,2929.8,6959.248l2.123,2.57,3055.617-3424.3,1.1-1.237L3058.833,2.571,3056.722,0"
       transform="matrix(0.259, 0.966, -0.966, 0.259, 1032.702, 1099.782)"
       id="path51"
       fill="#64cc82" />
    <path
       d="M2999.26,7115.369,5.21,3504.173,3126.7,6.056l2994.04,3611.2L2999.26,7115.369M3126.807,0,.9,3503.08l-.9.989,2997.449,3615.3,1.706,2.05,3125.912-3503.08.9-.99L3128.514,2.05,3126.807,0"
       transform="matrix(0.259, 0.966, -0.966, 0.259, 1092.015, 1012.808)"
       id="path53"
       fill="#64cc82" />
    <path
       d="M43.137,0,84.516,49.9,41.379,98.239,0,48.332,43.137,0"
       transform="matrix(0.259, 0.966, -0.966, 0.259, -1518.105, 4839.471)"
       id="path55"
       fill="#64cc82" />
    <path
       d="M109.855,186.684,61.214,128.013l50.733-56.839,48.626,58.671-50.717,56.839M113.207,0,0,126.879,108.584,257.858,221.8,130.979,113.207,0"
       transform="matrix(0.259, 0.966, -0.966, 0.259, -1458.777, 4752.509)"
       id="path57"
       fill="#64cc82" />
    <path
       d="M177.065,347.817,59.92,206.523,182.035,69.659,299.2,210.95,177.065,347.817M183.3,0,0,205.416,175.812,417.48l183.3-205.427L183.3,0"
       transform="matrix(0.259, 0.966, -0.966, 0.259, -1399.457, 4665.538)"
       id="path59"
       fill="#64cc82" />
    <path
       d="M244.259,508.946,58.631,285.034l193.555-216.9L437.814,292.047l-193.555,216.9M253.393,0,0,283.949,243.052,577.085,496.437,293.132,253.393,0"
       transform="matrix(0.259, 0.966, -0.966, 0.259, -1340.146, 4578.557)"
       id="path61"
       fill="#64cc82" />
    <path
       d="M311.488,670.083,57.325,363.562,322.278,66.624,576.436,373.152,311.488,670.083M323.49,0,0,362.492,310.272,736.707l323.49-362.485L323.49,0"
       transform="matrix(0.259, 0.966, -0.966, 0.259, -1280.819, 4491.58)"
       id="path63"
       fill="#64cc82" />
    <path
       d="M378.647,831.216,56.008,442.07,392.378,65.118,715.02,454.261,378.647,831.216M393.544,0,0,441.037l377.465,455.3L771.024,455.286,393.544,0"
       transform="matrix(0.259, 0.966, -0.966, 0.259, -1221.492, 4404.631)"
       id="path65"
       fill="#64cc82" />
    <path
       d="M445.833,992.353,54.707,520.588,462.49,63.6,853.627,535.366,445.833,992.353M463.614,0,0,519.578l444.709,536.375L908.334,536.376,463.614,0"
       transform="matrix(0.259, 0.966, -0.966, 0.259, -1162.171, 4317.659)"
       id="path67"
       fill="#64cc82" />
    <path
       d="M513.042,1153.478,53.4,599.094,532.609,62.083l459.629,554.38-479.2,537.015M533.722,0,0,598.114,511.929,1215.56l533.722-598.114L533.722,0"
       transform="matrix(0.259, 0.966, -0.966, 0.259, -1102.858, 4230.686)"
       id="path69"
       fill="#64cc82" />
    <path
       d="M580.228,1314.611,52.1,677.623,602.709,60.58l528.136,636.988L580.228,1314.611M603.78,0,0,676.655l579.157,698.536,603.8-676.658L603.78,0"
       transform="matrix(0.259, 0.966, -0.966, 0.259, -1043.527, 4143.723)"
       id="path71"
       fill="#64cc82" />
    <path
       d="M647.427,1475.744,50.807,756.134,672.821,59.055l596.62,719.61L647.427,1475.744M673.885,0,0,755.187l646.362,779.607,673.885-755.183L673.885,0"
       transform="matrix(0.259, 0.966, -0.966, 0.259, -984.21, 4056.752)"
       id="path73"
       fill="#64cc82" />
    <path
       d="M714.624,1636.884,49.489,834.651,742.924,57.544l665.139,802.233L714.624,1636.884M743.959,0,0,833.742l713.605,860.687,743.959-833.742L743.959,0"
       transform="matrix(0.259, 0.966, -0.966, 0.259, -924.886, 3969.777)"
       id="path75"
       fill="#64cc82" />
    <path
       d="M781.834,1798.01,48.192,913.162,813.04,56.03l733.642,884.844L781.834,1798.01M814.063,0,0,912.268,780.814,1854.04l814.059-912.275L814.063,0"
       transform="matrix(0.259, 0.966, -0.966, 0.259, -865.569, 3882.805)"
       id="path77"
       fill="#64cc82" />
    <path
       d="M849.02,1959.143,46.894,991.676,883.14,54.509l802.125,967.47L1067.947,1713.8,849.02,1959.143M884.118,0,0,990.812l848.042,1022.84L1732.16,1022.84,884.118,0"
       transform="matrix(0.259, 0.966, -0.966, 0.259, -806.249, 3795.846)"
       id="path79"
       fill="#64cc82" />
    <path
       d="M916.206,2120.268,45.589,1070.2,953.271,53l870.605,1050.074L916.206,2120.268M954.2,0,7.747,1060.68,0,1069.352,915.274,2173.271,1861.73,1112.595l7.747-8.672L954.2,0"
       transform="matrix(0.259, 0.966, -0.966, 0.259, -746.929, 3708.871)"
       id="path81"
       fill="#64cc82" />
    <path
       d="M983.415,2281.4,44.3,1148.719,1023.394,51.488l939.112,1132.689L983.415,2281.4M1024.323,0,0,1147.892l982.491,1185L2006.81,1185.008,1024.323,0"
       transform="matrix(0.259, 0.966, -0.966, 0.259, -687.608, 3621.887)"
       id="path83"
       fill="#64cc82" />
    <path
       d="M1050.6,2442.542,42.982,1227.219,1093.494,49.968,2101.118,1265.29,1050.6,2442.542M1094.377,0,0,1226.429l1049.707,1266.08L2144.085,1266.079,1094.377,0"
       transform="matrix(0.259, 0.966, -0.966, 0.259, -628.287, 3534.928)"
       id="path85"
       fill="#64cc82" />
    <path
       d="M1117.788,2603.663,41.673,1305.736,1163.6,48.453,2239.7,1346.376,1117.788,2603.663M1164.47,0,7.076,1297.031,0,1304.966,1116.912,2652.12,2274.307,1355.081l7.064-7.934L1164.47,0"
       transform="matrix(0.259, 0.966, -0.966, 0.259, -568.97, 3447.969)"
       id="path87"
       fill="#64cc82" />
    <path
       d="M1185,2764.8,40.379,1384.261,1233.7,46.954,2378.324,1427.492,1185,2764.8M1234.544,0,0,1383.517,1184.144,2811.75,2418.7,1428.233,1234.544,0"
       transform="matrix(0.259, 0.966, -0.966, 0.259, -509.64, 3360.991)"
       id="path89"
       fill="#64cc82" />
    <path
       d="M1252.172,2925.932,39.082,1462.772,1303.837,45.429,2516.927,1508.6,1252.172,2925.932M1304.633,0,6.643,1454.615,0,1462.047,1238.6,2955.964l12.774,15.4,1297.99-1454.608,6.644-7.435L1317.411,15.4,1304.633,0"
       transform="matrix(0.259, 0.966, -0.966, 0.259, -450.322, 3274.02)"
       id="path91"
       fill="#64cc82" />
    <path
       d="M1319.4,3087.073,37.785,1541.294,1373.938,43.915,2655.55,1589.695,1319.4,3087.073M1374.73,0,6.42,1533.4,0,1540.583l1318.616,1590.4,1368.31-1533.4,6.419-7.181L1374.73,0"
       transform="matrix(0.259, 0.966, -0.966, 0.259, -391.005, 3187.037)"
       id="path93"
       fill="#64cc82" />
    <path
       d="M1386.552,3248.2,36.448,1619.807,1444.03,42.409,2794.134,1670.8,1386.552,3248.2M1444.784,0,6.184,1612.194,0,1619.142,1385.8,3290.607l1438.6-1612.19,6.184-6.948L1444.784,0"
       transform="matrix(0.259, 0.966, -0.966, 0.259, -331.671, 3100.099)"
       id="path95"
       fill="#64cc82" />
  </g>
</svg>
